lucene-dev mailing list archives

Site index · List index
Message view « Date » · « Thread »
Top « Date » · « Thread »
From Policeman Jenkins Server <jenk...@thetaphi.de>
Subject [JENKINS] Lucene-Solr-master-Solaris (64bit/jdk1.8.0) - Build # 1000 - Still Unstable!
Date Sat, 10 Dec 2016 08:30:25 GMT
Build: https://jenkins.thetaphi.de/job/Lucene-Solr-master-Solaris/1000/
Java: 64bit/jdk1.8.0 -XX:-UseCompressedOops -XX:+UseConcMarkSweepGC

1 tests failed.
FAILED:  org.apache.solr.cloud.TestSolrCloudWithDelegationTokens.testDelegationTokenCancelFail

Error Message:
expected:<200> but was:<404>

Stack Trace:
java.lang.AssertionError: expected:<200> but was:<404>
	at __randomizedtesting.SeedInfo.seed([5D4C2B793AE9A9E3:35F31E53EA73BB0F]:0)
	at org.junit.Assert.fail(Assert.java:93)
	at org.junit.Assert.failNotEquals(Assert.java:647)
	at org.junit.Assert.assertEquals(Assert.java:128)
	at org.junit.Assert.assertEquals(Assert.java:472)
	at org.junit.Assert.assertEquals(Assert.java:456)
	at org.apache.solr.cloud.TestSolrCloudWithDelegationTokens.cancelDelegationToken(TestSolrCloudWithDelegationTokens.java:140)
	at org.apache.solr.cloud.TestSolrCloudWithDelegationTokens.testDelegationTokenCancelFail(TestSolrCloudWithDelegationTokens.java:294)
	at sun.reflect.NativeMethodAccessorImpl.invoke0(Native Method)
	at sun.reflect.NativeMethodAccessorImpl.invoke(NativeMethodAccessorImpl.java:62)
	at sun.reflect.DelegatingMethodAccessorImpl.invoke(DelegatingMethodAccessorImpl.java:43)
	at java.lang.reflect.Method.invoke(Method.java:498)
	at com.carrotsearch.randomizedtesting.RandomizedRunner.invoke(RandomizedRunner.java:1713)
	at com.carrotsearch.randomizedtesting.RandomizedRunner$8.evaluate(RandomizedRunner.java:907)
	at com.carrotsearch.randomizedtesting.RandomizedRunner$9.evaluate(RandomizedRunner.java:943)
	at com.carrotsearch.randomizedtesting.RandomizedRunner$10.evaluate(RandomizedRunner.java:957)
	at com.carrotsearch.randomizedtesting.rules.SystemPropertiesRestoreRule$1.evaluate(SystemPropertiesRestoreRule.java:57)
	at org.apache.lucene.util.TestRuleSetupTeardownChained$1.evaluate(TestRuleSetupTeardownChained.java:49)
	at org.apache.lucene.util.AbstractBeforeAfterRule$1.evaluate(AbstractBeforeAfterRule.java:45)
	at org.apache.lucene.util.TestRuleThreadAndTestName$1.evaluate(TestRuleThreadAndTestName.java:48)
	at org.apache.lucene.util.TestRuleIgnoreAfterMaxFailures$1.evaluate(TestRuleIgnoreAfterMaxFailures.java:64)
	at org.apache.lucene.util.TestRuleMarkFailure$1.evaluate(TestRuleMarkFailure.java:47)
	at com.carrotsearch.randomizedtesting.rules.StatementAdapter.evaluate(StatementAdapter.java:36)
	at com.carrotsearch.randomizedtesting.ThreadLeakControl$StatementRunner.run(ThreadLeakControl.java:367)
	at com.carrotsearch.randomizedtesting.ThreadLeakControl.forkTimeoutingTask(ThreadLeakControl.java:811)
	at com.carrotsearch.randomizedtesting.ThreadLeakControl$3.evaluate(ThreadLeakControl.java:462)
	at com.carrotsearch.randomizedtesting.RandomizedRunner.runSingleTest(RandomizedRunner.java:916)
	at com.carrotsearch.randomizedtesting.RandomizedRunner$5.evaluate(RandomizedRunner.java:802)
	at com.carrotsearch.randomizedtesting.RandomizedRunner$6.evaluate(RandomizedRunner.java:852)
	at com.carrotsearch.randomizedtesting.RandomizedRunner$7.evaluate(RandomizedRunner.java:863)
	at com.carrotsearch.randomizedtesting.rules.StatementAdapter.evaluate(StatementAdapter.java:36)
	at com.carrotsearch.randomizedtesting.rules.SystemPropertiesRestoreRule$1.evaluate(SystemPropertiesRestoreRule.java:57)
	at org.apache.lucene.util.AbstractBeforeAfterRule$1.evaluate(AbstractBeforeAfterRule.java:45)
	at com.carrotsearch.randomizedtesting.rules.StatementAdapter.evaluate(StatementAdapter.java:36)
	at org.apache.lucene.util.TestRuleStoreClassName$1.evaluate(TestRuleStoreClassName.java:41)
	at com.carrotsearch.randomizedtesting.rules.NoShadowingOrOverridesOnMethodsRule$1.evaluate(NoShadowingOrOverridesOnMethodsRule.java:40)
	at com.carrotsearch.randomizedtesting.rules.NoShadowingOrOverridesOnMethodsRule$1.evaluate(NoShadowingOrOverridesOnMethodsRule.java:40)
	at com.carrotsearch.randomizedtesting.rules.StatementAdapter.evaluate(StatementAdapter.java:36)
	at com.carrotsearch.randomizedtesting.rules.StatementAdapter.evaluate(StatementAdapter.java:36)
	at com.carrotsearch.randomizedtesting.rules.StatementAdapter.evaluate(StatementAdapter.java:36)
	at org.apache.lucene.util.TestRuleAssertionsRequired$1.evaluate(TestRuleAssertionsRequired.java:53)
	at org.apache.lucene.util.TestRuleMarkFailure$1.evaluate(TestRuleMarkFailure.java:47)
	at org.apache.lucene.util.TestRuleIgnoreAfterMaxFailures$1.evaluate(TestRuleIgnoreAfterMaxFailures.java:64)
	at org.apache.lucene.util.TestRuleIgnoreTestSuites$1.evaluate(TestRuleIgnoreTestSuites.java:54)
	at com.carrotsearch.randomizedtesting.rules.StatementAdapter.evaluate(StatementAdapter.java:36)
	at com.carrotsearch.randomizedtesting.ThreadLeakControl$StatementRunner.run(ThreadLeakControl.java:367)
	at java.lang.Thread.run(Thread.java:745)




Build Log:
[...truncated 11469 lines...]
   [junit4] Suite: org.apache.solr.cloud.TestSolrCloudWithDelegationTokens
   [junit4]   2> Creating dataDir: /export/home/jenkins/workspace/Lucene-Solr-master-Solaris/solr/build/solr-core/test/J0/temp/solr.cloud.TestSolrCloudWithDelegationTokens_5D4C2B793AE9A9E3-001/init-core-data-001
   [junit4]   2> 1438044 INFO  (SUITE-TestSolrCloudWithDelegationTokens-seed#[5D4C2B793AE9A9E3]-worker)
[    ] o.a.s.SolrTestCaseJ4 Randomized ssl (false) and clientAuth (false) via: @org.apache.solr.util.RandomizeSSL(reason=,
value=NaN, ssl=NaN, clientAuth=NaN)
   [junit4]   2> 1438049 INFO  (SUITE-TestSolrCloudWithDelegationTokens-seed#[5D4C2B793AE9A9E3]-worker)
[    ] o.a.s.c.MiniSolrCloudCluster Starting cluster of 2 servers in /export/home/jenkins/workspace/Lucene-Solr-master-Solaris/solr/build/solr-core/test/J0/temp/solr.cloud.TestSolrCloudWithDelegationTokens_5D4C2B793AE9A9E3-001/tempDir-001
   [junit4]   2> 1438049 INFO  (SUITE-TestSolrCloudWithDelegationTokens-seed#[5D4C2B793AE9A9E3]-worker)
[    ] o.a.s.c.ZkTestServer STARTING ZK TEST SERVER
   [junit4]   2> 1438050 INFO  (Thread-2870) [    ] o.a.s.c.ZkTestServer client port:0.0.0.0/0.0.0.0:0
   [junit4]   2> 1438050 INFO  (Thread-2870) [    ] o.a.s.c.ZkTestServer Starting server
   [junit4]   2> 1438150 INFO  (SUITE-TestSolrCloudWithDelegationTokens-seed#[5D4C2B793AE9A9E3]-worker)
[    ] o.a.s.c.ZkTestServer start zk server on port:43406
   [junit4]   2> 1438158 INFO  (jetty-launcher-1936-thread-2) [    ] o.e.j.s.Server jetty-9.3.14.v20161028
   [junit4]   2> 1438158 INFO  (jetty-launcher-1936-thread-1) [    ] o.e.j.s.Server jetty-9.3.14.v20161028
   [junit4]   2> 1438161 INFO  (jetty-launcher-1936-thread-1) [    ] o.e.j.s.h.ContextHandler
Started o.e.j.s.ServletContextHandler@7159a6e1{/solr,null,AVAILABLE}
   [junit4]   2> 1438161 INFO  (jetty-launcher-1936-thread-2) [    ] o.e.j.s.h.ContextHandler
Started o.e.j.s.ServletContextHandler@6a63c7fc{/solr,null,AVAILABLE}
   [junit4]   2> 1438162 INFO  (jetty-launcher-1936-thread-1) [    ] o.e.j.s.AbstractConnector
Started ServerConnector@1dac68c6{HTTP/1.1,[http/1.1]}{127.0.0.1:40185}
   [junit4]   2> 1438162 INFO  (jetty-launcher-1936-thread-1) [    ] o.e.j.s.Server Started
@1441536ms
   [junit4]   2> 1438162 INFO  (jetty-launcher-1936-thread-1) [    ] o.a.s.c.s.e.JettySolrRunner
Jetty properties: {hostContext=/solr, hostPort=40185}
   [junit4]   2> 1438162 ERROR (jetty-launcher-1936-thread-1) [    ] o.a.s.s.StartupLoggingUtils
Missing Java Option solr.log.dir. Logging may be missing or incomplete.
   [junit4]   2> 1438162 INFO  (jetty-launcher-1936-thread-1) [    ] o.a.s.s.SolrDispatchFilter
 ___      _       Welcome to Apache Solr? version 7.0.0
   [junit4]   2> 1438162 INFO  (jetty-launcher-1936-thread-1) [    ] o.a.s.s.SolrDispatchFilter
/ __| ___| |_ _   Starting in cloud mode on port null
   [junit4]   2> 1438162 INFO  (jetty-launcher-1936-thread-1) [    ] o.a.s.s.SolrDispatchFilter
\__ \/ _ \ | '_|  Install dir: null
   [junit4]   2> 1438162 INFO  (jetty-launcher-1936-thread-1) [    ] o.a.s.s.SolrDispatchFilter
|___/\___/_|_|    Start time: 2016-12-10T07:45:06.904Z
   [junit4]   2> 1438163 INFO  (jetty-launcher-1936-thread-2) [    ] o.e.j.s.AbstractConnector
Started ServerConnector@4ac53945{HTTP/1.1,[http/1.1]}{127.0.0.1:34833}
   [junit4]   2> 1438163 INFO  (jetty-launcher-1936-thread-2) [    ] o.e.j.s.Server Started
@1441537ms
   [junit4]   2> 1438163 INFO  (jetty-launcher-1936-thread-2) [    ] o.a.s.c.s.e.JettySolrRunner
Jetty properties: {hostContext=/solr, hostPort=34833}
   [junit4]   2> 1438163 ERROR (jetty-launcher-1936-thread-2) [    ] o.a.s.s.StartupLoggingUtils
Missing Java Option solr.log.dir. Logging may be missing or incomplete.
   [junit4]   2> 1438163 INFO  (jetty-launcher-1936-thread-2) [    ] o.a.s.s.SolrDispatchFilter
 ___      _       Welcome to Apache Solr? version 7.0.0
   [junit4]   2> 1438163 INFO  (jetty-launcher-1936-thread-2) [    ] o.a.s.s.SolrDispatchFilter
/ __| ___| |_ _   Starting in cloud mode on port null
   [junit4]   2> 1438163 INFO  (jetty-launcher-1936-thread-2) [    ] o.a.s.s.SolrDispatchFilter
\__ \/ _ \ | '_|  Install dir: null
   [junit4]   2> 1438163 INFO  (jetty-launcher-1936-thread-2) [    ] o.a.s.s.SolrDispatchFilter
|___/\___/_|_|    Start time: 2016-12-10T07:45:06.905Z
   [junit4]   2> 1438168 INFO  (jetty-launcher-1936-thread-1) [    ] o.a.s.s.SolrDispatchFilter
solr.xml found in ZooKeeper. Loading...
   [junit4]   2> 1438168 INFO  (jetty-launcher-1936-thread-2) [    ] o.a.s.s.SolrDispatchFilter
solr.xml found in ZooKeeper. Loading...
   [junit4]   2> 1438177 INFO  (jetty-launcher-1936-thread-1) [    ] o.a.s.c.ZkContainer
Zookeeper client=127.0.0.1:43406/solr
   [junit4]   2> 1438177 INFO  (jetty-launcher-1936-thread-2) [    ] o.a.s.c.ZkContainer
Zookeeper client=127.0.0.1:43406/solr
   [junit4]   2> 1438224 INFO  (jetty-launcher-1936-thread-1) [n:127.0.0.1:40185_solr 
  ] o.a.s.c.OverseerElectionContext I am going to be the leader 127.0.0.1:40185_solr
   [junit4]   2> 1438226 INFO  (jetty-launcher-1936-thread-1) [n:127.0.0.1:40185_solr 
  ] o.a.s.c.Overseer Overseer (id=97082140707586053-127.0.0.1:40185_solr-n_0000000000) starting
   [junit4]   2> 1438233 INFO  (jetty-launcher-1936-thread-2) [n:127.0.0.1:34833_solr 
  ] o.a.s.c.ZkController Register node as live in ZooKeeper:/live_nodes/127.0.0.1:34833_solr
   [junit4]   2> 1438235 INFO  (zkCallback-1947-thread-1-processing-n:127.0.0.1:34833_solr)
[n:127.0.0.1:34833_solr    ] o.a.s.c.c.ZkStateReader Updated live nodes from ZooKeeper...
(0) -> (1)
   [junit4]   2> 1438244 INFO  (OverseerStateUpdate-97082140707586053-127.0.0.1:40185_solr-n_0000000000)
[n:127.0.0.1:40185_solr    ] o.a.s.c.c.ZkStateReader Updated live nodes from ZooKeeper...
(0) -> (1)
   [junit4]   2> 1438245 INFO  (jetty-launcher-1936-thread-1) [n:127.0.0.1:40185_solr 
  ] o.a.s.c.ZkController Register node as live in ZooKeeper:/live_nodes/127.0.0.1:40185_solr
   [junit4]   2> 1438248 INFO  (zkCallback-1946-thread-2-processing-n:127.0.0.1:40185_solr)
[n:127.0.0.1:40185_solr    ] o.a.s.c.c.ZkStateReader Updated live nodes from ZooKeeper...
(1) -> (2)
   [junit4]   2> 1438250 INFO  (zkCallback-1947-thread-1-processing-n:127.0.0.1:34833_solr)
[n:127.0.0.1:34833_solr    ] o.a.s.c.c.ZkStateReader Updated live nodes from ZooKeeper...
(1) -> (2)
   [junit4]   2> 1438281 INFO  (jetty-launcher-1936-thread-1) [n:127.0.0.1:40185_solr 
  ] o.a.s.c.CoreContainer Initializing authentication plugin: org.apache.solr.security.HttpParamDelegationTokenPlugin
   [junit4]   2> 1438293 INFO  (jetty-launcher-1936-thread-1) [n:127.0.0.1:40185_solr 
  ] o.a.s.s.KerberosPlugin Params: {token.valid=30, delegation-token.token-kind=solr-dt, cookie.domain=127.0.0.1,
cookie.path=/, zk-dt-secret-manager.znodeWorkingPath=solr/security/zkdtsm, token.validity=36000,
signer.secret.provider.zookeeper.path=/token, type=kerberos, zk-dt-secret-manager.enable=true,
kerberos.name.rules=DEFAULT, signer.secret.provider=zookeeper}
   [junit4]   2> 1438301 INFO  (jetty-launcher-1936-thread-2) [n:127.0.0.1:34833_solr 
  ] o.a.s.c.CoreContainer Initializing authentication plugin: org.apache.solr.security.HttpParamDelegationTokenPlugin
   [junit4]   2> 1438302 INFO  (jetty-launcher-1936-thread-2) [n:127.0.0.1:34833_solr 
  ] o.a.s.s.KerberosPlugin Params: {token.valid=30, delegation-token.token-kind=solr-dt, cookie.domain=127.0.0.1,
cookie.path=/, zk-dt-secret-manager.znodeWorkingPath=solr/security/zkdtsm, token.validity=36000,
signer.secret.provider.zookeeper.path=/token, type=kerberos, zk-dt-secret-manager.enable=true,
kerberos.name.rules=DEFAULT, signer.secret.provider=zookeeper}
   [junit4]   2> 1438387 INFO  (jetty-launcher-1936-thread-1) [n:127.0.0.1:40185_solr 
  ] o.a.c.f.i.CuratorFrameworkImpl Starting
   [junit4]   2> 1438387 INFO  (jetty-launcher-1936-thread-2) [n:127.0.0.1:34833_solr 
  ] o.a.c.f.i.CuratorFrameworkImpl Starting
   [junit4]   2> 1438413 INFO  (jetty-launcher-1936-thread-1-EventThread) [n:127.0.0.1:40185_solr
   ] o.a.c.f.s.ConnectionStateManager State change: CONNECTED
   [junit4]   2> 1438413 INFO  (jetty-launcher-1936-thread-2-EventThread) [n:127.0.0.1:34833_solr
   ] o.a.c.f.s.ConnectionStateManager State change: CONNECTED
   [junit4]   2> 1438551 INFO  (jetty-launcher-1936-thread-1) [n:127.0.0.1:40185_solr 
  ] o.a.s.c.CorePropertiesLocator Found 0 core definitions underneath /export/home/jenkins/workspace/Lucene-Solr-master-Solaris/solr/build/solr-core/test/J0/temp/solr.cloud.TestSolrCloudWithDelegationTokens_5D4C2B793AE9A9E3-001/tempDir-001/node1/.
   [junit4]   2> 1438557 INFO  (jetty-launcher-1936-thread-2) [n:127.0.0.1:34833_solr 
  ] o.a.s.c.CorePropertiesLocator Found 0 core definitions underneath /export/home/jenkins/workspace/Lucene-Solr-master-Solaris/solr/build/solr-core/test/J0/temp/solr.cloud.TestSolrCloudWithDelegationTokens_5D4C2B793AE9A9E3-001/tempDir-001/node2/.
   [junit4]   2> 1438599 INFO  (TEST-TestSolrCloudWithDelegationTokens.testDelegationTokenRenew-seed#[5D4C2B793AE9A9E3])
[    ] o.a.s.SolrTestCaseJ4 ###Starting testDelegationTokenRenew
   [junit4]   2> 1438684 INFO  (qtp2080320930-12171) [n:127.0.0.1:40185_solr    ] o.a.s.h.a.CollectionsHandler
Invoked Collection Action :list with params action=LIST&delegation=GgADYmFyA2JhcgCKAVjnsVEjigFZC73VIwEDFCGVbSpieT2oaulanJZhx3TU7vP2B3NvbHItZHQA&wt=javabin&version=2
and sendToOCPQueue=true
   [junit4]   2> 1438684 INFO  (qtp2080320930-12171) [n:127.0.0.1:40185_solr    ] o.a.s.s.HttpSolrCall
[admin] webapp=null path=/admin/collections params={action=LIST&delegation=GgADYmFyA2JhcgCKAVjnsVEjigFZC73VIwEDFCGVbSpieT2oaulanJZhx3TU7vP2B3NvbHItZHQA&wt=javabin&version=2}
status=0 QTime=0
   [junit4]   2> 1438705 INFO  (qtp1047257633-12166) [n:127.0.0.1:34833_solr    ] o.a.s.h.a.CollectionsHandler
Invoked Collection Action :list with params action=LIST&delegation=GgADYmFyA2JhcgCKAVjnsVEjigFZC73VIwEDFCGVbSpieT2oaulanJZhx3TU7vP2B3NvbHItZHQA&wt=javabin&version=2
and sendToOCPQueue=true
   [junit4]   2> 1438705 INFO  (qtp1047257633-12166) [n:127.0.0.1:34833_solr    ] o.a.s.s.HttpSolrCall
[admin] webapp=null path=/admin/collections params={action=LIST&delegation=GgADYmFyA2JhcgCKAVjnsVEjigFZC73VIwEDFCGVbSpieT2oaulanJZhx3TU7vP2B3NvbHItZHQA&wt=javabin&version=2}
status=0 QTime=0
   [junit4]   2> 1438711 INFO  (TEST-TestSolrCloudWithDelegationTokens.testDelegationTokenRenew-seed#[5D4C2B793AE9A9E3])
[    ] o.a.s.c.c.ZkStateReader Updated live nodes from ZooKeeper... (0) -> (2)
   [junit4]   2> 1438713 INFO  (TEST-TestSolrCloudWithDelegationTokens.testDelegationTokenRenew-seed#[5D4C2B793AE9A9E3])
[    ] o.a.s.c.s.i.ZkClientClusterStateProvider Cluster at 127.0.0.1:43406/solr ready
   [junit4]   2> 1438744 INFO  (TEST-TestSolrCloudWithDelegationTokens.testDelegationTokenRenew-seed#[5D4C2B793AE9A9E3])
[    ] o.a.s.c.c.ZkStateReader Updated live nodes from ZooKeeper... (0) -> (2)
   [junit4]   2> 1438745 INFO  (TEST-TestSolrCloudWithDelegationTokens.testDelegationTokenRenew-seed#[5D4C2B793AE9A9E3])
[    ] o.a.s.c.s.i.ZkClientClusterStateProvider Cluster at 127.0.0.1:43406/solr ready
   [junit4]   2> 1438747 INFO  (qtp1047257633-12169) [n:127.0.0.1:34833_solr    ] o.a.s.h.a.CollectionsHandler
Invoked Collection Action :list with params action=LIST&delegation=GgADYmFyA2JhcgCKAVjnsVGEigFZC73VhAIDFFOTtjonWvpywlQOSFZjff59_p1rB3NvbHItZHQA&wt=javabin&version=2
and sendToOCPQueue=true
   [junit4]   2> 1438748 INFO  (qtp1047257633-12169) [n:127.0.0.1:34833_solr    ] o.a.s.s.HttpSolrCall
[admin] webapp=null path=/admin/collections params={action=LIST&delegation=GgADYmFyA2JhcgCKAVjnsVGEigFZC73VhAIDFFOTtjonWvpywlQOSFZjff59_p1rB3NvbHItZHQA&wt=javabin&version=2}
status=0 QTime=0
   [junit4]   2> 1438764 INFO  (qtp1047257633-12176) [n:127.0.0.1:34833_solr    ] o.a.s.h.a.CollectionsHandler
Invoked Collection Action :list with params action=LIST&delegation=GgADYmFyA2JhcgCKAVjnsVGEigFZC73VhAIDFFOTtjonWvpywlQOSFZjff59_p1rB3NvbHItZHQA&wt=javabin&version=2
and sendToOCPQueue=true
   [junit4]   2> 1438764 INFO  (qtp1047257633-12176) [n:127.0.0.1:34833_solr    ] o.a.s.s.HttpSolrCall
[admin] webapp=null path=/admin/collections params={action=LIST&delegation=GgADYmFyA2JhcgCKAVjnsVGEigFZC73VhAIDFFOTtjonWvpywlQOSFZjff59_p1rB3NvbHItZHQA&wt=javabin&version=2}
status=0 QTime=0
   [junit4]   2> 1438770 INFO  (TEST-TestSolrCloudWithDelegationTokens.testDelegationTokenRenew-seed#[5D4C2B793AE9A9E3])
[    ] o.a.s.c.c.ZkStateReader Updated live nodes from ZooKeeper... (0) -> (2)
   [junit4]   2> 1438771 INFO  (TEST-TestSolrCloudWithDelegationTokens.testDelegationTokenRenew-seed#[5D4C2B793AE9A9E3])
[    ] o.a.s.c.s.i.ZkClientClusterStateProvider Cluster at 127.0.0.1:43406/solr ready
   [junit4]   2> 1438786 INFO  (qtp2080320930-12172) [n:127.0.0.1:40185_solr    ] o.a.s.h.a.CollectionsHandler
Invoked Collection Action :list with params action=LIST&delegation=GgADYmFyA2JhcgCKAVjnsVG9igFZC73VvQMDFDgbU7ByB4bpzBiXUjn3YGQhyuKAB3NvbHItZHQA&wt=javabin&version=2
and sendToOCPQueue=true
   [junit4]   2> 1438787 INFO  (qtp2080320930-12172) [n:127.0.0.1:40185_solr    ] o.a.s.s.HttpSolrCall
[admin] webapp=null path=/admin/collections params={action=LIST&delegation=GgADYmFyA2JhcgCKAVjnsVG9igFZC73VvQMDFDgbU7ByB4bpzBiXUjn3YGQhyuKAB3NvbHItZHQA&wt=javabin&version=2}
status=0 QTime=0
   [junit4]   2> 1438792 INFO  (TEST-TestSolrCloudWithDelegationTokens.testDelegationTokenRenew-seed#[5D4C2B793AE9A9E3])
[    ] o.a.s.c.c.ZkStateReader Updated live nodes from ZooKeeper... (0) -> (2)
   [junit4]   2> 1438794 INFO  (TEST-TestSolrCloudWithDelegationTokens.testDelegationTokenRenew-seed#[5D4C2B793AE9A9E3])
[    ] o.a.s.c.s.i.ZkClientClusterStateProvider Cluster at 127.0.0.1:43406/solr ready
   [junit4]   2> 1438800 INFO  (qtp1047257633-12176) [n:127.0.0.1:34833_solr    ] o.a.s.h.a.CollectionsHandler
Invoked Collection Action :list with params action=LIST&delegation=GgADYmFyA2JhcgCKAVjnsVG9igFZC73VvQMDFDgbU7ByB4bpzBiXUjn3YGQhyuKAB3NvbHItZHQA&wt=javabin&version=2
and sendToOCPQueue=true
   [junit4]   2> 1438800 INFO  (qtp1047257633-12176) [n:127.0.0.1:34833_solr    ] o.a.s.s.HttpSolrCall
[admin] webapp=null path=/admin/collections params={action=LIST&delegation=GgADYmFyA2JhcgCKAVjnsVG9igFZC73VvQMDFDgbU7ByB4bpzBiXUjn3YGQhyuKAB3NvbHItZHQA&wt=javabin&version=2}
status=0 QTime=0
   [junit4]   2> 1438806 INFO  (TEST-TestSolrCloudWithDelegationTokens.testDelegationTokenRenew-seed#[5D4C2B793AE9A9E3])
[    ] o.a.s.c.c.ZkStateReader Updated live nodes from ZooKeeper... (0) -> (2)
   [junit4]   2> 1438807 INFO  (TEST-TestSolrCloudWithDelegationTokens.testDelegationTokenRenew-seed#[5D4C2B793AE9A9E3])
[    ] o.a.s.c.s.i.ZkClientClusterStateProvider Cluster at 127.0.0.1:43406/solr ready
   [junit4]   2> 1438823 INFO  (qtp2080320930-12170) [n:127.0.0.1:40185_solr    ] o.a.s.h.a.CollectionsHandler
Invoked Collection Action :list with params action=LIST&delegation=GgADYmFyA2JhcgCKAVjnsVHhigFZC73V4QQDFJbnzQxavGPuQ-ch0HjDD-EPvInSB3NvbHItZHQA&wt=javabin&version=2
and sendToOCPQueue=true
   [junit4]   2> 1438823 INFO  (qtp2080320930-12170) [n:127.0.0.1:40185_solr    ] o.a.s.s.HttpSolrCall
[admin] webapp=null path=/admin/collections params={action=LIST&delegation=GgADYmFyA2JhcgCKAVjnsVHhigFZC73V4QQDFJbnzQxavGPuQ-ch0HjDD-EPvInSB3NvbHItZHQA&wt=javabin&version=2}
status=0 QTime=0
   [junit4]   2> 1438828 INFO  (TEST-TestSolrCloudWithDelegationTokens.testDelegationTokenRenew-seed#[5D4C2B793AE9A9E3])
[    ] o.a.s.c.c.ZkStateReader Updated live nodes from ZooKeeper... (0) -> (2)
   [junit4]   2> 1438830 INFO  (TEST-TestSolrCloudWithDelegationTokens.testDelegationTokenRenew-seed#[5D4C2B793AE9A9E3])
[    ] o.a.s.c.s.i.ZkClientClusterStateProvider Cluster at 127.0.0.1:43406/solr ready
   [junit4]   2> 1438835 INFO  (qtp1047257633-12163) [n:127.0.0.1:34833_solr    ] o.a.s.h.a.CollectionsHandler
Invoked Collection Action :list with params action=LIST&delegation=GgADYmFyA2JhcgCKAVjnsVHhigFZC73V4QQDFJbnzQxavGPuQ-ch0HjDD-EPvInSB3NvbHItZHQA&wt=javabin&version=2
and sendToOCPQueue=true
   [junit4]   2> 1438835 INFO  (qtp1047257633-12163) [n:127.0.0.1:34833_solr    ] o.a.s.s.HttpSolrCall
[admin] webapp=null path=/admin/collections params={action=LIST&delegation=GgADYmFyA2JhcgCKAVjnsVHhigFZC73V4QQDFJbnzQxavGPuQ-ch0HjDD-EPvInSB3NvbHItZHQA&wt=javabin&version=2}
status=0 QTime=0
   [junit4]   2> 1438840 INFO  (TEST-TestSolrCloudWithDelegationTokens.testDelegationTokenRenew-seed#[5D4C2B793AE9A9E3])
[    ] o.a.s.c.c.ZkStateReader Updated live nodes from ZooKeeper... (0) -> (2)
   [junit4]   2> 1438842 INFO  (TEST-TestSolrCloudWithDelegationTokens.testDelegationTokenRenew-seed#[5D4C2B793AE9A9E3])
[    ] o.a.s.c.s.i.ZkClientClusterStateProvider Cluster at 127.0.0.1:43406/solr ready
   [junit4]   2> 1438845 INFO  (TEST-TestSolrCloudWithDelegationTokens.testDelegationTokenRenew-seed#[5D4C2B793AE9A9E3])
[    ] o.a.s.SolrTestCaseJ4 ###Ending testDelegationTokenRenew
   [junit4]   2> 1438870 INFO  (TEST-TestSolrCloudWithDelegationTokens.testDelegationTokenSolrClient-seed#[5D4C2B793AE9A9E3])
[    ] o.a.s.SolrTestCaseJ4 ###Starting testDelegationTokenSolrClient
   [junit4]   2> 1438879 INFO  (qtp2080320930-12172) [n:127.0.0.1:40185_solr    ] o.a.s.h.a.CollectionsHandler
Invoked Collection Action :list with params action=LIST&delegation=GgADYmFyA2JhcgCKAVjnsVIcigFZC73WHAUDFJHrxtNcg-duV64R-hejG2EK2myxB3NvbHItZHQA&wt=javabin&version=2
and sendToOCPQueue=true
   [junit4]   2> 1438879 INFO  (qtp2080320930-12172) [n:127.0.0.1:40185_solr    ] o.a.s.s.HttpSolrCall
[admin] webapp=null path=/admin/collections params={action=LIST&delegation=GgADYmFyA2JhcgCKAVjnsVIcigFZC73WHAUDFJHrxtNcg-duV64R-hejG2EK2myxB3NvbHItZHQA&wt=javabin&version=2}
status=0 QTime=0
   [junit4]   2> 1438880 INFO  (TEST-TestSolrCloudWithDelegationTokens.testDelegationTokenSolrClient-seed#[5D4C2B793AE9A9E3])
[    ] o.a.s.SolrTestCaseJ4 ###Ending testDelegationTokenSolrClient
   [junit4]   2> 1438907 INFO  (TEST-TestSolrCloudWithDelegationTokens.testDelegationTokenRenewFail-seed#[5D4C2B793AE9A9E3])
[    ] o.a.s.SolrTestCaseJ4 ###Starting testDelegationTokenRenewFail
   [junit4]   2> 1438913 WARN  (qtp2080320930-12174) [    ] o.a.h.s.a.s.AuthenticationFilter
Authentication exception: org.apache.hadoop.security.AccessControlException: foo tries to
renew a token with renewer bar
   [junit4]   2> 1438913 WARN  (qtp2080320930-12174) [    ] o.a.s.s.KerberosPlugin Could
not find org.apache.solr.security.kerberosplugin.requestcontinues
   [junit4]   2> 1438914 WARN  (qtp1047257633-12169) [n:127.0.0.1:34833_solr    ] o.a.h.s.a.s.AuthenticationFilter
Authentication exception: org.apache.hadoop.security.AccessControlException: foo tries to
renew a token with renewer bar
   [junit4]   2> 1438918 WARN  (qtp1047257633-12169) [n:127.0.0.1:34833_solr    ] o.a.s.s.KerberosPlugin
Could not find org.apache.solr.security.kerberosplugin.requestcontinues
   [junit4]   2> 1438923 WARN  (qtp2080320930-12168) [    ] o.a.h.s.a.s.AuthenticationFilter
Authentication exception: org.apache.hadoop.security.AccessControlException: notRenewUser
tries to renew a token with renewer renewUser
   [junit4]   2> 1438924 WARN  (qtp2080320930-12168) [    ] o.a.s.s.KerberosPlugin Could
not find org.apache.solr.security.kerberosplugin.requestcontinues
   [junit4]   2> 1438925 WARN  (qtp1047257633-12176) [n:127.0.0.1:34833_solr    ] o.a.h.s.a.s.AuthenticationFilter
Authentication exception: org.apache.hadoop.security.AccessControlException: notRenewUser
tries to renew a token with renewer renewUser
   [junit4]   2> 1438925 WARN  (qtp1047257633-12176) [n:127.0.0.1:34833_solr    ] o.a.s.s.KerberosPlugin
Could not find org.apache.solr.security.kerberosplugin.requestcontinues
   [junit4]   2> 1438925 INFO  (TEST-TestSolrCloudWithDelegationTokens.testDelegationTokenRenewFail-seed#[5D4C2B793AE9A9E3])
[    ] o.a.s.SolrTestCaseJ4 ###Ending testDelegationTokenRenewFail
   [junit4]   2> 1438973 INFO  (TEST-TestSolrCloudWithDelegationTokens.testDelegationTokenVerify-seed#[5D4C2B793AE9A9E3])
[    ] o.a.s.SolrTestCaseJ4 ###Starting testDelegationTokenVerify
   [junit4]   2> 1438989 INFO  (qtp2080320930-12164) [n:127.0.0.1:40185_solr    ] o.a.s.h.a.CollectionsHandler
Invoked Collection Action :list with params action=LIST&delegation=GgADYmFyA2JhcgCKAVjnsVKEigFZC73WhAgDFMHNhNZGqDRqNRHGzOIeJVkKiDeYB3NvbHItZHQA&wt=javabin&version=2
and sendToOCPQueue=true
   [junit4]   2> 1438989 INFO  (qtp2080320930-12164) [n:127.0.0.1:40185_solr    ] o.a.s.s.HttpSolrCall
[admin] webapp=null path=/admin/collections params={action=LIST&delegation=GgADYmFyA2JhcgCKAVjnsVKEigFZC73WhAgDFMHNhNZGqDRqNRHGzOIeJVkKiDeYB3NvbHItZHQA&wt=javabin&version=2}
status=0 QTime=0
   [junit4]   2> 1438994 INFO  (qtp1047257633-12173) [n:127.0.0.1:34833_solr    ] o.a.s.h.a.CollectionsHandler
Invoked Collection Action :list with params action=LIST&delegation=GgADYmFyA2JhcgCKAVjnsVKEigFZC73WhAgDFMHNhNZGqDRqNRHGzOIeJVkKiDeYB3NvbHItZHQA&wt=javabin&version=2
and sendToOCPQueue=true
   [junit4]   2> 1438994 INFO  (qtp1047257633-12173) [n:127.0.0.1:34833_solr    ] o.a.s.s.HttpSolrCall
[admin] webapp=null path=/admin/collections params={action=LIST&delegation=GgADYmFyA2JhcgCKAVjnsVKEigFZC73WhAgDFMHNhNZGqDRqNRHGzOIeJVkKiDeYB3NvbHItZHQA&wt=javabin&version=2}
status=0 QTime=0
   [junit4]   2> 1439000 INFO  (TEST-TestSolrCloudWithDelegationTokens.testDelegationTokenVerify-seed#[5D4C2B793AE9A9E3])
[    ] o.a.s.c.c.ZkStateReader Updated live nodes from ZooKeeper... (0) -> (2)
   [junit4]   2> 1439002 INFO  (TEST-TestSolrCloudWithDelegationTokens.testDelegationTokenVerify-seed#[5D4C2B793AE9A9E3])
[    ] o.a.s.c.s.i.ZkClientClusterStateProvider Cluster at 127.0.0.1:43406/solr ready
   [junit4]   2> 1439004 WARN  (NIOServerCxn.Factory:0.0.0.0/0.0.0.0:0) [    ] o.a.z.s.NIOServerCnxn
caught end of stream exception
   [junit4]   2> EndOfStreamException: Unable to read additional data from client sessionid
0x158e7b14ee90011, likely client has closed socket
   [junit4]   2> 	at org.apache.zookeeper.server.NIOServerCnxn.doIO(NIOServerCnxn.java:228)
   [junit4]   2> 	at org.apache.zookeeper.server.NIOServerCnxnFactory.run(NIOServerCnxnFactory.java:208)
   [junit4]   2> 	at java.lang.Thread.run(Thread.java:745)
   [junit4]   2> 1439005 INFO  (TEST-TestSolrCloudWithDelegationTokens.testDelegationTokenVerify-seed#[5D4C2B793AE9A9E3])
[    ] o.a.s.SolrTestCaseJ4 ###Ending testDelegationTokenVerify
   [junit4]   2> 1439038 INFO  (TEST-TestSolrCloudWithDelegationTokens.testDelegationTokenCancelFail-seed#[5D4C2B793AE9A9E3])
[    ] o.a.s.SolrTestCaseJ4 ###Starting testDelegationTokenCancelFail
   [junit4]   2> 1439063 ERROR (qtp1047257633-12163) [n:127.0.0.1:34833_solr    ] o.a.h.s.t.d.ZKDelegationTokenSecretManager
No node in path [/ZKDTSMTokensRoot/DT_9]
   [junit4]   2> 1439063 ERROR (qtp1047257633-12163) [n:127.0.0.1:34833_solr    ] o.a.h.s.t.d.ZKDelegationTokenSecretManager
Exception while checking if token exist !!
   [junit4]   2> org.apache.hadoop.security.token.SecretManager$InvalidToken: Token not
found
   [junit4]   2> 	at org.apache.hadoop.security.token.delegation.AbstractDelegationTokenSecretManager.cancelToken(AbstractDelegationTokenSecretManager.java:537)
   [junit4]   2> 	at org.apache.hadoop.security.token.delegation.ZKDelegationTokenSecretManager.cancelToken(ZKDelegationTokenSecretManager.java:800)
   [junit4]   2> 	at org.apache.hadoop.security.token.delegation.web.DelegationTokenManager.cancelToken(DelegationTokenManager.java:187)
   [junit4]   2> 	at org.apache.hadoop.security.token.delegation.web.DelegationTokenAuthenticationHandler.managementOperation(DelegationTokenAuthenticationHandler.java:264)
   [junit4]   2> 	at org.apache.solr.security.KerberosPlugin$RequestContinuesRecorderAuthenticationHandler.managementOperation(KerberosPlugin.java:566)
   [junit4]   2> 	at org.apache.hadoop.security.authentication.server.AuthenticationFilter.doFilter(AuthenticationFilter.java:514)
   [junit4]   2> 	at org.apache.solr.security.DelegationTokenKerberosFilter.doFilter(DelegationTokenKerberosFilter.java:128)
   [junit4]   2> 	at org.apache.solr.security.HttpParamDelegationTokenPlugin$HttpParamToRequestFilter.doFilter(HttpParamDelegationTokenPlugin.java:245)
   [junit4]   2> 	at org.apache.solr.security.KerberosPlugin.doAuthenticate(KerberosPlugin.java:265)
   [junit4]   2> 	at org.apache.solr.servlet.SolrDispatchFilter.authenticateRequest(SolrDispatchFilter.java:362)
   [junit4]   2> 	at org.apache.solr.servlet.SolrDispatchFilter.doFilter(SolrDispatchFilter.java:268)
   [junit4]   2> 	at org.apache.solr.servlet.SolrDispatchFilter.doFilter(SolrDispatchFilter.java:254)
   [junit4]   2> 	at org.eclipse.jetty.servlet.ServletHandler$CachedChain.doFilter(ServletHandler.java:1699)
   [junit4]   2> 	at org.apache.solr.client.solrj.embedded.JettySolrRunner$DebugFilter.doFilter(JettySolrRunner.java:113)
   [junit4]   2> 	at org.eclipse.jetty.servlet.ServletHandler$CachedChain.doFilter(ServletHandler.java:1699)
   [junit4]   2> 	at org.eclipse.jetty.servlet.ServletHandler.doHandle(ServletHandler.java:582)
   [junit4]   2> 	at org.eclipse.jetty.server.session.SessionHandler.doHandle(SessionHandler.java:224)
   [junit4]   2> 	at org.eclipse.jetty.server.handler.ContextHandler.doHandle(ContextHandler.java:1180)
   [junit4]   2> 	at org.eclipse.jetty.servlet.ServletHandler.doScope(ServletHandler.java:512)
   [junit4]   2> 	at org.eclipse.jetty.server.session.SessionHandler.doScope(SessionHandler.java:185)
   [junit4]   2> 	at org.eclipse.jetty.server.handler.ContextHandler.doScope(ContextHandler.java:1112)
   [junit4]   2> 	at org.eclipse.jetty.server.handler.ScopedHandler.handle(ScopedHandler.java:141)
   [junit4]   2> 	at org.eclipse.jetty.server.handler.gzip.GzipHandler.handle(GzipHandler.java:395)
   [junit4]   2> 	at org.eclipse.jetty.server.handler.HandlerWrapper.handle(HandlerWrapper.java:134)
   [junit4]   2> 	at org.eclipse.jetty.server.Server.handle(Server.java:534)
   [junit4]   2> 	at org.eclipse.jetty.server.HttpChannel.handle(HttpChannel.java:320)
   [junit4]   2> 	at org.eclipse.jetty.server.HttpConnection.onFillable(HttpConnection.java:251)
   [junit4]   2> 	at org.eclipse.jetty.io.AbstractConnection$ReadCallback.succeeded(AbstractConnection.java:273)
   [junit4]   2> 	at org.eclipse.jetty.io.FillInterest.fillable(FillInterest.java:95)
   [junit4]   2> 	at org.eclipse.jetty.io.SelectChannelEndPoint$2.run(SelectChannelEndPoint.java:93)
   [junit4]   2> 	at org.eclipse.jetty.util.thread.strategy.ExecuteProduceConsume.executeProduceConsume(ExecuteProduceConsume.java:303)
   [junit4]   2> 	at org.eclipse.jetty.util.thread.strategy.ExecuteProduceConsume.produceConsume(ExecuteProduceConsume.java:148)
   [junit4]   2> 	at org.eclipse.jetty.util.thread.strategy.ExecuteProduceConsume.run(ExecuteProduceConsume.java:136)
   [junit4]   2> 	at org.eclipse.jetty.util.thread.QueuedThreadPool.runJob(QueuedThreadPool.java:671)
   [junit4]   2> 	at org.eclipse.jetty.util.thread.QueuedThreadPool$2.run(QueuedThreadPool.java:589)
   [junit4]   2> 	at java.lang.Thread.run(Thread.java:745)
   [junit4]   2> 1439064 INFO  (TEST-TestSolrCloudWithDelegationTokens.testDelegationTokenCancelFail-seed#[5D4C2B793AE9A9E3])
[    ] o.a.s.SolrTestCaseJ4 ###Ending testDelegationTokenCancelFail
   [junit4]   2> NOTE: reproduce with: ant test  -Dtestcase=TestSolrCloudWithDelegationTokens
-Dtests.method=testDelegationTokenCancelFail -Dtests.seed=5D4C2B793AE9A9E3 -Dtests.slow=true
-Dtests.locale=en-GB -Dtests.timezone=Pacific/Tarawa -Dtests.asserts=true -Dtests.file.encoding=US-ASCII
   [junit4] FAILURE 0.06s J0 | TestSolrCloudWithDelegationTokens.testDelegationTokenCancelFail
<<<
   [junit4]    > Throwable #1: java.lang.AssertionError: expected:<200> but was:<404>
   [junit4]    > 	at __randomizedtesting.SeedInfo.seed([5D4C2B793AE9A9E3:35F31E53EA73BB0F]:0)
   [junit4]    > 	at org.apache.solr.cloud.TestSolrCloudWithDelegationTokens.cancelDelegationToken(TestSolrCloudWithDelegationTokens.java:140)
   [junit4]    > 	at org.apache.solr.cloud.TestSolrCloudWithDelegationTokens.testDelegationTokenCancelFail(TestSolrCloudWithDelegationTokens.java:294)
   [junit4]    > 	at java.lang.Thread.run(Thread.java:745)
   [junit4]   2> 1439098 INFO  (TEST-TestSolrCloudWithDelegationTokens.testZNodePaths-seed#[5D4C2B793AE9A9E3])
[    ] o.a.s.SolrTestCaseJ4 ###Starting testZNodePaths
   [junit4]   2> 1439109 INFO  (TEST-TestSolrCloudWithDelegationTokens.testZNodePaths-seed#[5D4C2B793AE9A9E3])
[    ] o.a.s.SolrTestCaseJ4 ###Ending testZNodePaths
   [junit4]   2> 1439141 INFO  (TEST-TestSolrCloudWithDelegationTokens.testDelegationTokenCancel-seed#[5D4C2B793AE9A9E3])
[    ] o.a.s.SolrTestCaseJ4 ###Starting testDelegationTokenCancel
   [junit4]   2> 1439159 INFO  (TEST-TestSolrCloudWithDelegationTokens.testDelegationTokenCancel-seed#[5D4C2B793AE9A9E3])
[    ] o.a.s.c.c.ZkStateReader Updated live nodes from ZooKeeper... (0) -> (2)
   [junit4]   2> 1439161 INFO  (TEST-TestSolrCloudWithDelegationTokens.testDelegationTokenCancel-seed#[5D4C2B793AE9A9E3])
[    ] o.a.s.c.s.i.ZkClientClusterStateProvider Cluster at 127.0.0.1:43406/solr ready
   [junit4]   2> 1439163 ERROR (qtp1047257633-12178) [    ] o.a.h.s.t.d.ZKDelegationTokenSecretManager
No node in path [/ZKDTSMTokensRoot/DT_11]
   [junit4]   2> 1439175 INFO  (TEST-TestSolrCloudWithDelegationTokens.testDelegationTokenCancel-seed#[5D4C2B793AE9A9E3])
[    ] o.a.s.c.c.ZkStateReader Updated live nodes from ZooKeeper... (0) -> (2)
   [junit4]   2> 1439176 INFO  (TEST-TestSolrCloudWithDelegationTokens.testDelegationTokenCancel-seed#[5D4C2B793AE9A9E3])
[    ] o.a.s.c.s.i.ZkClientClusterStateProvider Cluster at 127.0.0.1:43406/solr ready
   [junit4]   2> 1439193 ERROR (qtp1047257633-12167) [    ] o.a.h.s.t.d.ZKDelegationTokenSecretManager
No node in path [/ZKDTSMTokensRoot/DT_12]
   [junit4]   2> 1439202 INFO  (TEST-TestSolrCloudWithDelegationTokens.testDelegationTokenCancel-seed#[5D4C2B793AE9A9E3])
[    ] o.a.s.SolrTestCaseJ4 ###Ending testDelegationTokenCancel
   [junit4]   2> 1439240 INFO  (TEST-TestSolrCloudWithDelegationTokens.testDelegationOtherOp-seed#[5D4C2B793AE9A9E3])
[    ] o.a.s.SolrTestCaseJ4 ###Starting testDelegationOtherOp
   [junit4]   2> 1439243 INFO  (qtp2080320930-12170) [n:127.0.0.1:40185_solr    ] o.a.s.h.a.CollectionsHandler
Invoked Collection Action :list with params op=someSolrOperation&action=LIST&wt=javabin&version=2
and sendToOCPQueue=true
   [junit4]   2> 1439243 INFO  (qtp2080320930-12170) [n:127.0.0.1:40185_solr    ] o.a.s.s.HttpSolrCall
[admin] webapp=null path=/admin/collections params={op=someSolrOperation&action=LIST&wt=javabin&version=2}
status=0 QTime=0
   [junit4]   2> 1439244 INFO  (TEST-TestSolrCloudWithDelegationTokens.testDelegationOtherOp-seed#[5D4C2B793AE9A9E3])
[    ] o.a.s.SolrTestCaseJ4 ###Ending testDelegationOtherOp
   [junit4]   2> 1439245 INFO  (jetty-launcher-1936-thread-1) [    ] o.e.j.s.AbstractConnector
Stopped ServerConnector@4ac53945{HTTP/1.1,[http/1.1]}{127.0.0.1:0}
   [junit4]   2> 1439245 INFO  (jetty-launcher-1936-thread-2) [    ] o.e.j.s.AbstractConnector
Stopped ServerConnector@1dac68c6{HTTP/1.1,[http/1.1]}{127.0.0.1:0}
   [junit4]   2> 1439246 INFO  (jetty-launcher-1936-thread-1) [    ] o.a.s.c.CoreContainer
Shutting down CoreContainer instance=739891492
   [junit4]   2> 1439246 INFO  (jetty-launcher-1936-thread-2) [    ] o.a.s.c.CoreContainer
Shutting down CoreContainer instance=1563081050
   [junit4]   2> 1439256 INFO  (jetty-launcher-1936-thread-2) [    ] o.a.s.c.Overseer Overseer
(id=97082140707586053-127.0.0.1:40185_solr-n_0000000000) closing
   [junit4]   2> 1439257 INFO  (OverseerStateUpdate-97082140707586053-127.0.0.1:40185_solr-n_0000000000)
[n:127.0.0.1:40185_solr    ] o.a.s.c.Overseer Overseer Loop exiting : 127.0.0.1:40185_solr
   [junit4]   2> 1439257 INFO  (zkCallback-1946-thread-3-processing-n:127.0.0.1:40185_solr)
[n:127.0.0.1:40185_solr    ] o.a.s.c.c.ZkStateReader Updated live nodes from ZooKeeper...
(2) -> (1)
   [junit4]   2> 1439260 WARN  (zkCallback-1946-thread-3-processing-n:127.0.0.1:40185_solr)
[n:127.0.0.1:40185_solr    ] o.a.s.c.c.ZkStateReader ZooKeeper watch triggered, but Solr cannot
talk to ZK: [KeeperErrorCode = Session expired for /live_nodes]
   [junit4]   2> 1439260 WARN  (NIOServerCxn.Factory:0.0.0.0/0.0.0.0:0) [    ] o.a.z.s.NIOServerCnxn
caught end of stream exception
   [junit4]   2> EndOfStreamException: Unable to read additional data from client sessionid
0x158e7b14ee90005, likely client has closed socket
   [junit4]   2> 	at org.apache.zookeeper.server.NIOServerCnxn.doIO(NIOServerCnxn.java:228)
   [junit4]   2> 	at org.apache.zookeeper.server.NIOServerCnxnFactory.run(NIOServerCnxnFactory.java:208)
   [junit4]   2> 	at java.lang.Thread.run(Thread.java:745)
   [junit4]   2> 1439261 ERROR (Thread[Thread-2887,5,TGRP-TestSolrCloudWithDelegationTokens])
[n:127.0.0.1:40185_solr    ] o.a.h.s.t.d.AbstractDelegationTokenSecretManager ExpiredTokenRemover
received java.lang.InterruptedException: sleep interrupted
   [junit4]   2> 1439273 WARN  (NIOServerCxn.Factory:0.0.0.0/0.0.0.0:0) [    ] o.a.z.s.NIOServerCnxn
caught end of stream exception
   [junit4]   2> EndOfStreamException: Unable to read additional data from client sessionid
0x158e7b14ee90008, likely client has closed socket
   [junit4]   2> 	at org.apache.zookeeper.server.NIOServerCnxn.doIO(NIOServerCnxn.java:228)
   [junit4]   2> 	at org.apache.zookeeper.server.NIOServerCnxnFactory.run(NIOServerCnxnFactory.java:208)
   [junit4]   2> 	at java.lang.Thread.run(Thread.java:745)
   [junit4]   2> 1439274 INFO  (jetty-launcher-1936-thread-2) [    ] o.e.j.s.h.ContextHandler
Stopped o.e.j.s.ServletContextHandler@7159a6e1{/solr,null,UNAVAILABLE}
   [junit4]   2> 1440756 WARN  (zkCallback-1947-thread-1-processing-n:127.0.0.1:34833_solr)
[n:127.0.0.1:34833_solr    ] o.a.s.c.c.ZkStateReader ZooKeeper watch triggered, but Solr cannot
talk to ZK: [KeeperErrorCode = Session expired for /live_nodes]
   [junit4]   2> 1440757 ERROR (Thread[Thread-2889,5,TGRP-TestSolrCloudWithDelegationTokens])
[n:127.0.0.1:34833_solr    ] o.a.h.s.t.d.AbstractDelegationTokenSecretManager ExpiredTokenRemover
received java.lang.InterruptedException: sleep interrupted
   [junit4]   2> 1440761 INFO  (jetty-launcher-1936-thread-1) [    ] o.e.j.s.h.ContextHandler
Stopped o.e.j.s.ServletContextHandler@6a63c7fc{/solr,null,UNAVAILABLE}
   [junit4]   2> 1440765 INFO  (SUITE-TestSolrCloudWithDelegationTokens-seed#[5D4C2B793AE9A9E3]-worker)
[    ] o.a.s.c.ZkTestServer connecting to 127.0.0.1:43406 43406
   [junit4]   2> 1440858 INFO  (Thread-2870) [    ] o.a.s.c.ZkTestServer connecting to
127.0.0.1:43406 43406
   [junit4]   2> 1440860 WARN  (Thread-2870) [    ] o.a.s.c.ZkTestServer Watch limit violations:

   [junit4]   2> Maximum concurrent create/delete watches above limit:
   [junit4]   2> 
   [junit4]   2> 	12	/solr/aliases.json
   [junit4]   2> 	12	/solr/clusterprops.json
   [junit4]   2> 	2	/solr/security.json
   [junit4]   2> 
   [junit4]   2> Maximum concurrent data watches above limit:
   [junit4]   2> 
   [junit4]   2> 	12	/solr/clusterstate.json
   [junit4]   2> 	3	/solr/security/zkdtsm/ZKDTSMRoot/ZKDTSMKeyIdRoot
   [junit4]   2> 	2	/solr/security/zkdtsm/ZKDTSMRoot/ZKDTSMTokensRoot/DT_7
   [junit4]   2> 	2	/solr/security/zkdtsm/ZKDTSMRoot/ZKDTSMTokensRoot/DT_6
   [junit4]   2> 	2	/solr/security/zkdtsm/ZKDTSMRoot/ZKDTSMTokensRoot/DT_8
   [junit4]   2> 	2	/solr/security/zkdtsm/ZKDTSMRoot/ZKDTSMMasterKeyRoot/DK_1
   [junit4]   2> 	2	/solr/security/zkdtsm/ZKDTSMRoot/ZKDTSMTokensRoot/DT_1
   [junit4]   2> 	2	/solr/security/zkdtsm/ZKDTSMRoot/ZKDTSMMasterKeyRoot/DK_3
   [junit4]   2> 	2	/solr/security/zkdtsm/ZKDTSMRoot/ZKDTSMTokensRoot/DT_3
   [junit4]   2> 	2	/solr/security/zkdtsm/ZKDTSMRoot/ZKDTSMMasterKeyRoot/DK_2
   [junit4]   2> 	2	/solr/security/zkdtsm/ZKDTSMRoot/ZKDTSMTokensRoot/DT_2
   [junit4]   2> 	2	/solr/security/zkdtsm/ZKDTSMRoot/ZKDTSMTokensRoot/DT_5
   [junit4]   2> 	2	/solr/security/zkdtsm/ZKDTSMRoot/ZKDTSMMasterKeyRoot/DK_4
   [junit4]   2> 	2	/solr/security/zkdtsm/ZKDTSMRoot/ZKDTSMTokensRoot/DT_4
   [junit4]   2> 	2	/solr/security/zkdtsm/ZKDTSMRoot/ZKDTSMTokensRoot/DT_12
   [junit4]   2> 	2	/solr/security/zkdtsm/ZKDTSMRoot/ZKDTSMSeqNumRoot
   [junit4]   2> 	2	/solr/security/zkdtsm/ZKDTSMRoot/ZKDTSMTokensRoot/DT_11
   [junit4]   2> 	2	/solr/security/zkdtsm/ZKDTSMRoot/ZKDTSMTokensRoot/DT_10
   [junit4]   2> 
   [junit4]   2> Maximum concurrent children watches above limit:
   [junit4]   2> 
   [junit4]   2> 	12	/solr/live_nodes
   [junit4]   2> 	12	/solr/collections
   [junit4]   2> 	3	/solr/overseer/queue
   [junit4]   2> 	2	/solr/security/zkdtsm/ZKDTSMRoot/ZKDTSMMasterKeyRoot
   [junit4]   2> 	2	/solr/overseer/queue-work
   [junit4]   2> 	2	/solr/security/zkdtsm/ZKDTSMRoot/ZKDTSMTokensRoot
   [junit4]   2> 
   [junit4]   2> 1440861 INFO  (SUITE-TestSolrCloudWithDelegationTokens-seed#[5D4C2B793AE9A9E3]-worker)
[    ] o.a.s.SolrTestCaseJ4 ###deleteCore
   [junit4]   2> NOTE: leaving temporary files on disk at: /export/home/jenkins/workspace/Lucene-Solr-master-Solaris/solr/build/solr-core/test/J0/temp/solr.cloud.TestSolrCloudWithDelegationTokens_5D4C2B793AE9A9E3-001
   [junit4]   2> Dec 10, 2016 7:45:09 AM com.carrotsearch.randomizedtesting.ThreadLeakControl
checkThreadLeaks
   [junit4]   2> WARNING: Will linger awaiting termination of 1 leaked thread(s).
   [junit4]   2> NOTE: test params are: codec=CheapBastard, sim=RandomSimilarity(queryNorm=true):
{}, locale=en-GB, timezone=Pacific/Tarawa
   [junit4]   2> NOTE: SunOS 5.11 amd64/Oracle Corporation 1.8.0_112 (64-bit)/cpus=3,threads=1,free=117523960,total=363036672
   [junit4]   2> NOTE: All tests run in this JVM: [RequiredFieldsTest, OverseerTest, DeleteLastCustomShardedReplicaTest,
CustomCollectionTest, SyncSliceTest, TestElisionMultitermQuery, SolrCLIZkUtilsTest, HdfsChaosMonkeyNothingIsSafeTest,
TestOnReconnectListenerSupport, TestPostingsSolrHighlighter, HardAutoCommitTest, StatelessScriptUpdateProcessorFactoryTest,
DeleteStatusTest, TestInitQParser, ParsingFieldUpdateProcessorsTest, BufferStoreTest, NumericFieldsTest,
SampleTest, TestFieldCacheWithThreads, TestManagedResource, MultiTermTest, TestRequestStatusCollectionAPI,
TestCSVLoader, TestCSVResponseWriter, TestSolrCloudSnapshots, EnumFieldTest, TestSolrJ, TestRandomRequestDistribution,
ClassificationUpdateProcessorTest, TestReplicationHandlerBackup, TestLRUCache, SSLMigrationTest,
TestConfigSetsAPIExclusivity, TestUpdate, DistributedSpellCheckComponentTest, TestUninvertingReader,
TestSlowCompositeReaderWrapper, DirectUpdateHandlerTest, TestQuerySenderNoQuery, TestTestInjection,
JSONWriterTest, RecoveryZkTest, TestGroupingSearch, DeleteReplicaTest, TestQueryWrapperFilter,
ReplaceNodeTest, DirectSolrSpellCheckerTest, DistributedQueueTest, TestJsonFacetRefinement,
TestCharFilters, TolerantUpdateProcessorTest, HdfsRestartWhileUpdatingTest, DistributedQueryComponentCustomSortTest,
RulesTest, TestMacroExpander, TestSubQueryTransformerCrossCore, HdfsRecoverLeaseTest, TestWordDelimiterFilterFactory,
SimpleMLTQParserTest, BooleanFieldTest, LeaderFailoverAfterPartitionTest, PeerSyncTest, DocValuesTest,
DateFieldTest, TestFieldTypeResource, CoreSorterTest, BasicDistributedZkTest, DistributedMLTComponentTest,
TestSmileRequest, TestUseDocValuesAsStored2, TestBlendedInfixSuggestions, DistributedQueryElevationComponentTest,
InfoHandlerTest, StressHdfsTest, DistributedSuggestComponentTest, ClassificationUpdateProcessorFactoryTest,
HdfsLockFactoryTest, TestCorePropertiesReload, TestBinaryField, OverseerCollectionConfigSetProcessorTest,
TestMinMaxOnMultiValuedField, TestBM25SimilarityFactory, PingRequestHandlerTest, TestNumericTerms32,
TemplateUpdateProcessorTest, TestCollationFieldDocValues, TestSearcherReuse, TestManagedSynonymFilterFactory,
DateRangeFieldTest, TimerUtilsTest, TestSchemaResource, TestSort, DocValuesNotIndexedTest,
TestSolrDynamicMBean, SortSpecParsingTest, ShardRoutingTest, TestPseudoReturnFields, TestPartialUpdateDeduplication,
MergeStrategyTest, HttpPartitionTest, SolrIndexConfigTest, TestStressUserVersions, ZkStateReaderTest,
TestAuthorizationFramework, PluginInfoTest, TestSolrConfigHandlerConcurrent, TestSurroundQueryParser,
TestRuleBasedAuthorizationPlugin, TestLFUCache, TestTolerantSearch, LeaderElectionTest, SolrXmlInZkTest,
ConcurrentDeleteAndCreateCollectionTest, RecoveryAfterSoftCommitTest, SimplePostToolTest,
TestFreeTextSuggestions, ChaosMonkeyNothingIsSafeTest, TestCryptoKeys, TestBinaryResponseWriter,
OverseerRolesTest, TestFieldCacheSanityChecker, TestExtendedDismaxParser, TestJettySolrRunner,
TestCoreContainer, TestDynamicFieldResource, PreAnalyzedFieldManagedSchemaCloudTest, TestShortCircuitedRequests,
TestChildDocTransformer, HighlighterMaxOffsetTest, TestFieldCacheSortRandom, TestCloudPivotFacet,
SystemInfoHandlerTest, TestCollectionAPI, TestLeaderElectionWithEmptyReplica, TestSolrFieldCacheMBean,
TestExportWriter, TestTolerantUpdateProcessorRandomCloud, TestLazyCores, TestPhraseSuggestions,
TestSolrCloudWithDelegationTokens]
   [junit4] Completed [278/659 (1!)] on J0 in 3.34s, 8 tests, 1 failure <<< FAILURES!

[...truncated 63632 lines...]


Mime
View raw message