lucene-dev mailing list archives

Site index · List index
Message view « Date » · « Thread »
Top « Date » · « Thread »
From Policeman Jenkins Server <jenk...@thetaphi.de>
Subject [JENKINS-EA] Lucene-Solr-6.x-Linux (64bit/jdk-9-ea+147) - Build # 2469 - Unstable!
Date Tue, 20 Dec 2016 18:59:33 GMT
Build: https://jenkins.thetaphi.de/job/Lucene-Solr-6.x-Linux/2469/
Java: 64bit/jdk-9-ea+147 -XX:-UseCompressedOops -XX:+UseParallelGC

2 tests failed.
FAILED:  junit.framework.TestSuite.org.apache.solr.security.hadoop.TestSolrCloudWithHadoopAuthPlugin

Error Message:
FIXME: SOLR-8182: This test fails under Java 9

Stack Trace:
com.carrotsearch.randomizedtesting.InternalAssumptionViolatedException: FIXME: SOLR-8182:
This test fails under Java 9
	at __randomizedtesting.SeedInfo.seed([905FE3FDA59F2192]:0)
	at com.carrotsearch.randomizedtesting.RandomizedTest.assumeTrue(RandomizedTest.java:667)
	at com.carrotsearch.randomizedtesting.RandomizedTest.assumeFalse(RandomizedTest.java:675)
	at org.apache.lucene.util.LuceneTestCase.assumeFalse(LuceneTestCase.java:849)
	at org.apache.solr.security.hadoop.TestSolrCloudWithHadoopAuthPlugin.setupClass(TestSolrCloudWithHadoopAuthPlugin.java:45)
	at java.base/jdk.internal.reflect.NativeMethodAccessorImpl.invoke0(Native Method)
	at java.base/jdk.internal.reflect.NativeMethodAccessorImpl.invoke(NativeMethodAccessorImpl.java:62)
	at java.base/jdk.internal.reflect.DelegatingMethodAccessorImpl.invoke(DelegatingMethodAccessorImpl.java:43)
	at java.base/java.lang.reflect.Method.invoke(Method.java:538)
	at com.carrotsearch.randomizedtesting.RandomizedRunner.invoke(RandomizedRunner.java:1713)
	at com.carrotsearch.randomizedtesting.RandomizedRunner$6.evaluate(RandomizedRunner.java:847)
	at com.carrotsearch.randomizedtesting.RandomizedRunner$7.evaluate(RandomizedRunner.java:863)
	at com.carrotsearch.randomizedtesting.rules.StatementAdapter.evaluate(StatementAdapter.java:36)
	at com.carrotsearch.randomizedtesting.rules.SystemPropertiesRestoreRule$1.evaluate(SystemPropertiesRestoreRule.java:57)
	at org.apache.lucene.util.AbstractBeforeAfterRule$1.evaluate(AbstractBeforeAfterRule.java:45)
	at com.carrotsearch.randomizedtesting.rules.StatementAdapter.evaluate(StatementAdapter.java:36)
	at org.apache.lucene.util.TestRuleStoreClassName$1.evaluate(TestRuleStoreClassName.java:41)
	at com.carrotsearch.randomizedtesting.rules.NoShadowingOrOverridesOnMethodsRule$1.evaluate(NoShadowingOrOverridesOnMethodsRule.java:40)
	at com.carrotsearch.randomizedtesting.rules.NoShadowingOrOverridesOnMethodsRule$1.evaluate(NoShadowingOrOverridesOnMethodsRule.java:40)
	at com.carrotsearch.randomizedtesting.rules.StatementAdapter.evaluate(StatementAdapter.java:36)
	at com.carrotsearch.randomizedtesting.rules.StatementAdapter.evaluate(StatementAdapter.java:36)
	at com.carrotsearch.randomizedtesting.rules.StatementAdapter.evaluate(StatementAdapter.java:36)
	at org.apache.lucene.util.TestRuleAssertionsRequired$1.evaluate(TestRuleAssertionsRequired.java:53)
	at org.apache.lucene.util.TestRuleMarkFailure$1.evaluate(TestRuleMarkFailure.java:47)
	at org.apache.lucene.util.TestRuleIgnoreAfterMaxFailures$1.evaluate(TestRuleIgnoreAfterMaxFailures.java:64)
	at org.apache.lucene.util.TestRuleIgnoreTestSuites$1.evaluate(TestRuleIgnoreTestSuites.java:54)
	at com.carrotsearch.randomizedtesting.rules.StatementAdapter.evaluate(StatementAdapter.java:36)
	at com.carrotsearch.randomizedtesting.ThreadLeakControl$StatementRunner.run(ThreadLeakControl.java:367)
	at java.base/java.lang.Thread.run(Thread.java:844)


FAILED:  junit.framework.TestSuite.org.apache.solr.security.hadoop.TestSolrCloudWithHadoopAuthPlugin

Error Message:


Stack Trace:
java.lang.NullPointerException
	at __randomizedtesting.SeedInfo.seed([905FE3FDA59F2192]:0)
	at org.apache.solr.security.hadoop.TestSolrCloudWithHadoopAuthPlugin.tearDownClass(TestSolrCloudWithHadoopAuthPlugin.java:62)
	at java.base/jdk.internal.reflect.NativeMethodAccessorImpl.invoke0(Native Method)
	at java.base/jdk.internal.reflect.NativeMethodAccessorImpl.invoke(NativeMethodAccessorImpl.java:62)
	at java.base/jdk.internal.reflect.DelegatingMethodAccessorImpl.invoke(DelegatingMethodAccessorImpl.java:43)
	at java.base/java.lang.reflect.Method.invoke(Method.java:538)
	at com.carrotsearch.randomizedtesting.RandomizedRunner.invoke(RandomizedRunner.java:1713)
	at com.carrotsearch.randomizedtesting.RandomizedRunner$7.evaluate(RandomizedRunner.java:870)
	at com.carrotsearch.randomizedtesting.rules.StatementAdapter.evaluate(StatementAdapter.java:36)
	at com.carrotsearch.randomizedtesting.rules.SystemPropertiesRestoreRule$1.evaluate(SystemPropertiesRestoreRule.java:57)
	at org.apache.lucene.util.AbstractBeforeAfterRule$1.evaluate(AbstractBeforeAfterRule.java:45)
	at com.carrotsearch.randomizedtesting.rules.StatementAdapter.evaluate(StatementAdapter.java:36)
	at org.apache.lucene.util.TestRuleStoreClassName$1.evaluate(TestRuleStoreClassName.java:41)
	at com.carrotsearch.randomizedtesting.rules.NoShadowingOrOverridesOnMethodsRule$1.evaluate(NoShadowingOrOverridesOnMethodsRule.java:40)
	at com.carrotsearch.randomizedtesting.rules.NoShadowingOrOverridesOnMethodsRule$1.evaluate(NoShadowingOrOverridesOnMethodsRule.java:40)
	at com.carrotsearch.randomizedtesting.rules.StatementAdapter.evaluate(StatementAdapter.java:36)
	at com.carrotsearch.randomizedtesting.rules.StatementAdapter.evaluate(StatementAdapter.java:36)
	at com.carrotsearch.randomizedtesting.rules.StatementAdapter.evaluate(StatementAdapter.java:36)
	at org.apache.lucene.util.TestRuleAssertionsRequired$1.evaluate(TestRuleAssertionsRequired.java:53)
	at org.apache.lucene.util.TestRuleMarkFailure$1.evaluate(TestRuleMarkFailure.java:47)
	at org.apache.lucene.util.TestRuleIgnoreAfterMaxFailures$1.evaluate(TestRuleIgnoreAfterMaxFailures.java:64)
	at org.apache.lucene.util.TestRuleIgnoreTestSuites$1.evaluate(TestRuleIgnoreTestSuites.java:54)
	at com.carrotsearch.randomizedtesting.rules.StatementAdapter.evaluate(StatementAdapter.java:36)
	at com.carrotsearch.randomizedtesting.ThreadLeakControl$StatementRunner.run(ThreadLeakControl.java:367)
	at java.base/java.lang.Thread.run(Thread.java:844)




Build Log:
[...truncated 11490 lines...]
   [junit4] Suite: org.apache.solr.security.hadoop.TestSolrCloudWithHadoopAuthPlugin
   [junit4]   2> Creating dataDir: /home/jenkins/workspace/Lucene-Solr-6.x-Linux/solr/build/solr-core/test/J2/temp/solr.security.hadoop.TestSolrCloudWithHadoopAuthPlugin_905FE3FDA59F2192-001/init-core-data-001
   [junit4]   2> 599654 INFO  (SUITE-TestSolrCloudWithHadoopAuthPlugin-seed#[905FE3FDA59F2192]-worker)
[    ] o.a.s.SolrTestCaseJ4 Randomized ssl (true) and clientAuth (true) via: @org.apache.solr.util.RandomizeSSL(reason="",
ssl=0.0/0.0, value=0.0/0.0, clientAuth=0.0/0.0)
   [junit4]   2> 599655 INFO  (SUITE-TestSolrCloudWithHadoopAuthPlugin-seed#[905FE3FDA59F2192]-worker)
[    ] o.a.s.SolrTestCaseJ4 ###deleteCore
   [junit4]   2> NOTE: test params are: codec=Asserting(Lucene62): {}, docValues:{}, maxPointsInLeafNode=701,
maxMBSortInHeap=6.021732875755631, sim=RandomSimilarity(queryNorm=false,coord=no): {}, locale=lb-LU,
timezone=America/Belize
   [junit4]   2> NOTE: Linux 4.4.0-53-generic amd64/Oracle Corporation 9-ea (64-bit)/cpus=12,threads=1,free=134614984,total=521666560
   [junit4]   2> NOTE: All tests run in this JVM: [HdfsDirectoryFactoryTest, TestDistribIDF,
TestCustomSort, AnalysisErrorHandlingTest, TestGraphTermsQParserPlugin, UUIDUpdateProcessorFallbackTest,
TestBinaryField, TestClusterStateMutator, TestFieldCache, DistributedQueueTest, SolrPluginUtilsTest,
TestChildDocTransformer, TestFieldCacheSort, ConnectionReuseTest, TestSchemaResource, TestReversedWildcardFilterFactory,
RemoteQueryErrorTest, HdfsSyncSliceTest, UpdateParamsTest, AtomicUpdatesTest, TestReload,
TestConfigOverlay, TestSolrQueryParser, TestSmileRequest, IgnoreCommitOptimizeUpdateProcessorFactoryTest,
JSONWriterTest, TestDynamicFieldResource, BadComponentTest, SaslZkACLProviderTest, TestReloadDeadlock,
SuggesterTSTTest, CdcrRequestHandlerTest, TestDynamicLoading, RequestHandlersTest, TestDFISimilarityFactory,
NoCacheHeaderTest, CircularListTest, CurrencyFieldXmlFileTest, TimerUtilsTest, TestExpandComponent,
PrimitiveFieldTypeTest, CdcrBootstrapTest, JavabinLoaderTest, BlockJoinFacetRandomTest, TestPhraseSuggestions,
LeaderElectionTest, BinaryUpdateRequestHandlerTest, TestSortByMinMaxFunction, DistributedDebugComponentTest,
HardAutoCommitTest, TestUseDocValuesAsStored, TestCollationField, TestRequestStatusCollectionAPI,
TestSolrXml, TestRawResponseWriter, TestXmlQParser, TestFileDictionaryLookup, TestGraphMLResponseWriter,
DebugComponentTest, TestIntervalFaceting, CollectionsAPISolrJTest, HdfsChaosMonkeySafeLeaderTest,
BitVectorTest, TestShardHandlerFactory, DeleteReplicaTest, BlockCacheTest, TestShortCircuitedRequests,
LeaderInitiatedRecoveryOnShardRestartTest, RequestLoggingTest, TestExtendedDismaxParser, TestConfigSets,
DistributedQueryComponentOptimizationTest, TestSolrCloudWithHadoopAuthPlugin]
   [junit4]   2> NOTE: reproduce with: ant test  -Dtestcase=TestSolrCloudWithHadoopAuthPlugin
-Dtests.seed=905FE3FDA59F2192 -Dtests.multiplier=3 -Dtests.slow=true -Dtests.locale=lb-LU
-Dtests.timezone=America/Belize -Dtests.asserts=true -Dtests.file.encoding=UTF-8
   [junit4] ERROR   0.00s J2 | TestSolrCloudWithHadoopAuthPlugin (suite) <<<
   [junit4]    > Assumption #1: FIXME: SOLR-8182: This test fails under Java 9Throwable
#2: java.lang.NullPointerException
   [junit4]    > 	at __randomizedtesting.SeedInfo.seed([905FE3FDA59F2192]:0)
   [junit4]    > 	at org.apache.solr.security.hadoop.TestSolrCloudWithHadoopAuthPlugin.tearDownClass(TestSolrCloudWithHadoopAuthPlugin.java:62)
   [junit4]    > 	at java.base/jdk.internal.reflect.NativeMethodAccessorImpl.invoke0(Native
Method)
   [junit4]    > 	at java.base/jdk.internal.reflect.NativeMethodAccessorImpl.invoke(NativeMethodAccessorImpl.java:62)
   [junit4]    > 	at java.base/jdk.internal.reflect.DelegatingMethodAccessorImpl.invoke(DelegatingMethodAccessorImpl.java:43)
   [junit4]    > 	at java.base/java.lang.reflect.Method.invoke(Method.java:538)
   [junit4]    > 	at java.base/java.lang.Thread.run(Thread.java:844)
   [junit4] Completed [236/665 (1!)] on J2 in 0.02s, 0 tests, 1 error <<< FAILURES!

[...truncated 52825 lines...]


Mime
View raw message