lucene-dev mailing list archives

Site index · List index
Message view « Date » · « Thread »
Top « Date » · « Thread »
From Policeman Jenkins Server <jenk...@thetaphi.de>
Subject [JENKINS] Lucene-Solr-master-Windows (32bit/jdk1.8.0_112) - Build # 6283 - Still Unstable!
Date Mon, 12 Dec 2016 13:07:26 GMT
Build: https://jenkins.thetaphi.de/job/Lucene-Solr-master-Windows/6283/
Java: 32bit/jdk1.8.0_112 -server -XX:+UseParallelGC

2 tests failed.
FAILED:  org.apache.solr.cloud.DocValuesNotIndexedTest.testGroupingSorting

Error Message:
Should have exactly 4 documents returned expected:<4> but was:<3>

Stack Trace:
java.lang.AssertionError: Should have exactly 4 documents returned expected:<4> but was:<3>
	at __randomizedtesting.SeedInfo.seed([52132C1F8C2FF894:4C2B2417F0844214]:0)
	at org.junit.Assert.fail(Assert.java:93)
	at org.junit.Assert.failNotEquals(Assert.java:647)
	at org.junit.Assert.assertEquals(Assert.java:128)
	at org.junit.Assert.assertEquals(Assert.java:472)
	at org.apache.solr.cloud.DocValuesNotIndexedTest.checkSortOrder(DocValuesNotIndexedTest.java:263)
	at org.apache.solr.cloud.DocValuesNotIndexedTest.testGroupingSorting(DocValuesNotIndexedTest.java:244)
	at sun.reflect.NativeMethodAccessorImpl.invoke0(Native Method)
	at sun.reflect.NativeMethodAccessorImpl.invoke(NativeMethodAccessorImpl.java:62)
	at sun.reflect.DelegatingMethodAccessorImpl.invoke(DelegatingMethodAccessorImpl.java:43)
	at java.lang.reflect.Method.invoke(Method.java:498)
	at com.carrotsearch.randomizedtesting.RandomizedRunner.invoke(RandomizedRunner.java:1713)
	at com.carrotsearch.randomizedtesting.RandomizedRunner$8.evaluate(RandomizedRunner.java:907)
	at com.carrotsearch.randomizedtesting.RandomizedRunner$9.evaluate(RandomizedRunner.java:943)
	at com.carrotsearch.randomizedtesting.RandomizedRunner$10.evaluate(RandomizedRunner.java:957)
	at com.carrotsearch.randomizedtesting.rules.SystemPropertiesRestoreRule$1.evaluate(SystemPropertiesRestoreRule.java:57)
	at org.apache.lucene.util.TestRuleSetupTeardownChained$1.evaluate(TestRuleSetupTeardownChained.java:49)
	at org.apache.lucene.util.AbstractBeforeAfterRule$1.evaluate(AbstractBeforeAfterRule.java:45)
	at org.apache.lucene.util.TestRuleThreadAndTestName$1.evaluate(TestRuleThreadAndTestName.java:48)
	at org.apache.lucene.util.TestRuleIgnoreAfterMaxFailures$1.evaluate(TestRuleIgnoreAfterMaxFailures.java:64)
	at org.apache.lucene.util.TestRuleMarkFailure$1.evaluate(TestRuleMarkFailure.java:47)
	at com.carrotsearch.randomizedtesting.rules.StatementAdapter.evaluate(StatementAdapter.java:36)
	at com.carrotsearch.randomizedtesting.ThreadLeakControl$StatementRunner.run(ThreadLeakControl.java:367)
	at com.carrotsearch.randomizedtesting.ThreadLeakControl.forkTimeoutingTask(ThreadLeakControl.java:811)
	at com.carrotsearch.randomizedtesting.ThreadLeakControl$3.evaluate(ThreadLeakControl.java:462)
	at com.carrotsearch.randomizedtesting.RandomizedRunner.runSingleTest(RandomizedRunner.java:916)
	at com.carrotsearch.randomizedtesting.RandomizedRunner$5.evaluate(RandomizedRunner.java:802)
	at com.carrotsearch.randomizedtesting.RandomizedRunner$6.evaluate(RandomizedRunner.java:852)
	at com.carrotsearch.randomizedtesting.RandomizedRunner$7.evaluate(RandomizedRunner.java:863)
	at com.carrotsearch.randomizedtesting.rules.StatementAdapter.evaluate(StatementAdapter.java:36)
	at com.carrotsearch.randomizedtesting.rules.SystemPropertiesRestoreRule$1.evaluate(SystemPropertiesRestoreRule.java:57)
	at org.apache.lucene.util.AbstractBeforeAfterRule$1.evaluate(AbstractBeforeAfterRule.java:45)
	at com.carrotsearch.randomizedtesting.rules.StatementAdapter.evaluate(StatementAdapter.java:36)
	at org.apache.lucene.util.TestRuleStoreClassName$1.evaluate(TestRuleStoreClassName.java:41)
	at com.carrotsearch.randomizedtesting.rules.NoShadowingOrOverridesOnMethodsRule$1.evaluate(NoShadowingOrOverridesOnMethodsRule.java:40)
	at com.carrotsearch.randomizedtesting.rules.NoShadowingOrOverridesOnMethodsRule$1.evaluate(NoShadowingOrOverridesOnMethodsRule.java:40)
	at com.carrotsearch.randomizedtesting.rules.StatementAdapter.evaluate(StatementAdapter.java:36)
	at com.carrotsearch.randomizedtesting.rules.StatementAdapter.evaluate(StatementAdapter.java:36)
	at com.carrotsearch.randomizedtesting.rules.StatementAdapter.evaluate(StatementAdapter.java:36)
	at org.apache.lucene.util.TestRuleAssertionsRequired$1.evaluate(TestRuleAssertionsRequired.java:53)
	at org.apache.lucene.util.TestRuleMarkFailure$1.evaluate(TestRuleMarkFailure.java:47)
	at org.apache.lucene.util.TestRuleIgnoreAfterMaxFailures$1.evaluate(TestRuleIgnoreAfterMaxFailures.java:64)
	at org.apache.lucene.util.TestRuleIgnoreTestSuites$1.evaluate(TestRuleIgnoreTestSuites.java:54)
	at com.carrotsearch.randomizedtesting.rules.StatementAdapter.evaluate(StatementAdapter.java:36)
	at com.carrotsearch.randomizedtesting.ThreadLeakControl$StatementRunner.run(ThreadLeakControl.java:367)
	at java.lang.Thread.run(Thread.java:745)


FAILED:  junit.framework.TestSuite.org.apache.solr.core.TestBadConfig

Error Message:
Could not remove the following files (in the order of attempts):    C:\Users\jenkins\workspace\Lucene-Solr-master-Windows\solr\build\solr-core\test\J0\temp\solr.core.TestBadConfig_52132C1F8C2FF894-001\init-core-data-001: java.nio.file.AccessDeniedException: C:\Users\jenkins\workspace\Lucene-Solr-master-Windows\solr\build\solr-core\test\J0\temp\solr.core.TestBadConfig_52132C1F8C2FF894-001\init-core-data-001    C:\Users\jenkins\workspace\Lucene-Solr-master-Windows\solr\build\solr-core\test\J0\temp\solr.core.TestBadConfig_52132C1F8C2FF894-001: java.nio.file.DirectoryNotEmptyException: C:\Users\jenkins\workspace\Lucene-Solr-master-Windows\solr\build\solr-core\test\J0\temp\solr.core.TestBadConfig_52132C1F8C2FF894-001 

Stack Trace:
java.io.IOException: Could not remove the following files (in the order of attempts):
   C:\Users\jenkins\workspace\Lucene-Solr-master-Windows\solr\build\solr-core\test\J0\temp\solr.core.TestBadConfig_52132C1F8C2FF894-001\init-core-data-001: java.nio.file.AccessDeniedException: C:\Users\jenkins\workspace\Lucene-Solr-master-Windows\solr\build\solr-core\test\J0\temp\solr.core.TestBadConfig_52132C1F8C2FF894-001\init-core-data-001
   C:\Users\jenkins\workspace\Lucene-Solr-master-Windows\solr\build\solr-core\test\J0\temp\solr.core.TestBadConfig_52132C1F8C2FF894-001: java.nio.file.DirectoryNotEmptyException: C:\Users\jenkins\workspace\Lucene-Solr-master-Windows\solr\build\solr-core\test\J0\temp\solr.core.TestBadConfig_52132C1F8C2FF894-001

	at __randomizedtesting.SeedInfo.seed([52132C1F8C2FF894]:0)
	at org.apache.lucene.util.IOUtils.rm(IOUtils.java:323)
	at org.apache.lucene.util.TestRuleTemporaryFilesCleanup.afterAlways(TestRuleTemporaryFilesCleanup.java:216)
	at com.carrotsearch.randomizedtesting.rules.TestRuleAdapter$1.afterAlways(TestRuleAdapter.java:31)
	at com.carrotsearch.randomizedtesting.rules.StatementAdapter.evaluate(StatementAdapter.java:43)
	at com.carrotsearch.randomizedtesting.rules.StatementAdapter.evaluate(StatementAdapter.java:36)
	at org.apache.lucene.util.TestRuleAssertionsRequired$1.evaluate(TestRuleAssertionsRequired.java:53)
	at org.apache.lucene.util.TestRuleMarkFailure$1.evaluate(TestRuleMarkFailure.java:47)
	at org.apache.lucene.util.TestRuleIgnoreAfterMaxFailures$1.evaluate(TestRuleIgnoreAfterMaxFailures.java:64)
	at org.apache.lucene.util.TestRuleIgnoreTestSuites$1.evaluate(TestRuleIgnoreTestSuites.java:54)
	at com.carrotsearch.randomizedtesting.rules.StatementAdapter.evaluate(StatementAdapter.java:36)
	at com.carrotsearch.randomizedtesting.ThreadLeakControl$StatementRunner.run(ThreadLeakControl.java:367)
	at java.lang.Thread.run(Thread.java:745)




Build Log:
[...truncated 11787 lines...]
   [junit4] Suite: org.apache.solr.core.TestBadConfig
   [junit4]   2> Creating dataDir: C:\Users\jenkins\workspace\Lucene-Solr-master-Windows\solr\build\solr-core\test\J0\temp\solr.core.TestBadConfig_52132C1F8C2FF894-001\init-core-data-001
   [junit4]   2> 1600292 INFO  (SUITE-TestBadConfig-seed#[52132C1F8C2FF894]-worker) [    ] o.a.s.SolrTestCaseJ4 Randomized ssl (false) and clientAuth (false) via: @org.apache.solr.util.RandomizeSSL(reason=, value=NaN, ssl=NaN, clientAuth=NaN)
   [junit4]   2> 1600293 INFO  (TEST-TestBadConfig.testInvalidScriptFile-seed#[52132C1F8C2FF894]) [    ] o.a.s.SolrTestCaseJ4 ###Starting testInvalidScriptFile
   [junit4]   2> 1600720 INFO  (TEST-TestBadConfig.testInvalidScriptFile-seed#[52132C1F8C2FF894]) [    ] o.a.s.SolrTestCaseJ4 ####initCore
   [junit4]   2> 1600721 INFO  (TEST-TestBadConfig.testInvalidScriptFile-seed#[52132C1F8C2FF894]) [    ] o.a.s.c.SolrResourceLoader [null] Added 2 libs to classloader, from paths: [/C:/Users/jenkins/workspace/Lucene-Solr-master-Windows/solr/core/src/test-files/solr/collection1/lib, /C:/Users/jenkins/workspace/Lucene-Solr-master-Windows/solr/core/src/test-files/solr/collection1/lib/classes]
   [junit4]   2> 1600772 INFO  (TEST-TestBadConfig.testInvalidScriptFile-seed#[52132C1F8C2FF894]) [    ] o.a.s.c.SolrConfig Using Lucene MatchVersion: 7.0.0
   [junit4]   2> 1600780 INFO  (TEST-TestBadConfig.testInvalidScriptFile-seed#[52132C1F8C2FF894]) [    ] o.a.s.s.IndexSchema [null] Schema name=test
   [junit4]   2> 1601000 WARN  (TEST-TestBadConfig.testInvalidScriptFile-seed#[52132C1F8C2FF894]) [    ] o.a.s.s.IndexSchema [null] default search field in schema is text. WARNING: Deprecated, please use 'df' on request instead.
   [junit4]   2> 1601009 INFO  (TEST-TestBadConfig.testInvalidScriptFile-seed#[52132C1F8C2FF894]) [    ] o.a.s.s.IndexSchema Loaded schema test/1.0 with uniqueid field id
   [junit4]   2> 1601025 INFO  (coreLoadExecutor-6991-thread-1) [    ] o.a.s.c.SolrResourceLoader [null] Added 2 libs to classloader, from paths: [/C:/Users/jenkins/workspace/Lucene-Solr-master-Windows/solr/core/src/test-files/solr/collection1/lib, /C:/Users/jenkins/workspace/Lucene-Solr-master-Windows/solr/core/src/test-files/solr/collection1/lib/classes]
   [junit4]   2> 1601042 INFO  (coreLoadExecutor-6991-thread-1) [    ] o.a.s.c.SolrConfig Using Lucene MatchVersion: 7.0.0
   [junit4]   2> 1601049 INFO  (coreLoadExecutor-6991-thread-1) [    ] o.a.s.s.IndexSchema [collection1] Schema name=test
   [junit4]   2> 1601105 WARN  (coreLoadExecutor-6991-thread-1) [    ] o.a.s.s.IndexSchema [collection1] default search field in schema is text. WARNING: Deprecated, please use 'df' on request instead.
   [junit4]   2> 1601106 INFO  (coreLoadExecutor-6991-thread-1) [    ] o.a.s.s.IndexSchema Loaded schema test/1.0 with uniqueid field id
   [junit4]   2> 1601128 INFO  (coreLoadExecutor-6991-thread-1) [    ] o.a.s.c.CoreContainer Creating SolrCore 'collection1' using configuration from instancedir C:\Users\jenkins\workspace\Lucene-Solr-master-Windows\solr\core\src\test-files\solr\collection1
   [junit4]   2> 1601128 INFO  (coreLoadExecutor-6991-thread-1) [    x:collection1] o.a.s.c.SolrCore [[collection1] ] Opening new SolrCore at [C:\Users\jenkins\workspace\Lucene-Solr-master-Windows\solr\core\src\test-files\solr\collection1], dataDir=[C:\Users\jenkins\workspace\Lucene-Solr-master-Windows\solr\build\solr-core\test\J0\temp\solr.core.TestBadConfig_52132C1F8C2FF894-001\init-core-data-001\]
   [junit4]   2> 1601202 WARN  (coreLoadExecutor-6991-thread-1) [    x:collection1] o.a.s.c.RequestHandlers no default request handler is registered (either '/select' or 'standard')
   [junit4]   2> 1601202 INFO  (coreLoadExecutor-6991-thread-1) [    x:collection1] o.a.s.u.CommitTracker Hard AutoCommit: disabled
   [junit4]   2> 1601202 INFO  (coreLoadExecutor-6991-thread-1) [    x:collection1] o.a.s.u.CommitTracker Soft AutoCommit: disabled
   [junit4]   2> 1601203 INFO  (coreLoadExecutor-6991-thread-1) [    x:collection1] o.a.s.s.SolrIndexSearcher Opening [Searcher@1cc0627[collection1] main]
   [junit4]   2> 1601204 WARN  (coreLoadExecutor-6991-thread-1) [    x:collection1] o.a.s.r.ManagedResourceStorage Cannot write to config directory C:\Users\jenkins\workspace\Lucene-Solr-master-Windows\solr\core\src\test-files\solr\collection1\conf; switching to use InMemory storage instead.
   [junit4]   2> 1601271 ERROR (coreLoadExecutor-6991-thread-1) [    x:collection1] o.a.s.u.p.StatelessScriptUpdateProcessorFactory Unable to initialize scripts: Unable to evaluate script: currency.xml
   [junit4]   2> org.apache.solr.common.SolrException: Unable to evaluate script: currency.xml
   [junit4]   2> 	at org.apache.solr.update.processor.StatelessScriptUpdateProcessorFactory.initEngines(StatelessScriptUpdateProcessorFactory.java:315)
   [junit4]   2> 	at org.apache.solr.update.processor.StatelessScriptUpdateProcessorFactory.inform(StatelessScriptUpdateProcessorFactory.java:227)
   [junit4]   2> 	at org.apache.solr.core.SolrResourceLoader.inform(SolrResourceLoader.java:695)
   [junit4]   2> 	at org.apache.solr.core.SolrCore.<init>(SolrCore.java:897)
   [junit4]   2> 	at org.apache.solr.core.SolrCore.<init>(SolrCore.java:792)
   [junit4]   2> 	at org.apache.solr.core.CoreContainer.create(CoreContainer.java:868)
   [junit4]   2> 	at org.apache.solr.core.CoreContainer.lambda$load$0(CoreContainer.java:517)
   [junit4]   2> 	at java.util.concurrent.FutureTask.run(FutureTask.java:266)
   [junit4]   2> 	at org.apache.solr.common.util.ExecutorUtil$MDCAwareThreadPoolExecutor.lambda$execute$0(ExecutorUtil.java:229)
   [junit4]   2> 	at java.util.concurrent.ThreadPoolExecutor.runWorker(ThreadPoolExecutor.java:1142)
   [junit4]   2> 	at java.util.concurrent.ThreadPoolExecutor$Worker.run(ThreadPoolExecutor.java:617)
   [junit4]   2> 	at java.lang.Thread.run(Thread.java:745)
   [junit4]   2> Caused by: javax.script.ScriptException: <eval>:1:0 Expected an operand but found <
   [junit4]   2> <?xml version="1.0" ?>
   [junit4]   2> ^ in <eval> at line number 1 at column number 0
   [junit4]   2> 	at jdk.nashorn.api.scripting.NashornScriptEngine.throwAsScriptException(NashornScriptEngine.java:470)
   [junit4]   2> 	at jdk.nashorn.api.scripting.NashornScriptEngine.compileImpl(NashornScriptEngine.java:537)
   [junit4]   2> 	at jdk.nashorn.api.scripting.NashornScriptEngine.compileImpl(NashornScriptEngine.java:524)
   [junit4]   2> 	at jdk.nashorn.api.scripting.NashornScriptEngine.evalImpl(NashornScriptEngine.java:402)
   [junit4]   2> 	at jdk.nashorn.api.scripting.NashornScriptEngine.eval(NashornScriptEngine.java:150)
   [junit4]   2> 	at javax.script.AbstractScriptEngine.eval(AbstractScriptEngine.java:249)
   [junit4]   2> 	at org.apache.solr.update.processor.StatelessScriptUpdateProcessorFactory.initEngines(StatelessScriptUpdateProcessorFactory.java:311)
   [junit4]   2> 	... 11 more
   [junit4]   2> Caused by: jdk.nashorn.internal.runtime.ParserException: <eval>:1:0 Expected an operand but found <
   [junit4]   2> <?xml version="1.0" ?>
   [junit4]   2> ^
   [junit4]   2> 	at jdk.nashorn.internal.parser.AbstractParser.error(AbstractParser.java:294)
   [junit4]   2> 	at jdk.nashorn.internal.parser.AbstractParser.error(AbstractParser.java:279)
   [junit4]   2> 	at jdk.nashorn.internal.parser.Parser.unaryExpression(Parser.java:3182)
   [junit4]   2> 	at jdk.nashorn.internal.parser.Parser.expression(Parser.java:3282)
   [junit4]   2> 	at jdk.nashorn.internal.parser.Parser.expressionStatement(Parser.java:1150)
   [junit4]   2> 	at jdk.nashorn.internal.parser.Parser.statement(Parser.java:967)
   [junit4]   2> 	at jdk.nashorn.internal.parser.Parser.sourceElements(Parser.java:773)
   [junit4]   2> 	at jdk.nashorn.internal.parser.Parser.program(Parser.java:709)
   [junit4]   2> 	at jdk.nashorn.internal.parser.Parser.parse(Parser.java:283)
   [junit4]   2> 	at jdk.nashorn.internal.parser.Parser.parse(Parser.java:249)
   [junit4]   2> 	at jdk.nashorn.internal.runtime.Context.compile(Context.java:1284)
   [junit4]   2> 	at jdk.nashorn.internal.runtime.Context.compileScript(Context.java:1251)
   [junit4]   2> 	at jdk.nashorn.internal.runtime.Context.compileScript(Context.java:627)
   [junit4]   2> 	at jdk.nashorn.api.scripting.NashornScriptEngine.compileImpl(NashornScriptEngine.java:535)
   [junit4]   2> 	... 16 more
   [junit4]   2> 1601272 INFO  (coreLoadExecutor-6991-thread-1) [    x:collection1] o.a.s.c.SolrCore [collection1]  CLOSING SolrCore org.apache.solr.core.SolrCore@12bb423
   [junit4]   2> 1601272 INFO  (searcherExecutor-6992-thread-1-processing-x:collection1) [    x:collection1] o.a.s.c.SolrCore [collection1] Registered new searcher Searcher@1cc0627[collection1] main{ExitableDirectoryReader(UninvertingDirectoryReader())}
   [junit4]   2> 1601273 ERROR (coreLoadExecutor-6991-thread-1) [    x:collection1] o.a.s.c.CoreContainer Error creating core [collection1]: Unable to initialize scripts: Unable to evaluate script: currency.xml
   [junit4]   2> org.apache.solr.common.SolrException: Unable to initialize scripts: Unable to evaluate script: currency.xml
   [junit4]   2> 	at org.apache.solr.core.SolrCore.<init>(SolrCore.java:917)
   [junit4]   2> 	at org.apache.solr.core.SolrCore.<init>(SolrCore.java:792)
   [junit4]   2> 	at org.apache.solr.core.CoreContainer.create(CoreContainer.java:868)
   [junit4]   2> 	at org.apache.solr.core.CoreContainer.lambda$load$0(CoreContainer.java:517)
   [junit4]   2> 	at java.util.concurrent.FutureTask.run(FutureTask.java:266)
   [junit4]   2> 	at org.apache.solr.common.util.ExecutorUtil$MDCAwareThreadPoolExecutor.lambda$execute$0(ExecutorUtil.java:229)
   [junit4]   2> 	at java.util.concurrent.ThreadPoolExecutor.runWorker(ThreadPoolExecutor.java:1142)
   [junit4]   2> 	at java.util.concurrent.ThreadPoolExecutor$Worker.run(ThreadPoolExecutor.java:617)
   [junit4]   2> 	at java.lang.Thread.run(Thread.java:745)
   [junit4]   2> Caused by: org.apache.solr.common.SolrException: Unable to initialize scripts: Unable to evaluate script: currency.xml
   [junit4]   2> 	at org.apache.solr.update.processor.StatelessScriptUpdateProcessorFactory.inform(StatelessScriptUpdateProcessorFactory.java:231)
   [junit4]   2> 	at org.apache.solr.core.SolrResourceLoader.inform(SolrResourceLoader.java:695)
   [junit4]   2> 	at org.apache.solr.core.SolrCore.<init>(SolrCore.java:897)
   [junit4]   2> 	... 8 more
   [junit4]   2> Caused by: org.apache.solr.common.SolrException: Unable to evaluate script: currency.xml
   [junit4]   2> 	at org.apache.solr.update.processor.StatelessScriptUpdateProcessorFactory.initEngines(StatelessScriptUpdateProcessorFactory.java:315)
   [junit4]   2> 	at org.apache.solr.update.processor.StatelessScriptUpdateProcessorFactory.inform(StatelessScriptUpdateProcessorFactory.java:227)
   [junit4]   2> 	... 10 more
   [junit4]   2> Caused by: javax.script.ScriptException: <eval>:1:0 Expected an operand but found <
   [junit4]   2> <?xml version="1.0" ?>
   [junit4]   2> ^ in <eval> at line number 1 at column number 0
   [junit4]   2> 	at jdk.nashorn.api.scripting.NashornScriptEngine.throwAsScriptException(NashornScriptEngine.java:470)
   [junit4]   2> 	at jdk.nashorn.api.scripting.NashornScriptEngine.compileImpl(NashornScriptEngine.java:537)
   [junit4]   2> 	at jdk.nashorn.api.scripting.NashornScriptEngine.compileImpl(NashornScriptEngine.java:524)
   [junit4]   2> 	at jdk.nashorn.api.scripting.NashornScriptEngine.evalImpl(NashornScriptEngine.java:402)
   [junit4]   2> 	at jdk.nashorn.api.scripting.NashornScriptEngine.eval(NashornScriptEngine.java:150)
   [junit4]   2> 	at javax.script.AbstractScriptEngine.eval(AbstractScriptEngine.java:249)
   [junit4]   2> 	at org.apache.solr.update.processor.StatelessScriptUpdateProcessorFactory.initEngines(StatelessScriptUpdateProcessorFactory.java:311)
   [junit4]   2> 	... 11 more
   [junit4]   2> Caused by: jdk.nashorn.internal.runtime.ParserException: <eval>:1:0 Expected an operand but found <
   [junit4]   2> <?xml version="1.0" ?>
   [junit4]   2> ^
   [junit4]   2> 	at jdk.nashorn.internal.parser.AbstractParser.error(AbstractParser.java:294)
   [junit4]   2> 	at jdk.nashorn.internal.parser.AbstractParser.error(AbstractParser.java:279)
   [junit4]   2> 	at jdk.nashorn.internal.parser.Parser.unaryExpression(Parser.java:3182)
   [junit4]   2> 	at jdk.nashorn.internal.parser.Parser.expression(Parser.java:3282)
   [junit4]   2> 	at jdk.nashorn.internal.parser.Parser.expressionStatement(Parser.java:1150)
   [junit4]   2> 	at jdk.nashorn.internal.parser.Parser.statement(Parser.java:967)
   [junit4]   2> 	at jdk.nashorn.internal.parser.Parser.sourceElements(Parser.java:773)
   [junit4]   2> 	at jdk.nashorn.internal.parser.Parser.program(Parser.java:709)
   [junit4]   2> 	at jdk.nashorn.internal.parser.Parser.parse(Parser.java:283)
   [junit4]   2> 	at jdk.nashorn.internal.parser.Parser.parse(Parser.java:249)
   [junit4]   2> 	at jdk.nashorn.internal.runtime.Context.compile(Context.java:1284)
   [junit4]   2> 	at jdk.nashorn.internal.runtime.Context.compileScript(Context.java:1251)
   [junit4]   2> 	at jdk.nashorn.internal.runtime.Context.compileScript(Context.java:627)
   [junit4]   2> 	at jdk.nashorn.api.scripting.NashornScriptEngine.compileImpl(NashornScriptEngine.java:535)
   [junit4]   2> 	... 16 more
   [junit4]   2> 1601274 INFO  (TEST-TestBadConfig.testInvalidScriptFile-seed#[52132C1F8C2FF894]) [    ] o.a.s.SolrTestCaseJ4 ####initCore end
   [junit4]   2> 1601275 INFO  (TEST-TestBadConfig.testInvalidScriptFile-seed#[52132C1F8C2FF894]) [    ] o.a.s.SolrTestCaseJ4 ###deleteCore
   [junit4]   2> 1601275 INFO  (TEST-TestBadConfig.testInvalidScriptFile-seed#[52132C1F8C2FF894]) [    ] o.a.s.c.CoreContainer Shutting down CoreContainer instance=30911505
   [junit4]   2> 1601276 INFO  (TEST-TestBadConfig.testInvalidScriptFile-seed#[52132C1F8C2FF894]) [    ] o.a.s.SolrTestCaseJ4 ###Ending testInvalidScriptFile
   [junit4]   2> 1601278 INFO  (TEST-TestBadConfig.testMissingScriptFile-seed#[52132C1F8C2FF894]) [    ] o.a.s.SolrTestCaseJ4 ###Starting testMissingScriptFile
   [junit4]   2> 1601290 INFO  (TEST-TestBadConfig.testMissingScriptFile-seed#[52132C1F8C2FF894]) [    ] o.a.s.SolrTestCaseJ4 ####initCore
   [junit4]   2> 1601291 INFO  (TEST-TestBadConfig.testMissingScriptFile-seed#[52132C1F8C2FF894]) [    ] o.a.s.c.SolrResourceLoader [null] Added 2 libs to classloader, from paths: [/C:/Users/jenkins/workspace/Lucene-Solr-master-Windows/solr/core/src/test-files/solr/collection1/lib, /C:/Users/jenkins/workspace/Lucene-Solr-master-Windows/solr/core/src/test-files/solr/collection1/lib/classes]
   [junit4]   2> 1601350 INFO  (TEST-TestBadConfig.testMissingScriptFile-seed#[52132C1F8C2FF894]) [    ] o.a.s.c.SolrConfig Using Lucene MatchVersion: 7.0.0
   [junit4]   2> 1601358 INFO  (TEST-TestBadConfig.testMissingScriptFile-seed#[52132C1F8C2FF894]) [    ] o.a.s.s.IndexSchema [null] Schema name=test
   [junit4]   2> 1601424 WARN  (TEST-TestBadConfig.testMissingScriptFile-seed#[52132C1F8C2FF894]) [    ] o.a.s.s.IndexSchema [null] default search field in schema is text. WARNING: Deprecated, please use 'df' on request instead.
   [junit4]   2> 1601426 INFO  (TEST-TestBadConfig.testMissingScriptFile-seed#[52132C1F8C2FF894]) [    ] o.a.s.s.IndexSchema Loaded schema test/1.0 with uniqueid field id
   [junit4]   2> 1601444 INFO  (coreLoadExecutor-7002-thread-1) [    ] o.a.s.c.SolrResourceLoader [null] Added 2 libs to classloader, from paths: [/C:/Users/jenkins/workspace/Lucene-Solr-master-Windows/solr/core/src/test-files/solr/collection1/lib, /C:/Users/jenkins/workspace/Lucene-Solr-master-Windows/solr/core/src/test-files/solr/collection1/lib/classes]
   [junit4]   2> 1601463 INFO  (coreLoadExecutor-7002-thread-1) [    ] o.a.s.c.SolrConfig Using Lucene MatchVersion: 7.0.0
   [junit4]   2> 1601470 INFO  (coreLoadExecutor-7002-thread-1) [    ] o.a.s.s.IndexSchema [collection1] Schema name=test
   [junit4]   2> 1601529 WARN  (coreLoadExecutor-7002-thread-1) [    ] o.a.s.s.IndexSchema [collection1] default search field in schema is text. WARNING: Deprecated, please use 'df' on request instead.
   [junit4]   2> 1601532 INFO  (coreLoadExecutor-7002-thread-1) [    ] o.a.s.s.IndexSchema Loaded schema test/1.0 with uniqueid field id
   [junit4]   2> 1601546 INFO  (coreLoadExecutor-7002-thread-1) [    ] o.a.s.c.CoreContainer Creating SolrCore 'collection1' using configuration from instancedir C:\Users\jenkins\workspace\Lucene-Solr-master-Windows\solr\core\src\test-files\solr\collection1
   [junit4]   2> 1601546 INFO  (coreLoadExecutor-7002-thread-1) [    x:collection1] o.a.s.c.SolrCore [[collection1] ] Opening new SolrCore at [C:\Users\jenkins\workspace\Lucene-Solr-master-Windows\solr\core\src\test-files\solr\collection1], dataDir=[C:\Users\jenkins\workspace\Lucene-Solr-master-Windows\solr\build\solr-core\test\J0\temp\solr.core.TestBadConfig_52132C1F8C2FF894-001\init-core-data-001\]
   [junit4]   2> 1601561 WARN  (coreLoadExecutor-7002-thread-1) [    x:collection1] o.a.s.c.RequestHandlers no default request handler is registered (either '/select' or 'standard')
   [junit4]   2> 1601561 INFO  (coreLoadExecutor-7002-thread-1) [    x:collection1] o.a.s.u.CommitTracker Hard AutoCommit: disabled
   [junit4]   2> 1601561 INFO  (coreLoadExecutor-7002-thread-1) [    x:collection1] o.a.s.u.CommitTracker Soft AutoCommit: disabled
   [junit4]   2> 1601563 INFO  (coreLoadExecutor-7002-thread-1) [    x:collection1] o.a.s.s.SolrIndexSearcher Opening [Searcher@d700f4[collection1] main]
   [junit4]   2> 1601563 WARN  (coreLoadExecutor-7002-thread-1) [    x:collection1] o.a.s.r.ManagedResourceStorage Cannot write to config directory C:\Users\jenkins\workspace\Lucene-Solr-master-Windows\solr\core\src\test-files\solr\collection1\conf; switching to use InMemory storage instead.
   [junit4]   2> 1601583 ERROR (coreLoadExecutor-7002-thread-1) [    x:collection1] o.a.s.u.p.StatelessScriptUpdateProcessorFactory Unable to initialize scripts: Unable to evaluate script: a-file-name-that-does-not-exist.js
   [junit4]   2> org.apache.solr.common.SolrException: Unable to evaluate script: a-file-name-that-does-not-exist.js
   [junit4]   2> 	at org.apache.solr.update.processor.StatelessScriptUpdateProcessorFactory.initEngines(StatelessScriptUpdateProcessorFactory.java:322)
   [junit4]   2> 	at org.apache.solr.update.processor.StatelessScriptUpdateProcessorFactory.inform(StatelessScriptUpdateProcessorFactory.java:227)
   [junit4]   2> 	at org.apache.solr.core.SolrResourceLoader.inform(SolrResourceLoader.java:695)
   [junit4]   2> 	at org.apache.solr.core.SolrCore.<init>(SolrCore.java:897)
   [junit4]   2> 	at org.apache.solr.core.SolrCore.<init>(SolrCore.java:792)
   [junit4]   2> 	at org.apache.solr.core.CoreContainer.create(CoreContainer.java:868)
   [junit4]   2> 	at org.apache.solr.core.CoreContainer.lambda$load$0(CoreContainer.java:517)
   [junit4]   2> 	at java.util.concurrent.FutureTask.run(FutureTask.java:266)
   [junit4]   2> 	at org.apache.solr.common.util.ExecutorUtil$MDCAwareThreadPoolExecutor.lambda$execute$0(ExecutorUtil.java:229)
   [junit4]   2> 	at java.util.concurrent.ThreadPoolExecutor.runWorker(ThreadPoolExecutor.java:1142)
   [junit4]   2> 	at java.util.concurrent.ThreadPoolExecutor$Worker.run(ThreadPoolExecutor.java:617)
   [junit4]   2> 	at java.lang.Thread.run(Thread.java:745)
   [junit4]   2> Caused by: org.apache.solr.core.SolrResourceNotFoundException: Can't find resource 'a-file-name-that-does-not-exist.js' in classpath or 'C:\Users\jenkins\workspace\Lucene-Solr-master-Windows\solr\core\src\test-files\solr\collection1'
   [junit4]   2> 	at org.apache.solr.core.SolrResourceLoader.openResource(SolrResourceLoader.java:406)
   [junit4]   2> 	at org.apache.solr.update.processor.StatelessScriptUpdateProcessorFactory$ScriptFile.openReader(StatelessScriptUpdateProcessorFactory.java:488)
   [junit4]   2> 	at org.apache.solr.update.processor.StatelessScriptUpdateProcessorFactory.initEngines(StatelessScriptUpdateProcessorFactory.java:308)
   [junit4]   2> 	... 11 more
   [junit4]   2> 1601584 INFO  (coreLoadExecutor-7002-thread-1) [    x:collection1] o.a.s.c.SolrCore [collection1]  CLOSING SolrCore org.apache.solr.core.SolrCore@1a9a70e
   [junit4]   2> 1601584 INFO  (searcherExecutor-7003-thread-1-processing-x:collection1) [    x:collection1] o.a.s.c.SolrCore [collection1] Registered new searcher Searcher@d700f4[collection1] main{ExitableDirectoryReader(UninvertingDirectoryReader())}
   [junit4]   2> 1601585 ERROR (coreLoadExecutor-7002-thread-1) [    x:collection1] o.a.s.c.CoreContainer Error creating core [collection1]: Unable to initialize scripts: Unable to evaluate script: a-file-name-that-does-not-exist.js
   [junit4]   2> org.apache.solr.common.SolrException: Unable to initialize scripts: Unable to evaluate script: a-file-name-that-does-not-exist.js
   [junit4]   2> 	at org.apache.solr.core.SolrCore.<init>(SolrCore.java:917)
   [junit4]   2> 	at org.apache.solr.core.SolrCore.<init>(SolrCore.java:792)
   [junit4]   2> 	at org.apache.solr.core.CoreContainer.create(CoreContainer.java:868)
   [junit4]   2> 	at org.apache.solr.core.CoreContainer.lambda$load$0(CoreContainer.java:517)
   [junit4]   2> 	at java.util.concurrent.FutureTask.run(FutureTask.java:266)
   [junit4]   2> 	at org.apache.solr.common.util.ExecutorUtil$MDCAwareThreadPoolExecutor.lambda$execute$0(ExecutorUtil.java:229)
   [junit4]   2> 	at java.util.concurrent.ThreadPoolExecutor.runWorker(ThreadPoolExecutor.java:1142)
   [junit4]   2> 	at java.util.concurrent.ThreadPoolExecutor$Worker.run(ThreadPoolExecutor.java:617)
   [junit4]   2> 	at java.lang.Thread.run(Thread.java:745)
   [junit4]   2> Caused by: org.apache.solr.common.SolrException: Unable to initialize scripts: Unable to evaluate script: a-file-name-that-does-not-exist.js
   [junit4]   2> 	at org.apache.solr.update.processor.StatelessScriptUpdateProcessorFactory.inform(StatelessScriptUpdateProcessorFactory.java:231)
   [junit4]   2> 	at org.apache.solr.core.SolrResourceLoader.inform(SolrResourceLoader.java:695)
   [junit4]   2> 	at org.apache.solr.core.SolrCore.<init>(SolrCore.java:897)
   [junit4]   2> 	... 8 more
   [junit4]   2> Caused by: org.apache.solr.common.SolrException: Unable to evaluate script: a-file-name-that-does-not-exist.js
   [junit4]   2> 	at org.apache.solr.update.processor.StatelessScriptUpdateProcessorFactory.initEngines(StatelessScriptUpdateProcessorFactory.java:322)
   [junit4]   2> 	at org.apache.solr.update.processor.StatelessScriptUpdateProcessorFactory.inform(StatelessScriptUpdateProcessorFactory.java:227)
   [junit4]   2> 	... 10 more
   [junit4]   2> Caused by: org.apache.solr.core.SolrResourceNotFoundException: Can't find resource 'a-file-name-that-does-not-exist.js' in classpath or 'C:\Users\jenkins\workspace\Lucene-Solr-master-Windows\solr\core\src\test-files\solr\collection1'
   [junit4]   2> 	at org.apache.solr.core.SolrResourceLoader.openResource(SolrResourceLoader.java:406)
   [junit4]   2> 	at org.apache.solr.update.processor.StatelessScriptUpdateProcessorFactory$ScriptFile.openReader(StatelessScriptUpdateProcessorFactory.java:488)
   [junit4]   2> 	at org.apache.solr.update.processor.StatelessScriptUpdateProcessorFactory.initEngines(StatelessScriptUpdateProcessorFactory.java:308)
   [junit4]   2> 	... 11 more
   [junit4]   2> 1601586 INFO  (TEST-TestBadConfig.testMissingScriptFile-seed#[52132C1F8C2FF894]) [    ] o.a.s.SolrTestCaseJ4 ####initCore end
   [junit4]   2> 1601586 INFO  (TEST-TestBadConfig.testMissingScriptFile-seed#[52132C1F8C2FF894]) [    ] o.a.s.SolrTestCaseJ4 ###deleteCore
   [junit4]   2> 1601586 INFO  (TEST-TestBadConfig.testMissingScriptFile-seed#[52132C1F8C2FF894]) [    ] o.a.s.c.CoreContainer Shutting down CoreContainer instance=399499
   [junit4]   2> 1601588 INFO  (TEST-TestBadConfig.testMissingScriptFile-seed#[52132C1F8C2FF894]) [    ] o.a.s.SolrTestCaseJ4 ###Ending testMissingScriptFile
   [junit4]   2> 1601589 INFO  (TEST-TestBadConfig.testBogusMergePolicy-seed#[52132C1F8C2FF894]) [    ] o.a.s.SolrTestCaseJ4 ###Starting testBogusMergePolicy
   [junit4]   2> 1601590 INFO  (TEST-TestBadConfig.testBogusMergePolicy-seed#[52132C1F8C2FF894]) [    ] o.a.s.SolrTestCaseJ4 ####initCore
   [junit4]   2> 1601591 INFO  (TEST-TestBadConfig.testBogusMergePolicy-seed#[52132C1F8C2FF894]) [    ] o.a.s.c.SolrResourceLoader [null] Added 2 libs to classloader, from paths: [/C:/Users/jenkins/workspace/Lucene-Solr-master-Windows/solr/core/src/test-files/solr/collection1/lib, /C:/Users/jenkins/workspace/Lucene-Solr-master-Windows/solr/core/src/test-files/solr/collection1/lib/classes]
   [junit4]   2> 1601652 WARN  (TEST-TestBadConfig.testBogusMergePolicy-seed#[52132C1F8C2FF894]) [    ] o.a.s.c.Config Beginning with Solr 5.5, <mergePolicy> is deprecated, use <mergePolicyFactory> instead.
   [junit4]   2> 1601652 WARN  (TEST-TestBadConfig.testBogusMergePolicy-seed#[52132C1F8C2FF894]) [    ] o.a.s.c.Config Beginning with Solr 5.5, <mergeFactor> is deprecated, configure it on the relevant <mergePolicyFactory> instead.
   [junit4]   2> 1601652 INFO  (TEST-TestBadConfig.testBogusMergePolicy-seed#[52132C1F8C2FF894]) [    ] o.a.s.c.SolrConfig Using Lucene MatchVersion: 7.0.0
   [junit4]   2> 1601657 INFO  (TEST-TestBadConfig.testBogusMergePolicy-seed#[52132C1F8C2FF894]) [    ] o.a.s.s.IndexSchema [null] Schema name=minimal
   [junit4]   2> 1601663 WARN  (TEST-TestBadConfig.testBogusMergePolicy-seed#[52132C1F8C2FF894]) [    ] o.a.s.s.IndexSchema no uniqueKey specified in schema.
   [junit4]   2> 1601663 INFO  (TEST-TestBadConfig.testBogusMergePolicy-seed#[52132C1F8C2FF894]) [    ] o.a.s.s.IndexSchema Loaded schema minimal/1.1 with uniqueid field null
   [junit4]   2> 1601670 INFO  (coreLoadExecutor-7013-thread-1) [    ] o.a.s.c.SolrResourceLoader [null] Added 2 libs to classloader, from paths: [/C:/Users/jenkins/workspace/Lucene-Solr-master-Windows/solr/core/src/test-files/solr/collection1/lib, /C:/Users/jenkins/workspace/Lucene-Solr-master-Windows/solr/core/src/test-files/solr/collection1/lib/classes]
   [junit4]   2> 1601691 WARN  (coreLoadExecutor-7013-thread-1) [    ] o.a.s.c.Config Beginning with Solr 5.5, <mergePolicy> is deprecated, use <mergePolicyFactory> instead.
   [junit4]   2> 1601691 WARN  (coreLoadExecutor-7013-thread-1) [    ] o.a.s.c.Config Beginning with Solr 5.5, <mergeFactor> is deprecated, configure it on the relevant <mergePolicyFactory> instead.
   [junit4]   2> 1601691 INFO  (coreLoadExecutor-7013-thread-1) [    ] o.a.s.c.SolrConfig Using Lucene MatchVersion: 7.0.0
   [junit4]   2> 1601696 INFO  (coreLoadExecutor-7013-thread-1) [    ] o.a.s.s.IndexSchema [collection1] Schema name=minimal
   [junit4]   2> 1601699 WARN  (coreLoadExecutor-7013-thread-1) [    ] o.a.s.s.IndexSchema no uniqueKey specified in schema.
   [junit4]   2> 1601699 INFO  (coreLoadExecutor-7013-thread-1) [    ] o.a.s.s.IndexSchema Loaded schema minimal/1.1 with uniqueid field null
   [junit4]   2> 1601707 INFO  (coreLoadExecutor-7013-thread-1) [    ] o.a.s.c.CoreContainer Creating SolrCore 'collection1' using configuration from instancedir C:\Users\jenkins\workspace\Lucene-Solr-master-Windows\solr\core\src\test-files\solr\collection1
   [junit4]   2> 1601707 INFO  (coreLoadExecutor-7013-thread-1) [    x:collection1] o.a.s.c.SolrCore [[collection1] ] Opening new SolrCore at [C:\Users\jenkins\workspace\Lucene-Solr-master-Windows\solr\core\src\test-files\solr\collection1], dataDir=[C:\Users\jenkins\workspace\Lucene-Solr-master-Windows\solr\build\solr-core\test\J0\temp\solr.core.TestBadConfig_52132C1F8C2FF894-001\init-core-data-001\]
   [junit4]   2> 1601712 INFO  (coreLoadExecutor-7013-thread-1) [    x:collection1] o.a.s.c.SolrCore [collection1]  CLOSING SolrCore org.apache.solr.core.SolrCore@daf5fb
   [junit4]   2> 1601712 ERROR (coreLoadExecutor-7013-thread-1) [    x:collection1] o.a.s.c.CoreContainer Error creating core [collection1]: Error instantiating class: 'org.apache.solr.update.DummyMergePolicy'
   [junit4]   2> org.apache.solr.common.SolrException: Error instantiating class: 'org.apache.solr.update.DummyMergePolicy'
   [junit4]   2> 	at org.apache.solr.core.SolrCore.<init>(SolrCore.java:917)
   [junit4]   2> 	at org.apache.solr.core.SolrCore.<init>(SolrCore.java:792)
   [junit4]   2> 	at org.apache.solr.core.CoreContainer.create(CoreContainer.java:868)
   [junit4]   2> 	at org.apache.solr.core.CoreContainer.lambda$load$0(CoreContainer.java:517)
   [junit4]   2> 	at java.util.concurrent.FutureTask.run(FutureTask.java:266)
   [junit4]   2> 	at org.apache.solr.common.util.ExecutorUtil$MDCAwareThreadPoolExecutor.lambda$execute$0(ExecutorUtil.java:229)
   [junit4]   2> 	at java.util.concurrent.ThreadPoolExecutor.runWorker(ThreadPoolExecutor.java:1142)
   [junit4]   2> 	at java.util.concurrent.ThreadPoolExecutor$Worker.run(ThreadPoolExecutor.java:617)
   [junit4]   2> 	at java.lang.Thread.run(Thread.java:745)
   [junit4]   2> Caused by: org.apache.solr.common.SolrException: Error instantiating class: 'org.apache.solr.update.DummyMergePolicy'
   [junit4]   2> 	at org.apache.solr.core.SolrResourceLoader.newInstance(SolrResourceLoader.java:655)
   [junit4]   2> 	at org.apache.solr.core.SolrResourceLoader.newInstance(SolrResourceLoader.java:590)
   [junit4]   2> 	at org.apache.solr.core.SolrResourceLoader.newInstance(SolrResourceLoader.java:583)
   [junit4]   2> 	at org.apache.solr.update.SolrIndexConfig.buildMergePolicyFromInfo(SolrIndexConfig.java:322)
   [junit4]   2> 	at org.apache.solr.update.SolrIndexConfig.buildMergePolicy(SolrIndexConfig.java:276)
   [junit4]   2> 	at org.apache.solr.update.SolrIndexConfig.toIndexWriterConfig(SolrIndexConfig.java:238)
   [junit4]   2> 	at org.apache.solr.update.SolrIndexWriter.<init>(SolrIndexWriter.java:91)
   [junit4]   2> 	at org.apache.solr.update.SolrIndexWriter.create(SolrIndexWriter.java:68)
   [junit4]   2> 	at org.apache.solr.core.SolrCore.initIndex(SolrCore.java:690)
   [junit4]   2> 	at org.apache.solr.core.SolrCore.<init>(SolrCore.java:864)
   [junit4]   2> 	... 8 more
   [junit4]   2> Caused by: java.lang.NoSuchMethodException: org.apache.solr.update.DummyMergePolicy.<init>()
   [junit4]   2> 	at java.lang.Class.getConstructor0(Class.java:3082)
   [junit4]   2> 	at java.lang.Class.getConstructor(Class.java:1825)
   [junit4]   2> 	at org.apache.solr.core.SolrResourceLoader.newInstance(SolrResourceLoader.java:636)
   [junit4]   2> 	... 17 more
   [junit4]   2> 1601719 INFO  (TEST-TestBadConfig.testBogusMergePolicy-seed#[52132C1F8C2FF894]) [    ] o.a.s.SolrTestCaseJ4 ####initCore end
   [junit4]   2> 1601719 INFO  (TEST-TestBadConfig.testBogusMergePolicy-seed#[52132C1F8C2FF894]) [    ] o.a.s.SolrTestCaseJ4 ###deleteCore
   [junit4]   2> 1601719 INFO  (TEST-TestBadConfig.testBogusMergePolicy-seed#[52132C1F8C2FF894]) [    ] o.a.s.c.CoreContainer Shutting down CoreContainer instance=10060945
   [junit4]   2> 1601720 INFO  (TEST-TestBadConfig.testBogusMergePolicy-seed#[52132C1F8C2FF894]) [    ] o.a.s.SolrTestCaseJ4 ####initCore
   [junit4]   2> 1601721 INFO  (TEST-TestBadConfig.testBogusMergePolicy-seed#[52132C1F8C2FF894]) [    ] o.a.s.c.SolrResourceLoader [null] Added 2 libs to classloader, from paths: [/C:/Users/jenkins/workspace/Lucene-Solr-master-Windows/solr/core/src/test-files/solr/collection1/lib, /C:/Users/jenkins/workspace/Lucene-Solr-master-Windows/solr/core/src/test-files/solr/collection1/lib/classes]
   [junit4]   2> 1601773 INFO  (TEST-TestBadConfig.testBogusMergePolicy-seed#[52132C1F8C2FF894]) [    ] o.a.s.c.SolrConfig Using Lucene MatchVersion: 7.0.0
   [junit4]   2> 1601779 INFO  (TEST-TestBadConfig.testBogusMergePolicy-seed#[52132C1F8C2FF894]) [    ] o.a.s.s.IndexSchema [null] Schema name=minimal
   [junit4]   2> 1601783 WARN  (TEST-TestBadConfig.testBogusMergePolicy-seed#[52132C1F8C2FF894]) [    ] o.a.s.s.IndexSchema no uniqueKey specified in schema.
   [junit4]   2> 1601783 INFO  (TEST-TestBadConfig.testBogusMergePolicy-seed#[52132C1F8C2FF894]) [    ] o.a.s.s.IndexSchema Loaded schema minimal/1.1 with uniqueid field null
   [junit4]   2> 1601792 INFO  (coreLoadExecutor-7021-thread-1) [    ] o.a.s.c.SolrResourceLoader [null] Added 2 libs to classloader, from paths: [/C:/Users/jenkins/workspace/Lucene-Solr-master-Windows/solr/core/src/test-files/solr/collection1/lib, /C:/Users/jenkins/workspace/Lucene-Solr-master-Windows/solr/core/src/test-files/solr/collection1/lib/classes]
   [junit4]   2> 1601810 INFO  (coreLoadExecutor-7021-thread-1) [    ] o.a.s.c.SolrConfig Using Lucene MatchVersion: 7.0.0
   [junit4]   2> 1601817 INFO  (coreLoadExecutor-7021-thread-1) [    ] o.a.s.s.IndexSchema [collection1] Schema name=minimal
   [junit4]   2> 1601818 WARN  (coreLoadExecutor-7021-thread-1) [    ] o.a.s.s.IndexSchema no uniqueKey specified in schema.
   [junit4]   2> 1601818 INFO  (coreLoadExecutor-7021-thread-1) [    ] o.a.s.s.IndexSchema Loaded schema minimal/1.1 with uniqueid field null
   [junit4]   2> 1601825 INFO  (coreLoadExecutor-7021-thread-1) [    ] o.a.s.c.CoreContainer Creating SolrCore 'collection1' using configuration from instancedir C:\Users\jenkins\workspace\Lucene-Solr-master-Windows\solr\core\src\test-files\solr\collection1
   [junit4]   2> 1601825 INFO  (coreLoadExecutor-7021-thread-1) [    x:collection1] o.a.s.c.SolrCore [[collection1] ] Opening new SolrCore at [C:\Users\jenkins\workspace\Lucene-Solr-master-Windows\solr\core\src\test-files\solr\collection1], dataDir=[C:\Users\jenkins\workspace\Lucene-Solr-master-Windows\solr\build\solr-core\test\J0\temp\solr.core.TestBadConfig_52132C1F8C2FF894-001\init-core-data-001\]
   [junit4]   2> 1601921 INFO  (coreLoadExecutor-7021-thread-1) [    x:collection1] o.a.s.c.SolrCore [collection1]  CLOSING SolrCore org.apache.solr.core.SolrCore@3e2d82
   [junit4]   2> 1601921 ERROR (coreLoadExecutor-7021-thread-1) [    x:collection1] o.a.s.c.CoreContainer Error creating core [collection1]: Error loading class 'org.apache.solr.update.DummyMergePolicyFactory'
   [junit4]   2> org.apache.solr.common.SolrException: Error loading class 'org.apache.solr.update.DummyMergePolicyFactory'
   [junit4]   2> 	at org.apache.solr.core.SolrCore.<init>(SolrCore.java:917)
   [junit4]   2> 	at org.apache.solr.core.SolrCore.<init>(SolrCore.java:792)
   [junit4]   2> 	at org.apache.solr.core.CoreContainer.create(CoreContainer.java:868)
   [junit4]   2> 	at org.apache.solr.core.CoreContainer.lambda$load$0(CoreContainer.java:517)
   [junit4]   2> 	at java.util.concurrent.FutureTask.run(FutureTask.java:266)
   [junit4]   2> 	at org.apache.solr.common.util.ExecutorUtil$MDCAwareThreadPoolExecutor.lambda$execute$0(ExecutorUtil.java:229)
   [junit4]   2> 	at java.util.concurrent.ThreadPoolExecutor.runWorker(ThreadPoolExecutor.java:1142)
   [junit4]   2> 	at java.util.concurrent.ThreadPoolExecutor$Worker.run(ThreadPoolExecutor.java:617)
   [junit4]   2> 	at java.lang.Thread.run(Thread.java:745)
   [junit4]   2> Caused by: org.apache.solr.common.SolrException: Error loading class 'org.apache.solr.update.DummyMergePolicyFactory'
   [junit4]   2> 	at org.apache.solr.core.SolrResourceLoader.findClass(SolrResourceLoader.java:556)
   [junit4]   2> 	at org.apache.solr.core.SolrResourceLoader.newInstance(SolrResourceLoader.java:625)
   [junit4]   2> 	at org.apache.solr.update.SolrIndexConfig.buildMergePolicy(SolrIndexConfig.java:290)
   [junit4]   2> 	at org.apache.solr.update.SolrIndexConfig.toIndexWriterConfig(SolrIndexConfig.java:238)
   [junit4]   2> 	at org.apache.solr.update.SolrIndexWriter.<init>(SolrIndexWriter.java:91)
   [junit4]   2> 	at org.apache.solr.update.SolrIndexWriter.create(SolrIndexWriter.java:68)
   [junit4]   2> 	at org.apache.solr.core.SolrCore.initIndex(SolrCore.java:690)
   [junit4]   2> 	at org.apache.solr.core.SolrCore.<init>(SolrCore.java:864)
   [junit4]   2> 	... 8 more
   [junit4]   2> Caused by: java.lang.ClassNotFoundException: org.apache.solr.update.DummyMergePolicyFactory
   [junit4]   2> 	at java.net.URLClassLoader.findClass(URLClassLoader.java:381)
   [junit4]   2> 	at java.lang.ClassLoader.loadClass(ClassLoader.java:424)
   [junit4]   2> 	at java.net.FactoryURLClassLoader.loadClass(URLClassLoader.java:814)
   [junit4]   2> 	at java.lang.ClassLoader.loadClass(ClassLoader.java:357)
   [junit4]   2> 	at java.lang.Class.forName0(Native Method)
   [junit4]   2> 	at java.lang.Class.forName(Class.java:348)
   [junit4]   2> 	at org.apache.solr.core.SolrResourceLoader.findClass(SolrResourceLoader.java:540)
   [junit4]   2> 	... 15 more
   [junit4]   2> 1601927 INFO  (TEST-TestBadConfig.testBogusMergePolicy-seed#[52132C1F8C2FF894]) [    ] o.a.s.SolrTestCaseJ4 ####initCore end
   [junit4]   2> 1601928 INFO  (TEST-TestBadConfig.testBogusMergePolicy-seed#[52132C1F8C2FF894]) [    ] o.a.s.SolrTestCaseJ4 ###deleteCore
   [junit4]   2> 1601928 INFO  (TEST-TestBadConfig.testBogusMergePolicy-seed#[52132C1F8C2FF894]) [    ] o.a.s.c.CoreContainer Shutting down CoreContainer instance=5007324
   [junit4]   2> 1601928 INFO  (TEST-TestBadConfig.testBogusMergePolicy-seed#[52132C1F8C2FF894]) [    ] o.a.s.SolrTestCaseJ4 ###Ending testBogusMergePolicy
   [junit4]   2> 1601940 INFO  (TEST-TestBadConfig.testNRTModeProperty-seed#[52132C1F8C2FF894]) [    ] o.a.s.SolrTestCaseJ4 ###Starting testNRTModeProperty
   [junit4]   2> 1601941 INFO  (TEST-TestBadConfig.testNRTModeProperty-seed#[52132C1F8C2FF894]) [    ] o.a.s.SolrTestCaseJ4 ####initCore
   [junit4]   2> 1601942 INFO  (TEST-TestBadConfig.testNRTModeProperty-seed#[52132C1F8C2FF894]) [    ] o.a.s.c.SolrResourceLoader [null] Added 2 libs to classloader, from paths: [/C:/Users/jenkins/workspace/Lucene-Solr-master-Windows/solr/core/src/test-files/solr/collection1/lib, /C:/Users/jenkins/workspace/Lucene-Solr-master-Windows/solr/core/src/test-files/solr/collection1/lib/classes]
   [junit4]   2> 1601995 INFO  (TEST-TestBadConfig.testNRTModeProperty-seed#[52132C1F8C2FF894]) [    ] o.a.s.SolrTestCaseJ4 ###deleteCore
   [junit4]   2> 1601996 INFO  (TEST-TestBadConfig.testNRTModeProperty-seed#[52132C1F8C2FF894]) [    ] o.a.s.SolrTestCaseJ4 ###Ending testNRTModeProperty
   [junit4]   2> 1601997 INFO  (TEST-TestBadConfig.testSchemaMutableButNotManaged-seed#[52132C1F8C2FF894]) [    ] o.a.s.SolrTestCaseJ4 ###Starting testSchemaMutableButNotManaged
   [junit4]   2> 1601997 INFO  (TEST-TestBadConfig.testSchemaMutableButNotManaged-seed#[52132C1F8C2FF894]) [    ] o.a.s.SolrTestCaseJ4 ####initCore
   [junit4]   2> 1601998 INFO  (TEST-TestBadConfig.testSchemaMutableButNotManaged-seed#[52132C1F8C2FF894]) [    ] o.a.s.c.SolrResourceLoader [null] Added 2 libs to classloader, from paths: [/C:/Users/jenkins/workspace/Lucene-Solr-master-Windows/solr/core/src/test-files/solr/collection1/lib, /C:/Users/jenkins/workspace/Lucene-Solr-master-Windows/solr/core/src/test-files/solr/collection1/lib/classes]
   [junit4]   2> 1602015 INFO  (TEST-TestBadConfig.testSchemaMutableButNotManaged-seed#[52132C1F8C2FF894]) [    ] o.a.s.c.SolrConfig Using Lucene MatchVersion: 7.0.0
   [junit4]   2> 1602018 ERROR (TEST-TestBadConfig.testSchemaMutableButNotManaged-seed#[52132C1F8C2FF894]) [    ] o.a.s.s.ClassicIndexSchemaFactory Unexpected arg(s): {mutable=false,managedSchemaResourceName=schema.xml}
   [junit4]   2> 1602018 INFO  (TEST-TestBadConfig.testSchemaMutableButNotManaged-seed#[52132C1F8C2FF894]) [    ] o.a.s.SolrTestCaseJ4 ###deleteCore
   [junit4]   2> 1602018 INFO  (TEST-TestBadConfig.testSchemaMutableButNotManaged-seed#[52132C1F8C2FF894]) [    ] o.a.s.SolrTestCaseJ4 ###Ending testSchemaMutableButNotManaged
   [junit4]   2> 1602020 INFO  (TEST-TestBadConfig.testMultipleIndexConfigs-seed#[52132C1F8C2FF894]) [    ] o.a.s.SolrTestCaseJ4 ###Starting testMultipleIndexConfigs
   [junit4]   2> 1602020 INFO  (TEST-TestBadConfig.testMultipleIndexConfigs-seed#[52132C1F8C2FF894]) [    ] o.a.s.SolrTestCaseJ4 ####initCore
   [junit4]   2> 1602021 INFO  (TEST-TestBadConfig.testMultipleIndexConfigs-seed#[52132C1F8C2FF894]) [    ] o.a.s.c.SolrResourceLoader [null] Added 2 libs to classloader, from paths: [/C:/Users/jenkins/workspace/Lucene-Solr-master-Windows/solr/core/src/test-files/solr/collection1/lib, /C:/Users/jenkins/workspace/Lucene-Solr-master-Windows/solr/core/src/test-files/solr/collection1/lib/classes]
   [junit4]   2> 1602038 INFO  (TEST-TestBadConfig.testMultipleIndexConfigs-seed#[52132C1F8C2FF894]) [    ] o.a.s.SolrTestCaseJ4 ###deleteCore
   [junit4]   2> 1602038 INFO  (TEST-TestBadConfig.testMultipleIndexConfigs-seed#[52132C1F8C2FF894]) [    ] o.a.s.SolrTestCaseJ4 ###Ending testMultipleIndexConfigs
   [junit4]   2> 1602040 INFO  (TEST-TestBadConfig.testMultipleCFS-seed#[52132C1F8C2FF894]) [    ] o.a.s.SolrTestCaseJ4 ###Starting testMultipleCFS
   [junit4]   2> 1602040 INFO  (TEST-TestBadConfig.testMultipleCFS-seed#[52132C1F8C2FF894]) [    ] o.a.s.SolrTestCaseJ4 ####initCore
   [junit4]   2> 1602041 INFO  (TEST-TestBadConfig.testMultipleCFS-seed#[52132C1F8C2FF894]) [    ] o.a.s.c.SolrResourceLoader [null] Added 2 libs to classloader, from paths: [/C:/Users/jenkins/workspace/Lucene-Solr-master-Windows/solr/core/src/test-files/solr/collection1/lib, /C:/Users/jenkins/workspace/Lucene-Solr-master-Windows/solr/core/src/test-files/solr/collection1/lib/classes]
   [junit4]   2> 1602059 INFO  (TEST-TestBadConfig.testMultipleCFS-seed#[52132C1F8C2FF894]) [    ] o.a.s.SolrTestCaseJ4 ###deleteCore
   [junit4]   2> 1602059 INFO  (TEST-TestBadConfig.testMultipleCFS-seed#[52132C1F8C2FF894]) [    ] o.a.s.SolrTestCaseJ4 ###Ending testMultipleCFS
   [junit4]   2> 1602060 INFO  (TEST-TestBadConfig.testUnknownSchemaAttribute-seed#[52132C1F8C2FF894]) [    ] o.a.s.SolrTestCaseJ4 ###Starting testUnknownSchemaAttribute
   [junit4]   2> 1602060 INFO  (TEST-TestBadConfig.testUnknownSchemaAttribute-seed#[52132C1F8C2FF894]) [    ] o.a.s.SolrTestCaseJ4 ####initCore
   [junit4]   2> 1602061 INFO  (TEST-TestBadConfig.testUnknownSchemaAttribute-seed#[52132C1F8C2FF894]) [    ] o.a.s.c.SolrResourceLoader [null] Added 2 libs to classloader, from paths: [/C:/Users/jenkins/workspace/Lucene-Solr-master-Windows/solr/core/src/test-files/solr/collection1/lib, /C:/Users/jenkins/workspace/Lucene-Solr-master-Windows/solr/core/src/test-files/solr/collection1/lib/classes]
   [junit4]   2> 1602081 INFO  (TEST-TestBadConfig.testUnknownSchemaAttribute-seed#[52132C1F8C2FF894]) [    ] o.a.s.c.SolrConfig Using Lucene MatchVersion: 7.0.0
   [junit4]   2> 1602085 ERROR (TEST-TestBadConfig.testUnknownSchemaAttribute-seed#[52132C1F8C2FF894]) [    ] o.a.s.s.ManagedIndexSchemaFactory Unexpected arg(s): {bogusParam=bogusValue}
   [junit4]   2> 1602085 INFO  (TEST-TestBadConfig.testUnknownSchemaAttribute-seed#[52132C1F8C2FF894]) [    ] o.a.s.SolrTestCaseJ4 ###deleteCore
   [junit4]   2> 1602085 INFO  (TEST-TestBadConfig.testUnknownSchemaAttribute-seed#[52132C1F8C2FF894]) [    ] o.a.s.SolrTestCaseJ4 ###Ending testUnknownSchemaAttribute
   [junit4]   2> 1602087 INFO  (TEST-TestBadConfig.testMultipleDirectoryFactories-seed#[52132C1F8C2FF894]) [    ] o.a.s.SolrTestCaseJ4 ###Starting testMultipleDirectoryFactories
   [junit4]   2> 1602087 INFO  (TEST-TestBadConfig.testMultipleDirectoryFactories-seed#[52132C1F8C2FF894]) [    ] o.a.s.SolrTestCaseJ4 ####initCore
   [junit4]   2> 1602088 INFO  (TEST-TestBadConfig.testMultipleDirectoryFactories-seed#[52132C1F8C2FF894]) [    ] o.a.s.c.SolrResourceLoader [null] Added 2 libs to classloader, from paths: [/C:/Users/jenkins/workspace/Lucene-Solr-master-Windows/solr/core/src/test-files/solr/collection1/lib, /C:/Users/jenkins/workspace/Lucene-Solr-master-Windows/solr/core/src/test-files/solr/collection1/lib/classes]
   [junit4]   2> 1602107 WARN  (TEST-TestBadConfig.testMultipleDirectoryFactories-seed#[52132C1F8C2FF894]) [    ] o.a.s.c.Config Beginning with Solr 5.5, <mergePolicy> is deprecated, use <mergePolicyFactory> instead.
   [junit4]   2> 1602107 INFO  (TEST-TestBadConfig.testMultipleDirectoryFactories-seed#[52132C1F8C2FF894]) [    ] o.a.s.c.SolrConfig Using Lucene MatchVersion: 7.0.0
   [junit4]   2> 1602109 INFO  (TEST-TestBadConfig.testMultipleDirectoryFactories-seed#[52132C1F8C2FF894]) [    ] o.a.s.SolrTestCaseJ4 ###deleteCore
   [junit4]   2> 1602109 INFO  (TEST-TestBadConfig.testMultipleDirectoryFactories-seed#[52132C1F8C2FF894]) [    ] o.a.s.SolrTestCaseJ4 ###Ending testMultipleDirectoryFactories
   [junit4]   2> 1602110 INFO  (TEST-TestBadConfig.testManagedSchemaCannotBeNamedSchemaDotXml-seed#[52132C1F8C2FF894]) [    ] o.a.s.SolrTestCaseJ4 ###Starting testManagedSchemaCannotBeNamedSchemaDotXml
   [junit4]   2> 1602111 INFO  (TEST-TestBadConfig.testManagedSchemaCannotBeNamedSchemaDotXml-seed#[52132C1F8C2FF894]) [    ] o.a.s.SolrTestCaseJ4 ####initCore
   [junit4]   2> 1602111 INFO  (TEST-TestBadConfig.testManagedSchemaCannotBeNamedSchemaDotXml-seed#[52132C1F8C2FF894]) [    ] o.a.s.c.SolrResourceLoader [null] Added 2 libs to classloader, from paths: [/C:/Users/jenkins/workspace/Lucene-Solr-master-Windows/solr/core/src/test-files/solr/collection1/lib, /C:/Users/jenkins/workspace/Lucene-Solr-master-Windows/solr/core/src/test-files/solr/collection1/lib/classes]
   [junit4]   2> 1602130 INFO  (TEST-TestBadConfig.testManagedSchemaCannotBeNamedSchemaDotXml-seed#[52132C1F8C2FF894]) [    ] o.a.s.c.SolrConfig Using Lucene MatchVersion: 7.0.0
   [junit4]   2> 1602133 ERROR (TEST-TestBadConfig.testManagedSchemaCannotBeNamedSchemaDotXml-seed#[52132C1F8C2FF894]) [    ] o.a.s.s.ManagedIndexSchemaFactory managedSchemaResourceName can't be 'schema.xml'
   [junit4]   2> 1602133 INFO  (TEST-TestBadConfig.testManagedSchemaCannotBeNamedSchemaDotXml-seed#[52132C1F8C2FF894]) [    ] o.a.s.SolrTestCaseJ4 ###deleteCore
   [junit4]   2> 1602133 INFO  (TEST-TestBadConfig.testManagedSchemaCannotBeNamedSchemaDotXml-seed#[52132C1F8C2FF894]) [    ] o.a.s.SolrTestCaseJ4 ###Ending testManagedSchemaCannotBeNamedSchemaDotXml
   [junit4]   2> 1602135 INFO  (TEST-TestBadConfig.testUnsetSysProperty-seed#[52132C1F8C2FF894]) [    ] o.a.s.SolrTestCaseJ4 ###Starting testUnsetSysProperty
   [junit4]   2> 1602135 INFO  (TEST-TestBadConfig.testUnsetSysProperty-seed#[52132C1F8C2FF894]) [    ] o.a.s.SolrTestCaseJ4 ####initCore
   [junit4]   2> 1602136 INFO  (TEST-TestBadConfig.testUnsetSysProperty-seed#[52132C1F8C2FF894]) [    ] o.a.s.c.SolrResourceLoader [null] Added 2 libs to classloader, from paths: [/C:/Users/jenkins/workspace/Lucene-Solr-master-Windows/solr/core/src/test-files/solr/collection1/lib, /C:/Users/jenkins/workspace/Lucene-Solr-master-Windows/solr/core/src/test-files/solr/collection1/lib/classes]
   [junit4]   2> 1602152 INFO  (TEST-TestBadConfig.testUnsetSysProperty-seed#[52132C1F8C2FF894]) [    ] o.a.s.SolrTestCaseJ4 ###deleteCore
   [junit4]   2> 1602152 INFO  (TEST-TestBadConfig.testUnsetSysProperty-seed#[52132C1F8C2FF894]) [    ] o.a.s.SolrTestCaseJ4 ###Ending testUnsetSysProperty
   [junit4]   2> 1602153 INFO  (TEST-TestBadConfig.testUpdateLogButNoVersionField-seed#[52132C1F8C2FF894]) [    ] o.a.s.SolrTestCaseJ4 ###Starting testUpdateLogButNoVersionField
   [junit4]   2> 1602154 INFO  (TEST-TestBadConfig.testUpdateLogButNoVersionField-seed#[52132C1F8C2FF894]) [    ] o.a.s.SolrTestCaseJ4 ####initCore
   [junit4]   2> 1602154 INFO  (TEST-TestBadConfig.testUpdateLogButNoVersionField-seed#[52132C1F8C2FF894]) [    ] o.a.s.c.SolrResourceLoader [null] Added 2 libs to classloader, from paths: [/C:/Users/jenkins/workspace/Lucene-Solr-master-Windows/solr/core/src/test-files/solr/collection1/lib, /C:/Users/jenkins/workspace/Lucene-Solr-master-Windows/solr/core/src/test-files/solr/collection1/lib/classes]
   [junit4]   2> 1602179 WARN  (TEST-TestBadConfig.testUpdateLogButNoVersionField-seed#[52132C1F8C2FF894]) [    ] o.a.s.c.Config Beginning with Solr 5.5, <mergePolicy> is deprecated, use <mergePolicyFactory> instead.
   [junit4]   2> 1602181 INFO  (TEST-TestBadConfig.testUpdateLogButNoVersionField-seed#[52132C1F8C2FF894]) [    ] o.a.s.c.SolrConfig Using Lucene MatchVersion: 7.0.0
   [junit4]   2> 1602207 INFO  (TEST-TestBadConfig.testUpdateLogButNoVersionField-seed#[52132C1F8C2FF894]) [    ] o.a.s.s.IndexSchema [null] Schema name=test
   [junit4]   2> 1602252 WARN  (TEST-TestBadConfig.testUpdateLogButNoVersionField-seed#[52132C1F8C2FF894]) [    ] o.a.s.s.IndexSchema [null] default search field in schema is text. WARNING: Deprecated, please use 'df' on request instead.
   [junit4]   2> 1602253 WARN  (TEST-TestBadConfig.testUpdateLogButNoVersionField-seed#[52132C1F8C2FF894]) [    ] o.a.s.s.IndexSchema Field text is not multivalued and destination for multiple copyFields (2)
   [junit4]   2> 1602254 INFO  (TEST-TestBadConfig.testUpdateLogButNoVersionField-seed#[52132C1F8C2FF894]) [    ] o.a.s.s.IndexSchema Loaded schema test/1.4 with uniqueid field id
   [junit4]   2> 1602299 INFO  (coreLoadExecutor-7029-thread-1) [    ] o.a.s.c.SolrResourceLoader [null] Added 2 libs to classloader, from paths: [/C:/Users/jenkins/workspace/Lucene-Solr-master-Windows/solr/core/src/test-files/solr/collection1/lib, /C:/Users/jenkins/workspace/Lucene-Solr-master-Windows/solr/core/src/test-files/solr/collection1/lib/classes]
   [junit4]   2> 1602324 WARN  (coreLoadExecutor-7029-thread-1) [    ] o.a.s.c.Config Beginning with Solr 5.5, <mergePolicy> is deprecated, use <mergePolicyFactory> instead.
   [junit4]   2> 1602325 INFO  (coreLoadExecutor-7029-thread-1) [    ] o.a.s.c.SolrConfig Using Lucene MatchVersion: 7.0.0
   [junit4]   2> 1602344 INFO  (coreLoadExecutor-7029-thread-1) [    ] o.a.s.s.IndexSchema [collection1] Schema name=test
   [junit4]   2> 1602397 WARN  (coreLoadExecutor-7029-thread-1) [    ] o.a.s.s.IndexSchema [collection1] default search field in schema is text. WARNING: Deprecated, please use 'df' on request instead.
   [junit4]   2> 1602397 WARN  (coreLoadExecutor-7029-thread-1) [    ] o.a.s.s.IndexSchema Field text is not multivalued and destination for multiple copyFields (2)
   [junit4]   2> 1602398 INFO  (coreLoadExecutor-7029-thread-1) [    ] o.a.s.s.IndexSchema Loaded schema test/1.4 with uniqueid field id
   [junit4]   2> 1602414 INFO  (coreLoadExecutor-7029-thread-1) [    ] o.a.s.c.CoreContainer Creating SolrCore 'collection1' using configuration from instancedir C:\Users\jenkins\workspace\Lucene-Solr-master-Windows\solr\core\src\test-files\solr\collection1
   [junit4]   2> 1602415 INFO  (coreLoadExecutor-7029-thread-1) [    x:collection1] o.a.s.c.SolrCore [[collection1] ] Opening new SolrCore at [C:\Users\jenkins\workspace\Lucene-Solr-master-Windows\solr\core\src\test-files\solr\collection1], dataDir=[C:\Users\jenkins\workspace\Lucene-Solr-master-Windows\solr\build\solr-core\test\J0\temp\solr.core.TestBadConfig_52132C1F8C2FF894-001\init-core-data-001\]
   [junit4]   2> 1602415 INFO  (coreLoadExecutor-7029-thread-1) [    x:collection1] o.a.s.c.JmxMonitoredMap JMX monitoring is enabled. Adding Solr mbeans to JMX Server: com.sun.jmx.mbeanserver.JmxMBeanServer@863b26
   [junit4]   2> 1602418 INFO  (coreLoadExecutor-7029-thread-1) [    x:collection1] o.a.s.u.RandomMergePolicy RandomMergePolicy wrapping class org.apache.lucene.index.TieredMergePolicy: [TieredMergePolicy: maxMergeAtOnce=23, maxMergeAtOnceExplicit=21, maxMergedSegmentMB=18.0126953125, floorSegmentMB=2.1044921875, forceMergeDeletesPctAllowed=25.221773979712683, segmentsPerTier=33.0, maxCFSSegmentSizeMB=8.796093022207999E12, noCFSRatio=1.0
   [junit4]   2> 1602436 INFO  (coreLoadExecutor-7029-thread-1) [    x:collection1] o.a.s.u.UpdateHandler Using UpdateLog implementation: org.apache.solr.update.UpdateLog
   [junit4]   2> 1602436 INFO  (coreLoadExecutor-7029-thread-1) [    x:collection1] o.a.s.u.UpdateLog Initializing UpdateLog: dataDir= defaultSyncLevel=FLUSH numRecordsToKeep=100 maxNumLogsToKeep=10 numVersionBuckets=65536
   [junit4]   2> 1602436 ERROR (coreLoadExecutor-7029-thread-1) [    x:collection1] o.a.s.u.UpdateLog Unable to use updateLog: _version_ field must exist in schema and be searchable (indexed or docValues) and retrievable(stored or docValues) and not multiValued (_version_ does not exist)
   [junit4]   2> org.apache.solr.common.SolrException: _version_ field must exist in schema and be searchable (indexed or docValues) and retrievable(stored or docValues) and not multiValued (_version_ does not exist)
   [junit4]   2> 	at org.apache.solr.update.VersionInfo.getAndCheckVersionField(VersionInfo.java:68)
   [junit4]   2> 	at org.apache.solr.update.VersionInfo.<init>(VersionInfo.java:94)
   [junit4]   2> 	at org.apache.solr.update.UpdateLog.init(UpdateLog.java:308)
   [junit4]   2> 	at org.apache.solr.update.UpdateHandler.<init>(UpdateHandler.java:137)
   [junit4]   2> 	at org.apache.solr.update.UpdateHandler.<init>(UpdateHandler.java:94)
   [junit4]   2> 	at org.apache.solr.update.DirectUpdateHandler2.<init>(DirectUpdateHandler2.java:102)
   [junit4]   2> 	at sun.reflect.GeneratedConstructorAccessor149.newInstance(Unknown Source)
   [junit4]   2> 	at sun.reflect.DelegatingConstructorAccessorImpl.newInstance(DelegatingConstructorAccessorImpl.java:45)
   [junit4]   2> 	at java.lang.reflect.Constructor.newInstance(Constructor.java:423)
   [junit4]   2> 	at org.apache.solr.core.SolrCore.createInstance(SolrCore.java:722)
   [junit4]   2> 	at org.apache.solr.core.SolrCore.createUpdateHandler(SolrCore.java:784)
   [junit4]   2> 	at org.apache.solr.core.SolrCore.initUpdateHandler(SolrCore.java:1023)
   [junit4]   2> 	at org.apache.solr.core.SolrCore.<init>(SolrCore.java:888)
   [junit4]   2> 	at org.apache.solr.core.SolrCore.<init>(SolrCore.java:792)
   [junit4]   2> 	at org.apache.solr.core.CoreContainer.create(CoreContainer.java:868)
   [junit4]   2> 	at org.apache.solr.core.CoreContainer.lambda$load$0(CoreContainer.java:517)
   [junit4]   2> 	at java.util.concurrent.FutureTask.run(FutureTask.java:266)
   [junit4]   2> 	at org.apache.solr.common.util.ExecutorUtil$MDCAwareThreadPoolExecutor.lambda$execute$0(ExecutorUtil.java:229)
   [junit4]   2> 	at java.util.concurrent.ThreadPoolExecutor.runWorker(ThreadPoolExecutor.java:1142)
   [junit4]   2> 	at java.util.concurrent.ThreadPoolExecutor$Worker.run(ThreadPoolExecutor.java:617)
   [junit4]   2> 	at java.lang.Thread.run(Thread.java:745)
   [junit4]   2> 1602437 INFO  (coreLoadExecutor-7029-thread-1) [    x:collection1] o.a.s.c.SolrCore [collection1]  CLOSING SolrCore org.apache.solr.core.SolrCore@12f92ba
   [junit4]   2> 1602442 ERROR (coreLoadExecutor-7029-thread-1) [    x:collection1] o.a.s.c.CoreContainer Error creating core [collection1]: Unable to use updateLog: _version_ field must exist in schema and be searchable (indexed or docValues) and retrievable(stored or docValues) and not multiValued (_version_ does not exist)
   [junit4]   2> org.apache.solr.common.SolrException: Unable to use updateLog: _version_ field must exist in schema and be searchable (indexed or docValues) and retrievable(stored or docValues) and not multiValued (_version_ does not exist)
   [junit4]   2> 	at org.apache.solr.core.SolrCore.<init>(SolrCore.java:917)
   [junit4]   2> 	at org.apache.solr.core.SolrCore.<init>(SolrCore.java:792)
   [junit4]   2> 	at org.apache.solr.core.CoreContainer.create(CoreContainer.java:868)
   [junit4]   2> 	at org.apache.solr.core.CoreContainer.lambda$load$0(CoreContainer.java:517)
   [junit4]   2> 	at java.util.concurrent.FutureTask.run(FutureTask.java:266)
   [junit4]   2> 	at org.apache.solr.common.util.ExecutorUtil$MDCAwareThreadPoolExecutor.lambda$execute$0(ExecutorUtil.java:229)
   [junit4]   2> 	at java.util.concurrent.ThreadPoolExecutor.runWorker(ThreadPoolExecutor.java:1142)
   [junit4]   2> 	at java.util.concurrent.ThreadPoolExecutor$Worker.run(ThreadPoolExecutor.java:617)
   [junit4]   2> 	at java.lang.Thread.run(Thread.java:745)
   [junit4]   2> Caused by: org.apache.solr.common.SolrException: Unable to use updateLog: _version_ field must exist in schema and be searchable (indexed or docValues) and retrievable(stored or docValues) and not multiValued (_version_ does not exist)
   [junit4]   2> 	at org.apache.solr.update.UpdateLog.init(UpdateLog.java:312)
   [junit4]   2> 	at org.apache.solr.update.UpdateHandler.<init>(UpdateHandler.java:137)
   [junit4]   2> 	at org.apache.solr.update.UpdateHandler.<init>(UpdateHandler.java:94)
   [junit4]   2> 	at org.apache.solr.update.DirectUpdateHandler2.<init>(DirectUpdateHandler2.java:102)
   [junit4]   2> 	at sun.reflect.GeneratedConstructorAccessor149.newInstance(Unknown Source)
   [junit4]   2> 	at sun.reflect.DelegatingConstructorAccessorImpl.newInstance(DelegatingConstructorAccessorImpl.java:45)
   [junit4]   2> 	at java.lang.reflect.Constructor.newInstance(Constructor.java:423)
   [junit4]   2> 	at org.apache.solr.core.SolrCore.createInstance(SolrCore.java:722)
   [junit4]   2> 	at org.apache.solr.core.SolrCore.createUpdateHandler(SolrCore.java:784)
   [junit4]   2> 	at org.apache.solr.core.SolrCore.initUpdateHandler(SolrCore.java:1023)
   [junit4]   2> 	at org.apache.solr.core.SolrCore.<init>(SolrCore.java:888)
   [junit4]   2> 	... 8 more
   [junit4]   2> Caused by: org.apache.solr.common.SolrException: _version_ field must exist in schema and be searchable (indexed or docValues) and retrievable(stored or docValues) and not multiValued (_version_ does not exist)
   [junit4]   2> 	at org.apache.solr.update.VersionInfo.getAndCheckVersionField(VersionInfo.java:68)
   [junit4]   2> 	at org.apache.solr.update.VersionInfo.<init>(VersionInfo.java:94)
   [junit4]   2> 	at org.apache.solr.update.UpdateLog.init(UpdateLog.java:308)
   [junit4]   2> 	... 18 more
   [junit4]   2> 1602445 INFO  (TEST-TestBadConfig.testUpdateLogButNoVersionField-seed#[52132C1F8C2FF894]) [    ] o.a.s.SolrTestCaseJ4 ####initCore end
   [junit4]   2> 1602445 INFO  (TEST-TestBadConfig.testUpdateLogButNoVersionField-seed#[52132C1F8C2FF894]) [    ] o.a.s.SolrTestCaseJ4 ###deleteCore
   [junit4]   2> 1602445 INFO  (TEST-TestBadConfig.testUpdateLogButNoVersionField-seed#[52132C1F8C2FF894]) [    ] o.a.s.c.CoreContainer Shutting down CoreContainer instance=27265139
   [junit4]   2> 1602445 INFO  (TEST-TestBadConfig.testUpdateLogButNoVersionField-seed#[52132C1F8C2FF894]) [    ] o.a.s.SolrTestCaseJ4 ###Ending testUpdateLogButNoVersionField
   [junit4]   2> 1602446 INFO  (TEST-TestBadConfig.testTolerantUpdateProcessorNoUniqueKey-seed#[52132C1F8C2FF894]) [    ] o.a.s.SolrTestCaseJ4 ###Starting testTolerantUpdateProcessorNoUniqueKey
   [junit4]   2> 1602449 INFO  (TEST-TestBadConfig.testTolerantUpdateProcessorNoUniqueKey-seed#[52132C1F8C2FF894]) [    ] o.a.s.SolrTestCaseJ4 ####initCore
   [junit4]   2> 1602449 INFO  (TEST-TestBadConfig.testTolerantUpdateProcessorNoUniqueKey-seed#[52132C1F8C2FF894]) [    ] o.a.s.c.SolrResourceLoader [null] Added 2 libs to classloader, from paths: [/C:/Users/jenkins/workspace/Lucene-Solr-master-Windows/solr/core/src/test-files/solr/collection1/lib, /C:/Users/jenkins/workspace/Lucene-Solr-master-Windows/solr/core/src/test-files/solr/collection1/lib/classes]
   [junit4]   2> 1602507 WARN  (TEST-TestBadConfig.testTolerantUpdateProcessorNoUniqueKey-seed#[52132C1F8C2FF894]) [    ] o.a.s.c.Config Beginning with Solr 5.5, <mergePolicy> is deprecated, use <mergePolicyFactory> instead.
   [junit4]   2> 1602508 INFO  (TEST-TestBadConfig.testTolerantUpdateProcessorNoUniqueKey-seed#[52132C1F8C2FF894]) [    ] o.a.s.c.SolrConfig Using Lucene MatchVersion: 7.0.0
   [junit4]   2> 1602514 INFO  (TEST-TestBadConfig.testTolerantUpdateProcessorNoUniqueKey-seed#[52132C1F8C2FF894]) [    ] o.a.s.s.IndexSchema [null] Schema name=minimal
   [junit4]   2> 1602517 WARN  (TEST-TestBadConfig.testTolerantUpdateProcessorNoUniqueKey-seed#[52132C1F8C2FF894]) [    ] o.a.s.s.IndexSchema no uniqueKey specified in schema.
   [junit4]   2> 1602517 INFO  (TEST-TestBadConfig.testTolerantUpdateProcessorNoUniqueKey-seed#[52132C1F8C2FF894]) [    ] o.a.s.s.IndexSchema Loaded schema minimal/1.1 with uniqueid field null
   [junit4]   2> 1602526 INFO  (coreLoadExecutor-7039-thread-1) [    ] o.a.s.c.SolrResourceLoader [null] Added 2 libs to classloader, from paths: [/C:/Users/jenkins/workspace/Lucene-Solr-master-Windows/solr/core/src/test-files/solr/collection1/lib, /C:/Users/jenkins/workspace/Lucene-Solr-master-Windows/solr/core/src/test-files/solr/collection1/lib/classes]
   [junit4]   2> 1602551 WARN  (coreLoadExecutor-7039-thread-1) [    ] o.a.s.c.Config Beginning with Solr 5.5, <mergePolicy> is deprecated, use <mergePolicyFactory> instead.
   [junit4]   2> 1602553 INFO  (coreLoadExecutor-7039-thread-1) [    ] o.a.s.c.SolrConfig Using Lucene MatchVersion: 7.0.0
   [junit4]   2> 1602559 INFO  (coreLoadExecutor-7039-thread-1) [    ] o.a.s.s.IndexSchema [collection1] Schema name=minimal
   [junit4]   2> 1602560 WARN  (coreLoadExecutor-7039-thread-1) [    ] o.a.s.s.IndexSchema no uniqueKey specified in schema.
   [junit4]   2> 1602560 INFO  (coreLoadExecutor-7039-thread-1) [    ] o.a.s.s.IndexSchema Loaded schema minimal/1.1 with uniqueid field null
   [junit4]   2> 1602568 INFO  (coreLoadExecutor-7039-thread-1) [    ] o.a.s.c.CoreContainer Creating SolrCore 'collection1' using configuration from instancedir C:\Users\jenkins\workspace\Lucene-Solr-master-Windows\solr\core\src\test-files\solr\collection1
   [junit4]   2> 1602568 INFO  (coreLoadExecutor-7039-thread-1) [    x:collection1] o.a.s.c.SolrCore [[collection1] ] Opening new SolrCore at [C:\Users\jenkins\workspace\Lucene-Solr-master-Windows\solr\core\src\test-files\solr\collection1], dataDir=[C:\Users\jenkins\workspace\Lucene-Solr-master-Windows\solr\build\solr-core\test\J0\temp\solr.core.TestBadConfig_52132C1F8C2FF894-001\init-core-data-001\]
   [junit4]   2> 1602581 INFO  (coreLoadExecutor-7039-thread-1) [    x:collection1] o.a.s.u.CommitTracker Hard AutoCommit: disabled
   [junit4]   2> 1602581 INFO  (coreLoadExecutor-7039-thread-1) [    x:collection1] o.a.s.u.CommitTracker Soft AutoCommit: disabled
   [junit4]   2> 1602583 INFO  (coreLoadExecutor-7039-thread-1) [    x:collection1] o.a.s.u.RandomMergePolicy RandomMergePolicy wrapping class org.apache.lucene.index.LogDocMergePolicy: [LogDocMergePolicy: minMergeSize=1000, mergeFactor=32, maxMergeSize=9223372036854775807, maxMergeSizeForForcedMerge=9223372036854775807, calibrateSizeByDeletes=false, maxMergeDocs=2147483647, maxCFSSegmentSizeMB=8.796093022207999E12, noCFSRatio=0.67581184804897]
   [junit4]   2> 1602583 INFO  (coreLoadExecutor-7039-thread-1) [    x:collection1] o.a.s.s.SolrIndexSearcher Opening [Searcher@165efc4[collection1] main]
   [junit4]   2> 1602584 WARN  (coreLoadExecutor-7039-thread-1) [    x:collection1] o.a.s.r.ManagedResourceStorage Cannot write to config directory C:\Users\jenkins\workspace\Lucene-Solr-master-Windows\solr\core\src\test-files\solr\collection1\conf; switching to use InMemory storage instead.
   [junit4]   2> 1602584 INFO  (coreLoadExecutor-7039-thread-1) [    x:collection1] o.a.s.c.SolrCore [collection1]  CLOSING SolrCore org.apache.solr.core.SolrCore@1051a9
   [junit4]   2> 1602585 INFO  (searcherExecutor-7040-thread-1-processing-x:collection1) [    x:collection1] o.a.s.c.SolrCore [collection1] Registered new searcher Searcher@165efc4[collection1] main{ExitableDirectoryReader(UninvertingDirectoryReader())}
   [junit4]   2> 1602585 ERROR (coreLoadExecutor-7039-thread-1) [    x:collection1] o.a.s.c.CoreContainer Error creating core [collection1]: org.apache.solr.update.processor.TolerantUpdateProcessorFactory requires a schema that includes a uniqueKey field.
   [junit4]   2> org.apache.solr.common.SolrException: org.apache.solr.update.processor.TolerantUpdateProcessorFactory requires a schema that includes a uniqueKey field.
   [junit4]   2> 	at org.apache.solr.core.SolrCore.<init>(SolrCore.java:917)
   [junit4]   2> 	at org.apache.solr.core.SolrCore.<init>(SolrCore.java:792)
   [junit4]   2> 	at org.apache.solr.core.CoreContainer.create(CoreContainer.java:868)
   [junit4]   2> 	at org.apache.solr.core.CoreContainer.lambda$load$0(CoreContainer.java:517)
   [junit4]   2> 	at java.util.concurrent.FutureTask.run(FutureTask.java:266)
   [junit4]   2> 	at org.apache.solr.common.util.ExecutorUtil$MDCAwareThreadPoolExecutor.lambda$execute$0(ExecutorUtil.java:229)
   [junit4]   2> 	at java.util.concurrent.ThreadPoolExecutor.runWorker(ThreadPoolExecutor.java:1142)
   [junit4]   2> 	at java.util.concurrent.ThreadPoolExecutor$Worker.run(ThreadPoolExecutor.java:617)
   [junit4]   2> 	at java.lang.Thread.run(Thread.java:745)
   [junit4]   2> Caused by: org.apache.solr.common.SolrException: org.apache.solr.update.processor.TolerantUpdateProcessorFactory requires a schema that includes a uniqueKey field.
   [junit4]   2> 	at org.apache.solr.update.processor.TolerantUpdateProcessorFactory.inform(TolerantUpdateProcessorFactory.java:116)
   [junit4]   2> 	at org.apache.solr.core.SolrResourceLoader.inform(SolrResourceLoader.java:695)
   [junit4]   2> 	at org.apache.solr.core.SolrCore.<init>(SolrCore.java:897)
   [junit4]   2> 	... 8 more
   [junit4]   2> 1602586 INFO  (TEST-TestBadConfig.testTolerantUpdateProcessorNoUniqueKey-seed#[52132C1F8C2FF894]) [    ] o.a.s.SolrTestCaseJ4 ####initCore end
   [junit4]   2> 1602588 INFO  (TEST-TestBadConfig.testTolerantUpdateProcessorNoUniqueKey-seed#[52132C1F8C2FF894]) [    ] o.a.s.SolrTestCaseJ4 ###deleteCore
   [junit4]   2> 1602588 INFO  (TEST-TestBadConfig.testTolerantUpdateProcessorNoUniqueKey-seed#[52132C1F8C2FF894]) [    ] o.a.s.c.CoreContainer Shutting down CoreContainer instance=11597649
   [junit4]   2> 1602589 INFO  (TEST-TestBadConfig.testTolerantUpdateProcessorNoUniqueKey-seed#[52132C1F8C2FF894]) [    ] o.a.s.SolrTestCaseJ4 ###Ending testTolerantUpdateProcessorNoUniqueKey
   [junit4]   2> 1602591 INFO  (TEST-TestBadConfig.testBogusScriptEngine-seed#[52132C1F8C2FF894]) [    ] o.a.s.SolrTestCaseJ4 ###Starting testBogusScriptEngine
   [junit4]   2> 1602603 INFO  (TEST-TestBadConfig.testBogusScriptEngine-seed#[52132C1F8C2FF894]) [    ] o.a.s.SolrTestCaseJ4 ####initCore
   [junit4]   2> 1602603 INFO  (TEST-TestBadConfig.testBogusScriptEngine-seed#[52132C1F8C2FF894]) [    ] o.a.s.c.SolrResourceLoader [null] Added 2 libs to classloader, from paths: [/C:/Users/jenkins/workspace/Lucene-Solr-master-Windows/solr/core/src/test-files/solr/collection1/lib, /C:/Users/jenkins/workspace/Lucene-Solr-master-Windows/solr/core/src/test-files/solr/collection1/lib/classes]
   [junit4]   2> 1602656 INFO  (TEST-TestBadConfig.testBogusScriptEngine-seed#[52132C1F8C2FF894]) [    ] o.a.s.c.SolrConfig Using Lucene MatchVersion: 7.0.0
   [junit4]   2> 1602667 INFO  (TEST-TestBadConfig.testBogusScriptEngine-seed#[52132C1F8C2FF894]) [    ] o.a.s.s.IndexSchema [null] Schema name=test
   [junit4]   2> 1602735 WARN  (TEST-TestBadConfig.testBogusScriptEngine-seed#[52132C1F8C2FF894]) [    ] o.a.s.s.IndexSchema [null] default search field in schema is text. WARNING: Deprecated, please use 'df' on request instead.
   [junit4]   2> 1602736 INFO  (TEST-TestBadConfig.testBogusScriptEngine-seed#[52132C1F8C2FF894]) [    ] o.a.s.s.IndexSchema Loaded schema test/1.0 with uniqueid field id
   [junit4]   2> 1602754 INFO  (coreLoadExecutor-7050-thread-1) [    ] o.a.s.c.SolrResourceLoader [null] Added 2 libs to classloader, from paths: [/C:/Users/jenkins/workspace/Lucene-Solr-master-Windows/solr/core/src/test-files/solr/collection1/lib, /C:/Users/jenkins/workspace/Lucene-Solr-master-Windows/solr/core/src/test-files/solr/collection1/lib/classes]
   [junit4]   2> 1602773 INFO  (coreLoadExecutor-7050-thread-1) [    ] o.a.s.c.SolrConfig Using Lucene MatchVersion: 7.0.0
   [junit4]   2> 1602783 INFO  (coreLoadExecutor-7050-thread-1) [    ] o.a.s.s.IndexSchema [collection1] Schema name=test
   [junit4]   2> 1602844 WARN  (coreLoadExecutor-7050-thread-1) [    ] o.a.s.s.IndexSchema [collection1] default search field in schema is text. WARNING: Deprecated, please use 'df' on request instead.
   [junit4]   2> 1602846 INFO  (coreLoadExecutor-7050-thread-1) [    ] o.a.s.s.IndexSchema Loaded schema test/1.0 with uniqueid field id
   [junit4]   2> 1602860 INFO  (coreLoadExecutor-7050-thread-1) [    ] o.a.s.c.CoreContainer Creating SolrCore 'collection1' using configuration from instancedir C:\Users\jenkins\workspace\Lucene-Solr-master-Windows\solr\core\src\test-files\solr\collection1
   [junit4]   2> 1602861 INFO  (coreLoadExecutor-7050-thread-1) [    x:collection1] o.a.s.c.SolrCore [[collection1] ] Opening new SolrCore at [C:\Users\jenkins\workspace\Lucene-Solr-master-Windows\solr\core\src\test-files\solr\collection1], dataDir=[C:\Users\jenkins\workspace\Lucene-Solr-master-Windows\solr\build\solr-core\test\J0\temp\solr.core.TestBadConfig_52132C1F8C2FF894-001\init-core-data-001\]
   [junit4]   2> 1602876 WARN  (coreLoadExecutor-7050-thread-1) [    x:collection1] o.a.s.c.RequestHandlers no default request handler is registered (either '/select' or 'standard')
   [junit4]   2> 1602876 INFO  (coreLoadExecutor-7050-thread-1) [    x:collection1] o.a.s.u.CommitTracker Hard AutoCommit: disabled
   [junit4]   2> 1602876 INFO  (coreLoadExecutor-7050-thread-1) [    x:collection1] o.a.s.u.CommitTracker Soft AutoCommit: disabled
   [junit4]   2> 1602878 INFO  (coreLoadExecutor-7050-thread-1) [    x:collection1] o.a.s.s.SolrIndexSearcher Opening [Searcher@ddbe8b[collection1] main]
   [junit4]   2> 1602879 WARN  (coreLoadExecutor-7050-thread-1) [    x:collection1] o.a.s.r.ManagedResourceStorage Cannot write to config directory C:\Users\jenkins\workspace\Lucene-Solr-master-Windows\solr\core\src\test-files\solr\collection1\conf; switching to use InMemory storage instead.
   [junit4]   2> 1602884 ERROR (coreLoadExecutor-7050-thread-1) [    x:collection1] o.a.s.u.p.StatelessScriptUpdateProcessorFactory Unable to initialize scripts: No ScriptEngine found by name: giberish -- supported names: nashorn, Nashorn, js, JS, JavaScript, javascript, ECMAScript, ecmascript
   [junit4]   2> org.apache.solr.common.SolrException: No ScriptEngine found by name: giberish -- supported names: nashorn, Nashorn, js, JS, JavaScript, javascript, ECMAScript, ecmascript
   [junit4]   2> 	at org.apache.solr.update.processor.StatelessScriptUpdateProcessorFactory.initEngines(StatelessScriptUpdateProcessorFactory.java:271)
   [junit4]   2> 	at org.apache.solr.update.processor.StatelessScriptUpdateProcessorFactory.inform(StatelessScriptUpdateProcessorFactory.java:227)
   [junit4]   2> 	at org.apache.solr.core.SolrResourceLoader.inform(SolrResourceLoader.java:695)
   [junit4]   2> 	at org.apache.solr.core.SolrCore.<init>(SolrCore.java:897)
   [junit4]   2> 	at org.apache.solr.core.SolrCore.<init>(SolrCore.java:792)
   [junit4]   2> 	at org.apache.solr.core.CoreContainer.create(CoreContainer.java:868)
   [junit4]   2> 	at org.apache.solr.core.CoreContainer.lambda$load$0(CoreContainer.java:517)
   [junit4]   2> 	at java.util.concurrent.FutureTask.run(FutureTask.java:266)
   [junit4]   2> 	at org.apache.solr.common.util.ExecutorUtil$MDCAwareThreadPoolExecutor.lambda$execute$0(ExecutorUtil.java:229)
   [junit4]   2> 	at java.util.concurrent.ThreadPoolExecutor.runWorker(ThreadPoolExecutor.java:1142)
   [junit4]   2> 	at java.util.concurrent.ThreadPoolExecutor$Worker.run(ThreadPoolExecutor.java:617)
   [junit4]   2> 	at java.lang.Thread.run(Thread.java:745)
   [junit4]   2> 1602885 INFO  (coreLoadExecutor-7050-thread-1) [    x:collection1] o.a.s.c.SolrCore [collection1]  CLOSING SolrCore org.apache.solr.core.SolrCore@502553
   [junit4]   2> 1602885 INFO  (searcherExecutor-7051-thread-1-processing-x:collection1) [    x:collection1] o.a.s.c.SolrCore [collection1] Registered new searcher Searcher@ddbe8b[collection1] main{ExitableDirectoryReader(UninvertingDirectoryReader())}
   [junit4]   2> 1602885 ERROR (coreLoadExecutor-7050-thread-1) [    x:collection1] o.a.s.c.CoreContainer Error creating core [collection1]: Unable to initialize scripts: No ScriptEngine found by name: giberish -- supported names: nashorn, Nashorn, js, JS, JavaScript, javascript, ECMAScript, ecmascript
   [junit4]   2> org.apache.solr.common.SolrException: Unable to initialize scripts: No ScriptEngine found by name: giberish -- supported names: nashorn, Nashorn, js, JS, JavaScript, javascript, ECMAScript, ecmascript
   [junit4]   2> 	at org.apache.solr.core.SolrCore.<init>(SolrCore.java:917)
   [junit4]   2> 	at org.apache.solr.core.SolrCore.<init>(SolrCore.java:792)
   [junit4]   2> 	at org.apache.solr.core.CoreContainer.create(CoreContainer.java:868)
   [junit4]   2> 	at org.apache.solr.core.CoreContainer.lambda$load$0(CoreContainer.java:517)
   [junit4]   2> 	at java.util.concurrent.FutureTask.run(FutureTask.java:266)
   [junit4]   2> 	at org.apache.solr.common.util.ExecutorUtil$MDCAwareThreadPoolExecutor.lambda$execute$0(ExecutorUtil.java:229)
   [junit4]   2> 	at java.util.concurrent.ThreadPoolExecutor.runWorker(ThreadPoolExecutor.java:1142)
   [junit4]   2> 	at java.util.concurrent.ThreadPoolExecutor$Worker.run(ThreadPoolExecutor.java:617)
   [junit4]   2> 	at java.lang.Thread.run(Thread.java:745)
   [junit4]   2> Caused by: org.apache.solr.common.SolrException: Unable to initialize scripts: No ScriptEngine found by name: giberish -- supported names: nashorn, Nashorn, js, JS, JavaScript, javascript, ECMAScript, ecmascript
   [junit4]   2> 	at org.apache.solr.update.processor.StatelessScriptUpdateProcessorFactory.inform(StatelessScriptUpdateProcessorFactory.java:231)
   [junit4]   2> 	at org.apache.solr.core.SolrResourceLoader.inform(SolrResourceLoader.java:695)
   [junit4]   2> 	at org.apache.solr.core.SolrCore.<init>(SolrCore.java:897)
   [junit4]   2> 	... 8 more
   [junit4]   2> Caused by: org.apache.solr.common.SolrException: No ScriptEngine found by name: giberish -- supported names: nashorn, Nashorn, js, JS, JavaScript, javascript, ECMAScript, ecmascript
   [junit4]   2> 	at org.apache.solr.update.processor.StatelessScriptUpdateProcessorFactory.initEngines(StatelessScriptUpdateProcessorFactory.java:271)
   [junit4]   2> 	at org.apache.solr.update.processor.StatelessScriptUpdateProcessorFactory.inform(StatelessScriptUpdateProcessorFactory.java:227)
   [junit4]   2> 	... 10 more
   [junit4]   2> 1602887 INFO  (TEST-TestBadConfig.testBogusScriptEngine-seed#[52132C1F8C2FF894]) [    ] o.a.s.SolrTestCaseJ4 ####initCore end
   [junit4]   2> 1602887 INFO  (TEST-TestBadConfig.testBogusScriptEngine-seed#[52132C1F8C2FF894]) [    ] o.a.s.SolrTestCaseJ4 ###deleteCore
   [junit4]   2> 1602887 INFO  (TEST-TestBadConfig.testBogusScriptEngine-seed#[52132C1F8C2FF894]) [    ] o.a.s.c.CoreContainer Shutting down CoreContainer instance=22314859
   [junit4]   2> 1602888 INFO  (TEST-TestBadConfig.testBogusScriptEngine-seed#[52132C1F8C2FF894]) [    ] o.a.s.SolrTestCaseJ4 ###Ending testBogusScriptEngine
   [junit4]   2> 1602888 INFO  (SUITE-TestBadConfig-seed#[52132C1F8C2FF894]-worker) [    ] o.a.s.SolrTestCaseJ4 ###deleteCore
   [junit4]   2> Dec 12, 2016 12:24:43 PM com.carrotsearch.randomizedtesting.ThreadLeakControl checkThreadLeaks
   [junit4]   2> WARNING: Will linger awaiting termination of 1 leaked thread(s).
   [junit4]   2> NOTE: test params are: codec=Asserting(Lucene70): {}, docValues:{}, maxPointsInLeafNode=1790, maxMBSortInHeap=7.074954743113312, sim=RandomSimilarity(queryNorm=true): {}, locale=en-NZ, timezone=America/Indiana/Petersburg
   [junit4]   2> NOTE: Windows 10 10.0 x86/Oracle Corporation 1.8.0_112 (32-bit)/cpus=3,threads=1,free=164497800,total=371720192
   [junit4]   2> NOTE: All tests run in this JVM: [DocExpirationUpdateProcessorFactoryTest, TestSolrJ, TestLeaderInitiatedRecoveryThread, TestSolrFieldCacheMBean, OverseerCollectionConfigSetProcessorTest, TestSort, TestStressUserVersions, LeaderInitiatedRecoveryOnCommitTest, BigEndianAscendingWordDeserializerTest, AlternateDirectoryTest, DirectSolrSpellCheckerTest, PathHierarchyTokenizerFactoryTest, TestSchemaVersionResource, TestCollationField, TestPostingsSolrHighlighter, CollectionStateFormat2Test, TestIBSimilarityFactory, TestCollationFieldDocValues, BlockCacheTest, TestCloudRecovery, OutputWriterTest, BaseCdcrDistributedZkTest, DistributedQueueTest, ShardSplitTest, ShardRoutingTest, TestReplicaProperties, TestLockTree, TestDynamicLoading, RequiredFieldsTest, DistributedQueryComponentCustomSortTest, MultiTermTest, SOLR749Test, BufferStoreTest, BasicAuthStandaloneTest, CollectionsAPIAsyncDistributedZkTest, SolrTestCaseJ4Test, TestSchemaManager, TestHighlightDedupGrouping, TestManagedSchemaAPI, OverseerTaskQueueTest, TestRecoveryHdfs, PluginInfoTest, RequestLoggingTest, InfoHandlerTest, TestFieldCacheSanityChecker, TestCollectionAPI, ConcurrentDeleteAndCreateCollectionTest, AssignTest, FullHLLTest, TestRandomDVFaceting, RestartWhileUpdatingTest, AnalysisAfterCoreReloadTest, QueryResultKeyTest, TestSolrCloudWithDelegationTokens, MBeansHandlerTest, TestSmileRequest, TestUpdate, TriLevelCompositeIdRoutingTest, TestBinaryField, ZkNodePropsTest, RulesTest, TestRTGBase, TestPerFieldSimilarityWithDefaultOverride, SuggestComponentTest, TestSearcherReuse, TestSubQueryTransformerCrossCore, NumericFieldsTest, TestFieldCache, TestBM25SimilarityFactory, SynonymTokenizerTest, TestNoOpRegenerator, TestReplicationHandler, DocValuesMultiTest, HttpSolrCallGetCoreTest, HdfsLockFactoryTest, TestExtendedDismaxParser, TestCursorMarkWithoutUniqueKey, TestUseDocValuesAsStored2, TestCryptoKeys, TestJettySolrRunner, TolerantUpdateProcessorTest, TestFieldCacheSortRandom, XmlUpdateRequestHandlerTest, TimeZoneUtilsTest, CursorPagingTest, TestScoreJoinQPNoScore, DeleteStatusTest, TestInfoStreamLogging, HdfsChaosMonkeyNothingIsSafeTest, DistribDocExpirationUpdateProcessorTest, TestTrackingShardHandlerFactory, SSLMigrationTest, SolrIndexConfigTest, TestManagedSynonymFilterFactory, TestFunctionQuery, TestStressReorder, CustomCollectionTest, HighlighterTest, CoreSorterTest, ClusterStateUpdateTest, PolyFieldTest, DistributedFacetPivotLongTailTest, DistanceUnitsTest, CheckHdfsIndexTest, TestNRTOpen, TestMinMaxOnMultiValuedField, TestExpandComponent, TestCSVResponseWriter, SpatialHeatmapFacetsTest, TestCloudPivotFacet, QueryElevationComponentTest, LeaderElectionTest, SimpleMLTQParserTest, TestMergePolicyConfig, OpenExchangeRatesOrgProviderTest, StandardRequestHandlerTest, TestCSVLoader, TestConfigOverlay, AnalyticsQueryTest, DocValuesTest, TestBulkSchemaConcurrent, TestTolerantUpdateProcessorRandomCloud, TestInitQParser, RecoveryAfterSoftCommitTest, TestJsonFacetRefinement, OverseerRolesTest, BlockJoinFacetDistribTest, TestSolrConfigHandlerConcurrent, DeleteLastCustomShardedReplicaTest, TestRTimerTree, ZkStateReaderTest, TestComplexPhraseQParserPlugin, TestSlowCompositeReaderWrapper, SolrCLIZkUtilsTest, TestTestInjection, TestRequestStatusCollectionAPI, DistributedMLTComponentTest, JSONWriterTest, TestExclusionRuleCollectionAccess, StressHdfsTest, TestBlendedInfixSuggestions, TestPushWriter, FastVectorHighlighterTest, TestSolrCloudSnapshots, CurrencyFieldXmlFileTest, DistributedSpellCheckComponentTest, SampleTest, TestUniqueKeyFieldResource, TestFieldSortValues, TestUninvertingReader, TestRawTransformer, TestDefaultStatsCache, TestSolrDynamicMBean, TestCloudDeleteByQuery, TestGraphTermsQParserPlugin, HdfsUnloadDistributedZkTest, TestMacroExpander, FileUtilsTest, TestLFUCache, TestDistributedGrouping, TestFaceting, TestHashPartitioner, ZkControllerTest, TestRealTimeGet, TestReload, DistributedTermsComponentTest, TestGroupingSearch, PeerSyncTest, TestFiltering, DirectUpdateHandlerTest, TestBadConfig]
   [junit4]   2> NOTE: reproduce with: ant test  -Dtestcase=TestBadConfig -Dtests.seed=52132C1F8C2FF894 -Dtests.slow=true -Dtests.locale=en-NZ -Dtests.timezone=America/Indiana/Petersburg -Dtests.asserts=true -Dtests.file.encoding=US-ASCII
   [junit4] ERROR   0.00s J0 | TestBadConfig (suite) <<<
   [junit4]    > Throwable #1: java.io.IOException: Could not remove the following files (in the order of attempts):
   [junit4]    >    C:\Users\jenkins\workspace\Lucene-Solr-master-Windows\solr\build\solr-core\test\J0\temp\solr.core.TestBadConfig_52132C1F8C2FF894-001\init-core-data-001: java.nio.file.AccessDeniedException: C:\Users\jenkins\workspace\Lucene-Solr-master-Windows\solr\build\solr-core\test\J0\temp\solr.core.TestBadConfig_52132C1F8C2FF894-001\init-core-data-001
   [junit4]    >    C:\Users\jenkins\workspace\Lucene-Solr-master-Windows\solr\build\solr-core\test\J0\temp\solr.core.TestBadConfig_52132C1F8C2FF894-001: java.nio.file.DirectoryNotEmptyException: C:\Users\jenkins\workspace\Lucene-Solr-master-Windows\solr\build\solr-core\test\J0\temp\solr.core.TestBadConfig_52132C1F8C2FF894-001
   [junit4]    > 	at __randomizedtesting.SeedInfo.seed([52132C1F8C2FF894]:0)
   [junit4]    > 	at org.apache.lucene.util.IOUtils.rm(IOUtils.java:323)
   [junit4]    > 	at java.lang.Thread.run(Thread.java:745)
   [junit4] Completed [362/659 (1!)] on J0 in 2.88s, 14 tests, 1 error <<< FAILURES!

[...truncated 385 lines...]
   [junit4] Suite: org.apache.solr.cloud.DocValuesNotIndexedTest
   [junit4]   2> Creating dataDir: C:\Users\jenkins\workspace\Lucene-Solr-master-Windows\solr\build\solr-core\test\J0\temp\solr.cloud.DocValuesNotIndexedTest_52132C1F8C2FF894-001\init-core-data-001
   [junit4]   2> 1779749 INFO  (SUITE-DocValuesNotIndexedTest-seed#[52132C1F8C2FF894]-worker) [    ] o.a.s.SolrTestCaseJ4 Randomized ssl (false) and clientAuth (false) via: @org.apache.solr.util.RandomizeSSL(reason=, value=NaN, ssl=NaN, clientAuth=NaN)
   [junit4]   2> 1779751 INFO  (SUITE-DocValuesNotIndexedTest-seed#[52132C1F8C2FF894]-worker) [    ] o.a.s.c.MiniSolrCloudCluster Starting cluster of 2 servers in C:\Users\jenkins\workspace\Lucene-Solr-master-Windows\solr\build\solr-core\test\J0\temp\solr.cloud.DocValuesNotIndexedTest_52132C1F8C2FF894-001\tempDir-001
   [junit4]   2> 1779751 INFO  (SUITE-DocValuesNotIndexedTest-seed#[52132C1F8C2FF894]-worker) [    ] o.a.s.c.ZkTestServer STARTING ZK TEST SERVER
   [junit4]   2> 1779752 INFO  (Thread-4672) [    ] o.a.s.c.ZkTestServer client port:0.0.0.0/0.0.0.0:0
   [junit4]   2> 1779752 INFO  (Thread-4672) [    ] o.a.s.c.ZkTestServer Starting server
   [junit4]   2> 1779851 INFO  (SUITE-DocValuesNotIndexedTest-seed#[52132C1F8C2FF894]-worker) [    ] o.a.s.c.ZkTestServe

[...truncated too long message...]

Core [dv_coll_shard3_replica1]  CLOSING SolrCore org.apache.solr.core.SolrCore@c64387
   [junit4]   2> 1782972 INFO  (coreCloseExecutor-8447-thread-1) [n:127.0.0.1:57132_solr c:dv_coll s:shard4 r:core_node2 x:dv_coll_shard4_replica1] o.a.s.c.SolrCore [dv_coll_shard4_replica1]  CLOSING SolrCore org.apache.solr.core.SolrCore@36bcf5
   [junit4]   2> 1782972 INFO  (coreCloseExecutor-8447-thread-2) [n:127.0.0.1:57132_solr c:dv_coll s:shard2 r:core_node4 x:dv_coll_shard2_replica1] o.a.s.c.SolrCore [dv_coll_shard2_replica1]  CLOSING SolrCore org.apache.solr.core.SolrCore@189437c
   [junit4]   2> 1782983 WARN  (zkCallback-2649-thread-2-processing-n:127.0.0.1:57132_solr) [n:127.0.0.1:57132_solr    ] o.a.s.c.c.ZkStateReader ZooKeeper watch triggered, but Solr cannot talk to ZK: [KeeperErrorCode = Session expired for /live_nodes]
   [junit4]   2> 1782983 INFO  (jetty-launcher-2638-thread-2) [    ] o.e.j.s.h.ContextHandler Stopped o.e.j.s.ServletContextHandler@43de39{/solr,null,UNAVAILABLE}
   [junit4]   2> 1782984 INFO  (zkCallback-2648-thread-2-processing-n:127.0.0.1:57131_solr) [n:127.0.0.1:57131_solr    ] o.a.s.c.c.ZkStateReader Updated live nodes from ZooKeeper... (2) -> (1)
   [junit4]   2> 1782989 INFO  (jetty-launcher-2638-thread-1) [    ] o.a.s.c.Overseer Overseer (id=97094576416620549-127.0.0.1:57131_solr-n_0000000000) closing
   [junit4]   2> 1782989 INFO  (OverseerStateUpdate-97094576416620549-127.0.0.1:57131_solr-n_0000000000) [n:127.0.0.1:57131_solr    ] o.a.s.c.Overseer Overseer Loop exiting : 127.0.0.1:57131_solr
   [junit4]   2> 1782990 WARN  (zkCallback-2648-thread-2-processing-n:127.0.0.1:57131_solr) [n:127.0.0.1:57131_solr    ] o.a.s.c.c.ZkStateReader ZooKeeper watch triggered, but Solr cannot talk to ZK: [KeeperErrorCode = Session expired for /live_nodes]
   [junit4]   2> 1782991 INFO  (jetty-launcher-2638-thread-1) [    ] o.e.j.s.h.ContextHandler Stopped o.e.j.s.ServletContextHandler@1c1e38c{/solr,null,UNAVAILABLE}
   [junit4]   2> 1782993 INFO  (SUITE-DocValuesNotIndexedTest-seed#[52132C1F8C2FF894]-worker) [    ] o.a.s.c.ZkTestServer connecting to 127.0.0.1:57127 57127
   [junit4]   2> 1782994 INFO  (Thread-4672) [    ] o.a.s.c.ZkTestServer connecting to 127.0.0.1:57127 57127
   [junit4]   2> 1782995 WARN  (Thread-4672) [    ] o.a.s.c.ZkTestServer Watch limit violations: 
   [junit4]   2> Maximum concurrent create/delete watches above limit:
   [junit4]   2> 
   [junit4]   2> 	7	/solr/configs/conf1/managed-schema
   [junit4]   2> 	4	/solr/configs/conf1
   [junit4]   2> 	3	/solr/aliases.json
   [junit4]   2> 	3	/solr/clusterprops.json
   [junit4]   2> 	2	/solr/security.json
   [junit4]   2> 
   [junit4]   2> Maximum concurrent data watches above limit:
   [junit4]   2> 
   [junit4]   2> 	3	/solr/clusterstate.json
   [junit4]   2> 	2	/solr/configs/conf1/managed-schema
   [junit4]   2> 	2	/solr/collections/dv_coll/state.json
   [junit4]   2> 
   [junit4]   2> Maximum concurrent children watches above limit:
   [junit4]   2> 
   [junit4]   2> 	10	/solr/overseer/queue
   [junit4]   2> 	3	/solr/live_nodes
   [junit4]   2> 	3	/solr/collections
   [junit4]   2> 	3	/solr/overseer/queue-work
   [junit4]   2> 	3	/solr/overseer/collection-queue-work
   [junit4]   2> 
   [junit4]   2> 1782995 INFO  (SUITE-DocValuesNotIndexedTest-seed#[52132C1F8C2FF894]-worker) [    ] o.a.s.SolrTestCaseJ4 ###deleteCore
   [junit4]   2> NOTE: leaving temporary files on disk at: C:\Users\jenkins\workspace\Lucene-Solr-master-Windows\solr\build\solr-core\test\J0\temp\solr.cloud.DocValuesNotIndexedTest_52132C1F8C2FF894-001
   [junit4]   2> Dec 12, 2016 12:27:43 PM com.carrotsearch.randomizedtesting.ThreadLeakControl checkThreadLeaks
   [junit4]   2> WARNING: Will linger awaiting termination of 4 leaked thread(s).
   [junit4]   2> NOTE: test params are: codec=FastDecompressionCompressingStoredFields(storedFieldsFormat=CompressingStoredFieldsFormat(compressionMode=FAST_DECOMPRESSION, chunkSize=7, maxDocsPerChunk=1, blockSize=5), termVectorsFormat=CompressingTermVectorsFormat(compressionMode=FAST_DECOMPRESSION, chunkSize=7, blockSize=5)), sim=RandomSimilarity(queryNorm=true): {}, locale=ar-BH, timezone=WET
   [junit4]   2> NOTE: Windows 10 10.0 x86/Oracle Corporation 1.8.0_112 (32-bit)/cpus=3,threads=1,free=175523376,total=416284672
   [junit4]   2> NOTE: All tests run in this JVM: [DocExpirationUpdateProcessorFactoryTest, TestSolrJ, TestLeaderInitiatedRecoveryThread, TestSolrFieldCacheMBean, OverseerCollectionConfigSetProcessorTest, TestSort, TestStressUserVersions, LeaderInitiatedRecoveryOnCommitTest, BigEndianAscendingWordDeserializerTest, AlternateDirectoryTest, DirectSolrSpellCheckerTest, PathHierarchyTokenizerFactoryTest, TestSchemaVersionResource, TestCollationField, TestPostingsSolrHighlighter, CollectionStateFormat2Test, TestIBSimilarityFactory, TestCollationFieldDocValues, BlockCacheTest, TestCloudRecovery, OutputWriterTest, BaseCdcrDistributedZkTest, DistributedQueueTest, ShardSplitTest, ShardRoutingTest, TestReplicaProperties, TestLockTree, TestDynamicLoading, RequiredFieldsTest, DistributedQueryComponentCustomSortTest, MultiTermTest, SOLR749Test, BufferStoreTest, BasicAuthStandaloneTest, CollectionsAPIAsyncDistributedZkTest, SolrTestCaseJ4Test, TestSchemaManager, TestHighlightDedupGrouping, TestManagedSchemaAPI, OverseerTaskQueueTest, TestRecoveryHdfs, PluginInfoTest, RequestLoggingTest, InfoHandlerTest, TestFieldCacheSanityChecker, TestCollectionAPI, ConcurrentDeleteAndCreateCollectionTest, AssignTest, FullHLLTest, TestRandomDVFaceting, RestartWhileUpdatingTest, AnalysisAfterCoreReloadTest, QueryResultKeyTest, TestSolrCloudWithDelegationTokens, MBeansHandlerTest, TestSmileRequest, TestUpdate, TriLevelCompositeIdRoutingTest, TestBinaryField, ZkNodePropsTest, RulesTest, TestRTGBase, TestPerFieldSimilarityWithDefaultOverride, SuggestComponentTest, TestSearcherReuse, TestSubQueryTransformerCrossCore, NumericFieldsTest, TestFieldCache, TestBM25SimilarityFactory, SynonymTokenizerTest, TestNoOpRegenerator, TestReplicationHandler, DocValuesMultiTest, HttpSolrCallGetCoreTest, HdfsLockFactoryTest, TestExtendedDismaxParser, TestCursorMarkWithoutUniqueKey, TestUseDocValuesAsStored2, TestCryptoKeys, TestJettySolrRunner, TolerantUpdateProcessorTest, TestFieldCacheSortRandom, XmlUpdateRequestHandlerTest, TimeZoneUtilsTest, CursorPagingTest, TestScoreJoinQPNoScore, DeleteStatusTest, TestInfoStreamLogging, HdfsChaosMonkeyNothingIsSafeTest, DistribDocExpirationUpdateProcessorTest, TestTrackingShardHandlerFactory, SSLMigrationTest, SolrIndexConfigTest, TestManagedSynonymFilterFactory, TestFunctionQuery, TestStressReorder, CustomCollectionTest, HighlighterTest, CoreSorterTest, ClusterStateUpdateTest, PolyFieldTest, DistributedFacetPivotLongTailTest, DistanceUnitsTest, CheckHdfsIndexTest, TestNRTOpen, TestMinMaxOnMultiValuedField, TestExpandComponent, TestCSVResponseWriter, SpatialHeatmapFacetsTest, TestCloudPivotFacet, QueryElevationComponentTest, LeaderElectionTest, SimpleMLTQParserTest, TestMergePolicyConfig, OpenExchangeRatesOrgProviderTest, StandardRequestHandlerTest, TestCSVLoader, TestConfigOverlay, AnalyticsQueryTest, DocValuesTest, TestBulkSchemaConcurrent, TestTolerantUpdateProcessorRandomCloud, TestInitQParser, RecoveryAfterSoftCommitTest, TestJsonFacetRefinement, OverseerRolesTest, BlockJoinFacetDistribTest, TestSolrConfigHandlerConcurrent, DeleteLastCustomShardedReplicaTest, TestRTimerTree, ZkStateReaderTest, TestComplexPhraseQParserPlugin, TestSlowCompositeReaderWrapper, SolrCLIZkUtilsTest, TestTestInjection, TestRequestStatusCollectionAPI, DistributedMLTComponentTest, JSONWriterTest, TestExclusionRuleCollectionAccess, StressHdfsTest, TestBlendedInfixSuggestions, TestPushWriter, FastVectorHighlighterTest, TestSolrCloudSnapshots, CurrencyFieldXmlFileTest, DistributedSpellCheckComponentTest, SampleTest, TestUniqueKeyFieldResource, TestFieldSortValues, TestUninvertingReader, TestRawTransformer, TestDefaultStatsCache, TestSolrDynamicMBean, TestCloudDeleteByQuery, TestGraphTermsQParserPlugin, HdfsUnloadDistributedZkTest, TestMacroExpander, FileUtilsTest, TestLFUCache, TestDistributedGrouping, TestFaceting, TestHashPartitioner, ZkControllerTest, TestRealTimeGet, TestReload, DistributedTermsComponentTest, TestGroupingSearch, PeerSyncTest, TestFiltering, DirectUpdateHandlerTest, TestBadConfig, SoftAutoCommitTest, DistributedQueryElevationComponentTest, SolrRequestParserTest, SuggesterTest, SuggesterWFSTTest, SchemaVersionSpecificBehaviorTest, TestWordDelimiterFilterFactory, StatelessScriptUpdateProcessorFactoryTest, DistanceFunctionTest, SolrInfoMBeanTest, TestSurroundQueryParser, DisMaxRequestHandlerTest, TestWriterPerf, TestQueryTypes, TestOmitPositions, TermsComponentTest, DocumentBuilderTest, MoreLikeThisHandlerTest, LoggingHandlerTest, TestJmxIntegration, UniqFieldsUpdateProcessorFactoryTest, JsonLoaderTest, PingRequestHandlerTest, HighlighterConfigTest, UpdateParamsTest, TestQuerySenderNoQuery, BadComponentTest, MinimalSchemaTest, TestFuzzyAnalyzedSuggestions, DirectSolrConnectionTest, TestPhraseSuggestions, TestCharFilters, TestXIncludeConfig, TestSweetSpotSimilarityFactory, TestPerFieldSimilarity, TestJmxMonitoredMap, TestFastLRUCache, PrimUtilsTest, TestSuggestSpellingConverter, DateFieldTest, SpellingQueryConverterTest, DOMUtilTest, TestLRUCache, TestUtils, TestDocumentBuilder, SliceStateTest, SystemInfoHandlerTest, TestCrossCoreJoin, TestDistributedMissingSort, TestSimpleTrackingShardHandler, TestTolerantSearch, TestEmbeddedSolrServerConstructors, ActionThrottleTest, AliasIntegrationTest, CdcrReplicationDistributedZkTest, CdcrReplicationHandlerTest, CdcrRequestHandlerTest, CloudExitableDirectoryReaderTest, CollectionTooManyReplicasTest, ConfigSetsAPITest, ConnectionManagerTest, DeleteInactiveReplicaTest, DeleteNodeTest, DistribCursorPagingTest, DocValuesNotIndexedTest]
   [junit4] Completed [474/659 (2!)] on J0 in 3.52s, 4 tests, 1 failure <<< FAILURES!

[...truncated 55092 lines...]


Mime
View raw message