lucene-dev mailing list archives

Site index · List index
Message view « Date » · « Thread »
Top « Date » · « Thread »
From Policeman Jenkins Server <jenk...@thetaphi.de>
Subject [JENKINS-EA] Lucene-Solr-master-Linux (32bit/jdk-9-ea+148) - Build # 18484 - Failure!
Date Fri, 09 Dec 2016 19:39:33 GMT
Build: https://jenkins.thetaphi.de/job/Lucene-Solr-master-Linux/18484/
Java: 32bit/jdk-9-ea+148 -server -XX:+UseParallelGC

30 tests failed.
FAILED:  junit.framework.TestSuite.org.apache.lucene.index.TestCodecs

Error Message:
Clean up static fields (in @AfterClass?) and null them, your test still has references to classes of which the sizes cannot be measured due to security restrictions or Java 9 module encapsulation:   - private static java.lang.String[] org.apache.lucene.index.TestCodecs.fieldNames

Stack Trace:
junit.framework.AssertionFailedError: Clean up static fields (in @AfterClass?) and null them, your test still has references to classes of which the sizes cannot be measured due to security restrictions or Java 9 module encapsulation:
  - private static java.lang.String[] org.apache.lucene.index.TestCodecs.fieldNames
	at __randomizedtesting.SeedInfo.seed([15305BE129154701]:0)
	at com.carrotsearch.randomizedtesting.rules.StaticFieldsInvariantRule$1.afterAlways(StaticFieldsInvariantRule.java:146)
	at com.carrotsearch.randomizedtesting.rules.StatementAdapter.evaluate(StatementAdapter.java:43)
	at com.carrotsearch.randomizedtesting.rules.StatementAdapter.evaluate(StatementAdapter.java:36)
	at com.carrotsearch.randomizedtesting.rules.StatementAdapter.evaluate(StatementAdapter.java:36)
	at org.apache.lucene.util.TestRuleAssertionsRequired$1.evaluate(TestRuleAssertionsRequired.java:53)
	at org.apache.lucene.util.TestRuleMarkFailure$1.evaluate(TestRuleMarkFailure.java:47)
	at org.apache.lucene.util.TestRuleIgnoreAfterMaxFailures$1.evaluate(TestRuleIgnoreAfterMaxFailures.java:64)
	at org.apache.lucene.util.TestRuleIgnoreTestSuites$1.evaluate(TestRuleIgnoreTestSuites.java:54)
	at com.carrotsearch.randomizedtesting.rules.StatementAdapter.evaluate(StatementAdapter.java:36)
	at com.carrotsearch.randomizedtesting.ThreadLeakControl$StatementRunner.run(ThreadLeakControl.java:367)
	at java.base/java.lang.Thread.run(Thread.java:844)
Caused by: java.lang.IllegalStateException: Unable to access 'private final byte[] java.lang.String.value' to estimate memory usage
	at com.carrotsearch.randomizedtesting.rules.RamUsageEstimator.createCacheEntry(RamUsageEstimator.java:602)
	at com.carrotsearch.randomizedtesting.rules.RamUsageEstimator.measureSizeOf(RamUsageEstimator.java:545)
	at com.carrotsearch.randomizedtesting.rules.RamUsageEstimator.sizeOfAll(RamUsageEstimator.java:387)
	at com.carrotsearch.randomizedtesting.rules.StaticFieldsInvariantRule$1.afterAlways(StaticFieldsInvariantRule.java:129)
	... 10 more
Caused by: java.lang.reflect.InaccessibleObjectException: Unable to make field private final byte[] java.lang.String.value accessible: module java.base does not "opens java.lang" to unnamed module @1a36217
	at java.base/jdk.internal.reflect.Reflection.throwInaccessibleObjectException(Reflection.java:427)
	at java.base/java.lang.reflect.AccessibleObject.checkCanSetAccessible(AccessibleObject.java:201)
	at java.base/java.lang.reflect.Field.checkCanSetAccessible(Field.java:171)
	at java.base/java.lang.reflect.Field.setAccessible(Field.java:165)
	at com.carrotsearch.randomizedtesting.rules.RamUsageEstimator$3.run(RamUsageEstimator.java:597)
	at com.carrotsearch.randomizedtesting.rules.RamUsageEstimator$3.run(RamUsageEstimator.java:594)
	at java.base/java.security.AccessController.doPrivileged(Native Method)
	at com.carrotsearch.randomizedtesting.rules.RamUsageEstimator.createCacheEntry(RamUsageEstimator.java:594)
	... 13 more


FAILED:  junit.framework.TestSuite.org.apache.lucene.index.TestIndexWriterExceptions

Error Message:
Clean up static fields (in @AfterClass?) and null them, your test still has references to classes of which the sizes cannot be measured due to security restrictions or Java 9 module encapsulation:   - private static java.lang.String org.apache.lucene.index.TestIndexWriterExceptions.CRASH_FAIL_MESSAGE

Stack Trace:
junit.framework.AssertionFailedError: Clean up static fields (in @AfterClass?) and null them, your test still has references to classes of which the sizes cannot be measured due to security restrictions or Java 9 module encapsulation:
  - private static java.lang.String org.apache.lucene.index.TestIndexWriterExceptions.CRASH_FAIL_MESSAGE
	at __randomizedtesting.SeedInfo.seed([15305BE129154701]:0)
	at com.carrotsearch.randomizedtesting.rules.StaticFieldsInvariantRule$1.afterAlways(StaticFieldsInvariantRule.java:146)
	at com.carrotsearch.randomizedtesting.rules.StatementAdapter.evaluate(StatementAdapter.java:43)
	at com.carrotsearch.randomizedtesting.rules.StatementAdapter.evaluate(StatementAdapter.java:36)
	at com.carrotsearch.randomizedtesting.rules.StatementAdapter.evaluate(StatementAdapter.java:36)
	at org.apache.lucene.util.TestRuleAssertionsRequired$1.evaluate(TestRuleAssertionsRequired.java:53)
	at org.apache.lucene.util.TestRuleMarkFailure$1.evaluate(TestRuleMarkFailure.java:47)
	at org.apache.lucene.util.TestRuleIgnoreAfterMaxFailures$1.evaluate(TestRuleIgnoreAfterMaxFailures.java:64)
	at org.apache.lucene.util.TestRuleIgnoreTestSuites$1.evaluate(TestRuleIgnoreTestSuites.java:54)
	at com.carrotsearch.randomizedtesting.rules.StatementAdapter.evaluate(StatementAdapter.java:36)
	at com.carrotsearch.randomizedtesting.ThreadLeakControl$StatementRunner.run(ThreadLeakControl.java:367)
	at java.base/java.lang.Thread.run(Thread.java:844)
Caused by: java.lang.IllegalStateException: Unable to access 'private final byte[] java.lang.String.value' to estimate memory usage
	at com.carrotsearch.randomizedtesting.rules.RamUsageEstimator.createCacheEntry(RamUsageEstimator.java:602)
	at com.carrotsearch.randomizedtesting.rules.RamUsageEstimator.measureSizeOf(RamUsageEstimator.java:545)
	at com.carrotsearch.randomizedtesting.rules.RamUsageEstimator.sizeOfAll(RamUsageEstimator.java:387)
	at com.carrotsearch.randomizedtesting.rules.StaticFieldsInvariantRule$1.afterAlways(StaticFieldsInvariantRule.java:129)
	... 10 more
Caused by: java.lang.reflect.InaccessibleObjectException: Unable to make field private final byte[] java.lang.String.value accessible: module java.base does not "opens java.lang" to unnamed module @1a36217
	at java.base/jdk.internal.reflect.Reflection.throwInaccessibleObjectException(Reflection.java:427)
	at java.base/java.lang.reflect.AccessibleObject.checkCanSetAccessible(AccessibleObject.java:201)
	at java.base/java.lang.reflect.Field.checkCanSetAccessible(Field.java:171)
	at java.base/java.lang.reflect.Field.setAccessible(Field.java:165)
	at com.carrotsearch.randomizedtesting.rules.RamUsageEstimator$3.run(RamUsageEstimator.java:597)
	at com.carrotsearch.randomizedtesting.rules.RamUsageEstimator$3.run(RamUsageEstimator.java:594)
	at java.base/java.security.AccessController.doPrivileged(Native Method)
	at com.carrotsearch.randomizedtesting.rules.RamUsageEstimator.createCacheEntry(RamUsageEstimator.java:594)
	... 13 more


FAILED:  junit.framework.TestSuite.org.apache.lucene.index.TestStressIndexing2

Error Message:
Clean up static fields (in @AfterClass?) and null them, your test still has references to classes of which the sizes cannot be measured due to security restrictions or Java 9 module encapsulation:   - static org.apache.lucene.index.Term org.apache.lucene.index.TestStressIndexing2.idTerm

Stack Trace:
junit.framework.AssertionFailedError: Clean up static fields (in @AfterClass?) and null them, your test still has references to classes of which the sizes cannot be measured due to security restrictions or Java 9 module encapsulation:
  - static org.apache.lucene.index.Term org.apache.lucene.index.TestStressIndexing2.idTerm
	at __randomizedtesting.SeedInfo.seed([15305BE129154701]:0)
	at com.carrotsearch.randomizedtesting.rules.StaticFieldsInvariantRule$1.afterAlways(StaticFieldsInvariantRule.java:146)
	at com.carrotsearch.randomizedtesting.rules.StatementAdapter.evaluate(StatementAdapter.java:43)
	at com.carrotsearch.randomizedtesting.rules.StatementAdapter.evaluate(StatementAdapter.java:36)
	at com.carrotsearch.randomizedtesting.rules.StatementAdapter.evaluate(StatementAdapter.java:36)
	at org.apache.lucene.util.TestRuleAssertionsRequired$1.evaluate(TestRuleAssertionsRequired.java:53)
	at org.apache.lucene.util.TestRuleMarkFailure$1.evaluate(TestRuleMarkFailure.java:47)
	at org.apache.lucene.util.TestRuleIgnoreAfterMaxFailures$1.evaluate(TestRuleIgnoreAfterMaxFailures.java:64)
	at org.apache.lucene.util.TestRuleIgnoreTestSuites$1.evaluate(TestRuleIgnoreTestSuites.java:54)
	at com.carrotsearch.randomizedtesting.rules.StatementAdapter.evaluate(StatementAdapter.java:36)
	at com.carrotsearch.randomizedtesting.ThreadLeakControl$StatementRunner.run(ThreadLeakControl.java:367)
	at java.base/java.lang.Thread.run(Thread.java:844)
Caused by: java.lang.IllegalStateException: Unable to access 'private final byte[] java.lang.String.value' to estimate memory usage
	at com.carrotsearch.randomizedtesting.rules.RamUsageEstimator.createCacheEntry(RamUsageEstimator.java:602)
	at com.carrotsearch.randomizedtesting.rules.RamUsageEstimator.measureSizeOf(RamUsageEstimator.java:545)
	at com.carrotsearch.randomizedtesting.rules.RamUsageEstimator.sizeOfAll(RamUsageEstimator.java:387)
	at com.carrotsearch.randomizedtesting.rules.StaticFieldsInvariantRule$1.afterAlways(StaticFieldsInvariantRule.java:129)
	... 10 more
Caused by: java.lang.reflect.InaccessibleObjectException: Unable to make field private final byte[] java.lang.String.value accessible: module java.base does not "opens java.lang" to unnamed module @f45be
	at java.base/jdk.internal.reflect.Reflection.throwInaccessibleObjectException(Reflection.java:427)
	at java.base/java.lang.reflect.AccessibleObject.checkCanSetAccessible(AccessibleObject.java:201)
	at java.base/java.lang.reflect.Field.checkCanSetAccessible(Field.java:171)
	at java.base/java.lang.reflect.Field.setAccessible(Field.java:165)
	at com.carrotsearch.randomizedtesting.rules.RamUsageEstimator$3.run(RamUsageEstimator.java:597)
	at com.carrotsearch.randomizedtesting.rules.RamUsageEstimator$3.run(RamUsageEstimator.java:594)
	at java.base/java.security.AccessController.doPrivileged(Native Method)
	at com.carrotsearch.randomizedtesting.rules.RamUsageEstimator.createCacheEntry(RamUsageEstimator.java:594)
	... 13 more


FAILED:  junit.framework.TestSuite.org.apache.lucene.index.TestThreadedForceMerge

Error Message:
Clean up static fields (in @AfterClass?) and null them, your test still has references to classes of which the sizes cannot be measured due to security restrictions or Java 9 module encapsulation:   - private static org.apache.lucene.analysis.Analyzer org.apache.lucene.index.TestThreadedForceMerge.ANALYZER

Stack Trace:
junit.framework.AssertionFailedError: Clean up static fields (in @AfterClass?) and null them, your test still has references to classes of which the sizes cannot be measured due to security restrictions or Java 9 module encapsulation:
  - private static org.apache.lucene.analysis.Analyzer org.apache.lucene.index.TestThreadedForceMerge.ANALYZER
	at __randomizedtesting.SeedInfo.seed([15305BE129154701]:0)
	at com.carrotsearch.randomizedtesting.rules.StaticFieldsInvariantRule$1.afterAlways(StaticFieldsInvariantRule.java:146)
	at com.carrotsearch.randomizedtesting.rules.StatementAdapter.evaluate(StatementAdapter.java:43)
	at com.carrotsearch.randomizedtesting.rules.StatementAdapter.evaluate(StatementAdapter.java:36)
	at com.carrotsearch.randomizedtesting.rules.StatementAdapter.evaluate(StatementAdapter.java:36)
	at org.apache.lucene.util.TestRuleAssertionsRequired$1.evaluate(TestRuleAssertionsRequired.java:53)
	at org.apache.lucene.util.TestRuleMarkFailure$1.evaluate(TestRuleMarkFailure.java:47)
	at org.apache.lucene.util.TestRuleIgnoreAfterMaxFailures$1.evaluate(TestRuleIgnoreAfterMaxFailures.java:64)
	at org.apache.lucene.util.TestRuleIgnoreTestSuites$1.evaluate(TestRuleIgnoreTestSuites.java:54)
	at com.carrotsearch.randomizedtesting.rules.StatementAdapter.evaluate(StatementAdapter.java:36)
	at com.carrotsearch.randomizedtesting.ThreadLeakControl$StatementRunner.run(ThreadLeakControl.java:367)
	at java.base/java.lang.Thread.run(Thread.java:844)
Caused by: java.lang.IllegalStateException: Unable to access 'transient java.util.HashMap$Node[] java.util.HashMap.table' to estimate memory usage
	at com.carrotsearch.randomizedtesting.rules.RamUsageEstimator.createCacheEntry(RamUsageEstimator.java:602)
	at com.carrotsearch.randomizedtesting.rules.RamUsageEstimator.measureSizeOf(RamUsageEstimator.java:545)
	at com.carrotsearch.randomizedtesting.rules.RamUsageEstimator.sizeOfAll(RamUsageEstimator.java:387)
	at com.carrotsearch.randomizedtesting.rules.StaticFieldsInvariantRule$1.afterAlways(StaticFieldsInvariantRule.java:129)
	... 10 more
Caused by: java.lang.reflect.InaccessibleObjectException: Unable to make field transient java.util.HashMap$Node[] java.util.HashMap.table accessible: module java.base does not "opens java.util" to unnamed module @1a36217
	at java.base/jdk.internal.reflect.Reflection.throwInaccessibleObjectException(Reflection.java:427)
	at java.base/java.lang.reflect.AccessibleObject.checkCanSetAccessible(AccessibleObject.java:201)
	at java.base/java.lang.reflect.Field.checkCanSetAccessible(Field.java:171)
	at java.base/java.lang.reflect.Field.setAccessible(Field.java:165)
	at com.carrotsearch.randomizedtesting.rules.RamUsageEstimator$3.run(RamUsageEstimator.java:597)
	at com.carrotsearch.randomizedtesting.rules.RamUsageEstimator$3.run(RamUsageEstimator.java:594)
	at java.base/java.security.AccessController.doPrivileged(Native Method)
	at com.carrotsearch.randomizedtesting.rules.RamUsageEstimator.createCacheEntry(RamUsageEstimator.java:594)
	... 13 more


FAILED:  junit.framework.TestSuite.org.apache.lucene.search.TestApproximationSearchEquivalence

Error Message:
Clean up static fields (in @AfterClass?) and null them, your test still has references to classes of which the sizes cannot be measured due to security restrictions or Java 9 module encapsulation:   - protected static java.lang.String org.apache.lucene.search.SearchEquivalenceTestBase.stopword

Stack Trace:
junit.framework.AssertionFailedError: Clean up static fields (in @AfterClass?) and null them, your test still has references to classes of which the sizes cannot be measured due to security restrictions or Java 9 module encapsulation:
  - protected static java.lang.String org.apache.lucene.search.SearchEquivalenceTestBase.stopword
	at __randomizedtesting.SeedInfo.seed([15305BE129154701]:0)
	at com.carrotsearch.randomizedtesting.rules.StaticFieldsInvariantRule$1.afterAlways(StaticFieldsInvariantRule.java:146)
	at com.carrotsearch.randomizedtesting.rules.StatementAdapter.evaluate(StatementAdapter.java:43)
	at com.carrotsearch.randomizedtesting.rules.StatementAdapter.evaluate(StatementAdapter.java:36)
	at com.carrotsearch.randomizedtesting.rules.StatementAdapter.evaluate(StatementAdapter.java:36)
	at org.apache.lucene.util.TestRuleAssertionsRequired$1.evaluate(TestRuleAssertionsRequired.java:53)
	at org.apache.lucene.util.TestRuleMarkFailure$1.evaluate(TestRuleMarkFailure.java:47)
	at org.apache.lucene.util.TestRuleIgnoreAfterMaxFailures$1.evaluate(TestRuleIgnoreAfterMaxFailures.java:64)
	at org.apache.lucene.util.TestRuleIgnoreTestSuites$1.evaluate(TestRuleIgnoreTestSuites.java:54)
	at com.carrotsearch.randomizedtesting.rules.StatementAdapter.evaluate(StatementAdapter.java:36)
	at com.carrotsearch.randomizedtesting.ThreadLeakControl$StatementRunner.run(ThreadLeakControl.java:367)
	at java.base/java.lang.Thread.run(Thread.java:844)
Caused by: java.lang.IllegalStateException: Unable to access 'private final byte[] java.lang.String.value' to estimate memory usage
	at com.carrotsearch.randomizedtesting.rules.RamUsageEstimator.createCacheEntry(RamUsageEstimator.java:602)
	at com.carrotsearch.randomizedtesting.rules.RamUsageEstimator.measureSizeOf(RamUsageEstimator.java:545)
	at com.carrotsearch.randomizedtesting.rules.RamUsageEstimator.sizeOfAll(RamUsageEstimator.java:387)
	at com.carrotsearch.randomizedtesting.rules.StaticFieldsInvariantRule$1.afterAlways(StaticFieldsInvariantRule.java:129)
	... 10 more
Caused by: java.lang.reflect.InaccessibleObjectException: Unable to make field private final byte[] java.lang.String.value accessible: module java.base does not "opens java.lang" to unnamed module @1a36217
	at java.base/jdk.internal.reflect.Reflection.throwInaccessibleObjectException(Reflection.java:427)
	at java.base/java.lang.reflect.AccessibleObject.checkCanSetAccessible(AccessibleObject.java:201)
	at java.base/java.lang.reflect.Field.checkCanSetAccessible(Field.java:171)
	at java.base/java.lang.reflect.Field.setAccessible(Field.java:165)
	at com.carrotsearch.randomizedtesting.rules.RamUsageEstimator$3.run(RamUsageEstimator.java:597)
	at com.carrotsearch.randomizedtesting.rules.RamUsageEstimator$3.run(RamUsageEstimator.java:594)
	at java.base/java.security.AccessController.doPrivileged(Native Method)
	at com.carrotsearch.randomizedtesting.rules.RamUsageEstimator.createCacheEntry(RamUsageEstimator.java:594)
	... 13 more


FAILED:  junit.framework.TestSuite.org.apache.lucene.search.TestBoolean2

Error Message:
Clean up static fields (in @AfterClass?) and null them, your test still has references to classes of which the sizes cannot be measured due to security restrictions or Java 9 module encapsulation:   - private static java.lang.String[] org.apache.lucene.search.TestBoolean2.docFields

Stack Trace:
junit.framework.AssertionFailedError: Clean up static fields (in @AfterClass?) and null them, your test still has references to classes of which the sizes cannot be measured due to security restrictions or Java 9 module encapsulation:
  - private static java.lang.String[] org.apache.lucene.search.TestBoolean2.docFields
	at __randomizedtesting.SeedInfo.seed([15305BE129154701]:0)
	at com.carrotsearch.randomizedtesting.rules.StaticFieldsInvariantRule$1.afterAlways(StaticFieldsInvariantRule.java:146)
	at com.carrotsearch.randomizedtesting.rules.StatementAdapter.evaluate(StatementAdapter.java:43)
	at com.carrotsearch.randomizedtesting.rules.StatementAdapter.evaluate(StatementAdapter.java:36)
	at com.carrotsearch.randomizedtesting.rules.StatementAdapter.evaluate(StatementAdapter.java:36)
	at org.apache.lucene.util.TestRuleAssertionsRequired$1.evaluate(TestRuleAssertionsRequired.java:53)
	at org.apache.lucene.util.TestRuleMarkFailure$1.evaluate(TestRuleMarkFailure.java:47)
	at org.apache.lucene.util.TestRuleIgnoreAfterMaxFailures$1.evaluate(TestRuleIgnoreAfterMaxFailures.java:64)
	at org.apache.lucene.util.TestRuleIgnoreTestSuites$1.evaluate(TestRuleIgnoreTestSuites.java:54)
	at com.carrotsearch.randomizedtesting.rules.StatementAdapter.evaluate(StatementAdapter.java:36)
	at com.carrotsearch.randomizedtesting.ThreadLeakControl$StatementRunner.run(ThreadLeakControl.java:367)
	at java.base/java.lang.Thread.run(Thread.java:844)
Caused by: java.lang.IllegalStateException: Unable to access 'private final byte[] java.lang.String.value' to estimate memory usage
	at com.carrotsearch.randomizedtesting.rules.RamUsageEstimator.createCacheEntry(RamUsageEstimator.java:602)
	at com.carrotsearch.randomizedtesting.rules.RamUsageEstimator.measureSizeOf(RamUsageEstimator.java:545)
	at com.carrotsearch.randomizedtesting.rules.RamUsageEstimator.sizeOfAll(RamUsageEstimator.java:387)
	at com.carrotsearch.randomizedtesting.rules.StaticFieldsInvariantRule$1.afterAlways(StaticFieldsInvariantRule.java:129)
	... 10 more
Caused by: java.lang.reflect.InaccessibleObjectException: Unable to make field private final byte[] java.lang.String.value accessible: module java.base does not "opens java.lang" to unnamed module @1a36217
	at java.base/jdk.internal.reflect.Reflection.throwInaccessibleObjectException(Reflection.java:427)
	at java.base/java.lang.reflect.AccessibleObject.checkCanSetAccessible(AccessibleObject.java:201)
	at java.base/java.lang.reflect.Field.checkCanSetAccessible(Field.java:171)
	at java.base/java.lang.reflect.Field.setAccessible(Field.java:165)
	at com.carrotsearch.randomizedtesting.rules.RamUsageEstimator$3.run(RamUsageEstimator.java:597)
	at com.carrotsearch.randomizedtesting.rules.RamUsageEstimator$3.run(RamUsageEstimator.java:594)
	at java.base/java.security.AccessController.doPrivileged(Native Method)
	at com.carrotsearch.randomizedtesting.rules.RamUsageEstimator.createCacheEntry(RamUsageEstimator.java:594)
	... 13 more


FAILED:  junit.framework.TestSuite.org.apache.lucene.search.TestBooleanOr

Error Message:
Clean up static fields (in @AfterClass?) and null them, your test still has references to classes of which the sizes cannot be measured due to security restrictions or Java 9 module encapsulation:   - private static java.lang.String org.apache.lucene.search.TestBooleanOr.FIELD_T   - private static java.lang.String org.apache.lucene.search.TestBooleanOr.FIELD_C

Stack Trace:
junit.framework.AssertionFailedError: Clean up static fields (in @AfterClass?) and null them, your test still has references to classes of which the sizes cannot be measured due to security restrictions or Java 9 module encapsulation:
  - private static java.lang.String org.apache.lucene.search.TestBooleanOr.FIELD_T
  - private static java.lang.String org.apache.lucene.search.TestBooleanOr.FIELD_C
	at __randomizedtesting.SeedInfo.seed([15305BE129154701]:0)
	at com.carrotsearch.randomizedtesting.rules.StaticFieldsInvariantRule$1.afterAlways(StaticFieldsInvariantRule.java:146)
	at com.carrotsearch.randomizedtesting.rules.StatementAdapter.evaluate(StatementAdapter.java:43)
	at com.carrotsearch.randomizedtesting.rules.StatementAdapter.evaluate(StatementAdapter.java:36)
	at com.carrotsearch.randomizedtesting.rules.StatementAdapter.evaluate(StatementAdapter.java:36)
	at org.apache.lucene.util.TestRuleAssertionsRequired$1.evaluate(TestRuleAssertionsRequired.java:53)
	at org.apache.lucene.util.TestRuleMarkFailure$1.evaluate(TestRuleMarkFailure.java:47)
	at org.apache.lucene.util.TestRuleIgnoreAfterMaxFailures$1.evaluate(TestRuleIgnoreAfterMaxFailures.java:64)
	at org.apache.lucene.util.TestRuleIgnoreTestSuites$1.evaluate(TestRuleIgnoreTestSuites.java:54)
	at com.carrotsearch.randomizedtesting.rules.StatementAdapter.evaluate(StatementAdapter.java:36)
	at com.carrotsearch.randomizedtesting.ThreadLeakControl$StatementRunner.run(ThreadLeakControl.java:367)
	at java.base/java.lang.Thread.run(Thread.java:844)
Caused by: java.lang.IllegalStateException: Unable to access 'private final byte[] java.lang.String.value' to estimate memory usage
	at com.carrotsearch.randomizedtesting.rules.RamUsageEstimator.createCacheEntry(RamUsageEstimator.java:602)
	at com.carrotsearch.randomizedtesting.rules.RamUsageEstimator.measureSizeOf(RamUsageEstimator.java:545)
	at com.carrotsearch.randomizedtesting.rules.RamUsageEstimator.sizeOfAll(RamUsageEstimator.java:387)
	at com.carrotsearch.randomizedtesting.rules.StaticFieldsInvariantRule$1.afterAlways(StaticFieldsInvariantRule.java:129)
	... 10 more
Caused by: java.lang.reflect.InaccessibleObjectException: Unable to make field private final byte[] java.lang.String.value accessible: module java.base does not "opens java.lang" to unnamed module @1a36217
	at java.base/jdk.internal.reflect.Reflection.throwInaccessibleObjectException(Reflection.java:427)
	at java.base/java.lang.reflect.AccessibleObject.checkCanSetAccessible(AccessibleObject.java:201)
	at java.base/java.lang.reflect.Field.checkCanSetAccessible(Field.java:171)
	at java.base/java.lang.reflect.Field.setAccessible(Field.java:165)
	at com.carrotsearch.randomizedtesting.rules.RamUsageEstimator$3.run(RamUsageEstimator.java:597)
	at com.carrotsearch.randomizedtesting.rules.RamUsageEstimator$3.run(RamUsageEstimator.java:594)
	at java.base/java.security.AccessController.doPrivileged(Native Method)
	at com.carrotsearch.randomizedtesting.rules.RamUsageEstimator.createCacheEntry(RamUsageEstimator.java:594)
	... 13 more


FAILED:  junit.framework.TestSuite.org.apache.lucene.search.TestSimpleExplanationsWithFillerDocs

Error Message:
Clean up static fields (in @AfterClass?) and null them, your test still has references to classes of which the sizes cannot be measured due to security restrictions or Java 9 module encapsulation:   - public static java.lang.String org.apache.lucene.search.TestSimpleExplanationsWithFillerDocs.EXTRA

Stack Trace:
junit.framework.AssertionFailedError: Clean up static fields (in @AfterClass?) and null them, your test still has references to classes of which the sizes cannot be measured due to security restrictions or Java 9 module encapsulation:
  - public static java.lang.String org.apache.lucene.search.TestSimpleExplanationsWithFillerDocs.EXTRA
	at __randomizedtesting.SeedInfo.seed([15305BE129154701]:0)
	at com.carrotsearch.randomizedtesting.rules.StaticFieldsInvariantRule$1.afterAlways(StaticFieldsInvariantRule.java:146)
	at com.carrotsearch.randomizedtesting.rules.StatementAdapter.evaluate(StatementAdapter.java:43)
	at com.carrotsearch.randomizedtesting.rules.StatementAdapter.evaluate(StatementAdapter.java:36)
	at com.carrotsearch.randomizedtesting.rules.StatementAdapter.evaluate(StatementAdapter.java:36)
	at org.apache.lucene.util.TestRuleAssertionsRequired$1.evaluate(TestRuleAssertionsRequired.java:53)
	at org.apache.lucene.util.TestRuleMarkFailure$1.evaluate(TestRuleMarkFailure.java:47)
	at org.apache.lucene.util.TestRuleIgnoreAfterMaxFailures$1.evaluate(TestRuleIgnoreAfterMaxFailures.java:64)
	at org.apache.lucene.util.TestRuleIgnoreTestSuites$1.evaluate(TestRuleIgnoreTestSuites.java:54)
	at com.carrotsearch.randomizedtesting.rules.StatementAdapter.evaluate(StatementAdapter.java:36)
	at com.carrotsearch.randomizedtesting.ThreadLeakControl$StatementRunner.run(ThreadLeakControl.java:367)
	at java.base/java.lang.Thread.run(Thread.java:844)
Caused by: java.lang.IllegalStateException: Unable to access 'private final byte[] java.lang.String.value' to estimate memory usage
	at com.carrotsearch.randomizedtesting.rules.RamUsageEstimator.createCacheEntry(RamUsageEstimator.java:602)
	at com.carrotsearch.randomizedtesting.rules.RamUsageEstimator.measureSizeOf(RamUsageEstimator.java:545)
	at com.carrotsearch.randomizedtesting.rules.RamUsageEstimator.sizeOfAll(RamUsageEstimator.java:387)
	at com.carrotsearch.randomizedtesting.rules.StaticFieldsInvariantRule$1.afterAlways(StaticFieldsInvariantRule.java:129)
	... 10 more
Caused by: java.lang.reflect.InaccessibleObjectException: Unable to make field private final byte[] java.lang.String.value accessible: module java.base does not "opens java.lang" to unnamed module @f45be
	at java.base/jdk.internal.reflect.Reflection.throwInaccessibleObjectException(Reflection.java:427)
	at java.base/java.lang.reflect.AccessibleObject.checkCanSetAccessible(AccessibleObject.java:201)
	at java.base/java.lang.reflect.Field.checkCanSetAccessible(Field.java:171)
	at java.base/java.lang.reflect.Field.setAccessible(Field.java:165)
	at com.carrotsearch.randomizedtesting.rules.RamUsageEstimator$3.run(RamUsageEstimator.java:597)
	at com.carrotsearch.randomizedtesting.rules.RamUsageEstimator$3.run(RamUsageEstimator.java:594)
	at java.base/java.security.AccessController.doPrivileged(Native Method)
	at com.carrotsearch.randomizedtesting.rules.RamUsageEstimator.createCacheEntry(RamUsageEstimator.java:594)
	... 13 more


FAILED:  junit.framework.TestSuite.org.apache.lucene.search.TestSimpleSearchEquivalence

Error Message:
Clean up static fields (in @AfterClass?) and null them, your test still has references to classes of which the sizes cannot be measured due to security restrictions or Java 9 module encapsulation:   - protected static java.lang.String org.apache.lucene.search.SearchEquivalenceTestBase.stopword

Stack Trace:
junit.framework.AssertionFailedError: Clean up static fields (in @AfterClass?) and null them, your test still has references to classes of which the sizes cannot be measured due to security restrictions or Java 9 module encapsulation:
  - protected static java.lang.String org.apache.lucene.search.SearchEquivalenceTestBase.stopword
	at __randomizedtesting.SeedInfo.seed([15305BE129154701]:0)
	at com.carrotsearch.randomizedtesting.rules.StaticFieldsInvariantRule$1.afterAlways(StaticFieldsInvariantRule.java:146)
	at com.carrotsearch.randomizedtesting.rules.StatementAdapter.evaluate(StatementAdapter.java:43)
	at com.carrotsearch.randomizedtesting.rules.StatementAdapter.evaluate(StatementAdapter.java:36)
	at com.carrotsearch.randomizedtesting.rules.StatementAdapter.evaluate(StatementAdapter.java:36)
	at org.apache.lucene.util.TestRuleAssertionsRequired$1.evaluate(TestRuleAssertionsRequired.java:53)
	at org.apache.lucene.util.TestRuleMarkFailure$1.evaluate(TestRuleMarkFailure.java:47)
	at org.apache.lucene.util.TestRuleIgnoreAfterMaxFailures$1.evaluate(TestRuleIgnoreAfterMaxFailures.java:64)
	at org.apache.lucene.util.TestRuleIgnoreTestSuites$1.evaluate(TestRuleIgnoreTestSuites.java:54)
	at com.carrotsearch.randomizedtesting.rules.StatementAdapter.evaluate(StatementAdapter.java:36)
	at com.carrotsearch.randomizedtesting.ThreadLeakControl$StatementRunner.run(ThreadLeakControl.java:367)
	at java.base/java.lang.Thread.run(Thread.java:844)
Caused by: java.lang.IllegalStateException: Unable to access 'private final byte[] java.lang.String.value' to estimate memory usage
	at com.carrotsearch.randomizedtesting.rules.RamUsageEstimator.createCacheEntry(RamUsageEstimator.java:602)
	at com.carrotsearch.randomizedtesting.rules.RamUsageEstimator.measureSizeOf(RamUsageEstimator.java:545)
	at com.carrotsearch.randomizedtesting.rules.RamUsageEstimator.sizeOfAll(RamUsageEstimator.java:387)
	at com.carrotsearch.randomizedtesting.rules.StaticFieldsInvariantRule$1.afterAlways(StaticFieldsInvariantRule.java:129)
	... 10 more
Caused by: java.lang.reflect.InaccessibleObjectException: Unable to make field private final byte[] java.lang.String.value accessible: module java.base does not "opens java.lang" to unnamed module @1a36217
	at java.base/jdk.internal.reflect.Reflection.throwInaccessibleObjectException(Reflection.java:427)
	at java.base/java.lang.reflect.AccessibleObject.checkCanSetAccessible(AccessibleObject.java:201)
	at java.base/java.lang.reflect.Field.checkCanSetAccessible(Field.java:171)
	at java.base/java.lang.reflect.Field.setAccessible(Field.java:165)
	at com.carrotsearch.randomizedtesting.rules.RamUsageEstimator$3.run(RamUsageEstimator.java:597)
	at com.carrotsearch.randomizedtesting.rules.RamUsageEstimator$3.run(RamUsageEstimator.java:594)
	at java.base/java.security.AccessController.doPrivileged(Native Method)
	at com.carrotsearch.randomizedtesting.rules.RamUsageEstimator.createCacheEntry(RamUsageEstimator.java:594)
	... 13 more


FAILED:  junit.framework.TestSuite.org.apache.lucene.search.TestSloppyPhraseQuery2

Error Message:
Clean up static fields (in @AfterClass?) and null them, your test still has references to classes of which the sizes cannot be measured due to security restrictions or Java 9 module encapsulation:   - protected static java.lang.String org.apache.lucene.search.SearchEquivalenceTestBase.stopword

Stack Trace:
junit.framework.AssertionFailedError: Clean up static fields (in @AfterClass?) and null them, your test still has references to classes of which the sizes cannot be measured due to security restrictions or Java 9 module encapsulation:
  - protected static java.lang.String org.apache.lucene.search.SearchEquivalenceTestBase.stopword
	at __randomizedtesting.SeedInfo.seed([15305BE129154701]:0)
	at com.carrotsearch.randomizedtesting.rules.StaticFieldsInvariantRule$1.afterAlways(StaticFieldsInvariantRule.java:146)
	at com.carrotsearch.randomizedtesting.rules.StatementAdapter.evaluate(StatementAdapter.java:43)
	at com.carrotsearch.randomizedtesting.rules.StatementAdapter.evaluate(StatementAdapter.java:36)
	at com.carrotsearch.randomizedtesting.rules.StatementAdapter.evaluate(StatementAdapter.java:36)
	at org.apache.lucene.util.TestRuleAssertionsRequired$1.evaluate(TestRuleAssertionsRequired.java:53)
	at org.apache.lucene.util.TestRuleMarkFailure$1.evaluate(TestRuleMarkFailure.java:47)
	at org.apache.lucene.util.TestRuleIgnoreAfterMaxFailures$1.evaluate(TestRuleIgnoreAfterMaxFailures.java:64)
	at org.apache.lucene.util.TestRuleIgnoreTestSuites$1.evaluate(TestRuleIgnoreTestSuites.java:54)
	at com.carrotsearch.randomizedtesting.rules.StatementAdapter.evaluate(StatementAdapter.java:36)
	at com.carrotsearch.randomizedtesting.ThreadLeakControl$StatementRunner.run(ThreadLeakControl.java:367)
	at java.base/java.lang.Thread.run(Thread.java:844)
Caused by: java.lang.IllegalStateException: Unable to access 'private final byte[] java.lang.String.value' to estimate memory usage
	at com.carrotsearch.randomizedtesting.rules.RamUsageEstimator.createCacheEntry(RamUsageEstimator.java:602)
	at com.carrotsearch.randomizedtesting.rules.RamUsageEstimator.measureSizeOf(RamUsageEstimator.java:545)
	at com.carrotsearch.randomizedtesting.rules.RamUsageEstimator.sizeOfAll(RamUsageEstimator.java:387)
	at com.carrotsearch.randomizedtesting.rules.StaticFieldsInvariantRule$1.afterAlways(StaticFieldsInvariantRule.java:129)
	... 10 more
Caused by: java.lang.reflect.InaccessibleObjectException: Unable to make field private final byte[] java.lang.String.value accessible: module java.base does not "opens java.lang" to unnamed module @1a36217
	at java.base/jdk.internal.reflect.Reflection.throwInaccessibleObjectException(Reflection.java:427)
	at java.base/java.lang.reflect.AccessibleObject.checkCanSetAccessible(AccessibleObject.java:201)
	at java.base/java.lang.reflect.Field.checkCanSetAccessible(Field.java:171)
	at java.base/java.lang.reflect.Field.setAccessible(Field.java:165)
	at com.carrotsearch.randomizedtesting.rules.RamUsageEstimator$3.run(RamUsageEstimator.java:597)
	at com.carrotsearch.randomizedtesting.rules.RamUsageEstimator$3.run(RamUsageEstimator.java:594)
	at java.base/java.security.AccessController.doPrivileged(Native Method)
	at com.carrotsearch.randomizedtesting.rules.RamUsageEstimator.createCacheEntry(RamUsageEstimator.java:594)
	... 13 more


FAILED:  junit.framework.TestSuite.org.apache.lucene.search.similarities.TestSimilarityBase

Error Message:
Clean up static fields (in @AfterClass?) and null them, your test still has references to classes of which the sizes cannot be measured due to security restrictions or Java 9 module encapsulation:   - private static java.lang.String org.apache.lucene.search.similarities.TestSimilarityBase.FIELD_BODY   - private static java.lang.String org.apache.lucene.search.similarities.TestSimilarityBase.FIELD_ID

Stack Trace:
junit.framework.AssertionFailedError: Clean up static fields (in @AfterClass?) and null them, your test still has references to classes of which the sizes cannot be measured due to security restrictions or Java 9 module encapsulation:
  - private static java.lang.String org.apache.lucene.search.similarities.TestSimilarityBase.FIELD_BODY
  - private static java.lang.String org.apache.lucene.search.similarities.TestSimilarityBase.FIELD_ID
	at __randomizedtesting.SeedInfo.seed([15305BE129154701]:0)
	at com.carrotsearch.randomizedtesting.rules.StaticFieldsInvariantRule$1.afterAlways(StaticFieldsInvariantRule.java:146)
	at com.carrotsearch.randomizedtesting.rules.StatementAdapter.evaluate(StatementAdapter.java:43)
	at com.carrotsearch.randomizedtesting.rules.StatementAdapter.evaluate(StatementAdapter.java:36)
	at com.carrotsearch.randomizedtesting.rules.StatementAdapter.evaluate(StatementAdapter.java:36)
	at org.apache.lucene.util.TestRuleAssertionsRequired$1.evaluate(TestRuleAssertionsRequired.java:53)
	at org.apache.lucene.util.TestRuleMarkFailure$1.evaluate(TestRuleMarkFailure.java:47)
	at org.apache.lucene.util.TestRuleIgnoreAfterMaxFailures$1.evaluate(TestRuleIgnoreAfterMaxFailures.java:64)
	at org.apache.lucene.util.TestRuleIgnoreTestSuites$1.evaluate(TestRuleIgnoreTestSuites.java:54)
	at com.carrotsearch.randomizedtesting.rules.StatementAdapter.evaluate(StatementAdapter.java:36)
	at com.carrotsearch.randomizedtesting.ThreadLeakControl$StatementRunner.run(ThreadLeakControl.java:367)
	at java.base/java.lang.Thread.run(Thread.java:844)
Caused by: java.lang.IllegalStateException: Unable to access 'private final byte[] java.lang.String.value' to estimate memory usage
	at com.carrotsearch.randomizedtesting.rules.RamUsageEstimator.createCacheEntry(RamUsageEstimator.java:602)
	at com.carrotsearch.randomizedtesting.rules.RamUsageEstimator.measureSizeOf(RamUsageEstimator.java:545)
	at com.carrotsearch.randomizedtesting.rules.RamUsageEstimator.sizeOfAll(RamUsageEstimator.java:387)
	at com.carrotsearch.randomizedtesting.rules.StaticFieldsInvariantRule$1.afterAlways(StaticFieldsInvariantRule.java:129)
	... 10 more
Caused by: java.lang.reflect.InaccessibleObjectException: Unable to make field private final byte[] java.lang.String.value accessible: module java.base does not "opens java.lang" to unnamed module @1a36217
	at java.base/jdk.internal.reflect.Reflection.throwInaccessibleObjectException(Reflection.java:427)
	at java.base/java.lang.reflect.AccessibleObject.checkCanSetAccessible(AccessibleObject.java:201)
	at java.base/java.lang.reflect.Field.checkCanSetAccessible(Field.java:171)
	at java.base/java.lang.reflect.Field.setAccessible(Field.java:165)
	at com.carrotsearch.randomizedtesting.rules.RamUsageEstimator$3.run(RamUsageEstimator.java:597)
	at com.carrotsearch.randomizedtesting.rules.RamUsageEstimator$3.run(RamUsageEstimator.java:594)
	at java.base/java.security.AccessController.doPrivileged(Native Method)
	at com.carrotsearch.randomizedtesting.rules.RamUsageEstimator.createCacheEntry(RamUsageEstimator.java:594)
	... 13 more


FAILED:  junit.framework.TestSuite.org.apache.lucene.search.spans.TestSpanSearchEquivalence

Error Message:
Clean up static fields (in @AfterClass?) and null them, your test still has references to classes of which the sizes cannot be measured due to security restrictions or Java 9 module encapsulation:   - protected static java.lang.String org.apache.lucene.search.SearchEquivalenceTestBase.stopword

Stack Trace:
junit.framework.AssertionFailedError: Clean up static fields (in @AfterClass?) and null them, your test still has references to classes of which the sizes cannot be measured due to security restrictions or Java 9 module encapsulation:
  - protected static java.lang.String org.apache.lucene.search.SearchEquivalenceTestBase.stopword
	at __randomizedtesting.SeedInfo.seed([15305BE129154701]:0)
	at com.carrotsearch.randomizedtesting.rules.StaticFieldsInvariantRule$1.afterAlways(StaticFieldsInvariantRule.java:146)
	at com.carrotsearch.randomizedtesting.rules.StatementAdapter.evaluate(StatementAdapter.java:43)
	at com.carrotsearch.randomizedtesting.rules.StatementAdapter.evaluate(StatementAdapter.java:36)
	at com.carrotsearch.randomizedtesting.rules.StatementAdapter.evaluate(StatementAdapter.java:36)
	at org.apache.lucene.util.TestRuleAssertionsRequired$1.evaluate(TestRuleAssertionsRequired.java:53)
	at org.apache.lucene.util.TestRuleMarkFailure$1.evaluate(TestRuleMarkFailure.java:47)
	at org.apache.lucene.util.TestRuleIgnoreAfterMaxFailures$1.evaluate(TestRuleIgnoreAfterMaxFailures.java:64)
	at org.apache.lucene.util.TestRuleIgnoreTestSuites$1.evaluate(TestRuleIgnoreTestSuites.java:54)
	at com.carrotsearch.randomizedtesting.rules.StatementAdapter.evaluate(StatementAdapter.java:36)
	at com.carrotsearch.randomizedtesting.ThreadLeakControl$StatementRunner.run(ThreadLeakControl.java:367)
	at java.base/java.lang.Thread.run(Thread.java:844)
Caused by: java.lang.IllegalStateException: Unable to access 'private final byte[] java.lang.String.value' to estimate memory usage
	at com.carrotsearch.randomizedtesting.rules.RamUsageEstimator.createCacheEntry(RamUsageEstimator.java:602)
	at com.carrotsearch.randomizedtesting.rules.RamUsageEstimator.measureSizeOf(RamUsageEstimator.java:545)
	at com.carrotsearch.randomizedtesting.rules.RamUsageEstimator.sizeOfAll(RamUsageEstimator.java:387)
	at com.carrotsearch.randomizedtesting.rules.StaticFieldsInvariantRule$1.afterAlways(StaticFieldsInvariantRule.java:129)
	... 10 more
Caused by: java.lang.reflect.InaccessibleObjectException: Unable to make field private final byte[] java.lang.String.value accessible: module java.base does not "opens java.lang" to unnamed module @d50698
	at java.base/jdk.internal.reflect.Reflection.throwInaccessibleObjectException(Reflection.java:427)
	at java.base/java.lang.reflect.AccessibleObject.checkCanSetAccessible(AccessibleObject.java:201)
	at java.base/java.lang.reflect.Field.checkCanSetAccessible(Field.java:171)
	at java.base/java.lang.reflect.Field.setAccessible(Field.java:165)
	at com.carrotsearch.randomizedtesting.rules.RamUsageEstimator$3.run(RamUsageEstimator.java:597)
	at com.carrotsearch.randomizedtesting.rules.RamUsageEstimator$3.run(RamUsageEstimator.java:594)
	at java.base/java.security.AccessController.doPrivileged(Native Method)
	at com.carrotsearch.randomizedtesting.rules.RamUsageEstimator.createCacheEntry(RamUsageEstimator.java:594)
	... 13 more


FAILED:  org.apache.lucene.codecs.lucene50.TestBlockPostingsFormat.testRamBytesUsed

Error Message:
Unable to make field final java.util.Collection java.util.Collections$SynchronizedCollection.c accessible: module java.base does not "opens java.util" to unnamed module @d50698

Stack Trace:
java.lang.reflect.InaccessibleObjectException: Unable to make field final java.util.Collection java.util.Collections$SynchronizedCollection.c accessible: module java.base does not "opens java.util" to unnamed module @d50698
	at __randomizedtesting.SeedInfo.seed([15305BE129154701:E79349A1E36A5857]:0)
	at java.base/jdk.internal.reflect.Reflection.throwInaccessibleObjectException(Reflection.java:427)
	at java.base/java.lang.reflect.AccessibleObject.checkCanSetAccessible(AccessibleObject.java:201)
	at java.base/java.lang.reflect.Field.checkCanSetAccessible(Field.java:171)
	at java.base/java.lang.reflect.Field.setAccessible(Field.java:165)
	at org.apache.lucene.util.RamUsageTester.lambda$createCacheEntry$0(RamUsageTester.java:205)
	at java.base/java.security.AccessController.doPrivileged(Native Method)
	at org.apache.lucene.util.RamUsageTester.createCacheEntry(RamUsageTester.java:190)
	at org.apache.lucene.util.RamUsageTester.measureObjectSize(RamUsageTester.java:146)
	at org.apache.lucene.util.RamUsageTester.sizeOf(RamUsageTester.java:68)
	at org.apache.lucene.index.BaseIndexFileFormatTestCase.testRamBytesUsed(BaseIndexFileFormatTestCase.java:274)
	at org.apache.lucene.index.BasePostingsFormatTestCase.testRamBytesUsed(BasePostingsFormatTestCase.java:85)
	at java.base/jdk.internal.reflect.NativeMethodAccessorImpl.invoke0(Native Method)
	at java.base/jdk.internal.reflect.NativeMethodAccessorImpl.invoke(NativeMethodAccessorImpl.java:62)
	at java.base/jdk.internal.reflect.DelegatingMethodAccessorImpl.invoke(DelegatingMethodAccessorImpl.java:43)
	at java.base/java.lang.reflect.Method.invoke(Method.java:538)
	at com.carrotsearch.randomizedtesting.RandomizedRunner.invoke(RandomizedRunner.java:1713)
	at com.carrotsearch.randomizedtesting.RandomizedRunner$8.evaluate(RandomizedRunner.java:907)
	at com.carrotsearch.randomizedtesting.RandomizedRunner$9.evaluate(RandomizedRunner.java:943)
	at com.carrotsearch.randomizedtesting.RandomizedRunner$10.evaluate(RandomizedRunner.java:957)
	at org.apache.lucene.util.TestRuleSetupTeardownChained$1.evaluate(TestRuleSetupTeardownChained.java:49)
	at org.apache.lucene.util.AbstractBeforeAfterRule$1.evaluate(AbstractBeforeAfterRule.java:45)
	at org.apache.lucene.util.TestRuleThreadAndTestName$1.evaluate(TestRuleThreadAndTestName.java:48)
	at org.apache.lucene.util.TestRuleIgnoreAfterMaxFailures$1.evaluate(TestRuleIgnoreAfterMaxFailures.java:64)
	at org.apache.lucene.util.TestRuleMarkFailure$1.evaluate(TestRuleMarkFailure.java:47)
	at com.carrotsearch.randomizedtesting.rules.StatementAdapter.evaluate(StatementAdapter.java:36)
	at com.carrotsearch.randomizedtesting.ThreadLeakControl$StatementRunner.run(ThreadLeakControl.java:367)
	at com.carrotsearch.randomizedtesting.ThreadLeakControl.forkTimeoutingTask(ThreadLeakControl.java:811)
	at com.carrotsearch.randomizedtesting.ThreadLeakControl$3.evaluate(ThreadLeakControl.java:462)
	at com.carrotsearch.randomizedtesting.RandomizedRunner.runSingleTest(RandomizedRunner.java:916)
	at com.carrotsearch.randomizedtesting.RandomizedRunner$5.evaluate(RandomizedRunner.java:802)
	at com.carrotsearch.randomizedtesting.RandomizedRunner$6.evaluate(RandomizedRunner.java:852)
	at com.carrotsearch.randomizedtesting.RandomizedRunner$7.evaluate(RandomizedRunner.java:863)
	at org.apache.lucene.util.AbstractBeforeAfterRule$1.evaluate(AbstractBeforeAfterRule.java:45)
	at com.carrotsearch.randomizedtesting.rules.StatementAdapter.evaluate(StatementAdapter.java:36)
	at org.apache.lucene.util.TestRuleStoreClassName$1.evaluate(TestRuleStoreClassName.java:41)
	at com.carrotsearch.randomizedtesting.rules.NoShadowingOrOverridesOnMethodsRule$1.evaluate(NoShadowingOrOverridesOnMethodsRule.java:40)
	at com.carrotsearch.randomizedtesting.rules.NoShadowingOrOverridesOnMethodsRule$1.evaluate(NoShadowingOrOverridesOnMethodsRule.java:40)
	at com.carrotsearch.randomizedtesting.rules.StatementAdapter.evaluate(StatementAdapter.java:36)
	at com.carrotsearch.randomizedtesting.rules.StatementAdapter.evaluate(StatementAdapter.java:36)
	at com.carrotsearch.randomizedtesting.rules.StatementAdapter.evaluate(StatementAdapter.java:36)
	at org.apache.lucene.util.TestRuleAssertionsRequired$1.evaluate(TestRuleAssertionsRequired.java:53)
	at org.apache.lucene.util.TestRuleMarkFailure$1.evaluate(TestRuleMarkFailure.java:47)
	at org.apache.lucene.util.TestRuleIgnoreAfterMaxFailures$1.evaluate(TestRuleIgnoreAfterMaxFailures.java:64)
	at org.apache.lucene.util.TestRuleIgnoreTestSuites$1.evaluate(TestRuleIgnoreTestSuites.java:54)
	at com.carrotsearch.randomizedtesting.rules.StatementAdapter.evaluate(StatementAdapter.java:36)
	at com.carrotsearch.randomizedtesting.ThreadLeakControl$StatementRunner.run(ThreadLeakControl.java:367)
	at java.base/java.lang.Thread.run(Thread.java:844)


FAILED:  org.apache.lucene.codecs.lucene50.TestBlockPostingsFormat.testInvertedWrite

Error Message:
Unable to make field transient java.lang.Object[] java.util.ArrayList.elementData accessible: module java.base does not "opens java.util" to unnamed module @d50698

Stack Trace:
java.lang.reflect.InaccessibleObjectException: Unable to make field transient java.lang.Object[] java.util.ArrayList.elementData accessible: module java.base does not "opens java.util" to unnamed module @d50698
	at __randomizedtesting.SeedInfo.seed([15305BE129154701:C44162A574ECCDD]:0)
	at java.base/jdk.internal.reflect.Reflection.throwInaccessibleObjectException(Reflection.java:427)
	at java.base/java.lang.reflect.AccessibleObject.checkCanSetAccessible(AccessibleObject.java:201)
	at java.base/java.lang.reflect.Field.checkCanSetAccessible(Field.java:171)
	at java.base/java.lang.reflect.Field.setAccessible(Field.java:165)
	at org.apache.lucene.util.RamUsageTester.lambda$createCacheEntry$0(RamUsageTester.java:205)
	at java.base/java.security.AccessController.doPrivileged(Native Method)
	at org.apache.lucene.util.RamUsageTester.createCacheEntry(RamUsageTester.java:190)
	at org.apache.lucene.util.RamUsageTester.measureObjectSize(RamUsageTester.java:146)
	at org.apache.lucene.util.RamUsageTester.sizeOf(RamUsageTester.java:68)
	at org.apache.lucene.util.RamUsageTester.sizeOf(RamUsageTester.java:73)
	at org.apache.lucene.index.BasePostingsFormatTestCase.testInvertedWrite(BasePostingsFormatTestCase.java:554)
	at java.base/jdk.internal.reflect.NativeMethodAccessorImpl.invoke0(Native Method)
	at java.base/jdk.internal.reflect.NativeMethodAccessorImpl.invoke(NativeMethodAccessorImpl.java:62)
	at java.base/jdk.internal.reflect.DelegatingMethodAccessorImpl.invoke(DelegatingMethodAccessorImpl.java:43)
	at java.base/java.lang.reflect.Method.invoke(Method.java:538)
	at com.carrotsearch.randomizedtesting.RandomizedRunner.invoke(RandomizedRunner.java:1713)
	at com.carrotsearch.randomizedtesting.RandomizedRunner$8.evaluate(RandomizedRunner.java:907)
	at com.carrotsearch.randomizedtesting.RandomizedRunner$9.evaluate(RandomizedRunner.java:943)
	at com.carrotsearch.randomizedtesting.RandomizedRunner$10.evaluate(RandomizedRunner.java:957)
	at org.apache.lucene.util.TestRuleSetupTeardownChained$1.evaluate(TestRuleSetupTeardownChained.java:49)
	at org.apache.lucene.util.AbstractBeforeAfterRule$1.evaluate(AbstractBeforeAfterRule.java:45)
	at org.apache.lucene.util.TestRuleThreadAndTestName$1.evaluate(TestRuleThreadAndTestName.java:48)
	at org.apache.lucene.util.TestRuleIgnoreAfterMaxFailures$1.evaluate(TestRuleIgnoreAfterMaxFailures.java:64)
	at org.apache.lucene.util.TestRuleMarkFailure$1.evaluate(TestRuleMarkFailure.java:47)
	at com.carrotsearch.randomizedtesting.rules.StatementAdapter.evaluate(StatementAdapter.java:36)
	at com.carrotsearch.randomizedtesting.ThreadLeakControl$StatementRunner.run(ThreadLeakControl.java:367)
	at com.carrotsearch.randomizedtesting.ThreadLeakControl.forkTimeoutingTask(ThreadLeakControl.java:811)
	at com.carrotsearch.randomizedtesting.ThreadLeakControl$3.evaluate(ThreadLeakControl.java:462)
	at com.carrotsearch.randomizedtesting.RandomizedRunner.runSingleTest(RandomizedRunner.java:916)
	at com.carrotsearch.randomizedtesting.RandomizedRunner$5.evaluate(RandomizedRunner.java:802)
	at com.carrotsearch.randomizedtesting.RandomizedRunner$6.evaluate(RandomizedRunner.java:852)
	at com.carrotsearch.randomizedtesting.RandomizedRunner$7.evaluate(RandomizedRunner.java:863)
	at org.apache.lucene.util.AbstractBeforeAfterRule$1.evaluate(AbstractBeforeAfterRule.java:45)
	at com.carrotsearch.randomizedtesting.rules.StatementAdapter.evaluate(StatementAdapter.java:36)
	at org.apache.lucene.util.TestRuleStoreClassName$1.evaluate(TestRuleStoreClassName.java:41)
	at com.carrotsearch.randomizedtesting.rules.NoShadowingOrOverridesOnMethodsRule$1.evaluate(NoShadowingOrOverridesOnMethodsRule.java:40)
	at com.carrotsearch.randomizedtesting.rules.NoShadowingOrOverridesOnMethodsRule$1.evaluate(NoShadowingOrOverridesOnMethodsRule.java:40)
	at com.carrotsearch.randomizedtesting.rules.StatementAdapter.evaluate(StatementAdapter.java:36)
	at com.carrotsearch.randomizedtesting.rules.StatementAdapter.evaluate(StatementAdapter.java:36)
	at com.carrotsearch.randomizedtesting.rules.StatementAdapter.evaluate(StatementAdapter.java:36)
	at org.apache.lucene.util.TestRuleAssertionsRequired$1.evaluate(TestRuleAssertionsRequired.java:53)
	at org.apache.lucene.util.TestRuleMarkFailure$1.evaluate(TestRuleMarkFailure.java:47)
	at org.apache.lucene.util.TestRuleIgnoreAfterMaxFailures$1.evaluate(TestRuleIgnoreAfterMaxFailures.java:64)
	at org.apache.lucene.util.TestRuleIgnoreTestSuites$1.evaluate(TestRuleIgnoreTestSuites.java:54)
	at com.carrotsearch.randomizedtesting.rules.StatementAdapter.evaluate(StatementAdapter.java:36)
	at com.carrotsearch.randomizedtesting.ThreadLeakControl$StatementRunner.run(ThreadLeakControl.java:367)
	at java.base/java.lang.Thread.run(Thread.java:844)


FAILED:  org.apache.lucene.codecs.lucene50.TestLucene50CompoundFormat.testRamBytesUsed

Error Message:
Unable to make field final java.util.Collection java.util.Collections$SynchronizedCollection.c accessible: module java.base does not "opens java.util" to unnamed module @1a36217

Stack Trace:
java.lang.reflect.InaccessibleObjectException: Unable to make field final java.util.Collection java.util.Collections$SynchronizedCollection.c accessible: module java.base does not "opens java.util" to unnamed module @1a36217
	at __randomizedtesting.SeedInfo.seed([15305BE129154701:E79349A1E36A5857]:0)
	at java.base/jdk.internal.reflect.Reflection.throwInaccessibleObjectException(Reflection.java:427)
	at java.base/java.lang.reflect.AccessibleObject.checkCanSetAccessible(AccessibleObject.java:201)
	at java.base/java.lang.reflect.Field.checkCanSetAccessible(Field.java:171)
	at java.base/java.lang.reflect.Field.setAccessible(Field.java:165)
	at org.apache.lucene.util.RamUsageTester.lambda$createCacheEntry$0(RamUsageTester.java:205)
	at java.base/java.security.AccessController.doPrivileged(Native Method)
	at org.apache.lucene.util.RamUsageTester.createCacheEntry(RamUsageTester.java:190)
	at org.apache.lucene.util.RamUsageTester.measureObjectSize(RamUsageTester.java:146)
	at org.apache.lucene.util.RamUsageTester.sizeOf(RamUsageTester.java:68)
	at org.apache.lucene.index.BaseIndexFileFormatTestCase.testRamBytesUsed(BaseIndexFileFormatTestCase.java:274)
	at org.apache.lucene.index.BaseCompoundFormatTestCase.testRamBytesUsed(BaseCompoundFormatTestCase.java:52)
	at java.base/jdk.internal.reflect.NativeMethodAccessorImpl.invoke0(Native Method)
	at java.base/jdk.internal.reflect.NativeMethodAccessorImpl.invoke(NativeMethodAccessorImpl.java:62)
	at java.base/jdk.internal.reflect.DelegatingMethodAccessorImpl.invoke(DelegatingMethodAccessorImpl.java:43)
	at java.base/java.lang.reflect.Method.invoke(Method.java:538)
	at com.carrotsearch.randomizedtesting.RandomizedRunner.invoke(RandomizedRunner.java:1713)
	at com.carrotsearch.randomizedtesting.RandomizedRunner$8.evaluate(RandomizedRunner.java:907)
	at com.carrotsearch.randomizedtesting.RandomizedRunner$9.evaluate(RandomizedRunner.java:943)
	at com.carrotsearch.randomizedtesting.RandomizedRunner$10.evaluate(RandomizedRunner.java:957)
	at org.apache.lucene.util.TestRuleSetupTeardownChained$1.evaluate(TestRuleSetupTeardownChained.java:49)
	at org.apache.lucene.util.AbstractBeforeAfterRule$1.evaluate(AbstractBeforeAfterRule.java:45)
	at org.apache.lucene.util.TestRuleThreadAndTestName$1.evaluate(TestRuleThreadAndTestName.java:48)
	at org.apache.lucene.util.TestRuleIgnoreAfterMaxFailures$1.evaluate(TestRuleIgnoreAfterMaxFailures.java:64)
	at org.apache.lucene.util.TestRuleMarkFailure$1.evaluate(TestRuleMarkFailure.java:47)
	at com.carrotsearch.randomizedtesting.rules.StatementAdapter.evaluate(StatementAdapter.java:36)
	at com.carrotsearch.randomizedtesting.ThreadLeakControl$StatementRunner.run(ThreadLeakControl.java:367)
	at com.carrotsearch.randomizedtesting.ThreadLeakControl.forkTimeoutingTask(ThreadLeakControl.java:811)
	at com.carrotsearch.randomizedtesting.ThreadLeakControl$3.evaluate(ThreadLeakControl.java:462)
	at com.carrotsearch.randomizedtesting.RandomizedRunner.runSingleTest(RandomizedRunner.java:916)
	at com.carrotsearch.randomizedtesting.RandomizedRunner$5.evaluate(RandomizedRunner.java:802)
	at com.carrotsearch.randomizedtesting.RandomizedRunner$6.evaluate(RandomizedRunner.java:852)
	at com.carrotsearch.randomizedtesting.RandomizedRunner$7.evaluate(RandomizedRunner.java:863)
	at org.apache.lucene.util.AbstractBeforeAfterRule$1.evaluate(AbstractBeforeAfterRule.java:45)
	at com.carrotsearch.randomizedtesting.rules.StatementAdapter.evaluate(StatementAdapter.java:36)
	at org.apache.lucene.util.TestRuleStoreClassName$1.evaluate(TestRuleStoreClassName.java:41)
	at com.carrotsearch.randomizedtesting.rules.NoShadowingOrOverridesOnMethodsRule$1.evaluate(NoShadowingOrOverridesOnMethodsRule.java:40)
	at com.carrotsearch.randomizedtesting.rules.NoShadowingOrOverridesOnMethodsRule$1.evaluate(NoShadowingOrOverridesOnMethodsRule.java:40)
	at com.carrotsearch.randomizedtesting.rules.StatementAdapter.evaluate(StatementAdapter.java:36)
	at com.carrotsearch.randomizedtesting.rules.StatementAdapter.evaluate(StatementAdapter.java:36)
	at com.carrotsearch.randomizedtesting.rules.StatementAdapter.evaluate(StatementAdapter.java:36)
	at org.apache.lucene.util.TestRuleAssertionsRequired$1.evaluate(TestRuleAssertionsRequired.java:53)
	at org.apache.lucene.util.TestRuleMarkFailure$1.evaluate(TestRuleMarkFailure.java:47)
	at org.apache.lucene.util.TestRuleIgnoreAfterMaxFailures$1.evaluate(TestRuleIgnoreAfterMaxFailures.java:64)
	at org.apache.lucene.util.TestRuleIgnoreTestSuites$1.evaluate(TestRuleIgnoreTestSuites.java:54)
	at com.carrotsearch.randomizedtesting.rules.StatementAdapter.evaluate(StatementAdapter.java:36)
	at com.carrotsearch.randomizedtesting.ThreadLeakControl$StatementRunner.run(ThreadLeakControl.java:367)
	at java.base/java.lang.Thread.run(Thread.java:844)


FAILED:  org.apache.lucene.codecs.lucene50.TestLucene50StoredFieldsFormat.testRamBytesUsed

Error Message:
Unable to make field final java.util.Collection java.util.Collections$SynchronizedCollection.c accessible: module java.base does not "opens java.util" to unnamed module @f45be

Stack Trace:
java.lang.reflect.InaccessibleObjectException: Unable to make field final java.util.Collection java.util.Collections$SynchronizedCollection.c accessible: module java.base does not "opens java.util" to unnamed module @f45be
	at __randomizedtesting.SeedInfo.seed([15305BE129154701:E79349A1E36A5857]:0)
	at java.base/jdk.internal.reflect.Reflection.throwInaccessibleObjectException(Reflection.java:427)
	at java.base/java.lang.reflect.AccessibleObject.checkCanSetAccessible(AccessibleObject.java:201)
	at java.base/java.lang.reflect.Field.checkCanSetAccessible(Field.java:171)
	at java.base/java.lang.reflect.Field.setAccessible(Field.java:165)
	at org.apache.lucene.util.RamUsageTester.lambda$createCacheEntry$0(RamUsageTester.java:205)
	at java.base/java.security.AccessController.doPrivileged(Native Method)
	at org.apache.lucene.util.RamUsageTester.createCacheEntry(RamUsageTester.java:190)
	at org.apache.lucene.util.RamUsageTester.measureObjectSize(RamUsageTester.java:146)
	at org.apache.lucene.util.RamUsageTester.sizeOf(RamUsageTester.java:68)
	at org.apache.lucene.index.BaseIndexFileFormatTestCase.testRamBytesUsed(BaseIndexFileFormatTestCase.java:274)
	at org.apache.lucene.index.BaseStoredFieldsFormatTestCase.testRamBytesUsed(BaseStoredFieldsFormatTestCase.java:66)
	at java.base/jdk.internal.reflect.NativeMethodAccessorImpl.invoke0(Native Method)
	at java.base/jdk.internal.reflect.NativeMethodAccessorImpl.invoke(NativeMethodAccessorImpl.java:62)
	at java.base/jdk.internal.reflect.DelegatingMethodAccessorImpl.invoke(DelegatingMethodAccessorImpl.java:43)
	at java.base/java.lang.reflect.Method.invoke(Method.java:538)
	at com.carrotsearch.randomizedtesting.RandomizedRunner.invoke(RandomizedRunner.java:1713)
	at com.carrotsearch.randomizedtesting.RandomizedRunner$8.evaluate(RandomizedRunner.java:907)
	at com.carrotsearch.randomizedtesting.RandomizedRunner$9.evaluate(RandomizedRunner.java:943)
	at com.carrotsearch.randomizedtesting.RandomizedRunner$10.evaluate(RandomizedRunner.java:957)
	at org.apache.lucene.util.TestRuleSetupTeardownChained$1.evaluate(TestRuleSetupTeardownChained.java:49)
	at org.apache.lucene.util.AbstractBeforeAfterRule$1.evaluate(AbstractBeforeAfterRule.java:45)
	at org.apache.lucene.util.TestRuleThreadAndTestName$1.evaluate(TestRuleThreadAndTestName.java:48)
	at org.apache.lucene.util.TestRuleIgnoreAfterMaxFailures$1.evaluate(TestRuleIgnoreAfterMaxFailures.java:64)
	at org.apache.lucene.util.TestRuleMarkFailure$1.evaluate(TestRuleMarkFailure.java:47)
	at com.carrotsearch.randomizedtesting.rules.StatementAdapter.evaluate(StatementAdapter.java:36)
	at com.carrotsearch.randomizedtesting.ThreadLeakControl$StatementRunner.run(ThreadLeakControl.java:367)
	at com.carrotsearch.randomizedtesting.ThreadLeakControl.forkTimeoutingTask(ThreadLeakControl.java:811)
	at com.carrotsearch.randomizedtesting.ThreadLeakControl$3.evaluate(ThreadLeakControl.java:462)
	at com.carrotsearch.randomizedtesting.RandomizedRunner.runSingleTest(RandomizedRunner.java:916)
	at com.carrotsearch.randomizedtesting.RandomizedRunner$5.evaluate(RandomizedRunner.java:802)
	at com.carrotsearch.randomizedtesting.RandomizedRunner$6.evaluate(RandomizedRunner.java:852)
	at com.carrotsearch.randomizedtesting.RandomizedRunner$7.evaluate(RandomizedRunner.java:863)
	at org.apache.lucene.util.AbstractBeforeAfterRule$1.evaluate(AbstractBeforeAfterRule.java:45)
	at com.carrotsearch.randomizedtesting.rules.StatementAdapter.evaluate(StatementAdapter.java:36)
	at org.apache.lucene.util.TestRuleStoreClassName$1.evaluate(TestRuleStoreClassName.java:41)
	at com.carrotsearch.randomizedtesting.rules.NoShadowingOrOverridesOnMethodsRule$1.evaluate(NoShadowingOrOverridesOnMethodsRule.java:40)
	at com.carrotsearch.randomizedtesting.rules.NoShadowingOrOverridesOnMethodsRule$1.evaluate(NoShadowingOrOverridesOnMethodsRule.java:40)
	at com.carrotsearch.randomizedtesting.rules.StatementAdapter.evaluate(StatementAdapter.java:36)
	at com.carrotsearch.randomizedtesting.rules.StatementAdapter.evaluate(StatementAdapter.java:36)
	at com.carrotsearch.randomizedtesting.rules.StatementAdapter.evaluate(StatementAdapter.java:36)
	at org.apache.lucene.util.TestRuleAssertionsRequired$1.evaluate(TestRuleAssertionsRequired.java:53)
	at org.apache.lucene.util.TestRuleMarkFailure$1.evaluate(TestRuleMarkFailure.java:47)
	at org.apache.lucene.util.TestRuleIgnoreAfterMaxFailures$1.evaluate(TestRuleIgnoreAfterMaxFailures.java:64)
	at org.apache.lucene.util.TestRuleIgnoreTestSuites$1.evaluate(TestRuleIgnoreTestSuites.java:54)
	at com.carrotsearch.randomizedtesting.rules.StatementAdapter.evaluate(StatementAdapter.java:36)
	at com.carrotsearch.randomizedtesting.ThreadLeakControl$StatementRunner.run(ThreadLeakControl.java:367)
	at java.base/java.lang.Thread.run(Thread.java:844)


FAILED:  org.apache.lucene.codecs.lucene50.TestLucene50StoredFieldsFormatHighCompression.testRamBytesUsed

Error Message:
Unable to make field final java.util.Collection java.util.Collections$SynchronizedCollection.c accessible: module java.base does not "opens java.util" to unnamed module @f45be

Stack Trace:
java.lang.reflect.InaccessibleObjectException: Unable to make field final java.util.Collection java.util.Collections$SynchronizedCollection.c accessible: module java.base does not "opens java.util" to unnamed module @f45be
	at __randomizedtesting.SeedInfo.seed([15305BE129154701:E79349A1E36A5857]:0)
	at java.base/jdk.internal.reflect.Reflection.throwInaccessibleObjectException(Reflection.java:427)
	at java.base/java.lang.reflect.AccessibleObject.checkCanSetAccessible(AccessibleObject.java:201)
	at java.base/java.lang.reflect.Field.checkCanSetAccessible(Field.java:171)
	at java.base/java.lang.reflect.Field.setAccessible(Field.java:165)
	at org.apache.lucene.util.RamUsageTester.lambda$createCacheEntry$0(RamUsageTester.java:205)
	at java.base/java.security.AccessController.doPrivileged(Native Method)
	at org.apache.lucene.util.RamUsageTester.createCacheEntry(RamUsageTester.java:190)
	at org.apache.lucene.util.RamUsageTester.measureObjectSize(RamUsageTester.java:146)
	at org.apache.lucene.util.RamUsageTester.sizeOf(RamUsageTester.java:68)
	at org.apache.lucene.index.BaseIndexFileFormatTestCase.testRamBytesUsed(BaseIndexFileFormatTestCase.java:274)
	at org.apache.lucene.index.BaseStoredFieldsFormatTestCase.testRamBytesUsed(BaseStoredFieldsFormatTestCase.java:66)
	at java.base/jdk.internal.reflect.NativeMethodAccessorImpl.invoke0(Native Method)
	at java.base/jdk.internal.reflect.NativeMethodAccessorImpl.invoke(NativeMethodAccessorImpl.java:62)
	at java.base/jdk.internal.reflect.DelegatingMethodAccessorImpl.invoke(DelegatingMethodAccessorImpl.java:43)
	at java.base/java.lang.reflect.Method.invoke(Method.java:538)
	at com.carrotsearch.randomizedtesting.RandomizedRunner.invoke(RandomizedRunner.java:1713)
	at com.carrotsearch.randomizedtesting.RandomizedRunner$8.evaluate(RandomizedRunner.java:907)
	at com.carrotsearch.randomizedtesting.RandomizedRunner$9.evaluate(RandomizedRunner.java:943)
	at com.carrotsearch.randomizedtesting.RandomizedRunner$10.evaluate(RandomizedRunner.java:957)
	at org.apache.lucene.util.TestRuleSetupTeardownChained$1.evaluate(TestRuleSetupTeardownChained.java:49)
	at org.apache.lucene.util.AbstractBeforeAfterRule$1.evaluate(AbstractBeforeAfterRule.java:45)
	at org.apache.lucene.util.TestRuleThreadAndTestName$1.evaluate(TestRuleThreadAndTestName.java:48)
	at org.apache.lucene.util.TestRuleIgnoreAfterMaxFailures$1.evaluate(TestRuleIgnoreAfterMaxFailures.java:64)
	at org.apache.lucene.util.TestRuleMarkFailure$1.evaluate(TestRuleMarkFailure.java:47)
	at com.carrotsearch.randomizedtesting.rules.StatementAdapter.evaluate(StatementAdapter.java:36)
	at com.carrotsearch.randomizedtesting.ThreadLeakControl$StatementRunner.run(ThreadLeakControl.java:367)
	at com.carrotsearch.randomizedtesting.ThreadLeakControl.forkTimeoutingTask(ThreadLeakControl.java:811)
	at com.carrotsearch.randomizedtesting.ThreadLeakControl$3.evaluate(ThreadLeakControl.java:462)
	at com.carrotsearch.randomizedtesting.RandomizedRunner.runSingleTest(RandomizedRunner.java:916)
	at com.carrotsearch.randomizedtesting.RandomizedRunner$5.evaluate(RandomizedRunner.java:802)
	at com.carrotsearch.randomizedtesting.RandomizedRunner$6.evaluate(RandomizedRunner.java:852)
	at com.carrotsearch.randomizedtesting.RandomizedRunner$7.evaluate(RandomizedRunner.java:863)
	at org.apache.lucene.util.AbstractBeforeAfterRule$1.evaluate(AbstractBeforeAfterRule.java:45)
	at com.carrotsearch.randomizedtesting.rules.StatementAdapter.evaluate(StatementAdapter.java:36)
	at org.apache.lucene.util.TestRuleStoreClassName$1.evaluate(TestRuleStoreClassName.java:41)
	at com.carrotsearch.randomizedtesting.rules.NoShadowingOrOverridesOnMethodsRule$1.evaluate(NoShadowingOrOverridesOnMethodsRule.java:40)
	at com.carrotsearch.randomizedtesting.rules.NoShadowingOrOverridesOnMethodsRule$1.evaluate(NoShadowingOrOverridesOnMethodsRule.java:40)
	at com.carrotsearch.randomizedtesting.rules.StatementAdapter.evaluate(StatementAdapter.java:36)
	at com.carrotsearch.randomizedtesting.rules.StatementAdapter.evaluate(StatementAdapter.java:36)
	at com.carrotsearch.randomizedtesting.rules.StatementAdapter.evaluate(StatementAdapter.java:36)
	at org.apache.lucene.util.TestRuleAssertionsRequired$1.evaluate(TestRuleAssertionsRequired.java:53)
	at org.apache.lucene.util.TestRuleMarkFailure$1.evaluate(TestRuleMarkFailure.java:47)
	at org.apache.lucene.util.TestRuleIgnoreAfterMaxFailures$1.evaluate(TestRuleIgnoreAfterMaxFailures.java:64)
	at org.apache.lucene.util.TestRuleIgnoreTestSuites$1.evaluate(TestRuleIgnoreTestSuites.java:54)
	at com.carrotsearch.randomizedtesting.rules.StatementAdapter.evaluate(StatementAdapter.java:36)
	at com.carrotsearch.randomizedtesting.ThreadLeakControl$StatementRunner.run(ThreadLeakControl.java:367)
	at java.base/java.lang.Thread.run(Thread.java:844)


FAILED:  org.apache.lucene.codecs.lucene50.TestLucene50TermVectorsFormat.testRamBytesUsed

Error Message:
Unable to make field final java.util.Collection java.util.Collections$SynchronizedCollection.c accessible: module java.base does not "opens java.util" to unnamed module @1a36217

Stack Trace:
java.lang.reflect.InaccessibleObjectException: Unable to make field final java.util.Collection java.util.Collections$SynchronizedCollection.c accessible: module java.base does not "opens java.util" to unnamed module @1a36217
	at __randomizedtesting.SeedInfo.seed([15305BE129154701:E79349A1E36A5857]:0)
	at java.base/jdk.internal.reflect.Reflection.throwInaccessibleObjectException(Reflection.java:427)
	at java.base/java.lang.reflect.AccessibleObject.checkCanSetAccessible(AccessibleObject.java:201)
	at java.base/java.lang.reflect.Field.checkCanSetAccessible(Field.java:171)
	at java.base/java.lang.reflect.Field.setAccessible(Field.java:165)
	at org.apache.lucene.util.RamUsageTester.lambda$createCacheEntry$0(RamUsageTester.java:205)
	at java.base/java.security.AccessController.doPrivileged(Native Method)
	at org.apache.lucene.util.RamUsageTester.createCacheEntry(RamUsageTester.java:190)
	at org.apache.lucene.util.RamUsageTester.measureObjectSize(RamUsageTester.java:146)
	at org.apache.lucene.util.RamUsageTester.sizeOf(RamUsageTester.java:68)
	at org.apache.lucene.index.BaseIndexFileFormatTestCase.testRamBytesUsed(BaseIndexFileFormatTestCase.java:274)
	at org.apache.lucene.index.BaseTermVectorsFormatTestCase.testRamBytesUsed(BaseTermVectorsFormatTestCase.java:71)
	at java.base/jdk.internal.reflect.NativeMethodAccessorImpl.invoke0(Native Method)
	at java.base/jdk.internal.reflect.NativeMethodAccessorImpl.invoke(NativeMethodAccessorImpl.java:62)
	at java.base/jdk.internal.reflect.DelegatingMethodAccessorImpl.invoke(DelegatingMethodAccessorImpl.java:43)
	at java.base/java.lang.reflect.Method.invoke(Method.java:538)
	at com.carrotsearch.randomizedtesting.RandomizedRunner.invoke(RandomizedRunner.java:1713)
	at com.carrotsearch.randomizedtesting.RandomizedRunner$8.evaluate(RandomizedRunner.java:907)
	at com.carrotsearch.randomizedtesting.RandomizedRunner$9.evaluate(RandomizedRunner.java:943)
	at com.carrotsearch.randomizedtesting.RandomizedRunner$10.evaluate(RandomizedRunner.java:957)
	at org.apache.lucene.util.TestRuleSetupTeardownChained$1.evaluate(TestRuleSetupTeardownChained.java:49)
	at org.apache.lucene.util.AbstractBeforeAfterRule$1.evaluate(AbstractBeforeAfterRule.java:45)
	at org.apache.lucene.util.TestRuleThreadAndTestName$1.evaluate(TestRuleThreadAndTestName.java:48)
	at org.apache.lucene.util.TestRuleIgnoreAfterMaxFailures$1.evaluate(TestRuleIgnoreAfterMaxFailures.java:64)
	at org.apache.lucene.util.TestRuleMarkFailure$1.evaluate(TestRuleMarkFailure.java:47)
	at com.carrotsearch.randomizedtesting.rules.StatementAdapter.evaluate(StatementAdapter.java:36)
	at com.carrotsearch.randomizedtesting.ThreadLeakControl$StatementRunner.run(ThreadLeakControl.java:367)
	at com.carrotsearch.randomizedtesting.ThreadLeakControl.forkTimeoutingTask(ThreadLeakControl.java:811)
	at com.carrotsearch.randomizedtesting.ThreadLeakControl$3.evaluate(ThreadLeakControl.java:462)
	at com.carrotsearch.randomizedtesting.RandomizedRunner.runSingleTest(RandomizedRunner.java:916)
	at com.carrotsearch.randomizedtesting.RandomizedRunner$5.evaluate(RandomizedRunner.java:802)
	at com.carrotsearch.randomizedtesting.RandomizedRunner$6.evaluate(RandomizedRunner.java:852)
	at com.carrotsearch.randomizedtesting.RandomizedRunner$7.evaluate(RandomizedRunner.java:863)
	at org.apache.lucene.util.AbstractBeforeAfterRule$1.evaluate(AbstractBeforeAfterRule.java:45)
	at com.carrotsearch.randomizedtesting.rules.StatementAdapter.evaluate(StatementAdapter.java:36)
	at org.apache.lucene.util.TestRuleStoreClassName$1.evaluate(TestRuleStoreClassName.java:41)
	at com.carrotsearch.randomizedtesting.rules.NoShadowingOrOverridesOnMethodsRule$1.evaluate(NoShadowingOrOverridesOnMethodsRule.java:40)
	at com.carrotsearch.randomizedtesting.rules.NoShadowingOrOverridesOnMethodsRule$1.evaluate(NoShadowingOrOverridesOnMethodsRule.java:40)
	at com.carrotsearch.randomizedtesting.rules.StatementAdapter.evaluate(StatementAdapter.java:36)
	at com.carrotsearch.randomizedtesting.rules.StatementAdapter.evaluate(StatementAdapter.java:36)
	at com.carrotsearch.randomizedtesting.rules.StatementAdapter.evaluate(StatementAdapter.java:36)
	at org.apache.lucene.util.TestRuleAssertionsRequired$1.evaluate(TestRuleAssertionsRequired.java:53)
	at org.apache.lucene.util.TestRuleMarkFailure$1.evaluate(TestRuleMarkFailure.java:47)
	at org.apache.lucene.util.TestRuleIgnoreAfterMaxFailures$1.evaluate(TestRuleIgnoreAfterMaxFailures.java:64)
	at org.apache.lucene.util.TestRuleIgnoreTestSuites$1.evaluate(TestRuleIgnoreTestSuites.java:54)
	at com.carrotsearch.randomizedtesting.rules.StatementAdapter.evaluate(StatementAdapter.java:36)
	at com.carrotsearch.randomizedtesting.ThreadLeakControl$StatementRunner.run(ThreadLeakControl.java:367)
	at java.base/java.lang.Thread.run(Thread.java:844)


FAILED:  org.apache.lucene.codecs.lucene60.TestLucene60PointsFormat.testRamBytesUsed

Error Message:
Unable to make field final java.util.Collection java.util.Collections$SynchronizedCollection.c accessible: module java.base does not "opens java.util" to unnamed module @1a36217

Stack Trace:
java.lang.reflect.InaccessibleObjectException: Unable to make field final java.util.Collection java.util.Collections$SynchronizedCollection.c accessible: module java.base does not "opens java.util" to unnamed module @1a36217
	at __randomizedtesting.SeedInfo.seed([15305BE129154701:E79349A1E36A5857]:0)
	at java.base/jdk.internal.reflect.Reflection.throwInaccessibleObjectException(Reflection.java:427)
	at java.base/java.lang.reflect.AccessibleObject.checkCanSetAccessible(AccessibleObject.java:201)
	at java.base/java.lang.reflect.Field.checkCanSetAccessible(Field.java:171)
	at java.base/java.lang.reflect.Field.setAccessible(Field.java:165)
	at org.apache.lucene.util.RamUsageTester.lambda$createCacheEntry$0(RamUsageTester.java:205)
	at java.base/java.security.AccessController.doPrivileged(Native Method)
	at org.apache.lucene.util.RamUsageTester.createCacheEntry(RamUsageTester.java:190)
	at org.apache.lucene.util.RamUsageTester.measureObjectSize(RamUsageTester.java:146)
	at org.apache.lucene.util.RamUsageTester.sizeOf(RamUsageTester.java:68)
	at org.apache.lucene.index.BaseIndexFileFormatTestCase.testRamBytesUsed(BaseIndexFileFormatTestCase.java:274)
	at org.apache.lucene.index.BasePointsFormatTestCase.testRamBytesUsed(BasePointsFormatTestCase.java:56)
	at java.base/jdk.internal.reflect.NativeMethodAccessorImpl.invoke0(Native Method)
	at java.base/jdk.internal.reflect.NativeMethodAccessorImpl.invoke(NativeMethodAccessorImpl.java:62)
	at java.base/jdk.internal.reflect.DelegatingMethodAccessorImpl.invoke(DelegatingMethodAccessorImpl.java:43)
	at java.base/java.lang.reflect.Method.invoke(Method.java:538)
	at com.carrotsearch.randomizedtesting.RandomizedRunner.invoke(RandomizedRunner.java:1713)
	at com.carrotsearch.randomizedtesting.RandomizedRunner$8.evaluate(RandomizedRunner.java:907)
	at com.carrotsearch.randomizedtesting.RandomizedRunner$9.evaluate(RandomizedRunner.java:943)
	at com.carrotsearch.randomizedtesting.RandomizedRunner$10.evaluate(RandomizedRunner.java:957)
	at org.apache.lucene.util.TestRuleSetupTeardownChained$1.evaluate(TestRuleSetupTeardownChained.java:49)
	at org.apache.lucene.util.AbstractBeforeAfterRule$1.evaluate(AbstractBeforeAfterRule.java:45)
	at org.apache.lucene.util.TestRuleThreadAndTestName$1.evaluate(TestRuleThreadAndTestName.java:48)
	at org.apache.lucene.util.TestRuleIgnoreAfterMaxFailures$1.evaluate(TestRuleIgnoreAfterMaxFailures.java:64)
	at org.apache.lucene.util.TestRuleMarkFailure$1.evaluate(TestRuleMarkFailure.java:47)
	at com.carrotsearch.randomizedtesting.rules.StatementAdapter.evaluate(StatementAdapter.java:36)
	at com.carrotsearch.randomizedtesting.ThreadLeakControl$StatementRunner.run(ThreadLeakControl.java:367)
	at com.carrotsearch.randomizedtesting.ThreadLeakControl.forkTimeoutingTask(ThreadLeakControl.java:811)
	at com.carrotsearch.randomizedtesting.ThreadLeakControl$3.evaluate(ThreadLeakControl.java:462)
	at com.carrotsearch.randomizedtesting.RandomizedRunner.runSingleTest(RandomizedRunner.java:916)
	at com.carrotsearch.randomizedtesting.RandomizedRunner$5.evaluate(RandomizedRunner.java:802)
	at com.carrotsearch.randomizedtesting.RandomizedRunner$6.evaluate(RandomizedRunner.java:852)
	at com.carrotsearch.randomizedtesting.RandomizedRunner$7.evaluate(RandomizedRunner.java:863)
	at org.apache.lucene.util.AbstractBeforeAfterRule$1.evaluate(AbstractBeforeAfterRule.java:45)
	at com.carrotsearch.randomizedtesting.rules.StatementAdapter.evaluate(StatementAdapter.java:36)
	at org.apache.lucene.util.TestRuleStoreClassName$1.evaluate(TestRuleStoreClassName.java:41)
	at com.carrotsearch.randomizedtesting.rules.NoShadowingOrOverridesOnMethodsRule$1.evaluate(NoShadowingOrOverridesOnMethodsRule.java:40)
	at com.carrotsearch.randomizedtesting.rules.NoShadowingOrOverridesOnMethodsRule$1.evaluate(NoShadowingOrOverridesOnMethodsRule.java:40)
	at com.carrotsearch.randomizedtesting.rules.StatementAdapter.evaluate(StatementAdapter.java:36)
	at com.carrotsearch.randomizedtesting.rules.StatementAdapter.evaluate(StatementAdapter.java:36)
	at com.carrotsearch.randomizedtesting.rules.StatementAdapter.evaluate(StatementAdapter.java:36)
	at org.apache.lucene.util.TestRuleAssertionsRequired$1.evaluate(TestRuleAssertionsRequired.java:53)
	at org.apache.lucene.util.TestRuleMarkFailure$1.evaluate(TestRuleMarkFailure.java:47)
	at org.apache.lucene.util.TestRuleIgnoreAfterMaxFailures$1.evaluate(TestRuleIgnoreAfterMaxFailures.java:64)
	at org.apache.lucene.util.TestRuleIgnoreTestSuites$1.evaluate(TestRuleIgnoreTestSuites.java:54)
	at com.carrotsearch.randomizedtesting.rules.StatementAdapter.evaluate(StatementAdapter.java:36)
	at com.carrotsearch.randomizedtesting.ThreadLeakControl$StatementRunner.run(ThreadLeakControl.java:367)
	at java.base/java.lang.Thread.run(Thread.java:844)


FAILED:  org.apache.lucene.codecs.lucene70.TestLucene70DocValuesFormat.testRamBytesUsed

Error Message:
Unable to make field final java.util.Collection java.util.Collections$SynchronizedCollection.c accessible: module java.base does not "opens java.util" to unnamed module @d50698

Stack Trace:
java.lang.reflect.InaccessibleObjectException: Unable to make field final java.util.Collection java.util.Collections$SynchronizedCollection.c accessible: module java.base does not "opens java.util" to unnamed module @d50698
	at __randomizedtesting.SeedInfo.seed([15305BE129154701:E79349A1E36A5857]:0)
	at java.base/jdk.internal.reflect.Reflection.throwInaccessibleObjectException(Reflection.java:427)
	at java.base/java.lang.reflect.AccessibleObject.checkCanSetAccessible(AccessibleObject.java:201)
	at java.base/java.lang.reflect.Field.checkCanSetAccessible(Field.java:171)
	at java.base/java.lang.reflect.Field.setAccessible(Field.java:165)
	at org.apache.lucene.util.RamUsageTester.lambda$createCacheEntry$0(RamUsageTester.java:205)
	at java.base/java.security.AccessController.doPrivileged(Native Method)
	at org.apache.lucene.util.RamUsageTester.createCacheEntry(RamUsageTester.java:190)
	at org.apache.lucene.util.RamUsageTester.measureObjectSize(RamUsageTester.java:146)
	at org.apache.lucene.util.RamUsageTester.sizeOf(RamUsageTester.java:68)
	at org.apache.lucene.index.BaseIndexFileFormatTestCase.testRamBytesUsed(BaseIndexFileFormatTestCase.java:274)
	at org.apache.lucene.index.BaseDocValuesFormatTestCase.testRamBytesUsed(BaseDocValuesFormatTestCase.java:82)
	at java.base/jdk.internal.reflect.NativeMethodAccessorImpl.invoke0(Native Method)
	at java.base/jdk.internal.reflect.NativeMethodAccessorImpl.invoke(NativeMethodAccessorImpl.java:62)
	at java.base/jdk.internal.reflect.DelegatingMethodAccessorImpl.invoke(DelegatingMethodAccessorImpl.java:43)
	at java.base/java.lang.reflect.Method.invoke(Method.java:538)
	at com.carrotsearch.randomizedtesting.RandomizedRunner.invoke(RandomizedRunner.java:1713)
	at com.carrotsearch.randomizedtesting.RandomizedRunner$8.evaluate(RandomizedRunner.java:907)
	at com.carrotsearch.randomizedtesting.RandomizedRunner$9.evaluate(RandomizedRunner.java:943)
	at com.carrotsearch.randomizedtesting.RandomizedRunner$10.evaluate(RandomizedRunner.java:957)
	at org.apache.lucene.util.TestRuleSetupTeardownChained$1.evaluate(TestRuleSetupTeardownChained.java:49)
	at org.apache.lucene.util.AbstractBeforeAfterRule$1.evaluate(AbstractBeforeAfterRule.java:45)
	at org.apache.lucene.util.TestRuleThreadAndTestName$1.evaluate(TestRuleThreadAndTestName.java:48)
	at org.apache.lucene.util.TestRuleIgnoreAfterMaxFailures$1.evaluate(TestRuleIgnoreAfterMaxFailures.java:64)
	at org.apache.lucene.util.TestRuleMarkFailure$1.evaluate(TestRuleMarkFailure.java:47)
	at com.carrotsearch.randomizedtesting.rules.StatementAdapter.evaluate(StatementAdapter.java:36)
	at com.carrotsearch.randomizedtesting.ThreadLeakControl$StatementRunner.run(ThreadLeakControl.java:367)
	at com.carrotsearch.randomizedtesting.ThreadLeakControl.forkTimeoutingTask(ThreadLeakControl.java:811)
	at com.carrotsearch.randomizedtesting.ThreadLeakControl$3.evaluate(ThreadLeakControl.java:462)
	at com.carrotsearch.randomizedtesting.RandomizedRunner.runSingleTest(RandomizedRunner.java:916)
	at com.carrotsearch.randomizedtesting.RandomizedRunner$5.evaluate(RandomizedRunner.java:802)
	at com.carrotsearch.randomizedtesting.RandomizedRunner$6.evaluate(RandomizedRunner.java:852)
	at com.carrotsearch.randomizedtesting.RandomizedRunner$7.evaluate(RandomizedRunner.java:863)
	at org.apache.lucene.util.AbstractBeforeAfterRule$1.evaluate(AbstractBeforeAfterRule.java:45)
	at com.carrotsearch.randomizedtesting.rules.StatementAdapter.evaluate(StatementAdapter.java:36)
	at org.apache.lucene.util.TestRuleStoreClassName$1.evaluate(TestRuleStoreClassName.java:41)
	at com.carrotsearch.randomizedtesting.rules.NoShadowingOrOverridesOnMethodsRule$1.evaluate(NoShadowingOrOverridesOnMethodsRule.java:40)
	at com.carrotsearch.randomizedtesting.rules.NoShadowingOrOverridesOnMethodsRule$1.evaluate(NoShadowingOrOverridesOnMethodsRule.java:40)
	at com.carrotsearch.randomizedtesting.rules.StatementAdapter.evaluate(StatementAdapter.java:36)
	at com.carrotsearch.randomizedtesting.rules.StatementAdapter.evaluate(StatementAdapter.java:36)
	at com.carrotsearch.randomizedtesting.rules.StatementAdapter.evaluate(StatementAdapter.java:36)
	at org.apache.lucene.util.TestRuleAssertionsRequired$1.evaluate(TestRuleAssertionsRequired.java:53)
	at org.apache.lucene.util.TestRuleMarkFailure$1.evaluate(TestRuleMarkFailure.java:47)
	at org.apache.lucene.util.TestRuleIgnoreAfterMaxFailures$1.evaluate(TestRuleIgnoreAfterMaxFailures.java:64)
	at org.apache.lucene.util.TestRuleIgnoreTestSuites$1.evaluate(TestRuleIgnoreTestSuites.java:54)
	at com.carrotsearch.randomizedtesting.rules.StatementAdapter.evaluate(StatementAdapter.java:36)
	at com.carrotsearch.randomizedtesting.ThreadLeakControl$StatementRunner.run(ThreadLeakControl.java:367)
	at java.base/java.lang.Thread.run(Thread.java:844)


FAILED:  org.apache.lucene.codecs.lucene70.TestLucene70NormsFormat.testRamBytesUsed

Error Message:
Unable to make field final java.util.Collection java.util.Collections$SynchronizedCollection.c accessible: module java.base does not "opens java.util" to unnamed module @1a36217

Stack Trace:
java.lang.reflect.InaccessibleObjectException: Unable to make field final java.util.Collection java.util.Collections$SynchronizedCollection.c accessible: module java.base does not "opens java.util" to unnamed module @1a36217
	at __randomizedtesting.SeedInfo.seed([15305BE129154701:E79349A1E36A5857]:0)
	at java.base/jdk.internal.reflect.Reflection.throwInaccessibleObjectException(Reflection.java:427)
	at java.base/java.lang.reflect.AccessibleObject.checkCanSetAccessible(AccessibleObject.java:201)
	at java.base/java.lang.reflect.Field.checkCanSetAccessible(Field.java:171)
	at java.base/java.lang.reflect.Field.setAccessible(Field.java:165)
	at org.apache.lucene.util.RamUsageTester.lambda$createCacheEntry$0(RamUsageTester.java:205)
	at java.base/java.security.AccessController.doPrivileged(Native Method)
	at org.apache.lucene.util.RamUsageTester.createCacheEntry(RamUsageTester.java:190)
	at org.apache.lucene.util.RamUsageTester.measureObjectSize(RamUsageTester.java:146)
	at org.apache.lucene.util.RamUsageTester.sizeOf(RamUsageTester.java:68)
	at org.apache.lucene.index.BaseIndexFileFormatTestCase.testRamBytesUsed(BaseIndexFileFormatTestCase.java:274)
	at org.apache.lucene.index.BaseNormsFormatTestCase.testRamBytesUsed(BaseNormsFormatTestCase.java:52)
	at java.base/jdk.internal.reflect.NativeMethodAccessorImpl.invoke0(Native Method)
	at java.base/jdk.internal.reflect.NativeMethodAccessorImpl.invoke(NativeMethodAccessorImpl.java:62)
	at java.base/jdk.internal.reflect.DelegatingMethodAccessorImpl.invoke(DelegatingMethodAccessorImpl.java:43)
	at java.base/java.lang.reflect.Method.invoke(Method.java:538)
	at com.carrotsearch.randomizedtesting.RandomizedRunner.invoke(RandomizedRunner.java:1713)
	at com.carrotsearch.randomizedtesting.RandomizedRunner$8.evaluate(RandomizedRunner.java:907)
	at com.carrotsearch.randomizedtesting.RandomizedRunner$9.evaluate(RandomizedRunner.java:943)
	at com.carrotsearch.randomizedtesting.RandomizedRunner$10.evaluate(RandomizedRunner.java:957)
	at org.apache.lucene.util.TestRuleSetupTeardownChained$1.evaluate(TestRuleSetupTeardownChained.java:49)
	at org.apache.lucene.util.AbstractBeforeAfterRule$1.evaluate(AbstractBeforeAfterRule.java:45)
	at org.apache.lucene.util.TestRuleThreadAndTestName$1.evaluate(TestRuleThreadAndTestName.java:48)
	at org.apache.lucene.util.TestRuleIgnoreAfterMaxFailures$1.evaluate(TestRuleIgnoreAfterMaxFailures.java:64)
	at org.apache.lucene.util.TestRuleMarkFailure$1.evaluate(TestRuleMarkFailure.java:47)
	at com.carrotsearch.randomizedtesting.rules.StatementAdapter.evaluate(StatementAdapter.java:36)
	at com.carrotsearch.randomizedtesting.ThreadLeakControl$StatementRunner.run(ThreadLeakControl.java:367)
	at com.carrotsearch.randomizedtesting.ThreadLeakControl.forkTimeoutingTask(ThreadLeakControl.java:811)
	at com.carrotsearch.randomizedtesting.ThreadLeakControl$3.evaluate(ThreadLeakControl.java:462)
	at com.carrotsearch.randomizedtesting.RandomizedRunner.runSingleTest(RandomizedRunner.java:916)
	at com.carrotsearch.randomizedtesting.RandomizedRunner$5.evaluate(RandomizedRunner.java:802)
	at com.carrotsearch.randomizedtesting.RandomizedRunner$6.evaluate(RandomizedRunner.java:852)
	at com.carrotsearch.randomizedtesting.RandomizedRunner$7.evaluate(RandomizedRunner.java:863)
	at org.apache.lucene.util.AbstractBeforeAfterRule$1.evaluate(AbstractBeforeAfterRule.java:45)
	at com.carrotsearch.randomizedtesting.rules.StatementAdapter.evaluate(StatementAdapter.java:36)
	at org.apache.lucene.util.TestRuleStoreClassName$1.evaluate(TestRuleStoreClassName.java:41)
	at com.carrotsearch.randomizedtesting.rules.NoShadowingOrOverridesOnMethodsRule$1.evaluate(NoShadowingOrOverridesOnMethodsRule.java:40)
	at com.carrotsearch.randomizedtesting.rules.NoShadowingOrOverridesOnMethodsRule$1.evaluate(NoShadowingOrOverridesOnMethodsRule.java:40)
	at com.carrotsearch.randomizedtesting.rules.StatementAdapter.evaluate(StatementAdapter.java:36)
	at com.carrotsearch.randomizedtesting.rules.StatementAdapter.evaluate(StatementAdapter.java:36)
	at com.carrotsearch.randomizedtesting.rules.StatementAdapter.evaluate(StatementAdapter.java:36)
	at org.apache.lucene.util.TestRuleAssertionsRequired$1.evaluate(TestRuleAssertionsRequired.java:53)
	at org.apache.lucene.util.TestRuleMarkFailure$1.evaluate(TestRuleMarkFailure.java:47)
	at org.apache.lucene.util.TestRuleIgnoreAfterMaxFailures$1.evaluate(TestRuleIgnoreAfterMaxFailures.java:64)
	at org.apache.lucene.util.TestRuleIgnoreTestSuites$1.evaluate(TestRuleIgnoreTestSuites.java:54)
	at com.carrotsearch.randomizedtesting.rules.StatementAdapter.evaluate(StatementAdapter.java:36)
	at com.carrotsearch.randomizedtesting.ThreadLeakControl$StatementRunner.run(ThreadLeakControl.java:367)
	at java.base/java.lang.Thread.run(Thread.java:844)


FAILED:  org.apache.lucene.codecs.perfield.TestPerFieldDocValuesFormat.testRamBytesUsed

Error Message:
Unable to make field final java.util.Collection java.util.Collections$SynchronizedCollection.c accessible: module java.base does not "opens java.util" to unnamed module @f45be

Stack Trace:
java.lang.reflect.InaccessibleObjectException: Unable to make field final java.util.Collection java.util.Collections$SynchronizedCollection.c accessible: module java.base does not "opens java.util" to unnamed module @f45be
	at __randomizedtesting.SeedInfo.seed([15305BE129154701:E79349A1E36A5857]:0)
	at java.base/jdk.internal.reflect.Reflection.throwInaccessibleObjectException(Reflection.java:427)
	at java.base/java.lang.reflect.AccessibleObject.checkCanSetAccessible(AccessibleObject.java:201)
	at java.base/java.lang.reflect.Field.checkCanSetAccessible(Field.java:171)
	at java.base/java.lang.reflect.Field.setAccessible(Field.java:165)
	at org.apache.lucene.util.RamUsageTester.lambda$createCacheEntry$0(RamUsageTester.java:205)
	at java.base/java.security.AccessController.doPrivileged(Native Method)
	at org.apache.lucene.util.RamUsageTester.createCacheEntry(RamUsageTester.java:190)
	at org.apache.lucene.util.RamUsageTester.measureObjectSize(RamUsageTester.java:146)
	at org.apache.lucene.util.RamUsageTester.sizeOf(RamUsageTester.java:68)
	at org.apache.lucene.index.BaseIndexFileFormatTestCase.testRamBytesUsed(BaseIndexFileFormatTestCase.java:274)
	at org.apache.lucene.index.BaseDocValuesFormatTestCase.testRamBytesUsed(BaseDocValuesFormatTestCase.java:82)
	at java.base/jdk.internal.reflect.NativeMethodAccessorImpl.invoke0(Native Method)
	at java.base/jdk.internal.reflect.NativeMethodAccessorImpl.invoke(NativeMethodAccessorImpl.java:62)
	at java.base/jdk.internal.reflect.DelegatingMethodAccessorImpl.invoke(DelegatingMethodAccessorImpl.java:43)
	at java.base/java.lang.reflect.Method.invoke(Method.java:538)
	at com.carrotsearch.randomizedtesting.RandomizedRunner.invoke(RandomizedRunner.java:1713)
	at com.carrotsearch.randomizedtesting.RandomizedRunner$8.evaluate(RandomizedRunner.java:907)
	at com.carrotsearch.randomizedtesting.RandomizedRunner$9.evaluate(RandomizedRunner.java:943)
	at com.carrotsearch.randomizedtesting.RandomizedRunner$10.evaluate(RandomizedRunner.java:957)
	at org.apache.lucene.util.TestRuleSetupTeardownChained$1.evaluate(TestRuleSetupTeardownChained.java:49)
	at org.apache.lucene.util.AbstractBeforeAfterRule$1.evaluate(AbstractBeforeAfterRule.java:45)
	at org.apache.lucene.util.TestRuleThreadAndTestName$1.evaluate(TestRuleThreadAndTestName.java:48)
	at org.apache.lucene.util.TestRuleIgnoreAfterMaxFailures$1.evaluate(TestRuleIgnoreAfterMaxFailures.java:64)
	at org.apache.lucene.util.TestRuleMarkFailure$1.evaluate(TestRuleMarkFailure.java:47)
	at com.carrotsearch.randomizedtesting.rules.StatementAdapter.evaluate(StatementAdapter.java:36)
	at com.carrotsearch.randomizedtesting.ThreadLeakControl$StatementRunner.run(ThreadLeakControl.java:367)
	at com.carrotsearch.randomizedtesting.ThreadLeakControl.forkTimeoutingTask(ThreadLeakControl.java:811)
	at com.carrotsearch.randomizedtesting.ThreadLeakControl$3.evaluate(ThreadLeakControl.java:462)
	at com.carrotsearch.randomizedtesting.RandomizedRunner.runSingleTest(RandomizedRunner.java:916)
	at com.carrotsearch.randomizedtesting.Ran

[...truncated too long message...]

tPhraseQuery, TestFieldsReader, TestOmitNorms, TestBytesRefArray, TestDocumentsWriterDeleteQueue, TestFilterSpans, TestLongPostings, TestTieredMergePolicy, TestReusableStringReader, TestInPlaceMergeSorter, TestStressAdvance, TestRollback, TestMatchNoDocsQuery, TestStressIndexing2, TestSegmentTermEnum, TestIntroSorter, TestHugeRamFile, TestCheckIndex, TestIndexWriterUnicode, TestCharTermAttributeImpl, TestFixedBitSet, TestDuelingCodecs, TestIndexWriterMaxDocs, TestPerFieldDocValuesFormat, TestRecyclingIntBlockAllocator, TestStressDeletes, TestNotDocIdSet, TestSingleInstanceLockFactory, TestPagedBytes, TestDocIdsWriter, TestSPIClassIterator, TestByteSlices, TestSumDocFreq, TestFilterDirectoryReader, TestSameTokenSamePosition, TestBufferedChecksum, TestIndexWriterDeleteByQuery, TestUpgradeIndexMergePolicy, TestSimpleExplanationsWithFillerDocs, TestSpanOrQuery, TestMultiFields, TestAutomatonQueryUnicode, TestTermdocPerf, TestMultiPhraseEnum, TestDisjunctionMaxQuery, TestSortRandom, TestBooleanScorer, TestTermQuery, TestAssertions, TestSpanExplanationsOfNonMatches, TestBlendedTermQuery, TestMixedCodecs, TestVersion, TestOrdinalMap, TestIndexWriterDelete, TestNamedSPILoader, TestLucene60FieldInfoFormat, TestMultiTermQueryRewrites, Test2BDocs, TestSmallFloat, TestPositiveScoresOnlyCollector, TestStressNRT, TestByteArrayDataInput, TestElevationComparator, TestBytesRefAttImpl, TestBlockPostingsFormat3, TestAllFilesHaveCodecHeader, TestMmapDirectory, TestIndexFileDeleter, TestFlushByRamOrCountsPolicy, TestStandardAnalyzer, TestConcurrentMergeScheduler, TestDocumentsWriterStallControl, TestTermsEnum, TestDocument, TestTermScorer, TestWildcardRandom, TestPrefixRandom, TestParallelTermEnum, TestSubScorerFreqs, TestConjunctions, TestPositionIncrement, TestDateSort, TestSimilarity, TestVirtualMethod, TestRollingBuffer, TestSimilarityProvider, TestSetOnce, TestFilterLeafReader, TestSearch, TestFilterIterator, TestDateTools, TestCharsRef, TestPriorityQueue, Test2BPostings, TestCachingCollector, TestBinaryDocument, TestRamUsageEstimator, TestSpanFirstQuery, TestIsCurrent, TestPhrasePrefixQuery, TestByteBlockPool, TestTwoPhaseCommitTool, TestCloseableThreadLocal, MultiCollectorTest, TestScoreCachingWrappingScorer, TestIndexCommit, Test2BTerms, Test2BBinaryDocValues, TestCharArrayMap, TestCharacterUtils, TestCodecUtil, TestLucene50StoredFieldsFormatHighCompression, TestLucene62SegmentInfoFormat, TestIndexedDISI, TestFieldType, TestGeoEncodingUtils, TestGeoUtils, Test2BPoints, Test2BSortedDocValuesFixedSorted, Test2BSortedDocValuesOrds, TestAllFilesDetectTruncation, TestBinaryDocValuesUpdates, TestIndexWriterExceptions2, TestIndexWriterThreadsToSegments, TestLogMergePolicy, TestMergePolicyWrapper, TestMergeRateLimiter, TestMixedDocValuesUpdates, TestPointValues, TestEarlyTermination, TestFilterWeight, TestLRUQueryCache]
   [junit4] Completed [396/438 (25!)] on J1 in 3.86s, 18 tests, 1 failure, 3 errors <<< FAILURES!

[...truncated 172 lines...]
BUILD FAILED
/home/jenkins/workspace/Lucene-Solr-master-Linux/build.xml:765: The following error occurred while executing this line:
/home/jenkins/workspace/Lucene-Solr-master-Linux/build.xml:709: The following error occurred while executing this line:
/home/jenkins/workspace/Lucene-Solr-master-Linux/build.xml:59: The following error occurred while executing this line:
/home/jenkins/workspace/Lucene-Solr-master-Linux/lucene/build.xml:50: The following error occurred while executing this line:
/home/jenkins/workspace/Lucene-Solr-master-Linux/lucene/core/build.xml:201: groovy.lang.MissingMethodException: No signature of method: static java.lang.System.clearProperty() is applicable for argument types: (java.lang.String) values: [lockverifyserver.port]
Possible solutions: hasProperty(java.lang.String)
	at groovy.lang.MetaClassImpl.invokeStaticMissingMethod(MetaClassImpl.java:1500)
	at groovy.lang.MetaClassImpl.invokeStaticMethod(MetaClassImpl.java:1486)
	at org.codehaus.groovy.runtime.callsite.StaticMetaClassSite.call(StaticMetaClassSite.java:53)
	at org.codehaus.groovy.runtime.callsite.CallSiteArray.defaultCall(CallSiteArray.java:48)
	at org.codehaus.groovy.runtime.callsite.AbstractCallSite.call(AbstractCallSite.java:113)
	at org.codehaus.groovy.runtime.callsite.AbstractCallSite.call(AbstractCallSite.java:125)
	at embedded_script_in__home_jenkins_workspace_Lucene_Solr_master_Linux_lucene_core_build_dot_xml.run(embedded_script_in__home_jenkins_workspace_Lucene_Solr_master_Linux_lucene_core_build_dot_xml:1)
	at groovy.lang.GroovyShell.runScriptOrMainOrTestOrRunnable(GroovyShell.java:263)
	at groovy.lang.GroovyShell.run(GroovyShell.java:518)
	at groovy.lang.GroovyShell.run(GroovyShell.java:497)
	at org.codehaus.groovy.ant.Groovy.parseAndRunScript(Groovy.java:512)
	at org.codehaus.groovy.ant.Groovy.execGroovy(Groovy.java:448)
	at org.codehaus.groovy.ant.Groovy.execute(Groovy.java:313)
	at org.apache.tools.ant.UnknownElement.execute(UnknownElement.java:291)
	at jdk.internal.reflect.GeneratedMethodAccessor4.invoke(Unknown Source)
	at java.base/jdk.internal.reflect.DelegatingMethodAccessorImpl.invoke(DelegatingMethodAccessorImpl.java:43)
	at java.base/java.lang.reflect.Method.invoke(Method.java:538)
	at org.apache.tools.ant.dispatch.DispatchUtils.execute(DispatchUtils.java:106)
	at org.apache.tools.ant.Task.perform(Task.java:348)
	at org.apache.tools.ant.Target.execute(Target.java:390)
	at org.apache.tools.ant.Target.performTasks(Target.java:411)
	at org.apache.tools.ant.Project.executeSortedTargets(Project.java:1399)
	at org.apache.tools.ant.helper.SingleCheckExecutor.executeTargets(SingleCheckExecutor.java:38)
	at org.apache.tools.ant.Project.executeTargets(Project.java:1251)
	at org.apache.tools.ant.taskdefs.Ant.execute(Ant.java:442)
	at org.apache.tools.ant.UnknownElement.execute(UnknownElement.java:291)
	at jdk.internal.reflect.GeneratedMethodAccessor4.invoke(Unknown Source)
	at java.base/jdk.internal.reflect.DelegatingMethodAccessorImpl.invoke(DelegatingMethodAccessorImpl.java:43)
	at java.base/java.lang.reflect.Method.invoke(Method.java:538)
	at org.apache.tools.ant.dispatch.DispatchUtils.execute(DispatchUtils.java:106)
	at org.apache.tools.ant.Task.perform(Task.java:348)
	at org.apache.tools.ant.Target.execute(Target.java:390)
	at org.apache.tools.ant.Target.performTasks(Target.java:411)
	at org.apache.tools.ant.Project.executeSortedTargets(Project.java:1399)
	at org.apache.tools.ant.helper.SingleCheckExecutor.executeTargets(SingleCheckExecutor.java:38)
	at org.apache.tools.ant.Project.executeTargets(Project.java:1251)
	at org.apache.tools.ant.taskdefs.Ant.execute(Ant.java:442)
	at org.apache.tools.ant.taskdefs.SubAnt.execute(SubAnt.java:302)
	at org.apache.tools.ant.taskdefs.SubAnt.execute(SubAnt.java:221)
	at org.apache.tools.ant.UnknownElement.execute(UnknownElement.java:291)
	at jdk.internal.reflect.GeneratedMethodAccessor4.invoke(Unknown Source)
	at java.base/jdk.internal.reflect.DelegatingMethodAccessorImpl.invoke(DelegatingMethodAccessorImpl.java:43)
	at java.base/java.lang.reflect.Method.invoke(Method.java:538)
	at org.apache.tools.ant.dispatch.DispatchUtils.execute(DispatchUtils.java:106)
	at org.apache.tools.ant.Task.perform(Task.java:348)
	at org.apache.tools.ant.Target.execute(Target.java:390)
	at org.apache.tools.ant.Target.performTasks(Target.java:411)
	at org.apache.tools.ant.Project.executeSortedTargets(Project.java:1399)
	at org.apache.tools.ant.helper.SingleCheckExecutor.executeTargets(SingleCheckExecutor.java:38)
	at org.apache.tools.ant.Project.executeTargets(Project.java:1251)
	at org.apache.tools.ant.taskdefs.Ant.execute(Ant.java:442)
	at org.apache.tools.ant.taskdefs.CallTarget.execute(CallTarget.java:105)
	at org.apache.tools.ant.UnknownElement.execute(UnknownElement.java:291)
	at jdk.internal.reflect.GeneratedMethodAccessor4.invoke(Unknown Source)
	at java.base/jdk.internal.reflect.DelegatingMethodAccessorImpl.invoke(DelegatingMethodAccessorImpl.java:43)
	at java.base/java.lang.reflect.Method.invoke(Method.java:538)
	at org.apache.tools.ant.dispatch.DispatchUtils.execute(DispatchUtils.java:106)
	at org.apache.tools.ant.Task.perform(Task.java:348)
	at org.apache.tools.ant.Target.execute(Target.java:390)
	at org.apache.tools.ant.Target.performTasks(Target.java:411)
	at org.apache.tools.ant.Project.executeSortedTargets(Project.java:1399)
	at org.apache.tools.ant.helper.SingleCheckExecutor.executeTargets(SingleCheckExecutor.java:38)
	at org.apache.tools.ant.Project.executeTargets(Project.java:1251)
	at org.apache.tools.ant.taskdefs.Ant.execute(Ant.java:442)
	at org.apache.tools.ant.taskdefs.CallTarget.execute(CallTarget.java:105)
	at org.apache.tools.ant.UnknownElement.execute(UnknownElement.java:291)
	at jdk.internal.reflect.GeneratedMethodAccessor4.invoke(Unknown Source)
	at java.base/jdk.internal.reflect.DelegatingMethodAccessorImpl.invoke(DelegatingMethodAccessorImpl.java:43)
	at java.base/java.lang.reflect.Method.invoke(Method.java:538)
	at org.apache.tools.ant.dispatch.DispatchUtils.execute(DispatchUtils.java:106)
	at org.apache.tools.ant.Task.perform(Task.java:348)
	at org.apache.tools.ant.Target.execute(Target.java:390)
	at org.apache.tools.ant.Target.performTasks(Target.java:411)
	at org.apache.tools.ant.Project.executeSortedTargets(Project.java:1399)
	at org.apache.tools.ant.Project.executeTarget(Project.java:1368)
	at org.apache.tools.ant.helper.DefaultExecutor.executeTargets(DefaultExecutor.java:41)
	at org.apache.tools.ant.Project.executeTargets(Project.java:1251)
	at org.apache.tools.ant.Main.runBuild(Main.java:809)
	at org.apache.tools.ant.Main.startAnt(Main.java:217)
	at org.apache.tools.ant.launch.Launcher.run(Launcher.java:280)
	at org.apache.tools.ant.launch.Launcher.main(Launcher.java:109)

Total time: 8 minutes 18 seconds
Build step 'Invoke Ant' marked build as failure
Archiving artifacts
[WARNINGS] Skipping publisher since build result is FAILURE
Recording test results
Email was triggered for: Failure - Any
Sending email for trigger: Failure - Any



Mime
View raw message