lucene-dev mailing list archives

Site index · List index
Message view « Date » · « Thread »
Top « Date » · « Thread »
From Policeman Jenkins Server <jenk...@thetaphi.de>
Subject [JENKINS] Lucene-Solr-master-Solaris (64bit/jdk1.8.0) - Build # 1037 - Unstable!
Date Tue, 27 Dec 2016 12:13:13 GMT
Build: https://jenkins.thetaphi.de/job/Lucene-Solr-master-Solaris/1037/
Java: 64bit/jdk1.8.0 -XX:-UseCompressedOops -XX:+UseConcMarkSweepGC

3 tests failed.
FAILED:  junit.framework.TestSuite.org.apache.solr.core.TestCoreDiscovery

Error Message:
ObjectTracker found 5 object(s) that were not released!!! [MockDirectoryWrapper, SolrCore, MockDirectoryWrapper, MockDirectoryWrapper, MDCAwareThreadPoolExecutor] org.apache.solr.common.util.ObjectReleaseTracker$ObjectTrackerException  at org.apache.solr.common.util.ObjectReleaseTracker.track(ObjectReleaseTracker.java:43)  at org.apache.solr.core.CachingDirectoryFactory.get(CachingDirectoryFactory.java:347)  at org.apache.solr.core.SolrCore.getNewIndexDir(SolrCore.java:343)  at org.apache.solr.core.SolrCore.initIndex(SolrCore.java:683)  at org.apache.solr.core.SolrCore.<init>(SolrCore.java:901)  at org.apache.solr.core.SolrCore.<init>(SolrCore.java:817)  at org.apache.solr.core.CoreContainer.create(CoreContainer.java:902)  at org.apache.solr.core.CoreContainer.getCore(CoreContainer.java:1176)  at org.apache.solr.core.TestCoreDiscovery.testTooManyTransientCores(TestCoreDiscovery.java:211)  at sun.reflect.NativeMethodAccessorImpl.invoke0(Native Method)  at sun.reflect.NativeMethodAccessorImpl.invoke(NativeMethodAccessorImpl.java:62)  at sun.reflect.DelegatingMethodAccessorImpl.invoke(DelegatingMethodAccessorImpl.java:43)  at java.lang.reflect.Method.invoke(Method.java:498)  at com.carrotsearch.randomizedtesting.RandomizedRunner.invoke(RandomizedRunner.java:1713)  at com.carrotsearch.randomizedtesting.RandomizedRunner$8.evaluate(RandomizedRunner.java:907)  at com.carrotsearch.randomizedtesting.RandomizedRunner$9.evaluate(RandomizedRunner.java:943)  at com.carrotsearch.randomizedtesting.RandomizedRunner$10.evaluate(RandomizedRunner.java:957)  at com.carrotsearch.randomizedtesting.rules.SystemPropertiesRestoreRule$1.evaluate(SystemPropertiesRestoreRule.java:57)  at org.apache.lucene.util.TestRuleSetupTeardownChained$1.evaluate(TestRuleSetupTeardownChained.java:49)  at org.apache.lucene.util.AbstractBeforeAfterRule$1.evaluate(AbstractBeforeAfterRule.java:45)  at org.apache.lucene.util.TestRuleThreadAndTestName$1.evaluate(TestRuleThreadAndTestName.java:48)  at org.apache.lucene.util.TestRuleIgnoreAfterMaxFailures$1.evaluate(TestRuleIgnoreAfterMaxFailures.java:64)  at org.apache.lucene.util.TestRuleMarkFailure$1.evaluate(TestRuleMarkFailure.java:47)  at com.carrotsearch.randomizedtesting.rules.StatementAdapter.evaluate(StatementAdapter.java:36)  at com.carrotsearch.randomizedtesting.ThreadLeakControl$StatementRunner.run(ThreadLeakControl.java:367)  at com.carrotsearch.randomizedtesting.ThreadLeakControl.forkTimeoutingTask(ThreadLeakControl.java:811)  at com.carrotsearch.randomizedtesting.ThreadLeakControl$3.evaluate(ThreadLeakControl.java:462)  at com.carrotsearch.randomizedtesting.RandomizedRunner.runSingleTest(RandomizedRunner.java:916)  at com.carrotsearch.randomizedtesting.RandomizedRunner$5.evaluate(RandomizedRunner.java:802)  at com.carrotsearch.randomizedtesting.RandomizedRunner$6.evaluate(RandomizedRunner.java:852)  at com.carrotsearch.randomizedtesting.RandomizedRunner$7.evaluate(RandomizedRunner.java:863)  at com.carrotsearch.randomizedtesting.rules.StatementAdapter.evaluate(StatementAdapter.java:36)  at com.carrotsearch.randomizedtesting.rules.SystemPropertiesRestoreRule$1.evaluate(SystemPropertiesRestoreRule.java:57)  at org.apache.lucene.util.AbstractBeforeAfterRule$1.evaluate(AbstractBeforeAfterRule.java:45)  at com.carrotsearch.randomizedtesting.rules.StatementAdapter.evaluate(StatementAdapter.java:36)  at org.apache.lucene.util.TestRuleStoreClassName$1.evaluate(TestRuleStoreClassName.java:41)  at com.carrotsearch.randomizedtesting.rules.NoShadowingOrOverridesOnMethodsRule$1.evaluate(NoShadowingOrOverridesOnMethodsRule.java:40)  at com.carrotsearch.randomizedtesting.rules.NoShadowingOrOverridesOnMethodsRule$1.evaluate(NoShadowingOrOverridesOnMethodsRule.java:40)  at com.carrotsearch.randomizedtesting.rules.StatementAdapter.evaluate(StatementAdapter.java:36)  at com.carrotsearch.randomizedtesting.rules.StatementAdapter.evaluate(StatementAdapter.java:36)  at com.carrotsearch.randomizedtesting.rules.StatementAdapter.evaluate(StatementAdapter.java:36)  at org.apache.lucene.util.TestRuleAssertionsRequired$1.evaluate(TestRuleAssertionsRequired.java:53)  at org.apache.lucene.util.TestRuleMarkFailure$1.evaluate(TestRuleMarkFailure.java:47)  at org.apache.lucene.util.TestRuleIgnoreAfterMaxFailures$1.evaluate(TestRuleIgnoreAfterMaxFailures.java:64)  at org.apache.lucene.util.TestRuleIgnoreTestSuites$1.evaluate(TestRuleIgnoreTestSuites.java:54)  at com.carrotsearch.randomizedtesting.rules.StatementAdapter.evaluate(StatementAdapter.java:36)  at com.carrotsearch.randomizedtesting.ThreadLeakControl$StatementRunner.run(ThreadLeakControl.java:367)  at java.lang.Thread.run(Thread.java:745)  org.apache.solr.common.util.ObjectReleaseTracker$ObjectTrackerException  at org.apache.solr.common.util.ObjectReleaseTracker.track(ObjectReleaseTracker.java:43)  at org.apache.solr.core.SolrCore.<init>(SolrCore.java:991)  at org.apache.solr.core.SolrCore.<init>(SolrCore.java:817)  at org.apache.solr.core.CoreContainer.create(CoreContainer.java:902)  at org.apache.solr.core.CoreContainer.getCore(CoreContainer.java:1176)  at org.apache.solr.core.TestCoreDiscovery.testTooManyTransientCores(TestCoreDiscovery.java:211)  at sun.reflect.NativeMethodAccessorImpl.invoke0(Native Method)  at sun.reflect.NativeMethodAccessorImpl.invoke(NativeMethodAccessorImpl.java:62)  at sun.reflect.DelegatingMethodAccessorImpl.invoke(DelegatingMethodAccessorImpl.java:43)  at java.lang.reflect.Method.invoke(Method.java:498)  at com.carrotsearch.randomizedtesting.RandomizedRunner.invoke(RandomizedRunner.java:1713)  at com.carrotsearch.randomizedtesting.RandomizedRunner$8.evaluate(RandomizedRunner.java:907)  at com.carrotsearch.randomizedtesting.RandomizedRunner$9.evaluate(RandomizedRunner.java:943)  at com.carrotsearch.randomizedtesting.RandomizedRunner$10.evaluate(RandomizedRunner.java:957)  at com.carrotsearch.randomizedtesting.rules.SystemPropertiesRestoreRule$1.evaluate(SystemPropertiesRestoreRule.java:57)  at org.apache.lucene.util.TestRuleSetupTeardownChained$1.evaluate(TestRuleSetupTeardownChained.java:49)  at org.apache.lucene.util.AbstractBeforeAfterRule$1.evaluate(AbstractBeforeAfterRule.java:45)  at org.apache.lucene.util.TestRuleThreadAndTestName$1.evaluate(TestRuleThreadAndTestName.java:48)  at org.apache.lucene.util.TestRuleIgnoreAfterMaxFailures$1.evaluate(TestRuleIgnoreAfterMaxFailures.java:64)  at org.apache.lucene.util.TestRuleMarkFailure$1.evaluate(TestRuleMarkFailure.java:47)  at com.carrotsearch.randomizedtesting.rules.StatementAdapter.evaluate(StatementAdapter.java:36)  at com.carrotsearch.randomizedtesting.ThreadLeakControl$StatementRunner.run(ThreadLeakControl.java:367)  at com.carrotsearch.randomizedtesting.ThreadLeakControl.forkTimeoutingTask(ThreadLeakControl.java:811)  at com.carrotsearch.randomizedtesting.ThreadLeakControl$3.evaluate(ThreadLeakControl.java:462)  at com.carrotsearch.randomizedtesting.RandomizedRunner.runSingleTest(RandomizedRunner.java:916)  at com.carrotsearch.randomizedtesting.RandomizedRunner$5.evaluate(RandomizedRunner.java:802)  at com.carrotsearch.randomizedtesting.RandomizedRunner$6.evaluate(RandomizedRunner.java:852)  at com.carrotsearch.randomizedtesting.RandomizedRunner$7.evaluate(RandomizedRunner.java:863)  at com.carrotsearch.randomizedtesting.rules.StatementAdapter.evaluate(StatementAdapter.java:36)  at com.carrotsearch.randomizedtesting.rules.SystemPropertiesRestoreRule$1.evaluate(SystemPropertiesRestoreRule.java:57)  at org.apache.lucene.util.AbstractBeforeAfterRule$1.evaluate(AbstractBeforeAfterRule.java:45)  at com.carrotsearch.randomizedtesting.rules.StatementAdapter.evaluate(StatementAdapter.java:36)  at org.apache.lucene.util.TestRuleStoreClassName$1.evaluate(TestRuleStoreClassName.java:41)  at com.carrotsearch.randomizedtesting.rules.NoShadowingOrOverridesOnMethodsRule$1.evaluate(NoShadowingOrOverridesOnMethodsRule.java:40)  at com.carrotsearch.randomizedtesting.rules.NoShadowingOrOverridesOnMethodsRule$1.evaluate(NoShadowingOrOverridesOnMethodsRule.java:40)  at com.carrotsearch.randomizedtesting.rules.StatementAdapter.evaluate(StatementAdapter.java:36)  at com.carrotsearch.randomizedtesting.rules.StatementAdapter.evaluate(StatementAdapter.java:36)  at com.carrotsearch.randomizedtesting.rules.StatementAdapter.evaluate(StatementAdapter.java:36)  at org.apache.lucene.util.TestRuleAssertionsRequired$1.evaluate(TestRuleAssertionsRequired.java:53)  at org.apache.lucene.util.TestRuleMarkFailure$1.evaluate(TestRuleMarkFailure.java:47)  at org.apache.lucene.util.TestRuleIgnoreAfterMaxFailures$1.evaluate(TestRuleIgnoreAfterMaxFailures.java:64)  at org.apache.lucene.util.TestRuleIgnoreTestSuites$1.evaluate(TestRuleIgnoreTestSuites.java:54)  at com.carrotsearch.randomizedtesting.rules.StatementAdapter.evaluate(StatementAdapter.java:36)  at com.carrotsearch.randomizedtesting.ThreadLeakControl$StatementRunner.run(ThreadLeakControl.java:367)  at java.lang.Thread.run(Thread.java:745)  org.apache.solr.common.util.ObjectReleaseTracker$ObjectTrackerException  at org.apache.solr.common.util.ObjectReleaseTracker.track(ObjectReleaseTracker.java:43)  at org.apache.solr.core.CachingDirectoryFactory.get(CachingDirectoryFactory.java:347)  at org.apache.solr.core.SolrCore.initSnapshotMetaDataManager(SolrCore.java:458)  at org.apache.solr.core.SolrCore.<init>(SolrCore.java:895)  at org.apache.solr.core.SolrCore.<init>(SolrCore.java:817)  at org.apache.solr.core.CoreContainer.create(CoreContainer.java:902)  at org.apache.solr.core.CoreContainer.getCore(CoreContainer.java:1176)  at org.apache.solr.core.TestCoreDiscovery.testTooManyTransientCores(TestCoreDiscovery.java:211)  at sun.reflect.NativeMethodAccessorImpl.invoke0(Native Method)  at sun.reflect.NativeMethodAccessorImpl.invoke(NativeMethodAccessorImpl.java:62)  at sun.reflect.DelegatingMethodAccessorImpl.invoke(DelegatingMethodAccessorImpl.java:43)  at java.lang.reflect.Method.invoke(Method.java:498)  at com.carrotsearch.randomizedtesting.RandomizedRunner.invoke(RandomizedRunner.java:1713)  at com.carrotsearch.randomizedtesting.RandomizedRunner$8.evaluate(RandomizedRunner.java:907)  at com.carrotsearch.randomizedtesting.RandomizedRunner$9.evaluate(RandomizedRunner.java:943)  at com.carrotsearch.randomizedtesting.RandomizedRunner$10.evaluate(RandomizedRunner.java:957)  at com.carrotsearch.randomizedtesting.rules.SystemPropertiesRestoreRule$1.evaluate(SystemPropertiesRestoreRule.java:57)  at org.apache.lucene.util.TestRuleSetupTeardownChained$1.evaluate(TestRuleSetupTeardownChained.java:49)  at org.apache.lucene.util.AbstractBeforeAfterRule$1.evaluate(AbstractBeforeAfterRule.java:45)  at org.apache.lucene.util.TestRuleThreadAndTestName$1.evaluate(TestRuleThreadAndTestName.java:48)  at org.apache.lucene.util.TestRuleIgnoreAfterMaxFailures$1.evaluate(TestRuleIgnoreAfterMaxFailures.java:64)  at org.apache.lucene.util.TestRuleMarkFailure$1.evaluate(TestRuleMarkFailure.java:47)  at com.carrotsearch.randomizedtesting.rules.StatementAdapter.evaluate(StatementAdapter.java:36)  at com.carrotsearch.randomizedtesting.ThreadLeakControl$StatementRunner.run(ThreadLeakControl.java:367)  at com.carrotsearch.randomizedtesting.ThreadLeakControl.forkTimeoutingTask(ThreadLeakControl.java:811)  at com.carrotsearch.randomizedtesting.ThreadLeakControl$3.evaluate(ThreadLeakControl.java:462)  at com.carrotsearch.randomizedtesting.RandomizedRunner.runSingleTest(RandomizedRunner.java:916)  at com.carrotsearch.randomizedtesting.RandomizedRunner$5.evaluate(RandomizedRunner.java:802)  at com.carrotsearch.randomizedtesting.RandomizedRunner$6.evaluate(RandomizedRunner.java:852)  at com.carrotsearch.randomizedtesting.RandomizedRunner$7.evaluate(RandomizedRunner.java:863)  at com.carrotsearch.randomizedtesting.rules.StatementAdapter.evaluate(StatementAdapter.java:36)  at com.carrotsearch.randomizedtesting.rules.SystemPropertiesRestoreRule$1.evaluate(SystemPropertiesRestoreRule.java:57)  at org.apache.lucene.util.AbstractBeforeAfterRule$1.evaluate(AbstractBeforeAfterRule.java:45)  at com.carrotsearch.randomizedtesting.rules.StatementAdapter.evaluate(StatementAdapter.java:36)  at org.apache.lucene.util.TestRuleStoreClassName$1.evaluate(TestRuleStoreClassName.java:41)  at com.carrotsearch.randomizedtesting.rules.NoShadowingOrOverridesOnMethodsRule$1.evaluate(NoShadowingOrOverridesOnMethodsRule.java:40)  at com.carrotsearch.randomizedtesting.rules.NoShadowingOrOverridesOnMethodsRule$1.evaluate(NoShadowingOrOverridesOnMethodsRule.java:40)  at com.carrotsearch.randomizedtesting.rules.StatementAdapter.evaluate(StatementAdapter.java:36)  at com.carrotsearch.randomizedtesting.rules.StatementAdapter.evaluate(StatementAdapter.java:36)  at com.carrotsearch.randomizedtesting.rules.StatementAdapter.evaluate(StatementAdapter.java:36)  at org.apache.lucene.util.TestRuleAssertionsRequired$1.evaluate(TestRuleAssertionsRequired.java:53)  at org.apache.lucene.util.TestRuleMarkFailure$1.evaluate(TestRuleMarkFailure.java:47)  at org.apache.lucene.util.TestRuleIgnoreAfterMaxFailures$1.evaluate(TestRuleIgnoreAfterMaxFailures.java:64)  at org.apache.lucene.util.TestRuleIgnoreTestSuites$1.evaluate(TestRuleIgnoreTestSuites.java:54)  at com.carrotsearch.randomizedtesting.rules.StatementAdapter.evaluate(StatementAdapter.java:36)  at com.carrotsearch.randomizedtesting.ThreadLeakControl$StatementRunner.run(ThreadLeakControl.java:367)  at java.lang.Thread.run(Thread.java:745)  org.apache.solr.common.util.ObjectReleaseTracker$ObjectTrackerException  at org.apache.solr.common.util.ObjectReleaseTracker.track(ObjectReleaseTracker.java:43)  at org.apache.solr.core.CachingDirectoryFactory.get(CachingDirectoryFactory.java:347)  at org.apache.solr.update.SolrIndexWriter.create(SolrIndexWriter.java:66)  at org.apache.solr.core.SolrCore.initIndex(SolrCore.java:715)  at org.apache.solr.core.SolrCore.<init>(SolrCore.java:901)  at org.apache.solr.core.SolrCore.<init>(SolrCore.java:817)  at org.apache.solr.core.CoreContainer.create(CoreContainer.java:902)  at org.apache.solr.core.CoreContainer.getCore(CoreContainer.java:1176)  at org.apache.solr.core.TestCoreDiscovery.testTooManyTransientCores(TestCoreDiscovery.java:211)  at sun.reflect.NativeMethodAccessorImpl.invoke0(Native Method)  at sun.reflect.NativeMethodAccessorImpl.invoke(NativeMethodAccessorImpl.java:62)  at sun.reflect.DelegatingMethodAccessorImpl.invoke(DelegatingMethodAccessorImpl.java:43)  at java.lang.reflect.Method.invoke(Method.java:498)  at com.carrotsearch.randomizedtesting.RandomizedRunner.invoke(RandomizedRunner.java:1713)  at com.carrotsearch.randomizedtesting.RandomizedRunner$8.evaluate(RandomizedRunner.java:907)  at com.carrotsearch.randomizedtesting.RandomizedRunner$9.evaluate(RandomizedRunner.java:943)  at com.carrotsearch.randomizedtesting.RandomizedRunner$10.evaluate(RandomizedRunner.java:957)  at com.carrotsearch.randomizedtesting.rules.SystemPropertiesRestoreRule$1.evaluate(SystemPropertiesRestoreRule.java:57)  at org.apache.lucene.util.TestRuleSetupTeardownChained$1.evaluate(TestRuleSetupTeardownChained.java:49)  at org.apache.lucene.util.AbstractBeforeAfterRule$1.evaluate(AbstractBeforeAfterRule.java:45)  at org.apache.lucene.util.TestRuleThreadAndTestName$1.evaluate(TestRuleThreadAndTestName.java:48)  at org.apache.lucene.util.TestRuleIgnoreAfterMaxFailures$1.evaluate(TestRuleIgnoreAfterMaxFailures.java:64)  at org.apache.lucene.util.TestRuleMarkFailure$1.evaluate(TestRuleMarkFailure.java:47)  at com.carrotsearch.randomizedtesting.rules.StatementAdapter.evaluate(StatementAdapter.java:36)  at com.carrotsearch.randomizedtesting.ThreadLeakControl$StatementRunner.run(ThreadLeakControl.java:367)  at com.carrotsearch.randomizedtesting.ThreadLeakControl.forkTimeoutingTask(ThreadLeakControl.java:811)  at com.carrotsearch.randomizedtesting.ThreadLeakControl$3.evaluate(ThreadLeakControl.java:462)  at com.carrotsearch.randomizedtesting.RandomizedRunner.runSingleTest(RandomizedRunner.java:916)  at com.carrotsearch.randomizedtesting.RandomizedRunner$5.evaluate(RandomizedRunner.java:802)  at com.carrotsearch.randomizedtesting.RandomizedRunner$6.evaluate(RandomizedRunner.java:852)  at com.carrotsearch.randomizedtesting.RandomizedRunner$7.evaluate(RandomizedRunner.java:863)  at com.carrotsearch.randomizedtesting.rules.StatementAdapter.evaluate(StatementAdapter.java:36)  at com.carrotsearch.randomizedtesting.rules.SystemPropertiesRestoreRule$1.evaluate(SystemPropertiesRestoreRule.java:57)  at org.apache.lucene.util.AbstractBeforeAfterRule$1.evaluate(AbstractBeforeAfterRule.java:45)  at com.carrotsearch.randomizedtesting.rules.StatementAdapter.evaluate(StatementAdapter.java:36)  at org.apache.lucene.util.TestRuleStoreClassName$1.evaluate(TestRuleStoreClassName.java:41)  at com.carrotsearch.randomizedtesting.rules.NoShadowingOrOverridesOnMethodsRule$1.evaluate(NoShadowingOrOverridesOnMethodsRule.java:40)  at com.carrotsearch.randomizedtesting.rules.NoShadowingOrOverridesOnMethodsRule$1.evaluate(NoShadowingOrOverridesOnMethodsRule.java:40)  at com.carrotsearch.randomizedtesting.rules.StatementAdapter.evaluate(StatementAdapter.java:36)  at com.carrotsearch.randomizedtesting.rules.StatementAdapter.evaluate(StatementAdapter.java:36)  at com.carrotsearch.randomizedtesting.rules.StatementAdapter.evaluate(StatementAdapter.java:36)  at org.apache.lucene.util.TestRuleAssertionsRequired$1.evaluate(TestRuleAssertionsRequired.java:53)  at org.apache.lucene.util.TestRuleMarkFailure$1.evaluate(TestRuleMarkFailure.java:47)  at org.apache.lucene.util.TestRuleIgnoreAfterMaxFailures$1.evaluate(TestRuleIgnoreAfterMaxFailures.java:64)  at org.apache.lucene.util.TestRuleIgnoreTestSuites$1.evaluate(TestRuleIgnoreTestSuites.java:54)  at com.carrotsearch.randomizedtesting.rules.StatementAdapter.evaluate(StatementAdapter.java:36)  at com.carrotsearch.randomizedtesting.ThreadLeakControl$StatementRunner.run(ThreadLeakControl.java:367)  at java.lang.Thread.run(Thread.java:745)  org.apache.solr.common.util.ObjectReleaseTracker$ObjectTrackerException  at org.apache.solr.common.util.ObjectReleaseTracker.track(ObjectReleaseTracker.java:43)  at org.apache.solr.core.SolrCore.<init>(SolrCore.java:840)  at org.apache.solr.core.SolrCore.<init>(SolrCore.java:817)  at org.apache.solr.core.CoreContainer.create(CoreContainer.java:902)  at org.apache.solr.core.CoreContainer.getCore(CoreContainer.java:1176)  at org.apache.solr.core.TestCoreDiscovery.testTooManyTransientCores(TestCoreDiscovery.java:211)  at sun.reflect.NativeMethodAccessorImpl.invoke0(Native Method)  at sun.reflect.NativeMethodAccessorImpl.invoke(NativeMethodAccessorImpl.java:62)  at sun.reflect.DelegatingMethodAccessorImpl.invoke(DelegatingMethodAccessorImpl.java:43)  at java.lang.reflect.Method.invoke(Method.java:498)  at com.carrotsearch.randomizedtesting.RandomizedRunner.invoke(RandomizedRunner.java:1713)  at com.carrotsearch.randomizedtesting.RandomizedRunner$8.evaluate(RandomizedRunner.java:907)  at com.carrotsearch.randomizedtesting.RandomizedRunner$9.evaluate(RandomizedRunner.java:943)  at com.carrotsearch.randomizedtesting.RandomizedRunner$10.evaluate(RandomizedRunner.java:957)  at com.carrotsearch.randomizedtesting.rules.SystemPropertiesRestoreRule$1.evaluate(SystemPropertiesRestoreRule.java:57)  at org.apache.lucene.util.TestRuleSetupTeardownChained$1.evaluate(TestRuleSetupTeardownChained.java:49)  at org.apache.lucene.util.AbstractBeforeAfterRule$1.evaluate(AbstractBeforeAfterRule.java:45)  at org.apache.lucene.util.TestRuleThreadAndTestName$1.evaluate(TestRuleThreadAndTestName.java:48)  at org.apache.lucene.util.TestRuleIgnoreAfterMaxFailures$1.evaluate(TestRuleIgnoreAfterMaxFailures.java:64)  at org.apache.lucene.util.TestRuleMarkFailure$1.evaluate(TestRuleMarkFailure.java:47)  at com.carrotsearch.randomizedtesting.rules.StatementAdapter.evaluate(StatementAdapter.java:36)  at com.carrotsearch.randomizedtesting.ThreadLeakControl$StatementRunner.run(ThreadLeakControl.java:367)  at com.carrotsearch.randomizedtesting.ThreadLeakControl.forkTimeoutingTask(ThreadLeakControl.java:811)  at com.carrotsearch.randomizedtesting.ThreadLeakControl$3.evaluate(ThreadLeakControl.java:462)  at com.carrotsearch.randomizedtesting.RandomizedRunner.runSingleTest(RandomizedRunner.java:916)  at com.carrotsearch.randomizedtesting.RandomizedRunner$5.evaluate(RandomizedRunner.java:802)  at com.carrotsearch.randomizedtesting.RandomizedRunner$6.evaluate(RandomizedRunner.java:852)  at com.carrotsearch.randomizedtesting.RandomizedRunner$7.evaluate(RandomizedRunner.java:863)  at com.carrotsearch.randomizedtesting.rules.StatementAdapter.evaluate(StatementAdapter.java:36)  at com.carrotsearch.randomizedtesting.rules.SystemPropertiesRestoreRule$1.evaluate(SystemPropertiesRestoreRule.java:57)  at org.apache.lucene.util.AbstractBeforeAfterRule$1.evaluate(AbstractBeforeAfterRule.java:45)  at com.carrotsearch.randomizedtesting.rules.StatementAdapter.evaluate(StatementAdapter.java:36)  at org.apache.lucene.util.TestRuleStoreClassName$1.evaluate(TestRuleStoreClassName.java:41)  at com.carrotsearch.randomizedtesting.rules.NoShadowingOrOverridesOnMethodsRule$1.evaluate(NoShadowingOrOverridesOnMethodsRule.java:40)  at com.carrotsearch.randomizedtesting.rules.NoShadowingOrOverridesOnMethodsRule$1.evaluate(NoShadowingOrOverridesOnMethodsRule.java:40)  at com.carrotsearch.randomizedtesting.rules.StatementAdapter.evaluate(StatementAdapter.java:36)  at com.carrotsearch.randomizedtesting.rules.StatementAdapter.evaluate(StatementAdapter.java:36)  at com.carrotsearch.randomizedtesting.rules.StatementAdapter.evaluate(StatementAdapter.java:36)  at org.apache.lucene.util.TestRuleAssertionsRequired$1.evaluate(TestRuleAssertionsRequired.java:53)  at org.apache.lucene.util.TestRuleMarkFailure$1.evaluate(TestRuleMarkFailure.java:47)  at org.apache.lucene.util.TestRuleIgnoreAfterMaxFailures$1.evaluate(TestRuleIgnoreAfterMaxFailures.java:64)  at org.apache.lucene.util.TestRuleIgnoreTestSuites$1.evaluate(TestRuleIgnoreTestSuites.java:54)  at com.carrotsearch.randomizedtesting.rules.StatementAdapter.evaluate(StatementAdapter.java:36)  at com.carrotsearch.randomizedtesting.ThreadLeakControl$StatementRunner.run(ThreadLeakControl.java:367)  at java.lang.Thread.run(Thread.java:745)  

Stack Trace:
java.lang.AssertionError: ObjectTracker found 5 object(s) that were not released!!! [MockDirectoryWrapper, SolrCore, MockDirectoryWrapper, MockDirectoryWrapper, MDCAwareThreadPoolExecutor]
org.apache.solr.common.util.ObjectReleaseTracker$ObjectTrackerException
	at org.apache.solr.common.util.ObjectReleaseTracker.track(ObjectReleaseTracker.java:43)
	at org.apache.solr.core.CachingDirectoryFactory.get(CachingDirectoryFactory.java:347)
	at org.apache.solr.core.SolrCore.getNewIndexDir(SolrCore.java:343)
	at org.apache.solr.core.SolrCore.initIndex(SolrCore.java:683)
	at org.apache.solr.core.SolrCore.<init>(SolrCore.java:901)
	at org.apache.solr.core.SolrCore.<init>(SolrCore.java:817)
	at org.apache.solr.core.CoreContainer.create(CoreContainer.java:902)
	at org.apache.solr.core.CoreContainer.getCore(CoreContainer.java:1176)
	at org.apache.solr.core.TestCoreDiscovery.testTooManyTransientCores(TestCoreDiscovery.java:211)
	at sun.reflect.NativeMethodAccessorImpl.invoke0(Native Method)
	at sun.reflect.NativeMethodAccessorImpl.invoke(NativeMethodAccessorImpl.java:62)
	at sun.reflect.DelegatingMethodAccessorImpl.invoke(DelegatingMethodAccessorImpl.java:43)
	at java.lang.reflect.Method.invoke(Method.java:498)
	at com.carrotsearch.randomizedtesting.RandomizedRunner.invoke(RandomizedRunner.java:1713)
	at com.carrotsearch.randomizedtesting.RandomizedRunner$8.evaluate(RandomizedRunner.java:907)
	at com.carrotsearch.randomizedtesting.RandomizedRunner$9.evaluate(RandomizedRunner.java:943)
	at com.carrotsearch.randomizedtesting.RandomizedRunner$10.evaluate(RandomizedRunner.java:957)
	at com.carrotsearch.randomizedtesting.rules.SystemPropertiesRestoreRule$1.evaluate(SystemPropertiesRestoreRule.java:57)
	at org.apache.lucene.util.TestRuleSetupTeardownChained$1.evaluate(TestRuleSetupTeardownChained.java:49)
	at org.apache.lucene.util.AbstractBeforeAfterRule$1.evaluate(AbstractBeforeAfterRule.java:45)
	at org.apache.lucene.util.TestRuleThreadAndTestName$1.evaluate(TestRuleThreadAndTestName.java:48)
	at org.apache.lucene.util.TestRuleIgnoreAfterMaxFailures$1.evaluate(TestRuleIgnoreAfterMaxFailures.java:64)
	at org.apache.lucene.util.TestRuleMarkFailure$1.evaluate(TestRuleMarkFailure.java:47)
	at com.carrotsearch.randomizedtesting.rules.StatementAdapter.evaluate(StatementAdapter.java:36)
	at com.carrotsearch.randomizedtesting.ThreadLeakControl$StatementRunner.run(ThreadLeakControl.java:367)
	at com.carrotsearch.randomizedtesting.ThreadLeakControl.forkTimeoutingTask(ThreadLeakControl.java:811)
	at com.carrotsearch.randomizedtesting.ThreadLeakControl$3.evaluate(ThreadLeakControl.java:462)
	at com.carrotsearch.randomizedtesting.RandomizedRunner.runSingleTest(RandomizedRunner.java:916)
	at com.carrotsearch.randomizedtesting.RandomizedRunner$5.evaluate(RandomizedRunner.java:802)
	at com.carrotsearch.randomizedtesting.RandomizedRunner$6.evaluate(RandomizedRunner.java:852)
	at com.carrotsearch.randomizedtesting.RandomizedRunner$7.evaluate(RandomizedRunner.java:863)
	at com.carrotsearch.randomizedtesting.rules.StatementAdapter.evaluate(StatementAdapter.java:36)
	at com.carrotsearch.randomizedtesting.rules.SystemPropertiesRestoreRule$1.evaluate(SystemPropertiesRestoreRule.java:57)
	at org.apache.lucene.util.AbstractBeforeAfterRule$1.evaluate(AbstractBeforeAfterRule.java:45)
	at com.carrotsearch.randomizedtesting.rules.StatementAdapter.evaluate(StatementAdapter.java:36)
	at org.apache.lucene.util.TestRuleStoreClassName$1.evaluate(TestRuleStoreClassName.java:41)
	at com.carrotsearch.randomizedtesting.rules.NoShadowingOrOverridesOnMethodsRule$1.evaluate(NoShadowingOrOverridesOnMethodsRule.java:40)
	at com.carrotsearch.randomizedtesting.rules.NoShadowingOrOverridesOnMethodsRule$1.evaluate(NoShadowingOrOverridesOnMethodsRule.java:40)
	at com.carrotsearch.randomizedtesting.rules.StatementAdapter.evaluate(StatementAdapter.java:36)
	at com.carrotsearch.randomizedtesting.rules.StatementAdapter.evaluate(StatementAdapter.java:36)
	at com.carrotsearch.randomizedtesting.rules.StatementAdapter.evaluate(StatementAdapter.java:36)
	at org.apache.lucene.util.TestRuleAssertionsRequired$1.evaluate(TestRuleAssertionsRequired.java:53)
	at org.apache.lucene.util.TestRuleMarkFailure$1.evaluate(TestRuleMarkFailure.java:47)
	at org.apache.lucene.util.TestRuleIgnoreAfterMaxFailures$1.evaluate(TestRuleIgnoreAfterMaxFailures.java:64)
	at org.apache.lucene.util.TestRuleIgnoreTestSuites$1.evaluate(TestRuleIgnoreTestSuites.java:54)
	at com.carrotsearch.randomizedtesting.rules.StatementAdapter.evaluate(StatementAdapter.java:36)
	at com.carrotsearch.randomizedtesting.ThreadLeakControl$StatementRunner.run(ThreadLeakControl.java:367)
	at java.lang.Thread.run(Thread.java:745)

org.apache.solr.common.util.ObjectReleaseTracker$ObjectTrackerException
	at org.apache.solr.common.util.ObjectReleaseTracker.track(ObjectReleaseTracker.java:43)
	at org.apache.solr.core.SolrCore.<init>(SolrCore.java:991)
	at org.apache.solr.core.SolrCore.<init>(SolrCore.java:817)
	at org.apache.solr.core.CoreContainer.create(CoreContainer.java:902)
	at org.apache.solr.core.CoreContainer.getCore(CoreContainer.java:1176)
	at org.apache.solr.core.TestCoreDiscovery.testTooManyTransientCores(TestCoreDiscovery.java:211)
	at sun.reflect.NativeMethodAccessorImpl.invoke0(Native Method)
	at sun.reflect.NativeMethodAccessorImpl.invoke(NativeMethodAccessorImpl.java:62)
	at sun.reflect.DelegatingMethodAccessorImpl.invoke(DelegatingMethodAccessorImpl.java:43)
	at java.lang.reflect.Method.invoke(Method.java:498)
	at com.carrotsearch.randomizedtesting.RandomizedRunner.invoke(RandomizedRunner.java:1713)
	at com.carrotsearch.randomizedtesting.RandomizedRunner$8.evaluate(RandomizedRunner.java:907)
	at com.carrotsearch.randomizedtesting.RandomizedRunner$9.evaluate(RandomizedRunner.java:943)
	at com.carrotsearch.randomizedtesting.RandomizedRunner$10.evaluate(RandomizedRunner.java:957)
	at com.carrotsearch.randomizedtesting.rules.SystemPropertiesRestoreRule$1.evaluate(SystemPropertiesRestoreRule.java:57)
	at org.apache.lucene.util.TestRuleSetupTeardownChained$1.evaluate(TestRuleSetupTeardownChained.java:49)
	at org.apache.lucene.util.AbstractBeforeAfterRule$1.evaluate(AbstractBeforeAfterRule.java:45)
	at org.apache.lucene.util.TestRuleThreadAndTestName$1.evaluate(TestRuleThreadAndTestName.java:48)
	at org.apache.lucene.util.TestRuleIgnoreAfterMaxFailures$1.evaluate(TestRuleIgnoreAfterMaxFailures.java:64)
	at org.apache.lucene.util.TestRuleMarkFailure$1.evaluate(TestRuleMarkFailure.java:47)
	at com.carrotsearch.randomizedtesting.rules.StatementAdapter.evaluate(StatementAdapter.java:36)
	at com.carrotsearch.randomizedtesting.ThreadLeakControl$StatementRunner.run(ThreadLeakControl.java:367)
	at com.carrotsearch.randomizedtesting.ThreadLeakControl.forkTimeoutingTask(ThreadLeakControl.java:811)
	at com.carrotsearch.randomizedtesting.ThreadLeakControl$3.evaluate(ThreadLeakControl.java:462)
	at com.carrotsearch.randomizedtesting.RandomizedRunner.runSingleTest(RandomizedRunner.java:916)
	at com.carrotsearch.randomizedtesting.RandomizedRunner$5.evaluate(RandomizedRunner.java:802)
	at com.carrotsearch.randomizedtesting.RandomizedRunner$6.evaluate(RandomizedRunner.java:852)
	at com.carrotsearch.randomizedtesting.RandomizedRunner$7.evaluate(RandomizedRunner.java:863)
	at com.carrotsearch.randomizedtesting.rules.StatementAdapter.evaluate(StatementAdapter.java:36)
	at com.carrotsearch.randomizedtesting.rules.SystemPropertiesRestoreRule$1.evaluate(SystemPropertiesRestoreRule.java:57)
	at org.apache.lucene.util.AbstractBeforeAfterRule$1.evaluate(AbstractBeforeAfterRule.java:45)
	at com.carrotsearch.randomizedtesting.rules.StatementAdapter.evaluate(StatementAdapter.java:36)
	at org.apache.lucene.util.TestRuleStoreClassName$1.evaluate(TestRuleStoreClassName.java:41)
	at com.carrotsearch.randomizedtesting.rules.NoShadowingOrOverridesOnMethodsRule$1.evaluate(NoShadowingOrOverridesOnMethodsRule.java:40)
	at com.carrotsearch.randomizedtesting.rules.NoShadowingOrOverridesOnMethodsRule$1.evaluate(NoShadowingOrOverridesOnMethodsRule.java:40)
	at com.carrotsearch.randomizedtesting.rules.StatementAdapter.evaluate(StatementAdapter.java:36)
	at com.carrotsearch.randomizedtesting.rules.StatementAdapter.evaluate(StatementAdapter.java:36)
	at com.carrotsearch.randomizedtesting.rules.StatementAdapter.evaluate(StatementAdapter.java:36)
	at org.apache.lucene.util.TestRuleAssertionsRequired$1.evaluate(TestRuleAssertionsRequired.java:53)
	at org.apache.lucene.util.TestRuleMarkFailure$1.evaluate(TestRuleMarkFailure.java:47)
	at org.apache.lucene.util.TestRuleIgnoreAfterMaxFailures$1.evaluate(TestRuleIgnoreAfterMaxFailures.java:64)
	at org.apache.lucene.util.TestRuleIgnoreTestSuites$1.evaluate(TestRuleIgnoreTestSuites.java:54)
	at com.carrotsearch.randomizedtesting.rules.StatementAdapter.evaluate(StatementAdapter.java:36)
	at com.carrotsearch.randomizedtesting.ThreadLeakControl$StatementRunner.run(ThreadLeakControl.java:367)
	at java.lang.Thread.run(Thread.java:745)

org.apache.solr.common.util.ObjectReleaseTracker$ObjectTrackerException
	at org.apache.solr.common.util.ObjectReleaseTracker.track(ObjectReleaseTracker.java:43)
	at org.apache.solr.core.CachingDirectoryFactory.get(CachingDirectoryFactory.java:347)
	at org.apache.solr.core.SolrCore.initSnapshotMetaDataManager(SolrCore.java:458)
	at org.apache.solr.core.SolrCore.<init>(SolrCore.java:895)
	at org.apache.solr.core.SolrCore.<init>(SolrCore.java:817)
	at org.apache.solr.core.CoreContainer.create(CoreContainer.java:902)
	at org.apache.solr.core.CoreContainer.getCore(CoreContainer.java:1176)
	at org.apache.solr.core.TestCoreDiscovery.testTooManyTransientCores(TestCoreDiscovery.java:211)
	at sun.reflect.NativeMethodAccessorImpl.invoke0(Native Method)
	at sun.reflect.NativeMethodAccessorImpl.invoke(NativeMethodAccessorImpl.java:62)
	at sun.reflect.DelegatingMethodAccessorImpl.invoke(DelegatingMethodAccessorImpl.java:43)
	at java.lang.reflect.Method.invoke(Method.java:498)
	at com.carrotsearch.randomizedtesting.RandomizedRunner.invoke(RandomizedRunner.java:1713)
	at com.carrotsearch.randomizedtesting.RandomizedRunner$8.evaluate(RandomizedRunner.java:907)
	at com.carrotsearch.randomizedtesting.RandomizedRunner$9.evaluate(RandomizedRunner.java:943)
	at com.carrotsearch.randomizedtesting.RandomizedRunner$10.evaluate(RandomizedRunner.java:957)
	at com.carrotsearch.randomizedtesting.rules.SystemPropertiesRestoreRule$1.evaluate(SystemPropertiesRestoreRule.java:57)
	at org.apache.lucene.util.TestRuleSetupTeardownChained$1.evaluate(TestRuleSetupTeardownChained.java:49)
	at org.apache.lucene.util.AbstractBeforeAfterRule$1.evaluate(AbstractBeforeAfterRule.java:45)
	at org.apache.lucene.util.TestRuleThreadAndTestName$1.evaluate(TestRuleThreadAndTestName.java:48)
	at org.apache.lucene.util.TestRuleIgnoreAfterMaxFailures$1.evaluate(TestRuleIgnoreAfterMaxFailures.java:64)
	at org.apache.lucene.util.TestRuleMarkFailure$1.evaluate(TestRuleMarkFailure.java:47)
	at com.carrotsearch.randomizedtesting.rules.StatementAdapter.evaluate(StatementAdapter.java:36)
	at com.carrotsearch.randomizedtesting.ThreadLeakControl$StatementRunner.run(ThreadLeakControl.java:367)
	at com.carrotsearch.randomizedtesting.ThreadLeakControl.forkTimeoutingTask(ThreadLeakControl.java:811)
	at com.carrotsearch.randomizedtesting.ThreadLeakControl$3.evaluate(ThreadLeakControl.java:462)
	at com.carrotsearch.randomizedtesting.RandomizedRunner.runSingleTest(RandomizedRunner.java:916)
	at com.carrotsearch.randomizedtesting.RandomizedRunner$5.evaluate(RandomizedRunner.java:802)
	at com.carrotsearch.randomizedtesting.RandomizedRunner$6.evaluate(RandomizedRunner.java:852)
	at com.carrotsearch.randomizedtesting.RandomizedRunner$7.evaluate(RandomizedRunner.java:863)
	at com.carrotsearch.randomizedtesting.rules.StatementAdapter.evaluate(StatementAdapter.java:36)
	at com.carrotsearch.randomizedtesting.rules.SystemPropertiesRestoreRule$1.evaluate(SystemPropertiesRestoreRule.java:57)
	at org.apache.lucene.util.AbstractBeforeAfterRule$1.evaluate(AbstractBeforeAfterRule.java:45)
	at com.carrotsearch.randomizedtesting.rules.StatementAdapter.evaluate(StatementAdapter.java:36)
	at org.apache.lucene.util.TestRuleStoreClassName$1.evaluate(TestRuleStoreClassName.java:41)
	at com.carrotsearch.randomizedtesting.rules.NoShadowingOrOverridesOnMethodsRule$1.evaluate(NoShadowingOrOverridesOnMethodsRule.java:40)
	at com.carrotsearch.randomizedtesting.rules.NoShadowingOrOverridesOnMethodsRule$1.evaluate(NoShadowingOrOverridesOnMethodsRule.java:40)
	at com.carrotsearch.randomizedtesting.rules.StatementAdapter.evaluate(StatementAdapter.java:36)
	at com.carrotsearch.randomizedtesting.rules.StatementAdapter.evaluate(StatementAdapter.java:36)
	at com.carrotsearch.randomizedtesting.rules.StatementAdapter.evaluate(StatementAdapter.java:36)
	at org.apache.lucene.util.TestRuleAssertionsRequired$1.evaluate(TestRuleAssertionsRequired.java:53)
	at org.apache.lucene.util.TestRuleMarkFailure$1.evaluate(TestRuleMarkFailure.java:47)
	at org.apache.lucene.util.TestRuleIgnoreAfterMaxFailures$1.evaluate(TestRuleIgnoreAfterMaxFailures.java:64)
	at org.apache.lucene.util.TestRuleIgnoreTestSuites$1.evaluate(TestRuleIgnoreTestSuites.java:54)
	at com.carrotsearch.randomizedtesting.rules.StatementAdapter.evaluate(StatementAdapter.java:36)
	at com.carrotsearch.randomizedtesting.ThreadLeakControl$StatementRunner.run(ThreadLeakControl.java:367)
	at java.lang.Thread.run(Thread.java:745)

org.apache.solr.common.util.ObjectReleaseTracker$ObjectTrackerException
	at org.apache.solr.common.util.ObjectReleaseTracker.track(ObjectReleaseTracker.java:43)
	at org.apache.solr.core.CachingDirectoryFactory.get(CachingDirectoryFactory.java:347)
	at org.apache.solr.update.SolrIndexWriter.create(SolrIndexWriter.java:66)
	at org.apache.solr.core.SolrCore.initIndex(SolrCore.java:715)
	at org.apache.solr.core.SolrCore.<init>(SolrCore.java:901)
	at org.apache.solr.core.SolrCore.<init>(SolrCore.java:817)
	at org.apache.solr.core.CoreContainer.create(CoreContainer.java:902)
	at org.apache.solr.core.CoreContainer.getCore(CoreContainer.java:1176)
	at org.apache.solr.core.TestCoreDiscovery.testTooManyTransientCores(TestCoreDiscovery.java:211)
	at sun.reflect.NativeMethodAccessorImpl.invoke0(Native Method)
	at sun.reflect.NativeMethodAccessorImpl.invoke(NativeMethodAccessorImpl.java:62)
	at sun.reflect.DelegatingMethodAccessorImpl.invoke(DelegatingMethodAccessorImpl.java:43)
	at java.lang.reflect.Method.invoke(Method.java:498)
	at com.carrotsearch.randomizedtesting.RandomizedRunner.invoke(RandomizedRunner.java:1713)
	at com.carrotsearch.randomizedtesting.RandomizedRunner$8.evaluate(RandomizedRunner.java:907)
	at com.carrotsearch.randomizedtesting.RandomizedRunner$9.evaluate(RandomizedRunner.java:943)
	at com.carrotsearch.randomizedtesting.RandomizedRunner$10.evaluate(RandomizedRunner.java:957)
	at com.carrotsearch.randomizedtesting.rules.SystemPropertiesRestoreRule$1.evaluate(SystemPropertiesRestoreRule.java:57)
	at org.apache.lucene.util.TestRuleSetupTeardownChained$1.evaluate(TestRuleSetupTeardownChained.java:49)
	at org.apache.lucene.util.AbstractBeforeAfterRule$1.evaluate(AbstractBeforeAfterRule.java:45)
	at org.apache.lucene.util.TestRuleThreadAndTestName$1.evaluate(TestRuleThreadAndTestName.java:48)
	at org.apache.lucene.util.TestRuleIgnoreAfterMaxFailures$1.evaluate(TestRuleIgnoreAfterMaxFailures.java:64)
	at org.apache.lucene.util.TestRuleMarkFailure$1.evaluate(TestRuleMarkFailure.java:47)
	at com.carrotsearch.randomizedtesting.rules.StatementAdapter.evaluate(StatementAdapter.java:36)
	at com.carrotsearch.randomizedtesting.ThreadLeakControl$StatementRunner.run(ThreadLeakControl.java:367)
	at com.carrotsearch.randomizedtesting.ThreadLeakControl.forkTimeoutingTask(ThreadLeakControl.java:811)
	at com.carrotsearch.randomizedtesting.ThreadLeakControl$3.evaluate(ThreadLeakControl.java:462)
	at com.carrotsearch.randomizedtesting.RandomizedRunner.runSingleTest(RandomizedRunner.java:916)
	at com.carrotsearch.randomizedtesting.RandomizedRunner$5.evaluate(RandomizedRunner.java:802)
	at com.carrotsearch.randomizedtesting.RandomizedRunner$6.evaluate(RandomizedRunner.java:852)
	at com.carrotsearch.randomizedtesting.RandomizedRunner$7.evaluate(RandomizedRunner.java:863)
	at com.carrotsearch.randomizedtesting.rules.StatementAdapter.evaluate(StatementAdapter.java:36)
	at com.carrotsearch.randomizedtesting.rules.SystemPropertiesRestoreRule$1.evaluate(SystemPropertiesRestoreRule.java:57)
	at org.apache.lucene.util.AbstractBeforeAfterRule$1.evaluate(AbstractBeforeAfterRule.java:45)
	at com.carrotsearch.randomizedtesting.rules.StatementAdapter.evaluate(StatementAdapter.java:36)
	at org.apache.lucene.util.TestRuleStoreClassName$1.evaluate(TestRuleStoreClassName.java:41)
	at com.carrotsearch.randomizedtesting.rules.NoShadowingOrOverridesOnMethodsRule$1.evaluate(NoShadowingOrOverridesOnMethodsRule.java:40)
	at com.carrotsearch.randomizedtesting.rules.NoShadowingOrOverridesOnMethodsRule$1.evaluate(NoShadowingOrOverridesOnMethodsRule.java:40)
	at com.carrotsearch.randomizedtesting.rules.StatementAdapter.evaluate(StatementAdapter.java:36)
	at com.carrotsearch.randomizedtesting.rules.StatementAdapter.evaluate(StatementAdapter.java:36)
	at com.carrotsearch.randomizedtesting.rules.StatementAdapter.evaluate(StatementAdapter.java:36)
	at org.apache.lucene.util.TestRuleAssertionsRequired$1.evaluate(TestRuleAssertionsRequired.java:53)
	at org.apache.lucene.util.TestRuleMarkFailure$1.evaluate(TestRuleMarkFailure.java:47)
	at org.apache.lucene.util.TestRuleIgnoreAfterMaxFailures$1.evaluate(TestRuleIgnoreAfterMaxFailures.java:64)
	at org.apache.lucene.util.TestRuleIgnoreTestSuites$1.evaluate(TestRuleIgnoreTestSuites.java:54)
	at com.carrotsearch.randomizedtesting.rules.StatementAdapter.evaluate(StatementAdapter.java:36)
	at com.carrotsearch.randomizedtesting.ThreadLeakControl$StatementRunner.run(ThreadLeakControl.java:367)
	at java.lang.Thread.run(Thread.java:745)

org.apache.solr.common.util.ObjectReleaseTracker$ObjectTrackerException
	at org.apache.solr.common.util.ObjectReleaseTracker.track(ObjectReleaseTracker.java:43)
	at org.apache.solr.core.SolrCore.<init>(SolrCore.java:840)
	at org.apache.solr.core.SolrCore.<init>(SolrCore.java:817)
	at org.apache.solr.core.CoreContainer.create(CoreContainer.java:902)
	at org.apache.solr.core.CoreContainer.getCore(CoreContainer.java:1176)
	at org.apache.solr.core.TestCoreDiscovery.testTooManyTransientCores(TestCoreDiscovery.java:211)
	at sun.reflect.NativeMethodAccessorImpl.invoke0(Native Method)
	at sun.reflect.NativeMethodAccessorImpl.invoke(NativeMethodAccessorImpl.java:62)
	at sun.reflect.DelegatingMethodAccessorImpl.invoke(DelegatingMethodAccessorImpl.java:43)
	at java.lang.reflect.Method.invoke(Method.java:498)
	at com.carrotsearch.randomizedtesting.RandomizedRunner.invoke(RandomizedRunner.java:1713)
	at com.carrotsearch.randomizedtesting.RandomizedRunner$8.evaluate(RandomizedRunner.java:907)
	at com.carrotsearch.randomizedtesting.RandomizedRunner$9.evaluate(RandomizedRunner.java:943)
	at com.carrotsearch.randomizedtesting.RandomizedRunner$10.evaluate(RandomizedRunner.java:957)
	at com.carrotsearch.randomizedtesting.rules.SystemPropertiesRestoreRule$1.evaluate(SystemPropertiesRestoreRule.java:57)
	at org.apache.lucene.util.TestRuleSetupTeardownChained$1.evaluate(TestRuleSetupTeardownChained.java:49)
	at org.apache.lucene.util.AbstractBeforeAfterRule$1.evaluate(AbstractBeforeAfterRule.java:45)
	at org.apache.lucene.util.TestRuleThreadAndTestName$1.evaluate(TestRuleThreadAndTestName.java:48)
	at org.apache.lucene.util.TestRuleIgnoreAfterMaxFailures$1.evaluate(TestRuleIgnoreAfterMaxFailures.java:64)
	at org.apache.lucene.util.TestRuleMarkFailure$1.evaluate(TestRuleMarkFailure.java:47)
	at com.carrotsearch.randomizedtesting.rules.StatementAdapter.evaluate(StatementAdapter.java:36)
	at com.carrotsearch.randomizedtesting.ThreadLeakControl$StatementRunner.run(ThreadLeakControl.java:367)
	at com.carrotsearch.randomizedtesting.ThreadLeakControl.forkTimeoutingTask(ThreadLeakControl.java:811)
	at com.carrotsearch.randomizedtesting.ThreadLeakControl$3.evaluate(ThreadLeakControl.java:462)
	at com.carrotsearch.randomizedtesting.RandomizedRunner.runSingleTest(RandomizedRunner.java:916)
	at com.carrotsearch.randomizedtesting.RandomizedRunner$5.evaluate(RandomizedRunner.java:802)
	at com.carrotsearch.randomizedtesting.RandomizedRunner$6.evaluate(RandomizedRunner.java:852)
	at com.carrotsearch.randomizedtesting.RandomizedRunner$7.evaluate(RandomizedRunner.java:863)
	at com.carrotsearch.randomizedtesting.rules.StatementAdapter.evaluate(StatementAdapter.java:36)
	at com.carrotsearch.randomizedtesting.rules.SystemPropertiesRestoreRule$1.evaluate(SystemPropertiesRestoreRule.java:57)
	at org.apache.lucene.util.AbstractBeforeAfterRule$1.evaluate(AbstractBeforeAfterRule.java:45)
	at com.carrotsearch.randomizedtesting.rules.StatementAdapter.evaluate(StatementAdapter.java:36)
	at org.apache.lucene.util.TestRuleStoreClassName$1.evaluate(TestRuleStoreClassName.java:41)
	at com.carrotsearch.randomizedtesting.rules.NoShadowingOrOverridesOnMethodsRule$1.evaluate(NoShadowingOrOverridesOnMethodsRule.java:40)
	at com.carrotsearch.randomizedtesting.rules.NoShadowingOrOverridesOnMethodsRule$1.evaluate(NoShadowingOrOverridesOnMethodsRule.java:40)
	at com.carrotsearch.randomizedtesting.rules.StatementAdapter.evaluate(StatementAdapter.java:36)
	at com.carrotsearch.randomizedtesting.rules.StatementAdapter.evaluate(StatementAdapter.java:36)
	at com.carrotsearch.randomizedtesting.rules.StatementAdapter.evaluate(StatementAdapter.java:36)
	at org.apache.lucene.util.TestRuleAssertionsRequired$1.evaluate(TestRuleAssertionsRequired.java:53)
	at org.apache.lucene.util.TestRuleMarkFailure$1.evaluate(TestRuleMarkFailure.java:47)
	at org.apache.lucene.util.TestRuleIgnoreAfterMaxFailures$1.evaluate(TestRuleIgnoreAfterMaxFailures.java:64)
	at org.apache.lucene.util.TestRuleIgnoreTestSuites$1.evaluate(TestRuleIgnoreTestSuites.java:54)
	at com.carrotsearch.randomizedtesting.rules.StatementAdapter.evaluate(StatementAdapter.java:36)
	at com.carrotsearch.randomizedtesting.ThreadLeakControl$StatementRunner.run(ThreadLeakControl.java:367)
	at java.lang.Thread.run(Thread.java:745)


	at __randomizedtesting.SeedInfo.seed([AE0619F197BA1E9D]:0)
	at org.junit.Assert.fail(Assert.java:93)
	at org.junit.Assert.assertTrue(Assert.java:43)
	at org.junit.Assert.assertNull(Assert.java:551)
	at org.apache.solr.SolrTestCaseJ4.teardownTestCases(SolrTestCaseJ4.java:266)
	at sun.reflect.GeneratedMethodAccessor15.invoke(Unknown Source)
	at sun.reflect.DelegatingMethodAccessorImpl.invoke(DelegatingMethodAccessorImpl.java:43)
	at java.lang.reflect.Method.invoke(Method.java:498)
	at com.carrotsearch.randomizedtesting.RandomizedRunner.invoke(RandomizedRunner.java:1713)
	at com.carrotsearch.randomizedtesting.RandomizedRunner$7.evaluate(RandomizedRunner.java:870)
	at com.carrotsearch.randomizedtesting.rules.StatementAdapter.evaluate(StatementAdapter.java:36)
	at com.carrotsearch.randomizedtesting.rules.SystemPropertiesRestoreRule$1.evaluate(SystemPropertiesRestoreRule.java:57)
	at org.apache.lucene.util.AbstractBeforeAfterRule$1.evaluate(AbstractBeforeAfterRule.java:45)
	at com.carrotsearch.randomizedtesting.rules.StatementAdapter.evaluate(StatementAdapter.java:36)
	at org.apache.lucene.util.TestRuleStoreClassName$1.evaluate(TestRuleStoreClassName.java:41)
	at com.carrotsearch.randomizedtesting.rules.NoShadowingOrOverridesOnMethodsRule$1.evaluate(NoShadowingOrOverridesOnMethodsRule.java:40)
	at com.carrotsearch.randomizedtesting.rules.NoShadowingOrOverridesOnMethodsRule$1.evaluate(NoShadowingOrOverridesOnMethodsRule.java:40)
	at com.carrotsearch.randomizedtesting.rules.StatementAdapter.evaluate(StatementAdapter.java:36)
	at com.carrotsearch.randomizedtesting.rules.StatementAdapter.evaluate(StatementAdapter.java:36)
	at com.carrotsearch.randomizedtesting.rules.StatementAdapter.evaluate(StatementAdapter.java:36)
	at org.apache.lucene.util.TestRuleAssertionsRequired$1.evaluate(TestRuleAssertionsRequired.java:53)
	at org.apache.lucene.util.TestRuleMarkFailure$1.evaluate(TestRuleMarkFailure.java:47)
	at org.apache.lucene.util.TestRuleIgnoreAfterMaxFailures$1.evaluate(TestRuleIgnoreAfterMaxFailures.java:64)
	at org.apache.lucene.util.TestRuleIgnoreTestSuites$1.evaluate(TestRuleIgnoreTestSuites.java:54)
	at com.carrotsearch.randomizedtesting.rules.StatementAdapter.evaluate(StatementAdapter.java:36)
	at com.carrotsearch.randomizedtesting.ThreadLeakControl$StatementRunner.run(ThreadLeakControl.java:367)
	at java.lang.Thread.run(Thread.java:745)


FAILED:  junit.framework.TestSuite.org.apache.solr.core.TestCoreDiscovery

Error Message:
1 thread leaked from SUITE scope at org.apache.solr.core.TestCoreDiscovery:     1) Thread[id=42482, name=searcherExecutor-8713-thread-1, state=WAITING, group=TGRP-TestCoreDiscovery]         at sun.misc.Unsafe.park(Native Method)         at java.util.concurrent.locks.LockSupport.park(LockSupport.java:175)         at java.util.concurrent.locks.AbstractQueuedSynchronizer$ConditionObject.await(AbstractQueuedSynchronizer.java:2039)         at java.util.concurrent.LinkedBlockingQueue.take(LinkedBlockingQueue.java:442)         at java.util.concurrent.ThreadPoolExecutor.getTask(ThreadPoolExecutor.java:1067)         at java.util.concurrent.ThreadPoolExecutor.runWorker(ThreadPoolExecutor.java:1127)         at java.util.concurrent.ThreadPoolExecutor$Worker.run(ThreadPoolExecutor.java:617)         at java.lang.Thread.run(Thread.java:745)

Stack Trace:
com.carrotsearch.randomizedtesting.ThreadLeakError: 1 thread leaked from SUITE scope at org.apache.solr.core.TestCoreDiscovery: 
   1) Thread[id=42482, name=searcherExecutor-8713-thread-1, state=WAITING, group=TGRP-TestCoreDiscovery]
        at sun.misc.Unsafe.park(Native Method)
        at java.util.concurrent.locks.LockSupport.park(LockSupport.java:175)
        at java.util.concurrent.locks.AbstractQueuedSynchronizer$ConditionObject.await(AbstractQueuedSynchronizer.java:2039)
        at java.util.concurrent.LinkedBlockingQueue.take(LinkedBlockingQueue.java:442)
        at java.util.concurrent.ThreadPoolExecutor.getTask(ThreadPoolExecutor.java:1067)
        at java.util.concurrent.ThreadPoolExecutor.runWorker(ThreadPoolExecutor.java:1127)
        at java.util.concurrent.ThreadPoolExecutor$Worker.run(ThreadPoolExecutor.java:617)
        at java.lang.Thread.run(Thread.java:745)
	at __randomizedtesting.SeedInfo.seed([AE0619F197BA1E9D]:0)


FAILED:  junit.framework.TestSuite.org.apache.solr.core.TestCoreDiscovery

Error Message:
There are still zombie threads that couldn't be terminated:    1) Thread[id=42482, name=searcherExecutor-8713-thread-1, state=WAITING, group=TGRP-TestCoreDiscovery]         at sun.misc.Unsafe.park(Native Method)         at java.util.concurrent.locks.LockSupport.park(LockSupport.java:175)         at java.util.concurrent.locks.AbstractQueuedSynchronizer$ConditionObject.await(AbstractQueuedSynchronizer.java:2039)         at java.util.concurrent.LinkedBlockingQueue.take(LinkedBlockingQueue.java:442)         at java.util.concurrent.ThreadPoolExecutor.getTask(ThreadPoolExecutor.java:1067)         at java.util.concurrent.ThreadPoolExecutor.runWorker(ThreadPoolExecutor.java:1127)         at java.util.concurrent.ThreadPoolExecutor$Worker.run(ThreadPoolExecutor.java:617)         at java.lang.Thread.run(Thread.java:745)

Stack Trace:
com.carrotsearch.randomizedtesting.ThreadLeakError: There are still zombie threads that couldn't be terminated:
   1) Thread[id=42482, name=searcherExecutor-8713-thread-1, state=WAITING, group=TGRP-TestCoreDiscovery]
        at sun.misc.Unsafe.park(Native Method)
        at java.util.concurrent.locks.LockSupport.park(LockSupport.java:175)
        at java.util.concurrent.locks.AbstractQueuedSynchronizer$ConditionObject.await(AbstractQueuedSynchronizer.java:2039)
        at java.util.concurrent.LinkedBlockingQueue.take(LinkedBlockingQueue.java:442)
        at java.util.concurrent.ThreadPoolExecutor.getTask(ThreadPoolExecutor.java:1067)
        at java.util.concurrent.ThreadPoolExecutor.runWorker(ThreadPoolExecutor.java:1127)
        at java.util.concurrent.ThreadPoolExecutor$Worker.run(ThreadPoolExecutor.java:617)
        at java.lang.Thread.run(Thread.java:745)
	at __randomizedtesting.SeedInfo.seed([AE0619F197BA1E9D]:0)




Build Log:
[...truncated 12049 lines...]
   [junit4] Suite: org.apache.solr.core.TestCoreDiscovery
   [junit4]   2> Creating dataDir: /export/home/jenkins/workspace/Lucene-Solr-master-Solaris/solr/build/solr-core/test/J1/temp/solr.core.TestCoreDiscovery_AE0619F197BA1E9D-001/init-core-data-001
   [junit4]   2> 1810292 INFO  (SUITE-TestCoreDiscovery-seed#[AE0619F197BA1E9D]-worker) [    ] o.a.s.SolrTestCaseJ4 Randomized ssl (false) and clientAuth (true) via: @org.apache.solr.util.RandomizeSSL(reason=, value=NaN, ssl=NaN, clientAuth=NaN)
   [junit4]   2> 1810292 INFO  (SUITE-TestCoreDiscovery-seed#[AE0619F197BA1E9D]-worker) [    ] o.a.s.SolrTestCaseJ4 ####initCore
   [junit4]   2> 1810292 INFO  (SUITE-TestCoreDiscovery-seed#[AE0619F197BA1E9D]-worker) [    ] o.a.s.SolrTestCaseJ4 ####initCore end
   [junit4]   2> 1810302 INFO  (TEST-TestCoreDiscovery.testNonCoreDirCantRead-seed#[AE0619F197BA1E9D]) [    ] o.a.s.SolrTestCaseJ4 ###Starting testNonCoreDirCantRead
   [junit4]   2> 1810308 INFO  (TEST-TestCoreDiscovery.testNonCoreDirCantRead-seed#[AE0619F197BA1E9D]) [    ] o.a.s.c.SolrXmlConfig Loading container configuration from /export/home/jenkins/workspace/Lucene-Solr-master-Solaris/solr/build/solr-core/test/J1/temp/solr.core.TestCoreDiscovery_AE0619F197BA1E9D-001/tempDir-001/solr.xml
   [junit4]   2> 1810314 INFO  (TEST-TestCoreDiscovery.testNonCoreDirCantRead-seed#[AE0619F197BA1E9D]) [    ] o.a.s.c.SolrCores Allocating transient cache for 2 transient cores
   [junit4]   2> 1810319 WARN  (TEST-TestCoreDiscovery.testNonCoreDirCantRead-seed#[AE0619F197BA1E9D]) [    ] o.a.s.c.CorePropertiesLocator Error visiting /export/home/jenkins/workspace/Lucene-Solr-master-Solaris/solr/build/solr-core/test/J1/temp/solr.core.TestCoreDiscovery_AE0619F197BA1E9D-001/tempDir-001/cantReadDir: java.nio.file.AccessDeniedException: /export/home/jenkins/workspace/Lucene-Solr-master-Solaris/solr/build/solr-core/test/J1/temp/solr.core.TestCoreDiscovery_AE0619F197BA1E9D-001/tempDir-001/cantReadDir
   [junit4]   2> 1810320 INFO  (TEST-TestCoreDiscovery.testNonCoreDirCantRead-seed#[AE0619F197BA1E9D]) [    ] o.a.s.c.CorePropertiesLocator Found 2 core definitions underneath /export/home/jenkins/workspace/Lucene-Solr-master-Solaris/solr/build/solr-core/test/J1/temp/solr.core.TestCoreDiscovery_AE0619F197BA1E9D-001/tempDir-001
   [junit4]   2> 1810320 INFO  (TEST-TestCoreDiscovery.testNonCoreDirCantRead-seed#[AE0619F197BA1E9D]) [    ] o.a.s.c.CorePropertiesLocator Cores are: [core2, core1]
   [junit4]   2> 1810330 WARN  (coreLoadExecutor-8648-thread-1) [    x:core1] o.a.s.c.Config Beginning with Solr 5.5, <mergePolicy> is deprecated, use <mergePolicyFactory> instead.
   [junit4]   2> 1810331 INFO  (coreLoadExecutor-8648-thread-1) [    x:core1] o.a.s.c.SolrConfig Using Lucene MatchVersion: 7.0.0
   [junit4]   2> 1810355 INFO  (coreLoadExecutor-8648-thread-1) [    x:core1] o.a.s.s.IndexSchema [core1] Schema name=tiny
   [junit4]   2> 1810358 INFO  (coreLoadExecutor-8648-thread-1) [    x:core1] o.a.s.s.IndexSchema Loaded schema tiny/1.1 with uniqueid field id
   [junit4]   2> 1810361 INFO  (coreLoadExecutor-8648-thread-1) [    x:core1] o.a.s.c.CoreContainer Creating SolrCore 'core1' using configuration from instancedir /export/home/jenkins/workspace/Lucene-Solr-master-Solaris/solr/build/solr-core/test/J1/temp/solr.core.TestCoreDiscovery_AE0619F197BA1E9D-001/tempDir-001/core1
   [junit4]   2> 1810362 INFO  (coreLoadExecutor-8648-thread-1) [    x:core1] o.a.s.c.SolrCore [[core1] ] Opening new SolrCore at [/export/home/jenkins/workspace/Lucene-Solr-master-Solaris/solr/build/solr-core/test/J1/temp/solr.core.TestCoreDiscovery_AE0619F197BA1E9D-001/tempDir-001/core1], dataDir=[/export/home/jenkins/workspace/Lucene-Solr-master-Solaris/solr/build/solr-core/test/J1/temp/solr.core.TestCoreDiscovery_AE0619F197BA1E9D-001/tempDir-001/core1/stuffandnonsense/]
   [junit4]   2> 1810363 INFO  (coreLoadExecutor-8648-thread-1) [    x:core1] o.a.s.u.RandomMergePolicy RandomMergePolicy wrapping class org.apache.lucene.index.LogDocMergePolicy: [LogDocMergePolicy: minMergeSize=1000, mergeFactor=26, maxMergeSize=9223372036854775807, maxMergeSizeForForcedMerge=9223372036854775807, calibrateSizeByDeletes=true, maxMergeDocs=2147483647, maxCFSSegmentSizeMB=8.796093022207999E12, noCFSRatio=0.7070498460770588]
   [junit4]   2> 1810377 INFO  (coreLoadExecutor-8648-thread-1) [    x:core1] o.a.s.u.CommitTracker Hard AutoCommit: disabled
   [junit4]   2> 1810377 INFO  (coreLoadExecutor-8648-thread-1) [    x:core1] o.a.s.u.CommitTracker Soft AutoCommit: disabled
   [junit4]   2> 1810377 INFO  (coreLoadExecutor-8648-thread-1) [    x:core1] o.a.s.u.RandomMergePolicy RandomMergePolicy wrapping class org.apache.lucene.index.LogByteSizeMergePolicy: [LogByteSizeMergePolicy: minMergeSize=1677721, mergeFactor=40, maxMergeSize=2147483648, maxMergeSizeForForcedMerge=9223372036854775807, calibrateSizeByDeletes=true, maxMergeDocs=2147483647, maxCFSSegmentSizeMB=8.796093022207999E12, noCFSRatio=0.4178930543356525]
   [junit4]   2> 1810377 INFO  (coreLoadExecutor-8648-thread-1) [    x:core1] o.a.s.s.SolrIndexSearcher Opening [Searcher@9b964ef[core1] main]
   [junit4]   2> 1810377 INFO  (coreLoadExecutor-8648-thread-1) [    x:core1] o.a.s.r.ManagedResourceStorage File-based storage initialized to use dir: /export/home/jenkins/workspace/Lucene-Solr-master-Solaris/solr/build/solr-core/test/J1/temp/solr.core.TestCoreDiscovery_AE0619F197BA1E9D-001/tempDir-001/core1/conf
   [junit4]   2> 1810378 INFO  (coreLoadExecutor-8648-thread-1) [    x:core1] o.a.s.h.ReplicationHandler Commits will be reserved for  10000
   [junit4]   2> 1810378 INFO  (searcherExecutor-8649-thread-1-processing-x:core1) [    x:core1] o.a.s.c.SolrCore [core1] Registered new searcher Searcher@9b964ef[core1] main{ExitableDirectoryReader(UninvertingDirectoryReader())}
   [junit4]   2> 1810386 WARN  (TEST-TestCoreDiscovery.testNonCoreDirCantRead-seed#[AE0619F197BA1E9D]) [    x:core2] o.a.s.c.Config Beginning with Solr 5.5, <mergePolicy> is deprecated, use <mergePolicyFactory> instead.
   [junit4]   2> 1810391 INFO  (TEST-TestCoreDiscovery.testNonCoreDirCantRead-seed#[AE0619F197BA1E9D]) [    x:core2] o.a.s.c.SolrConfig Using Lucene MatchVersion: 7.0.0
   [junit4]   2> 1810402 INFO  (TEST-TestCoreDiscovery.testNonCoreDirCantRead-seed#[AE0619F197BA1E9D]) [    x:core2] o.a.s.s.IndexSchema [core2] Schema name=tiny
   [junit4]   2> 1810405 INFO  (TEST-TestCoreDiscovery.testNonCoreDirCantRead-seed#[AE0619F197BA1E9D]) [    x:core2] o.a.s.s.IndexSchema Loaded schema tiny/1.1 with uniqueid field id
   [junit4]   2> 1810406 INFO  (TEST-TestCoreDiscovery.testNonCoreDirCantRead-seed#[AE0619F197BA1E9D]) [    x:core2] o.a.s.c.CoreContainer Creating SolrCore 'core2' using configuration from instancedir /export/home/jenkins/workspace/Lucene-Solr-master-Solaris/solr/build/solr-core/test/J1/temp/solr.core.TestCoreDiscovery_AE0619F197BA1E9D-001/tempDir-001/core2
   [junit4]   2> 1810406 INFO  (TEST-TestCoreDiscovery.testNonCoreDirCantRead-seed#[AE0619F197BA1E9D]) [    x:core2] o.a.s.c.SolrCore [[core2] ] Opening new SolrCore at [/export/home/jenkins/workspace/Lucene-Solr-master-Solaris/solr/build/solr-core/test/J1/temp/solr.core.TestCoreDiscovery_AE0619F197BA1E9D-001/tempDir-001/core2], dataDir=[/export/home/jenkins/workspace/Lucene-Solr-master-Solaris/solr/build/solr-core/test/J1/temp/solr.core.TestCoreDiscovery_AE0619F197BA1E9D-001/tempDir-001/core2/core2/]
   [junit4]   2> 1810407 INFO  (TEST-TestCoreDiscovery.testNonCoreDirCantRead-seed#[AE0619F197BA1E9D]) [    x:core2] o.a.s.u.RandomMergePolicy RandomMergePolicy wrapping class org.apache.lucene.index.TieredMergePolicy: [TieredMergePolicy: maxMergeAtOnce=47, maxMergeAtOnceExplicit=48, maxMergedSegmentMB=99.4765625, floorSegmentMB=0.4033203125, forceMergeDeletesPctAllowed=21.709940873476345, segmentsPerTier=10.0, maxCFSSegmentSizeMB=8.796093022207999E12, noCFSRatio=0.0
   [junit4]   2> 1810417 INFO  (TEST-TestCoreDiscovery.testNonCoreDirCantRead-seed#[AE0619F197BA1E9D]) [    x:core2] o.a.s.u.CommitTracker Hard AutoCommit: disabled
   [junit4]   2> 1810417 INFO  (TEST-TestCoreDiscovery.testNonCoreDirCantRead-seed#[AE0619F197BA1E9D]) [    x:core2] o.a.s.u.CommitTracker Soft AutoCommit: disabled
   [junit4]   2> 1810417 INFO  (TEST-TestCoreDiscovery.testNonCoreDirCantRead-seed#[AE0619F197BA1E9D]) [    x:core2] o.a.s.u.RandomMergePolicy RandomMergePolicy wrapping class org.apache.lucene.index.TieredMergePolicy: [TieredMergePolicy: maxMergeAtOnce=34, maxMergeAtOnceExplicit=26, maxMergedSegmentMB=74.4404296875, floorSegmentMB=1.7275390625, forceMergeDeletesPctAllowed=7.837348606977091, segmentsPerTier=14.0, maxCFSSegmentSizeMB=8.796093022207999E12, noCFSRatio=0.0
   [junit4]   2> 1810418 INFO  (TEST-TestCoreDiscovery.testNonCoreDirCantRead-seed#[AE0619F197BA1E9D]) [    x:core2] o.a.s.s.SolrIndexSearcher Opening [Searcher@2c9a6412[core2] main]
   [junit4]   2> 1810418 INFO  (TEST-TestCoreDiscovery.testNonCoreDirCantRead-seed#[AE0619F197BA1E9D]) [    x:core2] o.a.s.r.ManagedResourceStorage File-based storage initialized to use dir: /export/home/jenkins/workspace/Lucene-Solr-master-Solaris/solr/build/solr-core/test/J1/temp/solr.core.TestCoreDiscovery_AE0619F197BA1E9D-001/tempDir-001/core2/conf
   [junit4]   2> 1810418 INFO  (TEST-TestCoreDiscovery.testNonCoreDirCantRead-seed#[AE0619F197BA1E9D]) [    x:core2] o.a.s.h.ReplicationHandler Commits will be reserved for  10000
   [junit4]   2> 1810418 INFO  (searcherExecutor-8653-thread-1-processing-x:core2) [    x:core2] o.a.s.c.SolrCore [core2] Registered new searcher Searcher@2c9a6412[core2] main{ExitableDirectoryReader(UninvertingDirectoryReader())}
   [junit4]   2> 1810419 INFO  (TEST-TestCoreDiscovery.testNonCoreDirCantRead-seed#[AE0619F197BA1E9D]) [    x:core2] o.a.s.c.CoreContainer Shutting down CoreContainer instance=570875504
   [junit4]   2> 1810419 INFO  (coreCloseExecutor-8657-thread-1-processing-x:core2) [    x:core1] o.a.s.c.SolrCore [core1]  CLOSING SolrCore org.apache.solr.core.SolrCore@725942c
   [junit4]   2> 1810419 INFO  (coreCloseExecutor-8657-thread-2-processing-x:core2) [    x:core2] o.a.s.c.SolrCore [core2]  CLOSING SolrCore org.apache.solr.core.SolrCore@dfb37bb
   [junit4]   2> 1810420 INFO  (coreCloseExecutor-8657-thread-2-processing-x:core2) [    x:core2] o.a.s.m.SolrMetricManager Closing metric reporters for: solr.core.core2
   [junit4]   2> 1810420 INFO  (coreCloseExecutor-8657-thread-1-processing-x:core2) [    x:core1] o.a.s.m.SolrMetricManager Closing metric reporters for: solr.core.core1
   [junit4]   2> 1810420 INFO  (TEST-TestCoreDiscovery.testNonCoreDirCantRead-seed#[AE0619F197BA1E9D]) [    x:core2] o.a.s.m.SolrMetricManager Closing metric reporters for: solr.node
   [junit4]   2> 1810421 INFO  (TEST-TestCoreDiscovery.testNonCoreDirCantRead-seed#[AE0619F197BA1E9D]) [    x:core2] o.a.s.SolrTestCaseJ4 ###Ending testNonCoreDirCantRead
   [junit4]   2> 1810423 INFO  (TEST-TestCoreDiscovery.testFileCantRead-seed#[AE0619F197BA1E9D]) [    x:core2] o.a.s.SolrTestCaseJ4 ###Starting testFileCantRead
   [junit4]   2> 1810428 INFO  (TEST-TestCoreDiscovery.testFileCantRead-seed#[AE0619F197BA1E9D]) [    x:core2] o.a.s.c.SolrXmlConfig Loading container configuration from /export/home/jenkins/workspace/Lucene-Solr-master-Solaris/solr/build/solr-core/test/J1/temp/solr.core.TestCoreDiscovery_AE0619F197BA1E9D-001/tempDir-002/solr.xml
   [junit4]   2> 1810441 INFO  (TEST-TestCoreDiscovery.testFileCantRead-seed#[AE0619F197BA1E9D]) [    x:core2] o.a.s.c.SolrCores Allocating transient cache for 2 transient cores
   [junit4]   2> 1810444 INFO  (TEST-TestCoreDiscovery.testFileCantRead-seed#[AE0619F197BA1E9D]) [    x:core2] o.a.s.c.CorePropertiesLocator Found 1 core definitions underneath /export/home/jenkins/workspace/Lucene-Solr-master-Solaris/solr/build/solr-core/test/J1/temp/solr.core.TestCoreDiscovery_AE0619F197BA1E9D-001/tempDir-002
   [junit4]   2> 1810445 INFO  (TEST-TestCoreDiscovery.testFileCantRead-seed#[AE0619F197BA1E9D]) [    x:core2] o.a.s.c.CorePropertiesLocator Cores are: [core1]
   [junit4]   2> 1810455 WARN  (coreLoadExecutor-8664-thread-1-processing-x:core2) [    x:core1] o.a.s.c.Config Beginning with Solr 5.5, <mergePolicy> is deprecated, use <mergePolicyFactory> instead.
   [junit4]   2> 1810456 INFO  (coreLoadExecutor-8664-thread-1-processing-x:core2) [    x:core1] o.a.s.c.SolrConfig Using Lucene MatchVersion: 7.0.0
   [junit4]   2> 1810471 INFO  (coreLoadExecutor-8664-thread-1-processing-x:core2) [    x:core1] o.a.s.s.IndexSchema [core1] Schema name=tiny
   [junit4]   2> 1810474 INFO  (coreLoadExecutor-8664-thread-1-processing-x:core2) [    x:core1] o.a.s.s.IndexSchema Loaded schema tiny/1.1 with uniqueid field id
   [junit4]   2> 1810479 INFO  (coreLoadExecutor-8664-thread-1-processing-x:core2) [    x:core1] o.a.s.c.CoreContainer Creating SolrCore 'core1' using configuration from instancedir /export/home/jenkins/workspace/Lucene-Solr-master-Solaris/solr/build/solr-core/test/J1/temp/solr.core.TestCoreDiscovery_AE0619F197BA1E9D-001/tempDir-002/core1
   [junit4]   2> 1810480 INFO  (coreLoadExecutor-8664-thread-1-processing-x:core2) [    x:core1] o.a.s.c.SolrCore [[core1] ] Opening new SolrCore at [/export/home/jenkins/workspace/Lucene-Solr-master-Solaris/solr/build/solr-core/test/J1/temp/solr.core.TestCoreDiscovery_AE0619F197BA1E9D-001/tempDir-002/core1], dataDir=[/export/home/jenkins/workspace/Lucene-Solr-master-Solaris/solr/build/solr-core/test/J1/temp/solr.core.TestCoreDiscovery_AE0619F197BA1E9D-001/tempDir-002/core1/stuffandnonsense/]
   [junit4]   2> 1810480 INFO  (coreLoadExecutor-8664-thread-1-processing-x:core2) [    x:core1] o.a.s.u.RandomMergePolicy RandomMergePolicy wrapping class org.apache.lucene.index.LogDocMergePolicy: [LogDocMergePolicy: minMergeSize=1000, mergeFactor=26, maxMergeSize=9223372036854775807, maxMergeSizeForForcedMerge=9223372036854775807, calibrateSizeByDeletes=true, maxMergeDocs=2147483647, maxCFSSegmentSizeMB=8.796093022207999E12, noCFSRatio=0.7070498460770588]
   [junit4]   2> 1810495 INFO  (coreLoadExecutor-8664-thread-1-processing-x:core2) [    x:core1] o.a.s.u.CommitTracker Hard AutoCommit: disabled
   [junit4]   2> 1810495 INFO  (coreLoadExecutor-8664-thread-1-processing-x:core2) [    x:core1] o.a.s.u.CommitTracker Soft AutoCommit: disabled
   [junit4]   2> 1810495 INFO  (coreLoadExecutor-8664-thread-1-processing-x:core2) [    x:core1] o.a.s.u.RandomMergePolicy RandomMergePolicy wrapping class org.apache.lucene.index.LogByteSizeMergePolicy: [LogByteSizeMergePolicy: minMergeSize=1677721, mergeFactor=40, maxMergeSize=2147483648, maxMergeSizeForForcedMerge=9223372036854775807, calibrateSizeByDeletes=true, maxMergeDocs=2147483647, maxCFSSegmentSizeMB=8.796093022207999E12, noCFSRatio=0.4178930543356525]
   [junit4]   2> 1810495 INFO  (coreLoadExecutor-8664-thread-1-processing-x:core2) [    x:core1] o.a.s.s.SolrIndexSearcher Opening [Searcher@30c2d10[core1] main]
   [junit4]   2> 1810495 INFO  (coreLoadExecutor-8664-thread-1-processing-x:core2) [    x:core1] o.a.s.r.ManagedResourceStorage File-based storage initialized to use dir: /export/home/jenkins/workspace/Lucene-Solr-master-Solaris/solr/build/solr-core/test/J1/temp/solr.core.TestCoreDiscovery_AE0619F197BA1E9D-001/tempDir-002/core1/conf
   [junit4]   2> 1810496 INFO  (coreLoadExecutor-8664-thread-1-processing-x:core2) [    x:core1] o.a.s.h.ReplicationHandler Commits will be reserved for  10000
   [junit4]   2> 1810496 INFO  (searcherExecutor-8665-thread-1-processing-x:core1) [    x:core1] o.a.s.c.SolrCore [core1] Registered new searcher Searcher@30c2d10[core1] main{ExitableDirectoryReader(UninvertingDirectoryReader())}
   [junit4]   2> 1810496 INFO  (TEST-TestCoreDiscovery.testFileCantRead-seed#[AE0619F197BA1E9D]) [    x:core2] o.a.s.c.CoreContainer Shutting down CoreContainer instance=1531299260
   [junit4]   2> 1810496 INFO  (coreCloseExecutor-8669-thread-1-processing-x:core2) [    x:core1] o.a.s.c.SolrCore [core1]  CLOSING SolrCore org.apache.solr.core.SolrCore@75ce6592
   [junit4]   2> 1810497 INFO  (coreCloseExecutor-8669-thread-1-processing-x:core2) [    x:core1] o.a.s.m.SolrMetricManager Closing metric reporters for: solr.core.core1
   [junit4]   2> 1810497 INFO  (TEST-TestCoreDiscovery.testFileCantRead-seed#[AE0619F197BA1E9D]) [    x:core2] o.a.s.m.SolrMetricManager Closing metric reporters for: solr.node
   [junit4]   2> 1810497 INFO  (TEST-TestCoreDiscovery.testFileCantRead-seed#[AE0619F197BA1E9D]) [    x:core2] o.a.s.SolrTestCaseJ4 ###Ending testFileCantRead
   [junit4]   2> 1810500 INFO  (TEST-TestCoreDiscovery.testTooManyTransientCores-seed#[AE0619F197BA1E9D]) [    x:core2] o.a.s.SolrTestCaseJ4 ###Starting testTooManyTransientCores
   [junit4]   2> 1810515 INFO  (TEST-TestCoreDiscovery.testTooManyTransientCores-seed#[AE0619F197BA1E9D]) [    x:core2] o.a.s.c.SolrXmlConfig Loading container configuration from /export/home/jenkins/workspace/Lucene-Solr-master-Solaris/solr/build/solr-core/test/J1/temp/solr.core.TestCoreDiscovery_AE0619F197BA1E9D-001/tempDir-003/solr.xml
   [junit4]   2> 1810521 INFO  (TEST-TestCoreDiscovery.testTooManyTransientCores-seed#[AE0619F197BA1E9D]) [    x:core2] o.a.s.c.SolrCores Allocating transient cache for 2 transient cores
   [junit4]   2> 1810526 INFO  (TEST-TestCoreDiscovery.testTooManyTransientCores-seed#[AE0619F197BA1E9D]) [    x:core2] o.a.s.c.CorePropertiesLocator Found 7 core definitions underneath /export/home/jenkins/workspace/Lucene-Solr-master-Solaris/solr/build/solr-core/test/J1/temp/solr.core.TestCoreDiscovery_AE0619F197BA1E9D-001/tempDir-003
   [junit4]   2> 1810526 INFO  (TEST-TestCoreDiscovery.testTooManyTransientCores-seed#[AE0619F197BA1E9D]) [    x:core2] o.a.s.c.CorePropertiesLocator Cores are: [coreT5, coreT2, coreT6, coreLOS, coreT1, coreT3, coreT4]
   [junit4]   2> 1810542 WARN  (coreLoadExecutor-8676-thread-3-processing-x:core2) [    x:coreT6] o.a.s.c.Config Beginning with Solr 5.5, <mergePolicy> is deprecated, use <mergePolicyFactory> instead.
   [junit4]   2> 1810542 WARN  (coreLoadExecutor-8676-thread-1-processing-x:core2) [    x:coreT5] o.a.s.c.Config Beginning with Solr 5.5, <mergePolicy> is deprecated, use <mergePolicyFactory> instead.
   [junit4]   2> 1810542 WARN  (coreLoadExecutor-8676-thread-2-processing-x:core2) [    x:coreT2] o.a.s.c.Config Beginning with Solr 5.5, <mergePolicy> is deprecated, use <mergePolicyFactory> instead.
   [junit4]   2> 1810548 INFO  (coreLoadExecutor-8676-thread-3-processing-x:core2) [    x:coreT6] o.a.s.c.SolrConfig Using Lucene MatchVersion: 7.0.0
   [junit4]   2> 1810548 INFO  (coreLoadExecutor-8676-thread-2-processing-x:core2) [    x:coreT2] o.a.s.c.SolrConfig Using Lucene MatchVersion: 7.0.0
   [junit4]   2> 1810548 INFO  (coreLoadExecutor-8676-thread-1-processing-x:core2) [    x:coreT5] o.a.s.c.SolrConfig Using Lucene MatchVersion: 7.0.0
   [junit4]   2> 1810568 INFO  (coreLoadExecutor-8676-thread-2-processing-x:core2) [    x:coreT2] o.a.s.s.IndexSchema [coreT2] Schema name=tiny
   [junit4]   2> 1810568 INFO  (coreLoadExecutor-8676-thread-3-processing-x:core2) [    x:coreT6] o.a.s.s.IndexSchema [coreT6] Schema name=tiny
   [junit4]   2> 1810568 INFO  (coreLoadExecutor-8676-thread-1-processing-x:core2) [    x:coreT5] o.a.s.s.IndexSchema [coreT5] Schema name=tiny
   [junit4]   2> 1810576 INFO  (coreLoadExecutor-8676-thread-2-processing-x:core2) [    x:coreT2] o.a.s.s.IndexSchema Loaded schema tiny/1.1 with uniqueid field id
   [junit4]   2> 1810576 INFO  (coreLoadExecutor-8676-thread-3-processing-x:core2) [    x:coreT6] o.a.s.s.IndexSchema Loaded schema tiny/1.1 with uniqueid field id
   [junit4]   2> 1810576 INFO  (coreLoadExecutor-8676-thread-1-processing-x:core2) [    x:coreT5] o.a.s.s.IndexSchema Loaded schema tiny/1.1 with uniqueid field id
   [junit4]   2> 1810578 INFO  (coreLoadExecutor-8676-thread-2-processing-x:core2) [    x:coreT2] o.a.s.c.CoreContainer Creating SolrCore 'coreT2' using configuration from instancedir /export/home/jenkins/workspace/Lucene-Solr-master-Solaris/solr/build/solr-core/test/J1/temp/solr.core.TestCoreDiscovery_AE0619F197BA1E9D-001/tempDir-003/coreT2
   [junit4]   2> 1810578 INFO  (coreLoadExecutor-8676-thread-1-processing-x:core2) [    x:coreT5] o.a.s.c.CoreContainer Creating SolrCore 'coreT5' using configuration from instancedir /export/home/jenkins/workspace/Lucene-Solr-master-Solaris/solr/build/solr-core/test/J1/temp/solr.core.TestCoreDiscovery_AE0619F197BA1E9D-001/tempDir-003/coreT5
   [junit4]   2> 1810578 INFO  (coreLoadExecutor-8676-thread-3-processing-x:core2) [    x:coreT6] o.a.s.c.CoreContainer Creating SolrCore 'coreT6' using configuration from instancedir /export/home/jenkins/workspace/Lucene-Solr-master-Solaris/solr/build/solr-core/test/J1/temp/solr.core.TestCoreDiscovery_AE0619F197BA1E9D-001/tempDir-003/coreT6
   [junit4]   2> 1810579 INFO  (coreLoadExecutor-8676-thread-3-processing-x:core2) [    x:coreT6] o.a.s.c.SolrCore [[coreT6] ] Opening new SolrCore at [/export/home/jenkins/workspace/Lucene-Solr-master-Solaris/solr/build/solr-core/test/J1/temp/solr.core.TestCoreDiscovery_AE0619F197BA1E9D-001/tempDir-003/coreT6], dataDir=[/export/home/jenkins/workspace/Lucene-Solr-master-Solaris/solr/build/solr-core/test/J1/temp/solr.core.TestCoreDiscovery_AE0619F197BA1E9D-001/tempDir-003/coreT6/coreT6/]
   [junit4]   2> 1810579 INFO  (coreLoadExecutor-8676-thread-1-processing-x:core2) [    x:coreT5] o.a.s.c.SolrCore [[coreT5] ] Opening new SolrCore at [/export/home/jenkins/workspace/Lucene-Solr-master-Solaris/solr/build/solr-core/test/J1/temp/solr.core.TestCoreDiscovery_AE0619F197BA1E9D-001/tempDir-003/coreT5], dataDir=[/export/home/jenkins/workspace/Lucene-Solr-master-Solaris/solr/build/solr-core/test/J1/temp/solr.core.TestCoreDiscovery_AE0619F197BA1E9D-001/tempDir-003/coreT5/coreT5/]
   [junit4]   2> 1810579 INFO  (coreLoadExecutor-8676-thread-2-processing-x:core2) [    x:coreT2] o.a.s.c.SolrCore [[coreT2] ] Opening new SolrCore at [/export/home/jenkins/workspace/Lucene-Solr-master-Solaris/solr/build/solr-core/test/J1/temp/solr.core.TestCoreDiscovery_AE0619F197BA1E9D-001/tempDir-003/coreT2], dataDir=[/export/home/jenkins/workspace/Lucene-Solr-master-Solaris/solr/build/solr-core/test/J1/temp/solr.core.TestCoreDiscovery_AE0619F197BA1E9D-001/tempDir-003/coreT2/coreT2/]
   [junit4]   2> 1810580 INFO  (coreLoadExecutor-8676-thread-2-processing-x:core2) [    x:coreT2] o.a.s.u.RandomMergePolicy RandomMergePolicy wrapping class org.apache.lucene.index.LogDocMergePolicy: [LogDocMergePolicy: minMergeSize=1000, mergeFactor=26, maxMergeSize=9223372036854775807, maxMergeSizeForForcedMerge=9223372036854775807, calibrateSizeByDeletes=true, maxMergeDocs=2147483647, maxCFSSegmentSizeMB=8.796093022207999E12, noCFSRatio=0.7070498460770588]
   [junit4]   2> 1810580 INFO  (coreLoadExecutor-8676-thread-3-processing-x:core2) [    x:coreT6] o.a.s.u.RandomMergePolicy RandomMergePolicy wrapping class org.apache.lucene.index.LogDocMergePolicy: [LogDocMergePolicy: minMergeSize=1000, mergeFactor=26, maxMergeSize=9223372036854775807, maxMergeSizeForForcedMerge=9223372036854775807, calibrateSizeByDeletes=true, maxMergeDocs=2147483647, maxCFSSegmentSizeMB=8.796093022207999E12, noCFSRatio=0.7070498460770588]
   [junit4]   2> 1810580 INFO  (coreLoadExecutor-8676-thread-1-processing-x:core2) [    x:coreT5] o.a.s.u.RandomMergePolicy RandomMergePolicy wrapping class org.apache.lucene.index.LogDocMergePolicy: [LogDocMergePolicy: minMergeSize=1000, mergeFactor=26, maxMergeSize=9223372036854775807, maxMergeSizeForForcedMerge=9223372036854775807, calibrateSizeByDeletes=true, maxMergeDocs=2147483647, maxCFSSegmentSizeMB=8.796093022207999E12, noCFSRatio=0.7070498460770588]
   [junit4]   2> 1810591 INFO  (coreLoadExecutor-8676-thread-2-processing-x:core2) [    x:coreT2] o.a.s.u.CommitTracker Hard AutoCommit: disabled
   [junit4]   2> 1810591 INFO  (coreLoadExecutor-8676-thread-2-processing-x:core2) [    x:coreT2] o.a.s.u.CommitTracker Soft AutoCommit: disabled
   [junit4]   2> 1810592 INFO  (coreLoadExecutor-8676-thread-2-processing-x:core2) [    x:coreT2] o.a.s.u.RandomMergePolicy RandomMergePolicy wrapping class org.apache.lucene.index.LogByteSizeMergePolicy: [LogByteSizeMergePolicy: minMergeSize=1677721, mergeFactor=40, maxMergeSize=2147483648, maxMergeSizeForForcedMerge=9223372036854775807, calibrateSizeByDeletes=true, maxMergeDocs=2147483647, maxCFSSegmentSizeMB=8.796093022207999E12, noCFSRatio=0.4178930543356525]
   [junit4]   2> 1810592 INFO  (coreLoadExecutor-8676-thread-2-processing-x:core2) [    x:coreT2] o.a.s.s.SolrIndexSearcher Opening [Searcher@37db7737[coreT2] main]
   [junit4]   2> 1810592 INFO  (coreLoadExecutor-8676-thread-2-processing-x:core2) [    x:coreT2] o.a.s.r.ManagedResourceStorage File-based storage initialized to use dir: /export/home/jenkins/workspace/Lucene-Solr-master-Solaris/solr/build/solr-core/test/J1/temp/solr.core.TestCoreDiscovery_AE0619F197BA1E9D-001/tempDir-003/coreT2/conf
   [junit4]   2> 1810592 INFO  (coreLoadExecutor-8676-thread-2-processing-x:core2) [    x:coreT2] o.a.s.h.ReplicationHandler Commits will be reserved for  10000
   [junit4]   2> 1810595 INFO  (coreLoadExecutor-8676-thread-3-processing-x:core2) [    x:coreT6] o.a.s.u.CommitTracker Hard AutoCommit: disabled
   [junit4]   2> 1810595 INFO  (coreLoadExecutor-8676-thread-3-processing-x:core2) [    x:coreT6] o.a.s.u.CommitTracker Soft AutoCommit: disabled
   [junit4]   2> 1810595 INFO  (coreLoadExecutor-8676-thread-1-processing-x:core2) [    x:coreT5] o.a.s.u.CommitTracker Hard AutoCommit: disabled
   [junit4]   2> 1810595 INFO  (coreLoadExecutor-8676-thread-3-processing-x:core2) [    x:coreT6] o.a.s.u.RandomMergePolicy RandomMergePolicy wrapping class org.apache.lucene.index.LogByteSizeMergePolicy: [LogByteSizeMergePolicy: minMergeSize=1677721, mergeFactor=40, maxMergeSize=2147483648, maxMergeSizeForForcedMerge=9223372036854775807, calibrateSizeByDeletes=true, maxMergeDocs=2147483647, maxCFSSegmentSizeMB=8.796093022207999E12, noCFSRatio=0.4178930543356525]
   [junit4]   2> 1810595 INFO  (coreLoadExecutor-8676-thread-1-processing-x:core2) [    x:coreT5] o.a.s.u.CommitTracker Soft AutoCommit: disabled
   [junit4]   2> 1810595 INFO  (coreLoadExecutor-8676-thread-1-processing-x:core2) [    x:coreT5] o.a.s.u.RandomMergePolicy RandomMergePolicy wrapping class org.apache.lucene.index.LogByteSizeMergePolicy: [LogByteSizeMergePolicy: minMergeSize=1677721, mergeFactor=40, maxMergeSize=2147483648, maxMergeSizeForForcedMerge=9223372036854775807, calibrateSizeByDeletes=true, maxMergeDocs=2147483647, maxCFSSegmentSizeMB=8.796093022207999E12, noCFSRatio=0.4178930543356525]
   [junit4]   2> 1810595 INFO  (coreLoadExecutor-8676-thread-3-processing-x:core2) [    x:coreT6] o.a.s.s.SolrIndexSearcher Opening [Searcher@58cfbd55[coreT6] main]
   [junit4]   2> 1810595 INFO  (coreLoadExecutor-8676-thread-1-processing-x:core2) [    x:coreT5] o.a.s.s.SolrIndexSearcher Opening [Searcher@466a8dfc[coreT5] main]
   [junit4]   2> 1810595 INFO  (coreLoadExecutor-8676-thread-3-processing-x:core2) [    x:coreT6] o.a.s.r.ManagedResourceStorage File-based storage initialized to use dir: /export/home/jenkins/workspace/Lucene-Solr-master-Solaris/solr/build/solr-core/test/J1/temp/solr.core.TestCoreDiscovery_AE0619F197BA1E9D-001/tempDir-003/coreT6/conf
   [junit4]   2> 1810595 INFO  (coreLoadExecutor-8676-thread-1-processing-x:core2) [    x:coreT5] o.a.s.r.ManagedResourceStorage File-based storage initialized to use dir: /export/home/jenkins/workspace/Lucene-Solr-master-Solaris/solr/build/solr-core/test/J1/temp/solr.core.TestCoreDiscovery_AE0619F197BA1E9D-001/tempDir-003/coreT5/conf
   [junit4]   2> 1810596 INFO  (coreLoadExecutor-8676-thread-1-processing-x:core2) [    x:coreT5] o.a.s.h.ReplicationHandler Commits will be reserved for  10000
   [junit4]   2> 1810596 INFO  (coreLoadExecutor-8676-thread-1-processing-x:core2) [    x:coreT5] o.a.s.c.SolrCores Opening transient core coreT5
   [junit4]   2> 1810601 INFO  (coreLoadExecutor-8676-thread-3-processing-x:core2) [    x:coreT6] o.a.s.h.ReplicationHandler Commits will be reserved for  10000
   [junit4]   2> 1810601 INFO  (coreLoadExecutor-8676-thread-3-processing-x:core2) [    x:coreT6] o.a.s.c.SolrCores Opening transient core coreT6
   [junit4]   2> 1810602 INFO  (searcherExecutor-8679-thread-1-processing-x:coreT6) [    x:coreT6] o.a.s.c.SolrCore [coreT6] Registered new searcher Searcher@58cfbd55[coreT6] main{ExitableDirectoryReader(UninvertingDirectoryReader())}
   [junit4]   2> 1810609 INFO  (searcherExecutor-8677-thread-1-processing-x:coreT2) [    x:coreT2] o.a.s.c.SolrCore [coreT2] Registered new searcher Searcher@37db7737[coreT2] main{ExitableDirectoryReader(UninvertingDirectoryReader())}
   [junit4]   2> 1810593 INFO  (coreLoadExecutor-8676-thread-2-processing-x:core2) [    x:coreT2] o.a.s.c.SolrCores Opening transient core coreT2
   [junit4]   2> 1810611 INFO  (coreLoadExecutor-8676-thread-2-processing-x:core2) [    x:coreT2] o.a.s.c.SolrCores Closing transient core [coreT5]
   [junit4]   2> 1810617 INFO  (searcherExecutor-8678-thread-1-processing-x:coreT5) [    x:coreT5] o.a.s.c.SolrCore [coreT5] Registered new searcher Searcher@466a8dfc[coreT5] main{ExitableDirectoryReader(UninvertingDirectoryReader())}
   [junit4]   2> 1810610 WARN  (coreLoadExecutor-8676-thread-1-processing-x:core2) [    x:core2] o.a.s.c.Config Beginning with Solr 5.5, <mergePolicy> is deprecated, use <mergePolicyFactory> instead.
   [junit4]   2> 1810618 WARN  (coreLoadExecutor-8676-thread-2-processing-x:core2) [    x:core2] o.a.s.c.Config Beginning with Solr 5.5, <mergePolicy> is deprecated, use <mergePolicyFactory> instead.
   [junit4]   2> 1810618 INFO  (coreLoadExecutor-8676-thread-1-processing-x:core2) [    x:core2] o.a.s.c.SolrConfig Using Lucene MatchVersion: 7.0.0
   [junit4]   2> 1810618 INFO  (coreLoadExecutor-8676-thread-2-processing-x:core2) [    x:core2] o.a.s.c.SolrConfig Using Lucene MatchVersion: 7.0.0
   [junit4]   2> 1810624 INFO  (Thread-4812) [    x:core2] o.a.s.c.SolrCore [coreT5]  CLOSING SolrCore org.apache.solr.core.SolrCore@7f0231ca
   [junit4]   2> 1810632 INFO  (Thread-4812) [    x:core2] o.a.s.m.SolrMetricManager Closing metric reporters for: solr.core.coreT5
   [junit4]   2> 1810642 INFO  (coreLoadExecutor-8676-thread-2-processing-x:core2) [    x:core2] o.a.s.s.IndexSchema [coreT3] Schema name=tiny
   [junit4]   2> 1810645 INFO  (coreLoadExecutor-8676-thread-2-processing-x:core2) [    x:core2] o.a.s.s.IndexSchema Loaded schema tiny/1.1 with uniqueid field id
   [junit4]   2> 1810646 INFO  (coreLoadExecutor-8676-thread-2-processing-x:core2) [    x:core2] o.a.s.c.CoreContainer Creating SolrCore 'coreT3' using configuration from instancedir /export/home/jenkins/workspace/Lucene-Solr-master-Solaris/solr/build/solr-core/test/J1/temp/solr.core.TestCoreDiscovery_AE0619F197BA1E9D-001/tempDir-003/coreT3
   [junit4]   2> 1810646 INFO  (coreLoadExecutor-8676-thread-2-processing-x:core2) [    x:core2] o.a.s.c.SolrCore [[coreT3] ] Opening new SolrCore at [/export/home/jenkins/workspace/Lucene-Solr-master-Solaris/solr/build/solr-core/test/J1/temp/solr.core.TestCoreDiscovery_AE0619F197BA1E9D-001/tempDir-003/coreT3], dataDir=[/export/home/jenkins/workspace/Lucene-Solr-master-Solaris/solr/build/solr-core/test/J1/temp/solr.core.TestCoreDiscovery_AE0619F197BA1E9D-001/tempDir-003/coreT3/coreT3/]
   [junit4]   2> 1810647 INFO  (coreLoadExecutor-8676-thread-2-processing-x:core2) [    x:core2] o.a.s.u.RandomMergePolicy RandomMergePolicy wrapping class org.apache.lucene.index.TieredMergePolicy: [TieredMergePolicy: maxMergeAtOnce=39, maxMergeAtOnceExplicit=30, maxMergedSegmentMB=83.0517578125, floorSegmentMB=1.5078125, forceMergeDeletesPctAllowed=7.660455053930183, segmentsPerTier=22.0, maxCFSSegmentSizeMB=8.796093022207999E12, noCFSRatio=0.0
   [junit4]   2> 1810657 INFO  (coreLoadExecutor-8676-thread-2-processing-x:core2) [    x:core2] o.a.s.u.CommitTracker Hard AutoCommit: disabled
   [junit4]   2> 1810657 INFO  (coreLoadExecutor-8676-thread-2-processing-x:core2) [    x:core2] o.a.s.u.CommitTracker Soft AutoCommit: disabled
   [junit4]   2> 1810657 INFO  (coreLoadExecutor-8676-thread-2-processing-x:core2) [    x:core2] o.a.s.u.RandomMergePolicy RandomMergePolicy wrapping class org.apache.lucene.index.TieredMergePolicy: [TieredMergePolicy: maxMergeAtOnce=38, maxMergeAtOnceExplicit=33, maxMergedSegmentMB=87.337890625, floorSegmentMB=1.771484375, forceMergeDeletesPctAllowed=17.482917072542772, segmentsPerTier=14.0, maxCFSSegmentSizeMB=8.796093022207999E12, noCFSRatio=0.7892525634581441
   [junit4]   2> 1810657 INFO  (coreLoadExecutor-8676-thread-2-processing-x:core2) [    x:core2] o.a.s.s.SolrIndexSearcher Opening [Searcher@524c64f[coreT3] main]
   [junit4]   2> 1810657 INFO  (coreLoadExecutor-8676-thread-2-processing-x:core2) [    x:core2] o.a.s.r.ManagedResourceStorage File-based storage initialized to use dir: /export/home/jenkins/workspace/Lucene-Solr-master-Solaris/solr/build/solr-core/test/J1/temp/solr.core.TestCoreDiscovery_AE0619F197BA1E9D-001/tempDir-003/coreT3/conf
   [junit4]   2> 1810658 INFO  (coreLoadExecutor-8676-thread-2-processing-x:core2) [    x:core2] o.a.s.h.ReplicationHandler Commits will be reserved for  10000
   [junit4]   2> 1810658 INFO  (coreLoadExecutor-8676-thread-2-processing-x:core2) [    x:core2] o.a.s.c.SolrCores Opening transient core coreT3
   [junit4]   2> 1810658 INFO  (coreLoadExecutor-8676-thread-2-processing-x:core2) [    x:core2] o.a.s.c.SolrCores Closing transient core [coreT6]
   [junit4]   2> 1810658 INFO  (searcherExecutor-8689-thread-1-processing-x:core2) [    x:core2] o.a.s.c.SolrCore [coreT3] Registered new searcher Searcher@524c64f[coreT3] main{ExitableDirectoryReader(UninvertingDirectoryReader())}
   [junit4]   2> 1810659 INFO  (coreLoadExecutor-8676-thread-1-processing-x:core2) [    x:core2] o.a.s.s.IndexSchema [coreLOS] Schema name=tiny
   [junit4]   2> 1810662 INFO  (coreLoadExecutor-8676-thread-1-processing-x:core2) [    x:core2] o.a.s.s.IndexSchema Loaded schema tiny/1.1 with uniqueid field id
   [junit4]   2> 1810663 INFO  (Thread-4812) [    x:core2] o.a.s.c.SolrCore [coreT6]  CLOSING SolrCore org.apache.solr.core.SolrCore@76b7b56a
   [junit4]   2> 1810665 INFO  (coreLoadExecutor-8676-thread-1-processing-x:core2) [    x:core2] o.a.s.c.CoreContainer Creating SolrCore 'coreLOS' using configuration from instancedir /export/home/jenkins/workspace/Lucene-Solr-master-Solaris/solr/build/solr-core/test/J1/temp/solr.core.TestCoreDiscovery_AE0619F197BA1E9D-001/tempDir-003/coreLOS
   [junit4]   2> 1810665 INFO  (coreLoadExecutor-8676-thread-1-processing-x:core2) [    x:core2] o.a.s.c.SolrCore [[coreLOS] ] Opening new SolrCore at [/export/home/jenkins/workspace/Lucene-Solr-master-Solaris/solr/build/solr-core/test/J1/temp/solr.core.TestCoreDiscovery_AE0619F197BA1E9D-001/tempDir-003/coreLOS], dataDir=[/export/home/jenkins/workspace/Lucene-Solr-master-Solaris/solr/build/solr-core/test/J1/temp/solr.core.TestCoreDiscovery_AE0619F197BA1E9D-001/tempDir-003/coreLOS/coreLOS/]
   [junit4]   2> 1810666 INFO  (coreLoadExecutor-8676-thread-1-processing-x:core2) [    x:core2] o.a.s.u.RandomMergePolicy RandomMergePolicy wrapping class org.apache.lucene.index.TieredMergePolicy: [TieredMergePolicy: maxMergeAtOnce=39, maxMergeAtOnceExplicit=30, maxMergedSegmentMB=83.0517578125, floorSegmentMB=1.5078125, forceMergeDeletesPctAllowed=7.660455053930183, segmentsPerTier=22.0, maxCFSSegmentSizeMB=8.796093022207999E12, noCFSRatio=0.0
   [junit4]   2> 1810679 INFO  (Thread-4812) [    x:core2] o.a.s.m.SolrMetricManager Closing metric reporters for: solr.core.coreT6
   [junit4]   2> 1810681 WARN  (coreLoadExecutor-8676-thread-2-processing-x:core2) [    x:core2] o.a.s.c.Config Beginning with Solr 5.5, <mergePolicy> is deprecated, use <mergePolicyFactory> instead.
   [junit4]   2> 1810681 INFO  (coreLoadExecutor-8676-thread-2-processing-x:core2) [    x:core2] o.a.s.c.SolrConfig Using Lucene MatchVersion: 7.0.0
   [junit4]   2> 1810689 WARN  (coreLoadExecutor-8676-thread-3-processing-x:core2) [    x:core2] o.a.s.c.Config Beginning with Solr 5.5, <mergePolicy> is deprecated, use <mergePolicyFactory> instead.
   [junit4]   2> 1810689 INFO  (coreLoadExecutor-8676-thread-3-processing-x:core2) [    x:core2] o.a.s.c.SolrConfig Using Lucene MatchVersion: 7.0.0
   [junit4]   2> 1810704 INFO  (coreLoadExecutor-8676-thread-1-processing-x:core2) [    x:core2] o.a.s.u.CommitTracker Hard AutoCommit: disabled
   [junit4]   2> 1810704 INFO  (coreLoadExecutor-8676-thread-1-processing-x:core2) [    x:core2] o.a.s.u.CommitTracker Soft AutoCommit: disabled
   [junit4]   2> 1810704 INFO  (coreLoadExecutor-8676-thread-3-processing-x:core2) [    x:core2] o.a.s.s.IndexSchema [coreT1] Schema name=tiny
   [junit4]   2> 1810705 INFO  (coreLoadExecutor-8676-thread-1-processing-x:core2) [    x:core2] o.a.s.u.RandomMergePolicy RandomMergePolicy wrapping class org.apache.lucene.index.TieredMergePolicy: [TieredMergePolicy: maxMergeAtOnce=38, maxMergeAtOnceExplicit=33, maxMergedSegmentMB=87.337890625, floorSegmentMB=1.771484375, forceMergeDeletesPctAllowed=17.482917072542772, segmentsPerTier=14.0, maxCFSSegmentSizeMB=8.796093022207999E12, noCFSRatio=0.7892525634581441
   [junit4]   2> 1810705 INFO  (coreLoadExecutor-8676-thread-1-processing-x:core2) [    x:core2] o.a.s.s.SolrIndexSearcher Opening [Searcher@769daf48[coreLOS] main]
   [junit4]   2> 1810706 INFO  (coreLoadExecutor-8676-thread-1-processing-x:core2) [    x:core2] o.a.s.r.ManagedResourceStorage File-based storage initialized to use dir: /export/home/jenkins/workspace/Lucene-Solr-master-Solaris/solr/build/solr-core/test/J1/temp/solr.core.TestCoreDiscovery_AE0619F197BA1E9D-001/tempDir-003/coreLOS/conf
   [junit4]   2> 1810706 INFO  (coreLoadExecutor-8676-thread-1-processing-x:core2) [    x:core2] o.a.s.h.ReplicationHandler Commits will be reserved for  10000
   [junit4]   2> 1810707 INFO  (searcherExecutor-8693-thread-1-processing-x:core2) [    x:core2] o.a.s.c.SolrCore [coreLOS] Registered new searcher Searcher@769daf48[coreLOS] main{ExitableDirectoryReader(UninvertingDirectoryReader())}
   [junit4]   2> 1810707 INFO  (coreLoadExecutor-8676-thread-3-processing-x:core2) [    x:core2] o.a.s.s.IndexSchema Loaded schema tiny/1.1 with uniqueid field id
   [junit4]   2> 1810708 INFO  (coreLoadExecutor-8676-thread-3-processing-x:core2) [    x:core2] o.a.s.c.CoreContainer Creating SolrCore 'coreT1' using configuration from instancedir /export/home/jenkins/workspace/Lucene-Solr-master-Solaris/solr/build/solr-core/test/J1/temp/solr.core.TestCoreDiscovery_AE0619F197BA1E9D-001/tempDir-003/coreT1
   [junit4]   2> 1810708 INFO  (coreLoadExecutor-8676-thread-3-processing-x:core2) [    x:core2] o.a.s.c.SolrCore [[coreT1] ] Opening new SolrCore at [/export/home/jenkins/workspace/Lucene-Solr-master-Solaris/solr/build/solr-core/test/J1/temp/solr.core.TestCoreDiscovery_AE0619F197BA1E9D-001/tempDir-003/coreT1], dataDir=[/export/home/jenkins/workspace/Lucene-Solr-master-Solaris/solr/build/solr-core/test/J1/temp/solr.core.TestCoreDiscovery_AE0619F197BA1E9D-001/tempDir-003/coreT1/coreT1/]
   [junit4]   2> 1810709 INFO  (coreLoadEx

[...truncated too long message...]

uzzyAnalyzedSuggestions, TestFieldCacheSanityChecker, FullHLLTest, SolrInfoMBeanTest, TestSubQueryTransformer, DirectUpdateHandlerOptimizeTest, DistributedExpandComponentTest, DeleteInactiveReplicaTest, DistributedQueryComponentOptimizationTest, BasicDistributedZk2Test, OverseerStatusTest, SuggesterTSTTest, TestJavabinTupleStreamParser, TestConfigSetsAPI, TestFieldCacheWithThreads, ManagedSchemaRoundRobinCloudTest, TestRandomFaceting, TestCopyFieldCollectionResource, TestDynamicFieldCollectionResource, TestStressRecovery, TestSha256AuthenticationProvider, ExitableDirectoryReaderTest, BlockCacheTest, TestSerializedLuceneMatchVersion, TestLuceneMatchVersion, FullSolrCloudDistribCmdsTest, TestConfig, LeaderElectionContextKeyTest, OverriddenZkACLAndCredentialsProvidersTest, InfoHandlerTest, ResponseLogComponentTest, TestComponentsName, DeleteShardTest, TestDynamicLoading, TestRecovery, PreAnalyzedFieldTest, LukeRequestHandlerTest, DistributedTermsComponentTest, TestTrie, NoCacheHeaderTest, TestConfigSetsAPIZkFailure, EchoParamsTest, SecurityConfHandlerTest, NotRequiredUniqueKeyTest, BasicAuthIntegrationTest, SliceStateTest, ZkStateReaderTest, TestJoin, LeaderElectionIntegrationTest, TestUnifiedSolrHighlighter, ZkSolrClientTest, CollectionReloadTest, DistributedFacetPivotWhiteBoxTest, FieldMutatingUpdateProcessorTest, TestLeaderElectionZkExpiry, CdcrReplicationHandlerTest, DistributedFacetPivotLargeTest, SolrIndexSplitterTest, TestSolr4Spatial2, ReplicationFactorTest, TermVectorComponentDistributedTest, CoreAdminHandlerTest, TermVectorComponentTest, TestSystemIdResolver, TestReload, CoreAdminRequestStatusTest, HdfsRecoverLeaseTest, TestNRTOpen, PKIAuthenticationIntegrationTest, AnalyticsMergeStrategyTest, TestSchemaSimilarityResource, SuggestComponentContextFilterQueryTest, TriLevelCompositeIdRoutingTest, TestClassicSimilarityFactory, WrapperMergePolicyFactoryTest, DeleteNodeTest, BlockJoinFacetRandomTest, FieldAnalysisRequestHandlerTest, SuggesterTest, CdcrBootstrapTest, ClusterStateTest, BigEndianAscendingWordDeserializerTest, RankQueryTest, CoreSorterTest, BadCopyFieldTest, SharedFSAutoReplicaFailoverTest, TestIndexSearcher, WordBreakSolrSpellCheckerTest, TestFiltering, HighlighterConfigTest, TestSolr4Spatial, TestZkChroot, AnalysisErrorHandlingTest, DistanceFunctionTest, CollectionsAPIDistributedZkTest, BasicZkTest, TestReplicationHandler, TestDistributedGrouping, TestStressReorder, TestStressVersions, TestCoreContainer, SimpleFacetsTest, SolrCoreTest, SpellCheckComponentTest, QueryElevationComponentTest, TestSort, ShowFileRequestHandlerTest, CurrencyFieldXmlFileTest, TestCoreDiscovery]
   [junit4]   2> NOTE: reproduce with: ant test  -Dtestcase=TestCoreDiscovery -Dtests.seed=AE0619F197BA1E9D -Dtests.slow=true -Dtests.locale=fr-CH -Dtests.timezone=America/Argentina/Tucuman -Dtests.asserts=true -Dtests.file.encoding=UTF-8
   [junit4] ERROR   0.00s J1 | TestCoreDiscovery (suite) <<<
   [junit4]    > Throwable #1: java.lang.AssertionError: ObjectTracker found 5 object(s) that were not released!!! [MockDirectoryWrapper, SolrCore, MockDirectoryWrapper, MockDirectoryWrapper, MDCAwareThreadPoolExecutor]
   [junit4]    > org.apache.solr.common.util.ObjectReleaseTracker$ObjectTrackerException
   [junit4]    > 	at org.apache.solr.common.util.ObjectReleaseTracker.track(ObjectReleaseTracker.java:43)
   [junit4]    > 	at org.apache.solr.core.CachingDirectoryFactory.get(CachingDirectoryFactory.java:347)
   [junit4]    > 	at org.apache.solr.core.SolrCore.getNewIndexDir(SolrCore.java:343)
   [junit4]    > 	at org.apache.solr.core.SolrCore.initIndex(SolrCore.java:683)
   [junit4]    > 	at org.apache.solr.core.SolrCore.<init>(SolrCore.java:901)
   [junit4]    > 	at org.apache.solr.core.SolrCore.<init>(SolrCore.java:817)
   [junit4]    > 	at org.apache.solr.core.CoreContainer.create(CoreContainer.java:902)
   [junit4]    > 	at org.apache.solr.core.CoreContainer.getCore(CoreContainer.java:1176)
   [junit4]    > 	at org.apache.solr.core.TestCoreDiscovery.testTooManyTransientCores(TestCoreDiscovery.java:211)
   [junit4]    > 	at java.lang.Thread.run(Thread.java:745)
   [junit4]    > org.apache.solr.common.util.ObjectReleaseTracker$ObjectTrackerException
   [junit4]    > 	at org.apache.solr.common.util.ObjectReleaseTracker.track(ObjectReleaseTracker.java:43)
   [junit4]    > 	at org.apache.solr.core.SolrCore.<init>(SolrCore.java:991)
   [junit4]    > 	at org.apache.solr.core.SolrCore.<init>(SolrCore.java:817)
   [junit4]    > 	at org.apache.solr.core.CoreContainer.create(CoreContainer.java:902)
   [junit4]    > 	at org.apache.solr.core.CoreContainer.getCore(CoreContainer.java:1176)
   [junit4]    > 	at org.apache.solr.core.TestCoreDiscovery.testTooManyTransientCores(TestCoreDiscovery.java:211)
   [junit4]    > 	at java.lang.Thread.run(Thread.java:745)
   [junit4]    > org.apache.solr.common.util.ObjectReleaseTracker$ObjectTrackerException
   [junit4]    > 	at org.apache.solr.common.util.ObjectReleaseTracker.track(ObjectReleaseTracker.java:43)
   [junit4]    > 	at org.apache.solr.core.CachingDirectoryFactory.get(CachingDirectoryFactory.java:347)
   [junit4]    > 	at org.apache.solr.core.SolrCore.initSnapshotMetaDataManager(SolrCore.java:458)
   [junit4]    > 	at org.apache.solr.core.SolrCore.<init>(SolrCore.java:895)
   [junit4]    > 	at org.apache.solr.core.SolrCore.<init>(SolrCore.java:817)
   [junit4]    > 	at org.apache.solr.core.CoreContainer.create(CoreContainer.java:902)
   [junit4]    > 	at org.apache.solr.core.CoreContainer.getCore(CoreContainer.java:1176)
   [junit4]    > 	at org.apache.solr.core.TestCoreDiscovery.testTooManyTransientCores(TestCoreDiscovery.java:211)
   [junit4]    > 	at java.lang.Thread.run(Thread.java:745)
   [junit4]    > org.apache.solr.common.util.ObjectReleaseTracker$ObjectTrackerException
   [junit4]    > 	at org.apache.solr.common.util.ObjectReleaseTracker.track(ObjectReleaseTracker.java:43)
   [junit4]    > 	at org.apache.solr.core.CachingDirectoryFactory.get(CachingDirectoryFactory.java:347)
   [junit4]    > 	at org.apache.solr.update.SolrIndexWriter.create(SolrIndexWriter.java:66)
   [junit4]    > 	at org.apache.solr.core.SolrCore.initIndex(SolrCore.java:715)
   [junit4]    > 	at org.apache.solr.core.SolrCore.<init>(SolrCore.java:901)
   [junit4]    > 	at org.apache.solr.core.SolrCore.<init>(SolrCore.java:817)
   [junit4]    > 	at org.apache.solr.core.CoreContainer.create(CoreContainer.java:902)
   [junit4]    > 	at org.apache.solr.core.CoreContainer.getCore(CoreContainer.java:1176)
   [junit4]    > 	at org.apache.solr.core.TestCoreDiscovery.testTooManyTransientCores(TestCoreDiscovery.java:211)
   [junit4]    > 	at java.lang.Thread.run(Thread.java:745)
   [junit4]    > org.apache.solr.common.util.ObjectReleaseTracker$ObjectTrackerException
   [junit4]    > 	at org.apache.solr.common.util.ObjectReleaseTracker.track(ObjectReleaseTracker.java:43)
   [junit4]    > 	at org.apache.solr.core.SolrCore.<init>(SolrCore.java:840)
   [junit4]    > 	at org.apache.solr.core.SolrCore.<init>(SolrCore.java:817)
   [junit4]    > 	at org.apache.solr.core.CoreContainer.create(CoreContainer.java:902)
   [junit4]    > 	at org.apache.solr.core.CoreContainer.getCore(CoreContainer.java:1176)
   [junit4]    > 	at org.apache.solr.core.TestCoreDiscovery.testTooManyTransientCores(TestCoreDiscovery.java:211)
   [junit4]    > 	at java.lang.Thread.run(Thread.java:745)
   [junit4]    > 	at __randomizedtesting.SeedInfo.seed([AE0619F197BA1E9D]:0)
   [junit4]    > 	at org.apache.solr.SolrTestCaseJ4.teardownTestCases(SolrTestCaseJ4.java:266)
   [junit4]    > 	at java.lang.Thread.run(Thread.java:745)Throwable #2: com.carrotsearch.randomizedtesting.ThreadLeakError: 1 thread leaked from SUITE scope at org.apache.solr.core.TestCoreDiscovery: 
   [junit4]    >    1) Thread[id=42482, name=searcherExecutor-8713-thread-1, state=WAITING, group=TGRP-TestCoreDiscovery]
   [junit4]    >         at sun.misc.Unsafe.park(Native Method)
   [junit4]    >         at java.util.concurrent.locks.LockSupport.park(LockSupport.java:175)
   [junit4]    >         at java.util.concurrent.locks.AbstractQueuedSynchronizer$ConditionObject.await(AbstractQueuedSynchronizer.java:2039)
   [junit4]    >         at java.util.concurrent.LinkedBlockingQueue.take(LinkedBlockingQueue.java:442)
   [junit4]    >         at java.util.concurrent.ThreadPoolExecutor.getTask(ThreadPoolExecutor.java:1067)
   [junit4]    >         at java.util.concurrent.ThreadPoolExecutor.runWorker(ThreadPoolExecutor.java:1127)
   [junit4]    >         at java.util.concurrent.ThreadPoolExecutor$Worker.run(ThreadPoolExecutor.java:617)
   [junit4]    >         at java.lang.Thread.run(Thread.java:745)
   [junit4]    > 	at __randomizedtesting.SeedInfo.seed([AE0619F197BA1E9D]:0)Throwable #3: com.carrotsearch.randomizedtesting.ThreadLeakError: There are still zombie threads that couldn't be terminated:
   [junit4]    >    1) Thread[id=42482, name=searcherExecutor-8713-thread-1, state=WAITING, group=TGRP-TestCoreDiscovery]
   [junit4]    >         at sun.misc.Unsafe.park(Native Method)
   [junit4]    >         at java.util.concurrent.locks.LockSupport.park(LockSupport.java:175)
   [junit4]    >         at java.util.concurrent.locks.AbstractQueuedSynchronizer$ConditionObject.await(AbstractQueuedSynchronizer.java:2039)
   [junit4]    >         at java.util.concurrent.LinkedBlockingQueue.take(LinkedBlockingQueue.java:442)
   [junit4]    >         at java.util.concurrent.ThreadPoolExecutor.getTask(ThreadPoolExecutor.java:1067)
   [junit4]    >         at java.util.concurrent.ThreadPoolExecutor.runWorker(ThreadPoolExecutor.java:1127)
   [junit4]    >         at java.util.concurrent.ThreadPoolExecutor$Worker.run(ThreadPoolExecutor.java:617)
   [junit4]    >         at java.lang.Thread.run(Thread.java:745)
   [junit4]    > 	at __randomizedtesting.SeedInfo.seed([AE0619F197BA1E9D]:0)
   [junit4] Completed [464/670 (1!)] on J1 in 177.59s, 12 tests, 1 failure, 2 errors <<< FAILURES!

[...truncated 63100 lines...]


Mime
View raw message