lucene-dev mailing list archives

Site index · List index
Message view « Date » · « Thread »
Top « Date » · « Thread »
From Policeman Jenkins Server <jenk...@thetaphi.de>
Subject [JENKINS] Lucene-Solr-master-Windows (64bit/jdk1.8.0_112) - Build # 6284 - Still Unstable!
Date Mon, 12 Dec 2016 22:42:12 GMT
Build: https://jenkins.thetaphi.de/job/Lucene-Solr-master-Windows/6284/
Java: 64bit/jdk1.8.0_112 -XX:+UseCompressedOops -XX:+UseConcMarkSweepGC

1 tests failed.
FAILED:  org.apache.solr.update.AutoCommitTest.testCommitWithin

Error Message:
Exception during query

Stack Trace:
java.lang.RuntimeException: Exception during query
	at __randomizedtesting.SeedInfo.seed([95ACF757C15EC4C9:2F7E982F42702ADC]:0)
	at org.apache.solr.SolrTestCaseJ4.assertQ(SolrTestCaseJ4.java:818)
	at org.apache.solr.update.AutoCommitTest.testCommitWithin(AutoCommitTest.java:353)
	at sun.reflect.NativeMethodAccessorImpl.invoke0(Native Method)
	at sun.reflect.NativeMethodAccessorImpl.invoke(NativeMethodAccessorImpl.java:62)
	at sun.reflect.DelegatingMethodAccessorImpl.invoke(DelegatingMethodAccessorImpl.java:43)
	at java.lang.reflect.Method.invoke(Method.java:498)
	at com.carrotsearch.randomizedtesting.RandomizedRunner.invoke(RandomizedRunner.java:1713)
	at com.carrotsearch.randomizedtesting.RandomizedRunner$8.evaluate(RandomizedRunner.java:907)
	at com.carrotsearch.randomizedtesting.RandomizedRunner$9.evaluate(RandomizedRunner.java:943)
	at com.carrotsearch.randomizedtesting.RandomizedRunner$10.evaluate(RandomizedRunner.java:957)
	at com.carrotsearch.randomizedtesting.rules.SystemPropertiesRestoreRule$1.evaluate(SystemPropertiesRestoreRule.java:57)
	at org.apache.lucene.util.TestRuleSetupTeardownChained$1.evaluate(TestRuleSetupTeardownChained.java:49)
	at org.apache.lucene.util.AbstractBeforeAfterRule$1.evaluate(AbstractBeforeAfterRule.java:45)
	at org.apache.lucene.util.TestRuleThreadAndTestName$1.evaluate(TestRuleThreadAndTestName.java:48)
	at org.apache.lucene.util.TestRuleIgnoreAfterMaxFailures$1.evaluate(TestRuleIgnoreAfterMaxFailures.java:64)
	at org.apache.lucene.util.TestRuleMarkFailure$1.evaluate(TestRuleMarkFailure.java:47)
	at com.carrotsearch.randomizedtesting.rules.StatementAdapter.evaluate(StatementAdapter.java:36)
	at com.carrotsearch.randomizedtesting.ThreadLeakControl$StatementRunner.run(ThreadLeakControl.java:367)
	at com.carrotsearch.randomizedtesting.ThreadLeakControl.forkTimeoutingTask(ThreadLeakControl.java:811)
	at com.carrotsearch.randomizedtesting.ThreadLeakControl$3.evaluate(ThreadLeakControl.java:462)
	at com.carrotsearch.randomizedtesting.RandomizedRunner.runSingleTest(RandomizedRunner.java:916)
	at com.carrotsearch.randomizedtesting.RandomizedRunner$5.evaluate(RandomizedRunner.java:802)
	at com.carrotsearch.randomizedtesting.RandomizedRunner$6.evaluate(RandomizedRunner.java:852)
	at com.carrotsearch.randomizedtesting.RandomizedRunner$7.evaluate(RandomizedRunner.java:863)
	at com.carrotsearch.randomizedtesting.rules.StatementAdapter.evaluate(StatementAdapter.java:36)
	at com.carrotsearch.randomizedtesting.rules.SystemPropertiesRestoreRule$1.evaluate(SystemPropertiesRestoreRule.java:57)
	at org.apache.lucene.util.AbstractBeforeAfterRule$1.evaluate(AbstractBeforeAfterRule.java:45)
	at com.carrotsearch.randomizedtesting.rules.StatementAdapter.evaluate(StatementAdapter.java:36)
	at org.apache.lucene.util.TestRuleStoreClassName$1.evaluate(TestRuleStoreClassName.java:41)
	at com.carrotsearch.randomizedtesting.rules.NoShadowingOrOverridesOnMethodsRule$1.evaluate(NoShadowingOrOverridesOnMethodsRule.java:40)
	at com.carrotsearch.randomizedtesting.rules.NoShadowingOrOverridesOnMethodsRule$1.evaluate(NoShadowingOrOverridesOnMethodsRule.java:40)
	at com.carrotsearch.randomizedtesting.rules.StatementAdapter.evaluate(StatementAdapter.java:36)
	at com.carrotsearch.randomizedtesting.rules.StatementAdapter.evaluate(StatementAdapter.java:36)
	at com.carrotsearch.randomizedtesting.rules.StatementAdapter.evaluate(StatementAdapter.java:36)
	at org.apache.lucene.util.TestRuleAssertionsRequired$1.evaluate(TestRuleAssertionsRequired.java:53)
	at org.apache.lucene.util.TestRuleMarkFailure$1.evaluate(TestRuleMarkFailure.java:47)
	at org.apache.lucene.util.TestRuleIgnoreAfterMaxFailures$1.evaluate(TestRuleIgnoreAfterMaxFailures.java:64)
	at org.apache.lucene.util.TestRuleIgnoreTestSuites$1.evaluate(TestRuleIgnoreTestSuites.java:54)
	at com.carrotsearch.randomizedtesting.rules.StatementAdapter.evaluate(StatementAdapter.java:36)
	at com.carrotsearch.randomizedtesting.ThreadLeakControl$StatementRunner.run(ThreadLeakControl.java:367)
	at java.lang.Thread.run(Thread.java:745)
Caused by: java.lang.RuntimeException: REQUEST FAILED: xpath=//result[@numFound=1]
	xml response was: <?xml version="1.0" encoding="UTF-8"?>
<response>
<lst name="responseHeader"><int name="status">0</int><int name="QTime">0</int></lst><result name="response" numFound="0" start="0"></result>
</response>

	request was:q=id:529&qt=standard&start=0&rows=20&version=2.2
	at org.apache.solr.SolrTestCaseJ4.assertQ(SolrTestCaseJ4.java:811)
	... 40 more




Build Log:
[...truncated 10641 lines...]
   [junit4] Suite: org.apache.solr.update.AutoCommitTest
   [junit4]   2> Creating dataDir: C:\Users\jenkins\workspace\Lucene-Solr-master-Windows\solr\build\solr-core\test\J1\temp\solr.update.AutoCommitTest_95ACF757C15EC4C9-001\init-core-data-001
   [junit4]   2> 0    INFO  (SUITE-AutoCommitTest-seed#[95ACF757C15EC4C9]-worker) [    ] o.e.j.u.log Logging initialized @4190ms
   [junit4]   2> 47   INFO  (SUITE-AutoCommitTest-seed#[95ACF757C15EC4C9]-worker) [    ] o.a.s.SolrTestCaseJ4 Randomized ssl (false) and clientAuth (false) via: @org.apache.solr.util.RandomizeSSL(reason=, value=NaN, ssl=NaN, clientAuth=NaN)
   [junit4]   2> 94   INFO  (SUITE-AutoCommitTest-seed#[95ACF757C15EC4C9]-worker) [    ] o.a.s.SolrTestCaseJ4 ####initCore
   [junit4]   2> 391  INFO  (SUITE-AutoCommitTest-seed#[95ACF757C15EC4C9]-worker) [    ] o.a.s.c.SolrResourceLoader Using system property solr.solr.home: C:\Users\jenkins\workspace\Lucene-Solr-master-Windows\solr\core\src\test-files\solr
   [junit4]   2> 391  INFO  (SUITE-AutoCommitTest-seed#[95ACF757C15EC4C9]-worker) [    ] o.a.s.c.SolrResourceLoader [null] Added 2 libs to classloader, from paths: [/C:/Users/jenkins/workspace/Lucene-Solr-master-Windows/solr/core/src/test-files/solr/collection1/lib, /C:/Users/jenkins/workspace/Lucene-Solr-master-Windows/solr/core/src/test-files/solr/collection1/lib/classes]
   [junit4]   2> 1045 WARN  (SUITE-AutoCommitTest-seed#[95ACF757C15EC4C9]-worker) [    ] o.a.s.c.Config Beginning with Solr 5.5, <mergePolicy> is deprecated, use <mergePolicyFactory> instead.
   [junit4]   2> 1092 INFO  (SUITE-AutoCommitTest-seed#[95ACF757C15EC4C9]-worker) [    ] o.a.s.c.SolrConfig Using Lucene MatchVersion: 7.0.0
   [junit4]   2> 1404 INFO  (SUITE-AutoCommitTest-seed#[95ACF757C15EC4C9]-worker) [    ] o.a.s.s.IndexSchema [null] Schema name=test
   [junit4]   2> 2903 WARN  (SUITE-AutoCommitTest-seed#[95ACF757C15EC4C9]-worker) [    ] o.a.s.s.IndexSchema [null] default search field in schema is text. WARNING: Deprecated, please use 'df' on request instead.
   [junit4]   2> 2934 INFO  (SUITE-AutoCommitTest-seed#[95ACF757C15EC4C9]-worker) [    ] o.a.s.s.IndexSchema Loaded schema test/1.0 with uniqueid field id
   [junit4]   2> 4557 INFO  (coreLoadExecutor-6-thread-1) [    ] o.a.s.c.SolrResourceLoader [null] Added 2 libs to classloader, from paths: [/C:/Users/jenkins/workspace/Lucene-Solr-master-Windows/solr/core/src/test-files/solr/collection1/lib, /C:/Users/jenkins/workspace/Lucene-Solr-master-Windows/solr/core/src/test-files/solr/collection1/lib/classes]
   [junit4]   2> 4667 WARN  (coreLoadExecutor-6-thread-1) [    ] o.a.s.c.Config Beginning with Solr 5.5, <mergePolicy> is deprecated, use <mergePolicyFactory> instead.
   [junit4]   2> 4667 INFO  (coreLoadExecutor-6-thread-1) [    ] o.a.s.c.SolrConfig Using Lucene MatchVersion: 7.0.0
   [junit4]   2> 4714 INFO  (coreLoadExecutor-6-thread-1) [    ] o.a.s.s.IndexSchema [collection1] Schema name=test
   [junit4]   2> 4854 WARN  (coreLoadExecutor-6-thread-1) [    ] o.a.s.s.IndexSchema [collection1] default search field in schema is text. WARNING: Deprecated, please use 'df' on request instead.
   [junit4]   2> 4869 INFO  (coreLoadExecutor-6-thread-1) [    ] o.a.s.s.IndexSchema Loaded schema test/1.0 with uniqueid field id
   [junit4]   2> 4901 INFO  (coreLoadExecutor-6-thread-1) [    ] o.a.s.c.CoreContainer Creating SolrCore 'collection1' using configuration from instancedir C:\Users\jenkins\workspace\Lucene-Solr-master-Windows\solr\core\src\test-files\solr\collection1
   [junit4]   2> 5135 INFO  (coreLoadExecutor-6-thread-1) [    x:collection1] o.a.s.c.SolrCore [[collection1] ] Opening new SolrCore at [C:\Users\jenkins\workspace\Lucene-Solr-master-Windows\solr\core\src\test-files\solr\collection1], dataDir=[C:\Users\jenkins\workspace\Lucene-Solr-master-Windows\solr\build\solr-core\test\J1\temp\solr.update.AutoCommitTest_95ACF757C15EC4C9-001\init-core-data-001\]
   [junit4]   2> 5244 INFO  (coreLoadExecutor-6-thread-1) [    x:collection1] o.a.s.u.RandomMergePolicy RandomMergePolicy wrapping class org.apache.lucene.index.AlcoholicMergePolicy: [AlcoholicMergePolicy: minMergeSize=0, mergeFactor=10, maxMergeSize=570247278, maxMergeSizeForForcedMerge=9223372036854775807, calibrateSizeByDeletes=true, maxMergeDocs=2147483647, maxCFSSegmentSizeMB=8.796093022207999E12, noCFSRatio=0.1]
   [junit4]   2> 7850 INFO  (coreLoadExecutor-6-thread-1) [    x:collection1] o.a.s.u.UpdateHandler Using UpdateLog implementation: org.apache.solr.update.UpdateLog
   [junit4]   2> 7850 INFO  (coreLoadExecutor-6-thread-1) [    x:collection1] o.a.s.u.UpdateLog Initializing UpdateLog: dataDir= defaultSyncLevel=FLUSH numRecordsToKeep=100 maxNumLogsToKeep=10 numVersionBuckets=65536
   [junit4]   2> 7866 INFO  (coreLoadExecutor-6-thread-1) [    x:collection1] o.a.s.u.CommitTracker Hard AutoCommit: disabled
   [junit4]   2> 7866 INFO  (coreLoadExecutor-6-thread-1) [    x:collection1] o.a.s.u.CommitTracker Soft AutoCommit: disabled
   [junit4]   2> 7881 INFO  (coreLoadExecutor-6-thread-1) [    x:collection1] o.a.s.u.RandomMergePolicy RandomMergePolicy wrapping class org.apache.lucene.index.TieredMergePolicy: [TieredMergePolicy: maxMergeAtOnce=37, maxMergeAtOnceExplicit=43, maxMergedSegmentMB=57.9765625, floorSegmentMB=1.6953125, forceMergeDeletesPctAllowed=9.272491924891963, segmentsPerTier=41.0, maxCFSSegmentSizeMB=8.796093022207999E12, noCFSRatio=0.6397633881105909
   [junit4]   2> 7975 INFO  (coreLoadExecutor-6-thread-1) [    x:collection1] o.a.s.s.SolrIndexSearcher Opening [Searcher@279ee50c[collection1] main]
   [junit4]   2> 8131 INFO  (coreLoadExecutor-6-thread-1) [    x:collection1] o.a.s.h.c.SpellCheckComponent Initializing spell checkers
   [junit4]   2> 8288 INFO  (coreLoadExecutor-6-thread-1) [    x:collection1] o.a.s.s.DirectSolrSpellChecker init: {name=direct,classname=DirectSolrSpellChecker,field=lowerfilt,minQueryLength=3}
   [junit4]   2> 8491 INFO  (coreLoadExecutor-6-thread-1) [    x:collection1] o.a.s.h.ReplicationHandler Commits will be reserved for  10000
   [junit4]   2> 8569 INFO  (searcherExecutor-7-thread-1-processing-x:collection1) [    x:collection1] o.a.s.h.c.SpellCheckComponent Loading spell index for spellchecker: default
   [junit4]   2> 8569 INFO  (coreLoadExecutor-6-thread-1) [    x:collection1] o.a.s.u.UpdateLog Could not find max version in index or recent updates, using new clock 1553547363656663040
   [junit4]   2> 8585 INFO  (searcherExecutor-7-thread-1-processing-x:collection1) [    x:collection1] o.a.s.h.c.SpellCheckComponent Loading spell index for spellchecker: direct
   [junit4]   2> 8585 INFO  (searcherExecutor-7-thread-1-processing-x:collection1) [    x:collection1] o.a.s.h.c.SpellCheckComponent Loading spell index for spellchecker: wordbreak
   [junit4]   2> 8585 INFO  (searcherExecutor-7-thread-1-processing-x:collection1) [    x:collection1] o.a.s.h.c.SpellCheckComponent Loading spell index for spellchecker: multipleFields
   [junit4]   2> 8585 INFO  (searcherExecutor-7-thread-1-processing-x:collection1) [    x:collection1] o.a.s.h.c.SpellCheckComponent Loading spell index for spellchecker: jarowinkler
   [junit4]   2> 8600 INFO  (searcherExecutor-7-thread-1-processing-x:collection1) [    x:collection1] o.a.s.h.c.SpellCheckComponent Loading spell index for spellchecker: external
   [junit4]   2> 8600 INFO  (SUITE-AutoCommitTest-seed#[95ACF757C15EC4C9]-worker) [    ] o.a.s.SolrTestCaseJ4 ####initCore end
   [junit4]   2> 8600 INFO  (searcherExecutor-7-thread-1-processing-x:collection1) [    x:collection1] o.a.s.h.c.SpellCheckComponent Loading spell index for spellchecker: freq
   [junit4]   2> 8616 INFO  (searcherExecutor-7-thread-1-processing-x:collection1) [    x:collection1] o.a.s.h.c.SpellCheckComponent Loading spell index for spellchecker: fqcn
   [junit4]   2> 8616 INFO  (searcherExecutor-7-thread-1-processing-x:collection1) [    x:collection1] o.a.s.h.c.SpellCheckComponent Loading spell index for spellchecker: perDict
   [junit4]   2> 8616 INFO  (searcherExecutor-7-thread-1-processing-x:collection1) [    x:collection1] o.a.s.c.SolrCore [collection1] Registered new searcher Searcher@279ee50c[collection1] main{ExitableDirectoryReader(UninvertingDirectoryReader())}
   [junit4]   2> 8631 INFO  (TEST-AutoCommitTest.testCommitWithin-seed#[95ACF757C15EC4C9]) [    ] o.a.s.SolrTestCaseJ4 ###Starting testCommitWithin
   [junit4]   2> 9100 INFO  (TEST-AutoCommitTest.testCommitWithin-seed#[95ACF757C15EC4C9]) [    ] o.a.s.u.p.LogUpdateProcessorFactory [collection1]  webapp=null path=null params={}{deleteByQuery=*:* (-1553547363968090112)} 0 471
   [junit4]   2> 9132 INFO  (TEST-AutoCommitTest.testCommitWithin-seed#[95ACF757C15EC4C9]) [    ] o.a.s.c.SolrResourceLoader [null] Added 2 libs to classloader, from paths: [/C:/Users/jenkins/workspace/Lucene-Solr-master-Windows/solr/core/src/test-files/solr/collection1/lib, /C:/Users/jenkins/workspace/Lucene-Solr-master-Windows/solr/core/src/test-files/solr/collection1/lib/classes]
   [junit4]   2> 9210 WARN  (TEST-AutoCommitTest.testCommitWithin-seed#[95ACF757C15EC4C9]) [    ] o.a.s.c.Config Beginning with Solr 5.5, <mergePolicy> is deprecated, use <mergePolicyFactory> instead.
   [junit4]   2> 9210 INFO  (TEST-AutoCommitTest.testCommitWithin-seed#[95ACF757C15EC4C9]) [    ] o.a.s.c.SolrConfig Using Lucene MatchVersion: 7.0.0
   [junit4]   2> 9257 INFO  (TEST-AutoCommitTest.testCommitWithin-seed#[95ACF757C15EC4C9]) [    ] o.a.s.s.IndexSchema [collection1] Schema name=test
   [junit4]   2> 9413 WARN  (TEST-AutoCommitTest.testCommitWithin-seed#[95ACF757C15EC4C9]) [    ] o.a.s.s.IndexSchema [collection1] default search field in schema is text. WARNING: Deprecated, please use 'df' on request instead.
   [junit4]   2> 9413 INFO  (TEST-AutoCommitTest.testCommitWithin-seed#[95ACF757C15EC4C9]) [    ] o.a.s.s.IndexSchema Loaded schema test/1.0 with uniqueid field id
   [junit4]   2> 9458 INFO  (TEST-AutoCommitTest.testCommitWithin-seed#[95ACF757C15EC4C9]) [    ] o.a.s.c.CoreContainer Reloading SolrCore 'collection1' using configuration from instancedir C:\Users\jenkins\workspace\Lucene-Solr-master-Windows\solr\core\src\test-files\solr\collection1
   [junit4]   2> 9552 INFO  (TEST-AutoCommitTest.testCommitWithin-seed#[95ACF757C15EC4C9]) [    x:collection1] o.a.s.c.SolrCore [[collection1] ] Opening new SolrCore at [C:\Users\jenkins\workspace\Lucene-Solr-master-Windows\solr\core\src\test-files\solr\collection1], dataDir=[C:\Users\jenkins\workspace\Lucene-Solr-master-Windows\solr\build\solr-core\test\J1\temp\solr.update.AutoCommitTest_95ACF757C15EC4C9-001\init-core-data-001\]
   [junit4]   2> 9692 INFO  (TEST-AutoCommitTest.testCommitWithin-seed#[95ACF757C15EC4C9]) [    x:collection1] o.a.s.u.CommitTracker Hard AutoCommit: disabled
   [junit4]   2> 9692 INFO  (TEST-AutoCommitTest.testCommitWithin-seed#[95ACF757C15EC4C9]) [    x:collection1] o.a.s.u.CommitTracker Soft AutoCommit: disabled
   [junit4]   2> 9692 INFO  (TEST-AutoCommitTest.testCommitWithin-seed#[95ACF757C15EC4C9]) [    x:collection1] o.a.s.s.SolrIndexSearcher Opening [Searcher@6098f729[collection1] main]
   [junit4]   2> 9692 INFO  (TEST-AutoCommitTest.testCommitWithin-seed#[95ACF757C15EC4C9]) [    x:collection1] o.a.s.h.c.SpellCheckComponent Initializing spell checkers
   [junit4]   2> 9692 INFO  (TEST-AutoCommitTest.testCommitWithin-seed#[95ACF757C15EC4C9]) [    x:collection1] o.a.s.s.DirectSolrSpellChecker init: {name=direct,classname=DirectSolrSpellChecker,field=lowerfilt,minQueryLength=3}
   [junit4]   2> 9708 INFO  (TEST-AutoCommitTest.testCommitWithin-seed#[95ACF757C15EC4C9]) [    x:collection1] o.a.s.h.ReplicationHandler Commits will be reserved for  10000
   [junit4]   2> 9708 INFO  (searcherExecutor-12-thread-1-processing-x:collection1) [    x:collection1] o.a.s.h.c.SpellCheckComponent Loading spell index for spellchecker: default
   [junit4]   2> 9708 INFO  (searcherExecutor-12-thread-1-processing-x:collection1) [    x:collection1] o.a.s.h.c.SpellCheckComponent Loading spell index for spellchecker: direct
   [junit4]   2> 9708 INFO  (searcherExecutor-12-thread-1-processing-x:collection1) [    x:collection1] o.a.s.h.c.SpellCheckComponent Loading spell index for spellchecker: wordbreak
   [junit4]   2> 9708 INFO  (searcherExecutor-12-thread-1-processing-x:collection1) [    x:collection1] o.a.s.h.c.SpellCheckComponent Loading spell index for spellchecker: multipleFields
   [junit4]   2> 9723 INFO  (searcherExecutor-12-thread-1-processing-x:collection1) [    x:collection1] o.a.s.h.c.SpellCheckComponent Loading spell index for spellchecker: jarowinkler
   [junit4]   2> 9723 INFO  (searcherExecutor-12-thread-1-processing-x:collection1) [    x:collection1] o.a.s.h.c.SpellCheckComponent Loading spell index for spellchecker: external
   [junit4]   2> 9723 INFO  (searcherExecutor-12-thread-1-processing-x:collection1) [    x:collection1] o.a.s.h.c.SpellCheckComponent Loading spell index for spellchecker: freq
   [junit4]   2> 9723 INFO  (searcherExecutor-12-thread-1-processing-x:collection1) [    x:collection1] o.a.s.h.c.SpellCheckComponent Loading spell index for spellchecker: fqcn
   [junit4]   2> 9723 INFO  (TEST-AutoCommitTest.testCommitWithin-seed#[95ACF757C15EC4C9]) [    x:collection1] o.a.s.u.RandomMergePolicy RandomMergePolicy wrapping class org.apache.lucene.index.TieredMergePolicy: [TieredMergePolicy: maxMergeAtOnce=48, maxMergeAtOnceExplicit=30, maxMergedSegmentMB=35.4736328125, floorSegmentMB=0.740234375, forceMergeDeletesPctAllowed=17.979158579728107, segmentsPerTier=25.0, maxCFSSegmentSizeMB=8.796093022207999E12, noCFSRatio=0.0
   [junit4]   2> 9723 INFO  (searcherExecutor-12-thread-1-processing-x:collection1) [    x:collection1] o.a.s.h.c.SpellCheckComponent Loading spell index for spellchecker: perDict
   [junit4]   2> 9723 INFO  (searcherExecutor-12-thread-1-processing-x:collection1) [    x:collection1] o.a.s.c.SolrCore [collection1] Registered new searcher Searcher@6098f729[collection1] main{ExitableDirectoryReader(UninvertingDirectoryReader())}
   [junit4]   2> 9723 INFO  (TEST-AutoCommitTest.testCommitWithin-seed#[95ACF757C15EC4C9]) [    x:collection1] o.a.s.u.DefaultSolrCoreState New IndexWriter is ready to be used.
   [junit4]   2> 9723 INFO  (TEST-AutoCommitTest.testCommitWithin-seed#[95ACF757C15EC4C9]) [    x:collection1] o.a.s.s.SolrIndexSearcher Opening [Searcher@21abd937[collection1] main]
   [junit4]   2> 9723 INFO  (TEST-AutoCommitTest.testCommitWithin-seed#[95ACF757C15EC4C9]) [    x:collection1] o.a.s.c.SolrCore [collection1]  CLOSING SolrCore org.apache.solr.core.SolrCore@2e594991
   [junit4]   2> 9739 INFO  (searcherExecutor-12-thread-1-processing-x:collection1) [    x:collection1] o.a.s.c.SolrCore [collection1] Registered new searcher Searcher@21abd937[collection1] main{ExitableDirectoryReader(UninvertingDirectoryReader())}
   [junit4]   2> 10005 INFO  (TEST-AutoCommitTest.testCommitWithin-seed#[95ACF757C15EC4C9]) [    x:collection1] o.a.s.u.p.LogUpdateProcessorFactory [collection1] {add=[529 (1553547364917051392)]} 0 271
   [junit4]   2> 10067 INFO  (TEST-AutoCommitTest.testCommitWithin-seed#[95ACF757C15EC4C9]) [    x:collection1] o.a.s.c.S.Request [collection1]  webapp=null path=null params={q=id:529&qt=standard&start=0&rows=20&version=2.2} hits=0 status=0 QTime=50
   [junit4]   2> 10067 INFO  (TEST-AutoCommitTest.testCommitWithin-seed#[95ACF757C15EC4C9]) [    x:collection1] o.a.s.u.p.LogUpdateProcessorFactory [collection1] {add=[530 (1553547365227429888)]} 0 334
   [junit4]   2> 10067 INFO  (TEST-AutoCommitTest.testCommitWithin-seed#[95ACF757C15EC4C9]) [    x:collection1] o.a.s.c.S.Request [collection1]  webapp=null path=null params={q=id:530&qt=standard&start=0&rows=20&version=2.2} hits=0 status=0 QTime=0
   [junit4]   2> 10067 INFO  (TEST-AutoCommitTest.testCommitWithin-seed#[95ACF757C15EC4C9]) [    x:collection1] o.a.s.u.p.LogUpdateProcessorFactory [collection1] {delete=[529 (-1553547365227429889)]} 0 337
   [junit4]   2> 10083 INFO  (TEST-AutoCommitTest.testCommitWithin-seed#[95ACF757C15EC4C9]) [    x:collection1] o.a.s.c.S.Request [collection1]  webapp=null path=null params={q=id:529&qt=standard&start=0&rows=20&version=2.2} hits=0 status=0 QTime=0
   [junit4]   2> 10083 ERROR (TEST-AutoCommitTest.testCommitWithin-seed#[95ACF757C15EC4C9]) [    x:collection1] o.a.s.SolrTestCaseJ4 REQUEST FAILED: xpath=//result[@numFound=1]
   [junit4]   2> 	xml response was: <?xml version="1.0" encoding="UTF-8"?>
   [junit4]   2> <response>
   [junit4]   2> <lst name="responseHeader"><int name="status">0</int><int name="QTime">0</int></lst><result name="response" numFound="0" start="0"></result>
   [junit4]   2> </response>
   [junit4]   2> 
   [junit4]   2> 	request was:q=id:529&qt=standard&start=0&rows=20&version=2.2
   [junit4]   2> 10114 ERROR (TEST-AutoCommitTest.testCommitWithin-seed#[95ACF757C15EC4C9]) [    x:collection1] o.a.s.SolrTestCaseJ4 REQUEST FAILED: q=id:529&qt=standard&start=0&rows=20&version=2.2:java.lang.RuntimeException: REQUEST FAILED: xpath=//result[@numFound=1]
   [junit4]   2> 	xml response was: <?xml version="1.0" encoding="UTF-8"?>
   [junit4]   2> <response>
   [junit4]   2> <lst name="responseHeader"><int name="status">0</int><int name="QTime">0</int></lst><result name="response" numFound="0" start="0"></result>
   [junit4]   2> </response>
   [junit4]   2> 
   [junit4]   2> 	request was:q=id:529&qt=standard&start=0&rows=20&version=2.2
   [junit4]   2> 	at org.apache.solr.SolrTestCaseJ4.assertQ(SolrTestCaseJ4.java:811)
   [junit4]   2> 	at org.apache.solr.update.AutoCommitTest.testCommitWithin(AutoCommitTest.java:353)
   [junit4]   2> 	at sun.reflect.NativeMethodAccessorImpl.invoke0(Native Method)
   [junit4]   2> 	at sun.reflect.NativeMethodAccessorImpl.invoke(NativeMethodAccessorImpl.java:62)
   [junit4]   2> 	at sun.reflect.DelegatingMethodAccessorImpl.invoke(DelegatingMethodAccessorImpl.java:43)
   [junit4]   2> 	at java.lang.reflect.Method.invoke(Method.java:498)
   [junit4]   2> 	at com.carrotsearch.randomizedtesting.RandomizedRunner.invoke(RandomizedRunner.java:1713)
   [junit4]   2> 	at com.carrotsearch.randomizedtesting.RandomizedRunner$8.evaluate(RandomizedRunner.java:907)
   [junit4]   2> 	at com.carrotsearch.randomizedtesting.RandomizedRunner$9.evaluate(RandomizedRunner.java:943)
   [junit4]   2> 	at com.carrotsearch.randomizedtesting.RandomizedRunner$10.evaluate(RandomizedRunner.java:957)
   [junit4]   2> 	at com.carrotsearch.randomizedtesting.rules.SystemPropertiesRestoreRule$1.evaluate(SystemPropertiesRestoreRule.java:57)
   [junit4]   2> 	at org.apache.lucene.util.TestRuleSetupTeardownChained$1.evaluate(TestRuleSetupTeardownChained.java:49)
   [junit4]   2> 	at org.apache.lucene.util.AbstractBeforeAfterRule$1.evaluate(AbstractBeforeAfterRule.java:45)
   [junit4]   2> 	at org.apache.lucene.util.TestRuleThreadAndTestName$1.evaluate(TestRuleThreadAndTestName.java:48)
   [junit4]   2> 	at org.apache.lucene.util.TestRuleIgnoreAfterMaxFailures$1.evaluate(TestRuleIgnoreAfterMaxFailures.java:64)
   [junit4]   2> 	at org.apache.lucene.util.TestRuleMarkFailure$1.evaluate(TestRuleMarkFailure.java:47)
   [junit4]   2> 	at com.carrotsearch.randomizedtesting.rules.StatementAdapter.evaluate(StatementAdapter.java:36)
   [junit4]   2> 	at com.carrotsearch.randomizedtesting.ThreadLeakControl$StatementRunner.run(ThreadLeakControl.java:367)
   [junit4]   2> 	at com.carrotsearch.randomizedtesting.ThreadLeakControl.forkTimeoutingTask(ThreadLeakControl.java:811)
   [junit4]   2> 	at com.carrotsearch.randomizedtesting.ThreadLeakControl$3.evaluate(ThreadLeakControl.java:462)
   [junit4]   2> 	at com.carrotsearch.randomizedtesting.RandomizedRunner.runSingleTest(RandomizedRunner.java:916)
   [junit4]   2> 	at com.carrotsearch.randomizedtesting.RandomizedRunner$5.evaluate(RandomizedRunner.java:802)
   [junit4]   2> 	at com.carrotsearch.randomizedtesting.RandomizedRunner$6.evaluate(RandomizedRunner.java:852)
   [junit4]   2> 	at com.carrotsearch.randomizedtesting.RandomizedRunner$7.evaluate(RandomizedRunner.java:863)
   [junit4]   2> 	at com.carrotsearch.randomizedtesting.rules.StatementAdapter.evaluate(StatementAdapter.java:36)
   [junit4]   2> 	at com.carrotsearch.randomizedtesting.rules.SystemPropertiesRestoreRule$1.evaluate(SystemPropertiesRestoreRule.java:57)
   [junit4]   2> 	at org.apache.lucene.util.AbstractBeforeAfterRule$1.evaluate(AbstractBeforeAfterRule.java:45)
   [junit4]   2> 	at com.carrotsearch.randomizedtesting.rules.StatementAdapter.evaluate(StatementAdapter.java:36)
   [junit4]   2> 	at org.apache.lucene.util.TestRuleStoreClassName$1.evaluate(TestRuleStoreClassName.java:41)
   [junit4]   2> 	at com.carrotsearch.randomizedtesting.rules.NoShadowingOrOverridesOnMethodsRule$1.evaluate(NoShadowingOrOverridesOnMethodsRule.java:40)
   [junit4]   2> 	at com.carrotsearch.randomizedtesting.rules.NoShadowingOrOverridesOnMethodsRule$1.evaluate(NoShadowingOrOverridesOnMethodsRule.java:40)
   [junit4]   2> 	at com.carrotsearch.randomizedtesting.rules.StatementAdapter.evaluate(StatementAdapter.java:36)
   [junit4]   2> 	at com.carrotsearch.randomizedtesting.rules.StatementAdapter.evaluate(StatementAdapter.java:36)
   [junit4]   2> 	at com.carrotsearch.randomizedtesting.rules.StatementAdapter.evaluate(StatementAdapter.java:36)
   [junit4]   2> 	at org.apache.lucene.util.TestRuleAssertionsRequired$1.evaluate(TestRuleAssertionsRequired.java:53)
   [junit4]   2> 	at org.apache.lucene.util.TestRuleMarkFailure$1.evaluate(TestRuleMarkFailure.java:47)
   [junit4]   2> 	at org.apache.lucene.util.TestRuleIgnoreAfterMaxFailures$1.evaluate(TestRuleIgnoreAfterMaxFailures.java:64)
   [junit4]   2> 	at org.apache.lucene.util.TestRuleIgnoreTestSuites$1.evaluate(TestRuleIgnoreTestSuites.java:54)
   [junit4]   2> 	at com.carrotsearch.randomizedtesting.rules.StatementAdapter.evaluate(StatementAdapter.java:36)
   [junit4]   2> 	at com.carrotsearch.randomizedtesting.ThreadLeakControl$StatementRunner.run(ThreadLeakControl.java:367)
   [junit4]   2> 	at java.lang.Thread.run(Thread.java:745)
   [junit4]   2> 
   [junit4]   2> 10114 INFO  (TEST-AutoCommitTest.testCommitWithin-seed#[95ACF757C15EC4C9]) [    x:collection1] o.a.s.SolrTestCaseJ4 ###Ending testCommitWithin
   [junit4]   2> NOTE: reproduce with: ant test  -Dtestcase=AutoCommitTest -Dtests.method=testCommitWithin -Dtests.seed=95ACF757C15EC4C9 -Dtests.slow=true -Dtests.locale=fr-LU -Dtests.timezone=Europe/Belfast -Dtests.asserts=true -Dtests.file.encoding=Cp1252
   [junit4] ERROR   1.53s J1 | AutoCommitTest.testCommitWithin <<<
   [junit4]    > Throwable #1: java.lang.RuntimeException: Exception during query
   [junit4]    > 	at __randomizedtesting.SeedInfo.seed([95ACF757C15EC4C9:2F7E982F42702ADC]:0)
   [junit4]    > 	at org.apache.solr.SolrTestCaseJ4.assertQ(SolrTestCaseJ4.java:818)
   [junit4]    > 	at org.apache.solr.update.AutoCommitTest.testCommitWithin(AutoCommitTest.java:353)
   [junit4]    > 	at java.lang.Thread.run(Thread.java:745)
   [junit4]    > Caused by: java.lang.RuntimeException: REQUEST FAILED: xpath=//result[@numFound=1]
   [junit4]    > 	xml response was: <?xml version="1.0" encoding="UTF-8"?>
   [junit4]    > <response>
   [junit4]    > <lst name="responseHeader"><int name="status">0</int><int name="QTime">0</int></lst><result name="response" numFound="0" start="0"></result>
   [junit4]    > </response>
   [junit4]    > 	request was:q=id:529&qt=standard&start=0&rows=20&version=2.2
   [junit4]    > 	at org.apache.solr.SolrTestCaseJ4.assertQ(SolrTestCaseJ4.java:811)
   [junit4]    > 	... 40 more
   [junit4]   2> 10130 INFO  (TEST-AutoCommitTest.testMaxDocs-seed#[95ACF757C15EC4C9]) [    x:collection1] o.a.s.SolrTestCaseJ4 ###Starting testMaxDocs
   [junit4]   2> 10880 INFO  (TEST-AutoCommitTest.testMaxDocs-seed#[95ACF757C15EC4C9]) [    x:collection1] o.a.s.s.SolrIndexSearcher Opening [Searcher@15edea14[collection1] realtime]
   [junit4]   2> 10880 INFO  (TEST-AutoCommitTest.testMaxDocs-seed#[95ACF757C15EC4C9]) [    x:collection1] o.a.s.u.p.LogUpdateProcessorFactory [collection1]  webapp=null path=null params={}{deleteByQuery=*:* (-1553547365293490176)} 0 744
   [junit4]   2> 10896 INFO  (TEST-AutoCommitTest.testMaxDocs-seed#[95ACF757C15EC4C9]) [    x:collection1] o.a.s.c.SolrResourceLoader [null] Added 2 libs to classloader, from paths: [/C:/Users/jenkins/workspace/Lucene-Solr-master-Windows/solr/core/src/test-files/solr/collection1/lib, /C:/Users/jenkins/workspace/Lucene-Solr-master-Windows/solr/core/src/test-files/solr/collection1/lib/classes]
   [junit4]   2> 10973 WARN  (TEST-AutoCommitTest.testMaxDocs-seed#[95ACF757C15EC4C9]) [    x:collection1] o.a.s.c.Config Beginning with Solr 5.5, <mergePolicy> is deprecated, use <mergePolicyFactory> instead.
   [junit4]   2> 10973 INFO  (TEST-AutoCommitTest.testMaxDocs-seed#[95ACF757C15EC4C9]) [    x:collection1] o.a.s.c.SolrConfig Using Lucene MatchVersion: 7.0.0
   [junit4]   2> 11020 INFO  (TEST-AutoCommitTest.testMaxDocs-seed#[95ACF757C15EC4C9]) [    x:collection1] o.a.s.s.IndexSchema [collection1] Schema name=test
   [junit4]   2> 11253 WARN  (TEST-AutoCommitTest.testMaxDocs-seed#[95ACF757C15EC4C9]) [    x:collection1] o.a.s.s.IndexSchema [collection1] default search field in schema is text. WARNING: Deprecated, please use 'df' on request instead.
   [junit4]   2> 11253 INFO  (TEST-AutoCommitTest.testMaxDocs-seed#[95ACF757C15EC4C9]) [    x:collection1] o.a.s.s.IndexSchema Loaded schema test/1.0 with uniqueid field id
   [junit4]   2> 11316 INFO  (TEST-AutoCommitTest.testMaxDocs-seed#[95ACF757C15EC4C9]) [    x:collection1] o.a.s.c.CoreContainer Reloading SolrCore 'collection1' using configuration from instancedir C:\Users\jenkins\workspace\Lucene-Solr-master-Windows\solr\core\src\test-files\solr\collection1
   [junit4]   2> 11316 INFO  (TEST-AutoCommitTest.testMaxDocs-seed#[95ACF757C15EC4C9]) [    x:collection1] o.a.s.c.SolrCore [[collection1] ] Opening new SolrCore at [C:\Users\jenkins\workspace\Lucene-Solr-master-Windows\solr\core\src\test-files\solr\collection1], dataDir=[C:\Users\jenkins\workspace\Lucene-Solr-master-Windows\solr\build\solr-core\test\J1\temp\solr.update.AutoCommitTest_95ACF757C15EC4C9-001\init-core-data-001\]
   [junit4]   2> 11331 INFO  (TEST-AutoCommitTest.testMaxDocs-seed#[95ACF757C15EC4C9]) [    x:collection1] o.a.s.u.CommitTracker Hard AutoCommit: disabled
   [junit4]   2> 11331 INFO  (TEST-AutoCommitTest.testMaxDocs-seed#[95ACF757C15EC4C9]) [    x:collection1] o.a.s.u.CommitTracker Soft AutoCommit: disabled
   [junit4]   2> 11331 INFO  (TEST-AutoCommitTest.testMaxDocs-seed#[95ACF757C15EC4C9]) [    x:collection1] o.a.s.s.SolrIndexSearcher Opening [Searcher@2e3cdff4[collection1] main]
   [junit4]   2> 11331 INFO  (TEST-AutoCommitTest.testMaxDocs-seed#[95ACF757C15EC4C9]) [    x:collection1] o.a.s.h.c.SpellCheckComponent Initializing spell checkers
   [junit4]   2> 11331 INFO  (TEST-AutoCommitTest.testMaxDocs-seed#[95ACF757C15EC4C9]) [    x:collection1] o.a.s.s.DirectSolrSpellChecker init: {name=direct,classname=DirectSolrSpellChecker,field=lowerfilt,minQueryLength=3}
   [junit4]   2> 11347 INFO  (TEST-AutoCommitTest.testMaxDocs-seed#[95ACF757C15EC4C9]) [    x:collection1] o.a.s.h.ReplicationHandler Commits will be reserved for  10000
   [junit4]   2> 11362 INFO  (searcherExecutor-16-thread-1-processing-x:collection1) [    x:collection1] o.a.s.h.c.SpellCheckComponent Loading spell index for spellchecker: default
   [junit4]   2> 11362 INFO  (searcherExecutor-16-thread-1-processing-x:collection1) [    x:collection1] o.a.s.h.c.SpellCheckComponent Loading spell index for spellchecker: direct
   [junit4]   2> 11362 INFO  (searcherExecutor-16-thread-1-processing-x:collection1) [    x:collection1] o.a.s.h.c.SpellCheckComponent Loading spell index for spellchecker: wordbreak
   [junit4]   2> 11362 INFO  (searcherExecutor-16-thread-1-processing-x:collection1) [    x:collection1] o.a.s.h.c.SpellCheckComponent Loading spell index for spellchecker: multipleFields
   [junit4]   2> 11362 INFO  (searcherExecutor-16-thread-1-processing-x:collection1) [    x:collection1] o.a.s.h.c.SpellCheckComponent Loading spell index for spellchecker: jarowinkler
   [junit4]   2> 11362 INFO  (searcherExecutor-16-thread-1-processing-x:collection1) [    x:collection1] o.a.s.h.c.SpellCheckComponent Loading spell index for spellchecker: external
   [junit4]   2> 11362 INFO  (searcherExecutor-16-thread-1-processing-x:collection1) [    x:collection1] o.a.s.h.c.SpellCheckComponent Loading spell index for spellchecker: freq
   [junit4]   2> 11362 INFO  (searcherExecutor-16-thread-1-processing-x:collection1) [    x:collection1] o.a.s.h.c.SpellCheckComponent Loading spell index for spellchecker: fqcn
   [junit4]   2> 11362 INFO  (searcherExecutor-16-thread-1-processing-x:collection1) [    x:collection1] o.a.s.h.c.SpellCheckComponent Loading spell index for spellchecker: perDict
   [junit4]   2> 11362 INFO  (searcherExecutor-16-thread-1-processing-x:collection1) [    x:collection1] o.a.s.c.SolrCore [collection1] Registered new searcher Searcher@2e3cdff4[collection1] main{ExitableDirectoryReader(UninvertingDirectoryReader())}
   [junit4]   2> 11362 INFO  (TEST-AutoCommitTest.testMaxDocs-seed#[95ACF757C15EC4C9]) [    x:collection1] o.a.s.u.RandomMergePolicy RandomMergePolicy wrapping class org.apache.lucene.index.LogByteSizeMergePolicy: [LogByteSizeMergePolicy: minMergeSize=1677721, mergeFactor=20, maxMergeSize=2147483648, maxMergeSizeForForcedMerge=9223372036854775807, calibrateSizeByDeletes=false, maxMergeDocs=2147483647, maxCFSSegmentSizeMB=8.796093022207999E12, noCFSRatio=0.6072100702523175]
   [junit4]   2> 11362 INFO  (TEST-AutoCommitTest.testMaxDocs-seed#[95ACF757C15EC4C9]) [    x:collection1] o.a.s.u.DefaultSolrCoreState New IndexWriter is ready to be used.
   [junit4]   2> 11362 INFO  (TEST-AutoCommitTest.testMaxDocs-seed#[95ACF757C15EC4C9]) [    x:collection1] o.a.s.s.SolrIndexSearcher Opening [Searcher@58f80c97[collection1] main]
   [junit4]   2> 11362 INFO  (TEST-AutoCommitTest.testMaxDocs-seed#[95ACF757C15EC4C9]) [    x:collection1] o.a.s.c.SolrCore [collection1]  CLOSING SolrCore org.apache.solr.core.SolrCore@2c674c89
   [junit4]   2> 11362 INFO  (searcherExecutor-16-thread-1-processing-x:collection1) [    x:collection1] o.a.s.c.SolrCore [collection1] Registered new searcher Searcher@58f80c97[collection1] main{ExitableDirectoryReader(UninvertingDirectoryReader())}
   [junit4]   2> 11362 INFO  (TEST-AutoCommitTest.testMaxDocs-seed#[95ACF757C15EC4C9]) [    x:collection1] o.a.s.u.p.LogUpdateProcessorFactory [collection1] {add=[0 (1553547366585335808)]} 0 2
   [junit4]   2> 11362 INFO  (TEST-AutoCommitTest.testMaxDocs-seed#[95ACF757C15EC4C9]) [    x:collection1] o.a.s.u.p.LogUpdateProcessorFactory [collection1] {add=[1 (1553547366585335809)]} 0 3
   [junit4]   2> 11378 INFO  (TEST-AutoCommitTest.testMaxDocs-seed#[95ACF757C15EC4C9]) [    x:collection1] o.a.s.u.p.LogUpdateProcessorFactory [collection1] {add=[2 (1553547366585335810)]} 0 5
   [junit4]   2> 11378 INFO  (TEST-AutoCommitTest.testMaxDocs-seed#[95ACF757C15EC4C9]) [    x:collection1] o.a.s.u.p.LogUpdateProcessorFactory [collection1] {add=[3 (1553547366602113024)]} 0 6
   [junit4]   2> 11378 INFO  (TEST-AutoCommitTest.testMaxDocs-seed#[95ACF757C15EC4C9]) [    x:collection1] o.a.s.u.p.LogUpdateProcessorFactory [collection1] {add=[4 (1553547366602113025)]} 0 7
   [junit4]   2> 11378 INFO  (TEST-AutoCommitTest.testMaxDocs-seed#[95ACF757C15EC4C9]) [    x:collection1] o.a.s.u.p.LogUpdateProcessorFactory [collection1] {add=[5 (1553547366602113026)]} 0 9
   [junit4]   2> 11378 INFO  (TEST-AutoCommitTest.testMaxDocs-seed#[95ACF757C15EC4C9]) [    x:collection1] o.a.s.u.p.LogUpdateProcessorFactory [collection1] {add=[6 (1553547366602113027)]} 0 10
   [junit4]   2> 11378 INFO  (TEST-AutoCommitTest.testMaxDocs-seed#[95ACF757C15EC4C9]) [    x:collection1] o.a.s.u.p.LogUpdateProcessorFactory [collection1] {add=[7 (1553547366602113028)]} 0 11
   [junit4]   2> 11378 INFO  (TEST-AutoCommitTest.testMaxDocs-seed#[95ACF757C15EC4C9]) [    x:collection1] o.a.s.u.p.LogUpdateProcessorFactory [collection1] {add=[8 (1553547366602113029)]} 0 12
   [junit4]   2> 11378 INFO  (TEST-AutoCommitTest.testMaxDocs-seed#[95ACF757C15EC4C9]) [    x:collection1] o.a.s.u.p.LogUpdateProcessorFactory [collection1] {add=[9 (1553547366602113030)]} 0 13
   [junit4]   2> 11378 INFO  (TEST-AutoCommitTest.testMaxDocs-seed#[95ACF757C15EC4C9]) [    x:collection1] o.a.s.u.p.LogUpdateProcessorFactory [collection1] {add=[10 (1553547366602113031)]} 0 16
   [junit4]   2> 11378 INFO  (TEST-AutoCommitTest.testMaxDocs-seed#[95ACF757C15EC4C9]) [    x:collection1] o.a.s.u.p.LogUpdateProcessorFactory [collection1] {add=[11 (1553547366602113032)]} 0 17
   [junit4]   2> 11378 INFO  (TEST-AutoCommitTest.testMaxDocs-seed#[95ACF757C15EC4C9]) [    x:collection1] o.a.s.u.p.LogUpdateProcessorFactory [collection1] {add=[12 (1553547366602113033)]} 0 19
   [junit4]   2> 11394 INFO  (TEST-AutoCommitTest.testMaxDocs-seed#[95ACF757C15EC4C9]) [    x:collection1] o.a.s.u.p.LogUpdateProcessorFactory [collection1] {add=[13 (1553547366618890240)]} 0 21
   [junit4]   2> 11394 INFO  (TEST-AutoCommitTest.testMaxDocs-seed#[95ACF757C15EC4C9]) [    x:collection1] o.a.s.c.S.Request [collection1]  webapp=null path=null params={q=id:1&qt=standard&start=0&rows=20&version=2.2} hits=0 status=0 QTime=0
   [junit4]   2> 11394 INFO  (TEST-AutoCommitTest.testMaxDocs-seed#[95ACF757C15EC4C9]) [    x:collection1] o.a.s.u.p.LogUpdateProcessorFactory [collection1] {add=[14 (1553547366618890241)]} 0 25
   [junit4]   2> 11409 INFO  (commitScheduler-19-thread-1) [    x:collection1] o.a.s.u.DirectUpdateHandler2 start commit{,optimize=false,openSearcher=true,waitSearcher=true,expungeDeletes=false,softCommit=true,prepareCommit=false}
   [junit4]   2> 11425 INFO  (commitScheduler-19-thread-1) [    x:collection1] o.a.s.s.SolrIndexSearcher Opening [Searcher@1ed258ed[collection1] main]
   [junit4]   2> 11441 INFO  (commitScheduler-19-thread-1) [    x:collection1] o.a.s.u.DirectUpdateHandler2 end_commit_flush
   [junit4]   2> 11471 INFO  (searcherExecutor-16-thread-1-processing-x:collection1) [    x:collection1] o.a.s.c.SolrCore [collection1] Registered new searcher Searcher@1ed258ed[collection1] main{ExitableDirectoryReader(UninvertingDirectoryReader(Uninverting(_1(7.0.0):C15)))}
   [junit4]   2> 11659 INFO  (TEST-AutoCommitTest.testMaxDocs-seed#[95ACF757C15EC4C9]) [    x:collection1] o.a.s.u.p.LogUpdateProcessorFactory [collection1] {add=[15 (1553547366896762880)]} 0 288
   [junit4]   2> 11659 INFO  (TEST-AutoCommitTest.testMaxDocs-seed#[95ACF757C15EC4C9]) [    x:collection1] o.a.s.c.S.Request [collection1]  webapp=null path=null params={q=id:14&qt=standard&start=0&rows=20&version=2.2} hits=1 status=0 QTime=1
   [junit4]   2> 11674 INFO  (TEST-AutoCommitTest.testMaxDocs-seed#[95ACF757C15EC4C9]) [    x:collection1] o.a.s.c.S.Request [collection1]  webapp=null path=null params={q=id:15&qt=standard&start=0&rows=20&version=2.2} hits=0 status=0 QTime=0
   [junit4]   2> 11674 INFO  (TEST-AutoCommitTest.testMaxDocs-seed#[95ACF757C15EC4C9]) [    x:collection1] o.a.s.SolrTestCaseJ4 ###Ending testMaxDocs
   [junit4]   2> 11674 INFO  (TEST-AutoCommitTest.testMaxTime-seed#[95ACF757C15EC4C9]) [    x:collection1] o.a.s.SolrTestCaseJ4 ###Starting testMaxTime
   [junit4]   2> 11768 INFO  (TEST-AutoCommitTest.testMaxTime-seed#[95ACF757C15EC4C9]) [    x:collection1] o.a.s.s.SolrIndexSearcher Opening [Searcher@1a18cb57[collection1] realtime]
   [junit4]   2> 11768 INFO  (TEST-AutoCommitTest.testMaxTime-seed#[95ACF757C15EC4C9]) [    x:collection1] o.a.s.u.p.LogUpdateProcessorFactory [collection1]  webapp=null path=null params={}{deleteByQuery=*:* (-1553547366912491520)} 0 78
   [junit4]   2> 11768 INFO  (TEST-AutoCommitTest.testMaxTime-seed#[95ACF757C15EC4C9]) [    x:collection1] o.a.s.c.SolrResourceLoader [null] Added 2 libs to classloader, from paths: [/C:/Users/jenkins/workspace/Lucene-Solr-master-Windows/solr/core/src/test-files/solr/collection1/lib, /C:/Users/jenkins/workspace/Lucene-Solr-master-Windows/solr/core/src/test-files/solr/collection1/lib/classes]
   [junit4]   2> 11863 WARN  (TEST-AutoCommitTest.testMaxTime-seed#[95ACF757C15EC4C9]) [    x:collection1] o.a.s.c.Config Beginning with Solr 5.5, <mergePolicy> is deprecated, use <mergePolicyFactory> instead.
   [junit4]   2> 11863 INFO  (TEST-AutoCommitTest.testMaxTime-seed#[95ACF757C15EC4C9]) [    x:collection1] o.a.s.c.SolrConfig Using Lucene MatchVersion: 7.0.0
   [junit4]   2> 11909 INFO  (TEST-AutoCommitTest.testMaxTime-seed#[95ACF757C15EC4C9]) [    x:collection1] o.a.s.s.IndexSchema [collection1] Schema name=test
   [junit4]   2> 12018 WARN  (TEST-AutoCommitTest.testMaxTime-seed#[95ACF757C15EC4C9]) [    x:collection1] o.a.s.s.IndexSchema [collection1] default search field in schema is text. WARNING: Deprecated, please use 'df' on request instead.
   [junit4]   2> 12018 INFO  (TEST-AutoCommitTest.testMaxTime-seed#[95ACF757C15EC4C9]) [    x:collection1] o.a.s.s.IndexSchema Loaded schema test/1.0 with uniqueid field id
   [junit4]   2> 12034 INFO  (TEST-AutoCommitTest.testMaxTime-seed#[95ACF757C15EC4C9]) [    x:collection1] o.a.s.c.CoreContainer Reloading SolrCore 'collection1' using configuration from instancedir C:\Users\jenkins\workspace\Lucene-Solr-master-Windows\solr\core\src\test-files\solr\collection1
   [junit4]   2> 12034 INFO  (TEST-AutoCommitTest.testMaxTime-seed#[95ACF757C15EC4C9]) [    x:collection1] o.a.s.c.SolrCore [[collection1] ] Opening new SolrCore at [C:\Users\jenkins\workspace\Lucene-Solr-master-Windows\solr\core\src\test-files\solr\collection1], dataDir=[C:\Users\jenkins\workspace\Lucene-Solr-master-Windows\solr\build\solr-core\test\J1\temp\solr.update.AutoCommitTest_95ACF757C15EC4C9-001\init-core-data-001\]
   [junit4]   2> 12066 INFO  (TEST-AutoCommitTest.testMaxTime-seed#[95ACF757C15EC4C9]) [    x:collection1] o.a.s.u.CommitTracker Hard AutoCommit: disabled
   [junit4]   2> 12066 INFO  (TEST-AutoCommitTest.testMaxTime-seed#[95ACF757C15EC4C9]) [    x:collection1] o.a.s.u.CommitTracker Soft AutoCommit: disabled
   [junit4]   2> 12081 INFO  (TEST-AutoCommitTest.testMaxTime-seed#[95ACF757C15EC4C9]) [    x:collection1] o.a.s.s.SolrIndexSearcher Opening [Searcher@6dcfac3[collection1] main]
   [junit4]   2> 12081 INFO  (TEST-AutoCommitTest.testMaxTime-seed#[95ACF757C15EC4C9]) [    x:collection1] o.a.s.h.c.SpellCheckComponent Initializing spell checkers
   [junit4]   2> 12097 INFO  (TEST-AutoCommitTest.testMaxTime-seed#[95ACF757C15EC4C9]) [    x:collection1] o.a.s.s.DirectSolrSpellChecker init: {name=direct,classname=DirectSolrSpellChecker,field=lowerfilt,minQueryLength=3}
   [junit4]   2> 12112 INFO  (TEST-AutoCommitTest.testMaxTime-seed#[95ACF757C15EC4C9]) [    x:collection1] o.a.s.h.ReplicationHandler Commits will be reserved for  10000
   [junit4]   2> 12127 INFO  (searcherExecutor-20-thread-1-processing-x:collection1) [    x:collection1] o.a.s.h.c.SpellCheckComponent Loading spell index for spellchecker: default
   [junit4]   2> 12127 INFO  (searcherExecutor-20-thread-1-processing-x:collection1) [    x:collection1] o.a.s.h.c.SpellCheckComponent Loading spell index for spellchecker: direct
   [junit4]   2> 12127 INFO  (searcherExecutor-20-thread-1-processing-x:collection1) [    x:collection1] o.a.s.h.c.SpellCheckComponent Loading spell index for spellchecker: wordbreak
   [junit4]   2> 12127 INFO  (searcherExecutor-20-thread-1-processing-x:collection1) [    x:collection1] o.a.s.h.c.SpellCheckComponent Loading spell index for spellchecker: multipleFields
   [junit4]   2> 12127 INFO  (searcherExecutor-20-thread-1-processing-x:collection1) [    x:collection1] o.a.s.h.c.SpellCheckComponent Loading spell index for spellchecker: jarowinkler
   [junit4]   2> 12127 INFO  (searcherExecutor-20-thread-1-processing-x:collection1) [    x:collection1] o.a.s.h.c.SpellCheckComponent Loading spell index for spellchecker: external
   [junit4]   2> 12127 INFO  (searcherExecutor-20-thread-1-processing-x:collection1) [    x:collection1] o.a.s.h.c.SpellCheckComponent Loading spell index for spellchecker: freq
   [junit4]   2> 12127 INFO  (searcherExecutor-20-thread-1-processing-x:collection1) [    x:collection1] o.a.s.h.c.SpellCheckComponent Loading spell index for spellchecker: fqcn
   [junit4]   2> 12127 INFO  (searcherExecutor-20-thread-1-processing-x:collection1) [    x:collection1] o.a.s.h.c.SpellCheckComponent Loading spell index for spellchecker: perDict
   [junit4]   2> 12127 INFO  (searcherExecutor-20-thread-1-processing-x:collection1) [    x:collection1] o.a.s.c.SolrCore [collection1] Registered new searcher Searcher@6dcfac3[collection1] main{ExitableDirectoryReader(UninvertingDirectoryReader())}
   [junit4]   2> 12127 INFO  (TEST-AutoCommitTest.testMaxTime-seed#[95ACF757C15EC4C9]) [    x:collection1] o.a.s.u.RandomMergePolicy RandomMergePolicy wrapping class org.apache.lucene.index.TieredMergePolicy: [TieredMergePolicy: maxMergeAtOnce=46, maxMergeAtOnceExplicit=22, maxMergedSegmentMB=82.2900390625, floorSegmentMB=1.4189453125, forceMergeDeletesPctAllowed=0.16926166436279866, segmentsPerTier=31.0, maxCFSSegmentSizeMB=8.796093022207999E12, noCFSRatio=0.8214003507996952
   [junit4]   2> 12143 INFO  (TEST-AutoCommitTest.testMaxTime-seed#[95ACF757C15EC4C9]) [    x:collection1] o.a.s.u.DefaultSolrCoreState New IndexWriter is ready to be used.
   [junit4]   2> 12143 INFO  (TEST-AutoCommitTest.testMaxTime-seed#[95ACF757C15EC4C9]) [    x:collection1] o.a.s.s.SolrIndexSearcher Opening [Searcher@37419c26[collection1] main]
   [junit4]   2> 12143 INFO  (searcherExecutor-20-thread-1-processing-x:collection1) [    x:collection1] o.a.s.c.SolrCore [collection1] Registered new searcher Searcher@37419c26[collection1] main{ExitableDirectoryReader(UninvertingDirectoryReader())}
   [junit4]   2> 12143 INFO  (TEST-AutoCommitTest.testMaxTime-seed#[95ACF757C15EC4C9]) [    x:collection1] o.a.s.c.SolrCore [collection1]  CLOSING SolrCore org.apache.solr.core.SolrCore@61595bf9
   [junit4]   2> 12159 INFO  (TEST-AutoCommitTest.testMaxTime-seed#[95ACF757C15EC4C9]) [    x:collection1] o.a.s.u.p.LogUpdateProcessorFactory [collection1] {add=[529 (1553547367404273664)]} 0 9
   [junit4]   2> 12159 INFO  (TEST-AutoCommitTest.testMaxTime-seed#[95ACF757C15EC4C9]) [    x:collection1] o.a.s.c.S.Request [collection1]  webapp=null path=null params={q=id:529&qt=standard&start=0&rows=20&version=2.2} hits=0 status=0 QTime=0
   [junit4]   2> 13173 INFO  (commitScheduler-23-thread-1) [    x:collection1] o.a.s.u.DirectUpdateHandler2 start commit{,optimize=false,openSearcher=true,waitSearcher=true,expungeDeletes=false,softCommit=true,prepareCommit=false}
   [junit4]   2> 13173 INFO  (commitScheduler-23-thread-1) [    x:collection1] o.a.s.s.SolrIndexSearcher Opening [Searcher@338a2da4[collection1] main]
   [junit4]   2> 13204 INFO  (commitScheduler-23-thread-1) [    x:collection1] o.a.s.u.DirectUpdateHandler2 end_commit_flush
   [junit4]   2> 13204 INFO  (searcherExecutor-20-thread-1-processing-x:collection1) [    x:collection1] o.a.s.c.SolrCore [collection1] Registered new searcher Searcher@338a2da4[collection1] main{ExitableDirectoryReader(UninvertingDirectoryReader(Uninverting(_3(7.0.0):C1)))}
   [junit4]   2> 13204 INFO  (TEST-AutoCommitTest.testMaxTime-seed#[95ACF757C15EC4C9]) [    x:collection1] o.a.s.u.p.LogUpdateProcessorFactory [collection1] {add=[530 (1553547368516812800)]} 0 1065
   [junit4]   2> 13204 INFO  (TEST-AutoCommitTest.testMaxTime-seed#[95ACF757C15EC4C9]) [    x:collection1] o.a.s.c.S.Request [collection1]  webapp=null path=null params={q=id:529&qt=standard&start=0&rows=20&version=2.2} hits=1 status=0 QTime=0
   [junit4]   2> 13220 INFO  (TEST-AutoCommitTest.testMaxTime-seed#[95ACF757C15EC4C9]) [    x:collection1] o.a.s.c.S.Request [collection1]  webapp=null path=null params={q=id:530&qt=standard&start=0&rows=20&version=2.2} hits=0 status=0 QTime=1
   [junit4]   2> 13220 INFO  (TEST-AutoCommitTest.testMaxTime-seed#[95ACF757C15EC4C9]) [    x:collection1] o.a.s.u.p.LogUpdateProcessorFactory [collection1]  webapp=null path=null params={}{delete=[529 (-1553547368533590016)]} 0 0
   [junit4]   2> 13220 INFO  (TEST-AutoCommitTest.testMaxTime-seed#[95ACF757C15EC4C9]) [    x:collection1] o.a.s.c.S.Request [collection1]  webapp=null path=null params={q=id:529&qt=standard&start=0&rows=20&version=2.2} hits=1 status=0 QTime=0
   [junit4]   2> 14220 INFO  (commitScheduler-23-thread-1) [    x:collection1] o.a.s.u.DirectUpdateHandler2 start commit{,optimize=false,openSearcher=true,waitSearcher=true,expungeDeletes=false,softCommit=true,prepareCommit=false}
   [junit4]   2> 14220 INFO  (commitScheduler-23-thread-1) [    x:collection1] o.a.s.s.SolrIndexSearcher Opening [Searcher@153415c7[collection1] main]
   [junit4]   2> 14220 INFO  (searcherExecutor-20-thread-1-processing-x:collection1) [    x:collection1] o.a.s.c.SolrCore [collection1] Registered new searcher Searcher@153415c7[collection1] main{ExitableDirectoryReader(UninvertingDirectoryReader(Uninverting(_4(7.0.0):C1)))}
   [junit4]   2> 14220 INFO  (commitScheduler-23-thread-1) [    x:collection1] o.a.s.u.DirectUpdateHandler2 end_commit_flush
   [junit4]   2> 14282 INFO  (TEST-AutoCommitTest.testMaxTime-seed#[95ACF757C15EC4C9]) [    x:collection1] o.a.s.u.p.LogUpdateProcessorFactory [collection1] {add=[550 (1553547369647177728)]} 0 2134
   [junit4]   2> 14282 INFO  (TEST-AutoCommitTest.testMaxTime-seed#[95ACF757C15EC4C9]) [    x:collection1] o.a.s.c.S.Request [collection1]  webapp=null path=null params={q=id:529&qt=standard&start=0&rows=20&version=2.2} hits=0 status=0 QTime=0
   [junit4]   2> 14282 INFO  (TEST-AutoCommitTest.testMaxTime-seed#[95ACF757C15EC4C9]) [    x:collection1] o.a.s.u.p.LogUpdateProcessorFactory [collection1] {add=[500 (1553547369647177729)]} 0 2137
   [junit4]   2> 14282 INFO  (TEST-AutoCommitTest.testMaxTime-seed#[95ACF757C15EC4C9]) [    x:collection1] o.a.s.u.p.LogUpdateProcessorFactory [collection1] {add=[500 (1553547369647177730)]} 0 2138
   [junit4]   2> 14282 INFO  (TEST-AutoCommitTest.testMaxTime-seed#[95ACF757C15EC4C9]) [    x:collection1] o.a.s.u.p.LogUpdateProcessorFactory [collection1] {add=[500 (1553547369647177731)]} 0 2138
   [junit4]   2> 14282 INFO  (TEST-AutoCommitTest.testMaxTime-seed#[95ACF757C15EC4C9]) [    x:collection1] o.a.s.u.p.LogUpdateProcessorFactory [collection1] {add=[500 (1553547369647177732)]} 0 2140
   [junit4]   2> 14282 INFO  (TEST-AutoCommitTest.testMaxTime-seed#[95ACF757C15EC4C9]) [    x:collection1] o.a.s.u.p.LogUpdateProcessorFactory [collection1] {add=[500 (1553547369647177733)]} 0 2140
   [junit4]   2> 14282 INFO  (TEST-AutoCommitTest.testMaxTime-seed#[95ACF757C15EC4C9]) [    x:collection1] o.a.s.u.p.LogUpdateProcessorFactory [collection1] {add=[500 (1553547369647177734)]} 0 2141
   [junit4]   2> 14282 INFO  (TEST-AutoCommitTest.testMaxTime-seed#[95ACF757C15EC4C9]) [    x:collection1] o.a.s.u.p.LogUpdateProcessorFactory [collection1] {add=[500 (1553547369647177735)]} 0 2142
   [junit4]   2> 14282 INFO  (TEST-AutoCommitTest.testMaxTime-seed#[95ACF757C15EC4C9]) [    x:collection1] o.a.s.u.p.LogUpdateProcessorFactory [collection1] {add=[500 (1553547369647177736)]} 0 2144
   [junit4]   2> 14282 INFO  (TEST-AutoCommitTest.testMaxTime-seed#[95ACF757C15EC4C9]) [    x:collection1] o.a.s.u.p.LogUpdateProcessorFactory [collection1] {add=[500 (1553547369647177737)]} 0 2145
   [junit4]   2> 14282 INFO  (TEST-AutoCommitTest.testMaxTime-seed#[95ACF757C15EC4C9]) [    x:collection1] o.a.s.u.p.LogUpdateProcessorFactory [collection1] {add=[500 (1553547369647177738)]} 0 2145
   [junit4]   2> 14298 INFO  (TEST-AutoCommitTest.testMaxTime-seed#[95ACF757C15EC4C9]) [    x:collection1] o.a.s.c.S.Request [collection1]  webapp=null path=null params={q=id:500&qt=standard&start=0&rows=20&version=2.2} hits=0 status=0 QTime=1
   [junit4]   2> 15296 INFO  (commitScheduler-23-thread-1) [    x:collection1] o.a.s.u.DirectUpdateHandler2 start commit{,optimize=false,openSearcher=true,waitSearcher=true,expungeDeletes=false,softCommit=true,prepareCommit=false}
   [junit4]   2> 15296 INFO  (commitScheduler-23-thread-1) [    x:collection1] o.a.s.s.SolrIndexSearcher Opening [Searcher@78f89025[collection1] main]
   [junit4]   2> 15296 INFO  (commitScheduler-23-thread-1) [    x:collection1] o.a.s.u.DirectUpdateHandler2 end_commit_flush
   [junit4]   2> 15296 INFO  (searcherExecutor-20-thread-1-processing-x:collection1) [    x:collection1] o.a.s.c.SolrCore [collection1] Registered new searcher Searcher@78f89025[collection1] main{ExitableDirectoryReader(UninvertingDirectoryReader(Uninverting(_4(7.0.0):C1) Uninverting(_5(7.0.0):C11/9:delGen=1)))}
   [junit4]   2> 15359 INFO  (TEST-AutoCommitTest.testMaxTime-seed#[95ACF757C15EC4C9]) [    x:collection1] o.a.s.u.p.LogUpdateProcessorFactory [collection1] {add=[531 (1553547370776494080)]} 0 3210
   [junit4]   2> 15359 INFO  (TEST-AutoCommitTest.testMaxTime-seed#[95ACF757C15EC4C9]) [    x:collection1] o.a.s.c.S.Request [collection1]  webapp=null path=null params={q=id:500&qt=standard&start=0&rows=20&version=2.2} hits=1 status=0 QTime=0
   [junit4]   2> 15359 INFO  (TEST-AutoCommitTest.testMaxTime-seed#[95ACF757C15EC4C9]) [    x:collection1] o.a.s.SolrTestCaseJ4 ###Ending testMaxTime
   [junit4]   2> 15359 INFO  (SUITE-AutoCommitTest-seed#[95ACF757C15EC4C9]-worker) [    x:collection1] o.a.s.SolrTestCaseJ4 ###deleteCore
   [junit4]   2> 15359 INFO  (SUITE-AutoCommitTest-seed#[95ACF757C15EC4C9]-worker) [    x:collection1] o.a.s.c.CoreContainer Shutting down CoreContainer instance=457699618
   [junit4]   2> 15359 INFO  (coreCloseExecutor-24-thread-1-processing-x:collection1) [    x:collection1] o.a.s.c.SolrCore [collection1]  CLOSING SolrCore org.apache.solr.core.SolrCore@3a8bfb47
   [junit4]   2> 15374 INFO  (coreCloseExecutor-24-thread-1-processing-x:collection1) [    x:collection1] o.a.s.u.DirectUpdateHandler2 Committing on IndexWriter close.
   [junit4]   2> 15374 INFO  (coreCloseExecutor-24-thread-1-processing-x:collection1) [    x:collection1] o.a.s.u.SolrIndexWriter Calling setCommitData with IW:org.apache.solr.update.SolrIndexWriter@365dc1e3
   [junit4]   2> NOTE: leaving temporary files on disk at: C:\Users\jenkins\workspace\Lucene-Solr-master-Windows\solr\build\solr-core\test\J1\temp\solr.update.AutoCommitTest_95ACF757C15EC4C9-001
   [junit4]   2> NOTE: test params are: codec=FastCompressingStoredFields(storedFieldsFormat=CompressingStoredFieldsFormat(compressionMode=FAST, chunkSize=9246, maxDocsPerChunk=117, blockSize=1), termVectorsFormat=CompressingTermVectorsFormat(compressionMode=FAST, chunkSize=9246, blockSize=1)), sim=RandomSimilarity(queryNorm=true): {}, locale=fr-LU, timezone=Europe/Belfast
   [junit4]   2> NOTE: Windows 10 10.0 amd64/Oracle Corporation 1.8.0_112 (64-bit)/cpus=3,threads=1,free=32231032,total=64880640
   [junit4]   2> NOTE: All tests run in this JVM: [AutoCommitTest]
   [junit4] Completed [6/659 (1!)] on J1 in 17.98s, 3 tests, 1 error <<< FAILURES!

[...truncated 64488 lines...]


Mime
View raw message