lucene-dev mailing list archives

Site index · List index
Message view « Date » · « Thread »
Top « Date » · « Thread »
From Policeman Jenkins Server <jenk...@thetaphi.de>
Subject [JENKINS] Lucene-Solr-master-MacOSX (64bit/jdk1.8.0) - Build # 3713 - Unstable!
Date Thu, 15 Dec 2016 14:07:11 GMT
Build: https://jenkins.thetaphi.de/job/Lucene-Solr-master-MacOSX/3713/
Java: 64bit/jdk1.8.0 -XX:-UseCompressedOops -XX:+UseParallelGC

1 tests failed.
FAILED:  org.apache.solr.update.SoftAutoCommitTest.testSoftAndHardCommitMaxTimeMixedAdds

Error Message:
soft529 wasn't fast enough

Stack Trace:
java.lang.AssertionError: soft529 wasn't fast enough
	at __randomizedtesting.SeedInfo.seed([5D9E29CB098AE9D5:C4AD04BB8F9D972]:0)
	at org.junit.Assert.fail(Assert.java:93)
	at org.junit.Assert.assertTrue(Assert.java:43)
	at org.junit.Assert.assertNotNull(Assert.java:526)
	at org.apache.solr.update.SoftAutoCommitTest.testSoftAndHardCommitMaxTimeMixedAdds(SoftAutoCommitTest.java:111)
	at sun.reflect.NativeMethodAccessorImpl.invoke0(Native Method)
	at sun.reflect.NativeMethodAccessorImpl.invoke(NativeMethodAccessorImpl.java:62)
	at sun.reflect.DelegatingMethodAccessorImpl.invoke(DelegatingMethodAccessorImpl.java:43)
	at java.lang.reflect.Method.invoke(Method.java:498)
	at com.carrotsearch.randomizedtesting.RandomizedRunner.invoke(RandomizedRunner.java:1713)
	at com.carrotsearch.randomizedtesting.RandomizedRunner$8.evaluate(RandomizedRunner.java:907)
	at com.carrotsearch.randomizedtesting.RandomizedRunner$9.evaluate(RandomizedRunner.java:943)
	at com.carrotsearch.randomizedtesting.RandomizedRunner$10.evaluate(RandomizedRunner.java:957)
	at com.carrotsearch.randomizedtesting.rules.SystemPropertiesRestoreRule$1.evaluate(SystemPropertiesRestoreRule.java:57)
	at org.apache.lucene.util.TestRuleSetupTeardownChained$1.evaluate(TestRuleSetupTeardownChained.java:49)
	at org.apache.lucene.util.AbstractBeforeAfterRule$1.evaluate(AbstractBeforeAfterRule.java:45)
	at org.apache.lucene.util.TestRuleThreadAndTestName$1.evaluate(TestRuleThreadAndTestName.java:48)
	at org.apache.lucene.util.TestRuleIgnoreAfterMaxFailures$1.evaluate(TestRuleIgnoreAfterMaxFailures.java:64)
	at org.apache.lucene.util.TestRuleMarkFailure$1.evaluate(TestRuleMarkFailure.java:47)
	at com.carrotsearch.randomizedtesting.rules.StatementAdapter.evaluate(StatementAdapter.java:36)
	at com.carrotsearch.randomizedtesting.ThreadLeakControl$StatementRunner.run(ThreadLeakControl.java:367)
	at com.carrotsearch.randomizedtesting.ThreadLeakControl.forkTimeoutingTask(ThreadLeakControl.java:811)
	at com.carrotsearch.randomizedtesting.ThreadLeakControl$3.evaluate(ThreadLeakControl.java:462)
	at com.carrotsearch.randomizedtesting.RandomizedRunner.runSingleTest(RandomizedRunner.java:916)
	at com.carrotsearch.randomizedtesting.RandomizedRunner$5.evaluate(RandomizedRunner.java:802)
	at com.carrotsearch.randomizedtesting.RandomizedRunner$6.evaluate(RandomizedRunner.java:852)
	at com.carrotsearch.randomizedtesting.RandomizedRunner$7.evaluate(RandomizedRunner.java:863)
	at com.carrotsearch.randomizedtesting.rules.StatementAdapter.evaluate(StatementAdapter.java:36)
	at com.carrotsearch.randomizedtesting.rules.SystemPropertiesRestoreRule$1.evaluate(SystemPropertiesRestoreRule.java:57)
	at org.apache.lucene.util.AbstractBeforeAfterRule$1.evaluate(AbstractBeforeAfterRule.java:45)
	at com.carrotsearch.randomizedtesting.rules.StatementAdapter.evaluate(StatementAdapter.java:36)
	at org.apache.lucene.util.TestRuleStoreClassName$1.evaluate(TestRuleStoreClassName.java:41)
	at com.carrotsearch.randomizedtesting.rules.NoShadowingOrOverridesOnMethodsRule$1.evaluate(NoShadowingOrOverridesOnMethodsRule.java:40)
	at com.carrotsearch.randomizedtesting.rules.NoShadowingOrOverridesOnMethodsRule$1.evaluate(NoShadowingOrOverridesOnMethodsRule.java:40)
	at com.carrotsearch.randomizedtesting.rules.StatementAdapter.evaluate(StatementAdapter.java:36)
	at com.carrotsearch.randomizedtesting.rules.StatementAdapter.evaluate(StatementAdapter.java:36)
	at com.carrotsearch.randomizedtesting.rules.StatementAdapter.evaluate(StatementAdapter.java:36)
	at org.apache.lucene.util.TestRuleAssertionsRequired$1.evaluate(TestRuleAssertionsRequired.java:53)
	at org.apache.lucene.util.TestRuleMarkFailure$1.evaluate(TestRuleMarkFailure.java:47)
	at org.apache.lucene.util.TestRuleIgnoreAfterMaxFailures$1.evaluate(TestRuleIgnoreAfterMaxFailures.java:64)
	at org.apache.lucene.util.TestRuleIgnoreTestSuites$1.evaluate(TestRuleIgnoreTestSuites.java:54)
	at com.carrotsearch.randomizedtesting.rules.StatementAdapter.evaluate(StatementAdapter.java:36)
	at com.carrotsearch.randomizedtesting.ThreadLeakControl$StatementRunner.run(ThreadLeakControl.java:367)
	at java.lang.Thread.run(Thread.java:745)




Build Log:
[...truncated 10668 lines...]
   [junit4] Suite: org.apache.solr.update.SoftAutoCommitTest
   [junit4]   2> Creating dataDir: /Users/jenkins/workspace/Lucene-Solr-master-MacOSX/solr/build/solr-core/test/J0/temp/solr.update.SoftAutoCommitTest_5D9E29CB098AE9D5-001/init-core-data-001
   [junit4]   2> 90226 INFO  (SUITE-SoftAutoCommitTest-seed#[5D9E29CB098AE9D5]-worker)
[    ] o.a.s.SolrTestCaseJ4 Randomized ssl (false) and clientAuth (false) via: @org.apache.solr.util.RandomizeSSL(reason=,
value=NaN, ssl=NaN, clientAuth=NaN) w/ MAC_OS_X supressed clientAuth
   [junit4]   2> 90227 INFO  (SUITE-SoftAutoCommitTest-seed#[5D9E29CB098AE9D5]-worker)
[    ] o.a.s.SolrTestCaseJ4 ####initCore
   [junit4]   2> 90227 INFO  (SUITE-SoftAutoCommitTest-seed#[5D9E29CB098AE9D5]-worker)
[    ] o.a.s.c.SolrResourceLoader [null] Added 2 libs to classloader, from paths: [/Users/jenkins/workspace/Lucene-Solr-master-MacOSX/solr/core/src/test-files/solr/collection1/lib,
/Users/jenkins/workspace/Lucene-Solr-master-MacOSX/solr/core/src/test-files/solr/collection1/lib/classes]
   [junit4]   2> 90312 INFO  (SUITE-SoftAutoCommitTest-seed#[5D9E29CB098AE9D5]-worker)
[    ] o.a.s.c.SolrConfig Using Lucene MatchVersion: 7.0.0
   [junit4]   2> 90417 INFO  (SUITE-SoftAutoCommitTest-seed#[5D9E29CB098AE9D5]-worker)
[    ] o.a.s.s.IndexSchema [null] Schema name=test
   [junit4]   2> 90680 WARN  (SUITE-SoftAutoCommitTest-seed#[5D9E29CB098AE9D5]-worker)
[    ] o.a.s.s.IndexSchema [null] default search field in schema is text. WARNING: Deprecated,
please use 'df' on request instead.
   [junit4]   2> 90688 INFO  (SUITE-SoftAutoCommitTest-seed#[5D9E29CB098AE9D5]-worker)
[    ] o.a.s.s.IndexSchema Loaded schema test/1.0 with uniqueid field id
   [junit4]   2> 90763 INFO  (coreLoadExecutor-549-thread-1) [    x:collection1] o.a.s.c.SolrResourceLoader
[null] Added 2 libs to classloader, from paths: [/Users/jenkins/workspace/Lucene-Solr-master-MacOSX/solr/core/src/test-files/solr/collection1/lib,
/Users/jenkins/workspace/Lucene-Solr-master-MacOSX/solr/core/src/test-files/solr/collection1/lib/classes]
   [junit4]   2> 90791 INFO  (coreLoadExecutor-549-thread-1) [    x:collection1] o.a.s.c.SolrConfig
Using Lucene MatchVersion: 7.0.0
   [junit4]   2> 90824 INFO  (coreLoadExecutor-549-thread-1) [    x:collection1] o.a.s.s.IndexSchema
[collection1] Schema name=test
   [junit4]   2> 91083 WARN  (coreLoadExecutor-549-thread-1) [    x:collection1] o.a.s.s.IndexSchema
[collection1] default search field in schema is text. WARNING: Deprecated, please use 'df'
on request instead.
   [junit4]   2> 91088 INFO  (coreLoadExecutor-549-thread-1) [    x:collection1] o.a.s.s.IndexSchema
Loaded schema test/1.0 with uniqueid field id
   [junit4]   2> 91099 INFO  (coreLoadExecutor-549-thread-1) [    x:collection1] o.a.s.c.CoreContainer
Creating SolrCore 'collection1' using configuration from instancedir /Users/jenkins/workspace/Lucene-Solr-master-MacOSX/solr/core/src/test-files/solr/collection1
   [junit4]   2> 91099 INFO  (coreLoadExecutor-549-thread-1) [    x:collection1] o.a.s.c.SolrCore
[[collection1] ] Opening new SolrCore at [/Users/jenkins/workspace/Lucene-Solr-master-MacOSX/solr/core/src/test-files/solr/collection1],
dataDir=[/Users/jenkins/workspace/Lucene-Solr-master-MacOSX/solr/build/solr-core/test/J0/temp/solr.update.SoftAutoCommitTest_5D9E29CB098AE9D5-001/init-core-data-001/]
   [junit4]   2> 91099 INFO  (coreLoadExecutor-549-thread-1) [    x:collection1] o.a.s.c.JmxMonitoredMap
JMX monitoring is enabled. Adding Solr mbeans to JMX Server: com.sun.jmx.mbeanserver.JmxMBeanServer@771cb9a7
   [junit4]   2> 91124 INFO  (coreLoadExecutor-549-thread-1) [    x:collection1] o.a.s.u.RandomMergePolicy
RandomMergePolicy wrapping class org.apache.lucene.index.LogDocMergePolicy: [LogDocMergePolicy:
minMergeSize=1000, mergeFactor=43, maxMergeSize=9223372036854775807, maxMergeSizeForForcedMerge=9223372036854775807,
calibrateSizeByDeletes=false, maxMergeDocs=2147483647, maxCFSSegmentSizeMB=8.796093022207999E12,
noCFSRatio=0.6364244082186123]
   [junit4]   2> 91219 INFO  (coreLoadExecutor-549-thread-1) [    x:collection1] o.a.s.u.UpdateHandler
Using UpdateLog implementation: org.apache.solr.update.UpdateLog
   [junit4]   2> 91219 INFO  (coreLoadExecutor-549-thread-1) [    x:collection1] o.a.s.u.UpdateLog
Initializing UpdateLog: dataDir= defaultSyncLevel=FLUSH numRecordsToKeep=100 maxNumLogsToKeep=10
numVersionBuckets=65536
   [junit4]   2> 91220 INFO  (coreLoadExecutor-549-thread-1) [    x:collection1] o.a.s.u.CommitTracker
Hard AutoCommit: disabled
   [junit4]   2> 91220 INFO  (coreLoadExecutor-549-thread-1) [    x:collection1] o.a.s.u.CommitTracker
Soft AutoCommit: disabled
   [junit4]   2> 91231 INFO  (coreLoadExecutor-549-thread-1) [    x:collection1] o.a.s.u.RandomMergePolicy
RandomMergePolicy wrapping class org.apache.lucene.index.TieredMergePolicy: [TieredMergePolicy:
maxMergeAtOnce=20, maxMergeAtOnceExplicit=15, maxMergedSegmentMB=22.5458984375, floorSegmentMB=1.7578125,
forceMergeDeletesPctAllowed=16.056429537349175, segmentsPerTier=25.0, maxCFSSegmentSizeMB=8.796093022207999E12,
noCFSRatio=0.7765885353628417
   [junit4]   2> 91243 INFO  (coreLoadExecutor-549-thread-1) [    x:collection1] o.a.s.s.SolrIndexSearcher
Opening [Searcher@4754885c[collection1] main]
   [junit4]   2> 91245 INFO  (coreLoadExecutor-549-thread-1) [    x:collection1] o.a.s.h.c.SpellCheckComponent
Initializing spell checkers
   [junit4]   2> 91269 INFO  (coreLoadExecutor-549-thread-1) [    x:collection1] o.a.s.s.DirectSolrSpellChecker
init: {name=direct,classname=DirectSolrSpellChecker,field=lowerfilt,minQueryLength=3}
   [junit4]   2> 91374 INFO  (coreLoadExecutor-549-thread-1) [    x:collection1] o.a.s.h.ReplicationHandler
Commits will be reserved for  10000
   [junit4]   2> 91374 INFO  (searcherExecutor-550-thread-1-processing-x:collection1) [
   x:collection1] o.a.s.h.c.SpellCheckComponent Loading spell index for spellchecker: default
   [junit4]   2> 91376 INFO  (coreLoadExecutor-549-thread-1) [    x:collection1] o.a.s.u.UpdateLog
Could not find max version in index or recent updates, using new clock 1553786671221178368
   [junit4]   2> 91379 INFO  (SUITE-SoftAutoCommitTest-seed#[5D9E29CB098AE9D5]-worker)
[    ] o.a.s.SolrTestCaseJ4 ####initCore end
   [junit4]   2> 91385 INFO  (searcherExecutor-550-thread-1-processing-x:collection1) [
   x:collection1] o.a.s.h.c.SpellCheckComponent Loading spell index for spellchecker: direct
   [junit4]   2> 91386 INFO  (searcherExecutor-550-thread-1-processing-x:collection1) [
   x:collection1] o.a.s.h.c.SpellCheckComponent Loading spell index for spellchecker: wordbreak
   [junit4]   2> 91386 INFO  (searcherExecutor-550-thread-1-processing-x:collection1) [
   x:collection1] o.a.s.h.c.SpellCheckComponent Loading spell index for spellchecker: multipleFields
   [junit4]   2> 91387 INFO  (TEST-SoftAutoCommitTest.testSoftAndHardCommitMaxTimeMixedAdds-seed#[5D9E29CB098AE9D5])
[    ] o.a.s.SolrTestCaseJ4 ###Starting testSoftAndHardCommitMaxTimeMixedAdds
   [junit4]   2> 91387 INFO  (TEST-SoftAutoCommitTest.testSoftAndHardCommitMaxTimeMixedAdds-seed#[5D9E29CB098AE9D5])
[    ] o.a.s.c.SolrResourceLoader [null] Added 2 libs to classloader, from paths: [/Users/jenkins/workspace/Lucene-Solr-master-MacOSX/solr/core/src/test-files/solr/collection1/lib,
/Users/jenkins/workspace/Lucene-Solr-master-MacOSX/solr/core/src/test-files/solr/collection1/lib/classes]
   [junit4]   2> 91397 INFO  (searcherExecutor-550-thread-1-processing-x:collection1) [
   x:collection1] o.a.s.h.c.SpellCheckComponent Loading spell index for spellchecker: jarowinkler
   [junit4]   2> 91408 INFO  (searcherExecutor-550-thread-1-processing-x:collection1) [
   x:collection1] o.a.s.h.c.SpellCheckComponent Loading spell index for spellchecker: external
   [junit4]   2> 91419 INFO  (searcherExecutor-550-thread-1-processing-x:collection1) [
   x:collection1] o.a.s.h.c.SpellCheckComponent Loading spell index for spellchecker: freq
   [junit4]   2> 91437 INFO  (searcherExecutor-550-thread-1-processing-x:collection1) [
   x:collection1] o.a.s.h.c.SpellCheckComponent Loading spell index for spellchecker: fqcn
   [junit4]   2> 91448 INFO  (searcherExecutor-550-thread-1-processing-x:collection1) [
   x:collection1] o.a.s.h.c.SpellCheckComponent Loading spell index for spellchecker: perDict
   [junit4]   2> 91449 INFO  (searcherExecutor-550-thread-1-processing-x:collection1) [
   x:collection1] o.a.s.c.SolrCore [collection1] Registered new searcher Searcher@4754885c[collection1]
main{ExitableDirectoryReader(UninvertingDirectoryReader())}
   [junit4]   2> 91464 INFO  (TEST-SoftAutoCommitTest.testSoftAndHardCommitMaxTimeMixedAdds-seed#[5D9E29CB098AE9D5])
[    ] o.a.s.c.SolrConfig Using Lucene MatchVersion: 7.0.0
   [junit4]   2> 92116 INFO  (TEST-SoftAutoCommitTest.testSoftAndHardCommitMaxTimeMixedAdds-seed#[5D9E29CB098AE9D5])
[    ] o.a.s.s.IndexSchema [collection1] Schema name=test
   [junit4]   2> 92234 WARN  (TEST-SoftAutoCommitTest.testSoftAndHardCommitMaxTimeMixedAdds-seed#[5D9E29CB098AE9D5])
[    ] o.a.s.s.IndexSchema [collection1] default search field in schema is text. WARNING:
Deprecated, please use 'df' on request instead.
   [junit4]   2> 92239 INFO  (TEST-SoftAutoCommitTest.testSoftAndHardCommitMaxTimeMixedAdds-seed#[5D9E29CB098AE9D5])
[    ] o.a.s.s.IndexSchema Loaded schema test/1.0 with uniqueid field id
   [junit4]   2> 92335 INFO  (TEST-SoftAutoCommitTest.testSoftAndHardCommitMaxTimeMixedAdds-seed#[5D9E29CB098AE9D5])
[    ] o.a.s.c.CoreContainer Reloading SolrCore 'collection1' using configuration from instancedir
/Users/jenkins/workspace/Lucene-Solr-master-MacOSX/solr/core/src/test-files/solr/collection1
   [junit4]   2> 92349 INFO  (TEST-SoftAutoCommitTest.testSoftAndHardCommitMaxTimeMixedAdds-seed#[5D9E29CB098AE9D5])
[    x:collection1] o.a.s.c.SolrCore [[collection1] ] Opening new SolrCore at [/Users/jenkins/workspace/Lucene-Solr-master-MacOSX/solr/core/src/test-files/solr/collection1],
dataDir=[/Users/jenkins/workspace/Lucene-Solr-master-MacOSX/solr/build/solr-core/test/J0/temp/solr.update.SoftAutoCommitTest_5D9E29CB098AE9D5-001/init-core-data-001/]
   [junit4]   2> 92349 INFO  (TEST-SoftAutoCommitTest.testSoftAndHardCommitMaxTimeMixedAdds-seed#[5D9E29CB098AE9D5])
[    x:collection1] o.a.s.c.JmxMonitoredMap JMX monitoring is enabled. Adding Solr mbeans
to JMX Server: com.sun.jmx.mbeanserver.JmxMBeanServer@771cb9a7
   [junit4]   2> 92404 INFO  (TEST-SoftAutoCommitTest.testSoftAndHardCommitMaxTimeMixedAdds-seed#[5D9E29CB098AE9D5])
[    x:collection1] o.a.s.u.CommitTracker Hard AutoCommit: disabled
   [junit4]   2> 92404 INFO  (TEST-SoftAutoCommitTest.testSoftAndHardCommitMaxTimeMixedAdds-seed#[5D9E29CB098AE9D5])
[    x:collection1] o.a.s.u.CommitTracker Soft AutoCommit: disabled
   [junit4]   2> 92418 INFO  (TEST-SoftAutoCommitTest.testSoftAndHardCommitMaxTimeMixedAdds-seed#[5D9E29CB098AE9D5])
[    x:collection1] o.a.s.s.SolrIndexSearcher Opening [Searcher@19c2096c[collection1] main]
   [junit4]   2> 92419 INFO  (TEST-SoftAutoCommitTest.testSoftAndHardCommitMaxTimeMixedAdds-seed#[5D9E29CB098AE9D5])
[    x:collection1] o.a.s.h.c.SpellCheckComponent Initializing spell checkers
   [junit4]   2> 92434 INFO  (TEST-SoftAutoCommitTest.testSoftAndHardCommitMaxTimeMixedAdds-seed#[5D9E29CB098AE9D5])
[    x:collection1] o.a.s.s.DirectSolrSpellChecker init: {name=direct,classname=DirectSolrSpellChecker,field=lowerfilt,minQueryLength=3}
   [junit4]   2> 92505 INFO  (TEST-SoftAutoCommitTest.testSoftAndHardCommitMaxTimeMixedAdds-seed#[5D9E29CB098AE9D5])
[    x:collection1] o.a.s.h.ReplicationHandler Commits will be reserved for  10000
   [junit4]   2> 92505 INFO  (searcherExecutor-555-thread-1-processing-x:collection1) [
   x:collection1] o.a.s.h.c.SpellCheckComponent Loading spell index for spellchecker: default
   [junit4]   2> 92509 INFO  (TEST-SoftAutoCommitTest.testSoftAndHardCommitMaxTimeMixedAdds-seed#[5D9E29CB098AE9D5])
[    x:collection1] o.a.s.u.UpdateLog Could not find max version in index or recent updates,
using new clock 1553786672409214976
   [junit4]   2> 92516 INFO  (searcherExecutor-555-thread-1-processing-x:collection1) [
   x:collection1] o.a.s.h.c.SpellCheckComponent Loading spell index for spellchecker: direct
   [junit4]   2> 92516 INFO  (searcherExecutor-555-thread-1-processing-x:collection1) [
   x:collection1] o.a.s.h.c.SpellCheckComponent Loading spell index for spellchecker: wordbreak
   [junit4]   2> 92516 INFO  (searcherExecutor-555-thread-1-processing-x:collection1) [
   x:collection1] o.a.s.h.c.SpellCheckComponent Loading spell index for spellchecker: multipleFields
   [junit4]   2> 92526 INFO  (TEST-SoftAutoCommitTest.testSoftAndHardCommitMaxTimeMixedAdds-seed#[5D9E29CB098AE9D5])
[    x:collection1] o.a.s.u.RandomMergePolicy RandomMergePolicy wrapping class org.apache.lucene.index.TieredMergePolicy:
[TieredMergePolicy: maxMergeAtOnce=2, maxMergeAtOnceExplicit=6, maxMergedSegmentMB=68.79296875,
floorSegmentMB=1.130859375, forceMergeDeletesPctAllowed=10.477911980226779, segmentsPerTier=22.0,
maxCFSSegmentSizeMB=8.796093022207999E12, noCFSRatio=0.0
   [junit4]   2> 92526 INFO  (searcherExecutor-555-thread-1-processing-x:collection1) [
   x:collection1] o.a.s.h.c.SpellCheckComponent Loading spell index for spellchecker: jarowinkler
   [junit4]   2> 92538 INFO  (searcherExecutor-555-thread-1-processing-x:collection1) [
   x:collection1] o.a.s.h.c.SpellCheckComponent Loading spell index for spellchecker: external
   [junit4]   2> 92549 INFO  (searcherExecutor-555-thread-1-processing-x:collection1) [
   x:collection1] o.a.s.h.c.SpellCheckComponent Loading spell index for spellchecker: freq
   [junit4]   2> 92560 INFO  (searcherExecutor-555-thread-1-processing-x:collection1) [
   x:collection1] o.a.s.h.c.SpellCheckComponent Loading spell index for spellchecker: fqcn
   [junit4]   2> 92560 INFO  (TEST-SoftAutoCommitTest.testSoftAndHardCommitMaxTimeMixedAdds-seed#[5D9E29CB098AE9D5])
[    x:collection1] o.a.s.u.DefaultSolrCoreState New IndexWriter is ready to be used.
   [junit4]   2> 92560 WARN  (TEST-SoftAutoCommitTest.testSoftAndHardCommitMaxTimeMixedAdds-seed#[5D9E29CB098AE9D5])
[    x:collection1] o.a.s.c.SolrCore [collection1] PERFORMANCE WARNING: Overlapping onDeckSearchers=2
   [junit4]   2> 92571 INFO  (searcherExecutor-555-thread-1-processing-x:collection1) [
   x:collection1] o.a.s.h.c.SpellCheckComponent Loading spell index for spellchecker: perDict
   [junit4]   2> 92571 INFO  (searcherExecutor-555-thread-1-processing-x:collection1) [
   x:collection1] o.a.s.c.SolrCore [collection1] Registered new searcher Searcher@19c2096c[collection1]
main{ExitableDirectoryReader(UninvertingDirectoryReader())}
   [junit4]   2> 92572 INFO  (TEST-SoftAutoCommitTest.testSoftAndHardCommitMaxTimeMixedAdds-seed#[5D9E29CB098AE9D5])
[    x:collection1] o.a.s.s.SolrIndexSearcher Opening [Searcher@316342eb[collection1] main]
   [junit4]   2> 92572 INFO  (TEST-SoftAutoCommitTest.testSoftAndHardCommitMaxTimeMixedAdds-seed#[5D9E29CB098AE9D5])
[    x:collection1] o.a.s.c.SolrCore [collection1]  CLOSING SolrCore org.apache.solr.core.SolrCore@93ab416
   [junit4]   2> 92573 INFO  (searcherExecutor-555-thread-1-processing-x:collection1) [
   x:collection1] o.a.s.c.SolrCore [collection1] Registered new searcher Searcher@316342eb[collection1]
main{ExitableDirectoryReader(UninvertingDirectoryReader())}
   [junit4]   2> 92611 INFO  (TEST-SoftAutoCommitTest.testSoftAndHardCommitMaxTimeMixedAdds-seed#[5D9E29CB098AE9D5])
[    x:collection1] o.a.s.u.p.LogUpdateProcessorFactory [collection1]  webapp=null path=null
params={}{add=[529 (1553786672499392512)]} 0 15
   [junit4]   2> 93111 INFO  (commitScheduler-558-thread-1) [    x:collection1] o.a.s.u.DirectUpdateHandler2
start commit{,optimize=false,openSearcher=true,waitSearcher=true,expungeDeletes=false,softCommit=true,prepareCommit=false}
   [junit4]   2> 93616 INFO  (TEST-SoftAutoCommitTest.testSoftAndHardCommitMaxTimeMixedAdds-seed#[5D9E29CB098AE9D5])
[    x:collection1] o.a.s.SolrTestCaseJ4 ###Ending testSoftAndHardCommitMaxTimeMixedAdds
   [junit4]   2> NOTE: reproduce with: ant test  -Dtestcase=SoftAutoCommitTest -Dtests.method=testSoftAndHardCommitMaxTimeMixedAdds
-Dtests.seed=5D9E29CB098AE9D5 -Dtests.slow=true -Dtests.locale=uk-UA -Dtests.timezone=Etc/UTC
-Dtests.asserts=true -Dtests.file.encoding=UTF-8
   [junit4] FAILURE 2.24s J0 | SoftAutoCommitTest.testSoftAndHardCommitMaxTimeMixedAdds <<<
   [junit4]    > Throwable #1: java.lang.AssertionError: soft529 wasn't fast enough
   [junit4]    > 	at __randomizedtesting.SeedInfo.seed([5D9E29CB098AE9D5:C4AD04BB8F9D972]:0)
   [junit4]    > 	at org.apache.solr.update.SoftAutoCommitTest.testSoftAndHardCommitMaxTimeMixedAdds(SoftAutoCommitTest.java:111)
   [junit4]    > 	at java.lang.Thread.run(Thread.java:745)
   [junit4]   2> 93628 INFO  (TEST-SoftAutoCommitTest.testSoftAndHardCommitMaxTimeRapidAdds-seed#[5D9E29CB098AE9D5])
[    x:collection1] o.a.s.SolrTestCaseJ4 ###Starting testSoftAndHardCommitMaxTimeRapidAdds
   [junit4]   2> 93629 INFO  (TEST-SoftAutoCommitTest.testSoftAndHardCommitMaxTimeRapidAdds-seed#[5D9E29CB098AE9D5])
[    x:collection1] o.a.s.c.SolrResourceLoader [null] Added 2 libs to classloader, from paths:
[/Users/jenkins/workspace/Lucene-Solr-master-MacOSX/solr/core/src/test-files/solr/collection1/lib,
/Users/jenkins/workspace/Lucene-Solr-master-MacOSX/solr/core/src/test-files/solr/collection1/lib/classes]
   [junit4]   2> 93715 INFO  (TEST-SoftAutoCommitTest.testSoftAndHardCommitMaxTimeRapidAdds-seed#[5D9E29CB098AE9D5])
[    x:collection1] o.a.s.c.SolrConfig Using Lucene MatchVersion: 7.0.0
   [junit4]   2> 93759 INFO  (TEST-SoftAutoCommitTest.testSoftAndHardCommitMaxTimeRapidAdds-seed#[5D9E29CB098AE9D5])
[    x:collection1] o.a.s.s.IndexSchema [collection1] Schema name=test
   [junit4]   2> 93815 INFO  (commitScheduler-557-thread-1) [    x:collection1] o.a.s.u.DirectUpdateHandler2
start commit{,optimize=false,openSearcher=true,waitSearcher=true,expungeDeletes=false,softCommit=false,prepareCommit=false}
   [junit4]   2> 93900 INFO  (commitScheduler-558-thread-1) [    x:collection1] o.a.s.s.SolrIndexSearcher
Opening [Searcher@72d683da[collection1] main]
   [junit4]   2> 93901 INFO  (commitScheduler-557-thread-1) [    x:collection1] o.a.s.u.SolrIndexWriter
Calling setCommitData with IW:org.apache.solr.update.SolrIndexWriter@29ff8004
   [junit4]   2> 93912 INFO  (commitScheduler-558-thread-1) [    x:collection1] o.a.s.u.DirectUpdateHandler2
end_commit_flush
   [junit4]   2> 93912 INFO  (searcherExecutor-555-thread-1-processing-x:collection1) [
   x:collection1] o.a.s.c.SolrCore [collection1] Registered new searcher Searcher@72d683da[collection1]
main{ExitableDirectoryReader(UninvertingDirectoryReader(Uninverting(_0(7.0.0):c1)))}
   [junit4]   2> 93924 WARN  (TEST-SoftAutoCommitTest.testSoftAndHardCommitMaxTimeRapidAdds-seed#[5D9E29CB098AE9D5])
[    x:collection1] o.a.s.s.IndexSchema [collection1] default search field in schema is text.
WARNING: Deprecated, please use 'df' on request instead.
   [junit4]   2> 93933 INFO  (TEST-SoftAutoCommitTest.testSoftAndHardCommitMaxTimeRapidAdds-seed#[5D9E29CB098AE9D5])
[    x:collection1] o.a.s.s.IndexSchema Loaded schema test/1.0 with uniqueid field id
   [junit4]   2> 93955 INFO  (TEST-SoftAutoCommitTest.testSoftAndHardCommitMaxTimeRapidAdds-seed#[5D9E29CB098AE9D5])
[    x:collection1] o.a.s.c.CoreContainer Reloading SolrCore 'collection1' using configuration
from instancedir /Users/jenkins/workspace/Lucene-Solr-master-MacOSX/solr/core/src/test-files/solr/collection1
   [junit4]   2> 93983 INFO  (commitScheduler-557-thread-1) [    x:collection1] o.a.s.s.SolrIndexSearcher
Opening [Searcher@4c5f237c[collection1] main]
   [junit4]   2> 93984 INFO  (commitScheduler-557-thread-1) [    x:collection1] o.a.s.u.DirectUpdateHandler2
end_commit_flush
   [junit4]   2> 93984 INFO  (searcherExecutor-555-thread-1-processing-x:collection1) [
   x:collection1] o.a.s.c.SolrCore [collection1] Registered new searcher Searcher@4c5f237c[collection1]
main{ExitableDirectoryReader(UninvertingDirectoryReader(Uninverting(_0(7.0.0):c1)))}
   [junit4]   2> 93988 INFO  (TEST-SoftAutoCommitTest.testSoftAndHardCommitMaxTimeRapidAdds-seed#[5D9E29CB098AE9D5])
[    x:collection1] o.a.s.c.SolrCore [[collection1] ] Opening new SolrCore at [/Users/jenkins/workspace/Lucene-Solr-master-MacOSX/solr/core/src/test-files/solr/collection1],
dataDir=[/Users/jenkins/workspace/Lucene-Solr-master-MacOSX/solr/build/solr-core/test/J0/temp/solr.update.SoftAutoCommitTest_5D9E29CB098AE9D5-001/init-core-data-001/]
   [junit4]   2> 93988 INFO  (TEST-SoftAutoCommitTest.testSoftAndHardCommitMaxTimeRapidAdds-seed#[5D9E29CB098AE9D5])
[    x:collection1] o.a.s.c.JmxMonitoredMap JMX monitoring is enabled. Adding Solr mbeans
to JMX Server: com.sun.jmx.mbeanserver.JmxMBeanServer@771cb9a7
   [junit4]   2> 94111 INFO  (TEST-SoftAutoCommitTest.testSoftAndHardCommitMaxTimeRapidAdds-seed#[5D9E29CB098AE9D5])
[    x:collection1] o.a.s.u.CommitTracker Hard AutoCommit: disabled
   [junit4]   2> 94111 INFO  (TEST-SoftAutoCommitTest.testSoftAndHardCommitMaxTimeRapidAdds-seed#[5D9E29CB098AE9D5])
[    x:collection1] o.a.s.u.CommitTracker Soft AutoCommit: disabled
   [junit4]   2> 94112 INFO  (TEST-SoftAutoCommitTest.testSoftAndHardCommitMaxTimeRapidAdds-seed#[5D9E29CB098AE9D5])
[    x:collection1] o.a.s.s.SolrIndexSearcher Opening [Searcher@7b9cb8b9[collection1] main]
   [junit4]   2> 94112 INFO  (TEST-SoftAutoCommitTest.testSoftAndHardCommitMaxTimeRapidAdds-seed#[5D9E29CB098AE9D5])
[    x:collection1] o.a.s.h.c.SpellCheckComponent Initializing spell checkers
   [junit4]   2> 94132 INFO  (TEST-SoftAutoCommitTest.testSoftAndHardCommitMaxTimeRapidAdds-seed#[5D9E29CB098AE9D5])
[    x:collection1] o.a.s.s.DirectSolrSpellChecker init: {name=direct,classname=DirectSolrSpellChecker,field=lowerfilt,minQueryLength=3}
   [junit4]   2> 94193 INFO  (TEST-SoftAutoCommitTest.testSoftAndHardCommitMaxTimeRapidAdds-seed#[5D9E29CB098AE9D5])
[    x:collection1] o.a.s.h.ReplicationHandler Commits will be reserved for  10000
   [junit4]   2> 94194 INFO  (searcherExecutor-559-thread-1-processing-x:collection1) [
   x:collection1] o.a.s.h.c.SpellCheckComponent Loading spell index for spellchecker: default
   [junit4]   2> 94204 INFO  (searcherExecutor-559-thread-1-processing-x:collection1) [
   x:collection1] o.a.s.h.c.SpellCheckComponent Loading spell index for spellchecker: direct
   [junit4]   2> 94204 INFO  (searcherExecutor-559-thread-1-processing-x:collection1) [
   x:collection1] o.a.s.h.c.SpellCheckComponent Loading spell index for spellchecker: wordbreak
   [junit4]   2> 94204 INFO  (searcherExecutor-559-thread-1-processing-x:collection1) [
   x:collection1] o.a.s.h.c.SpellCheckComponent Loading spell index for spellchecker: multipleFields
   [junit4]   2> 94214 INFO  (searcherExecutor-559-thread-1-processing-x:collection1) [
   x:collection1] o.a.s.h.c.SpellCheckComponent Loading spell index for spellchecker: jarowinkler
   [junit4]   2> 94224 INFO  (searcherExecutor-559-thread-1-processing-x:collection1) [
   x:collection1] o.a.s.h.c.SpellCheckComponent Loading spell index for spellchecker: external
   [junit4]   2> 94226 INFO  (searcherExecutor-559-thread-1-processing-x:collection1) [
   x:collection1] o.a.s.h.c.SpellCheckComponent Loading spell index for spellchecker: freq
   [junit4]   2> 94228 INFO  (searcherExecutor-559-thread-1-processing-x:collection1) [
   x:collection1] o.a.s.h.c.SpellCheckComponent Loading spell index for spellchecker: fqcn
   [junit4]   2> 94232 INFO  (searcherExecutor-559-thread-1-processing-x:collection1) [
   x:collection1] o.a.s.h.c.SpellCheckComponent Loading spell index for spellchecker: perDict
   [junit4]   2> 94233 INFO  (searcherExecutor-559-thread-1-processing-x:collection1) [
   x:collection1] o.a.s.c.SolrCore [collection1] Registered new searcher Searcher@7b9cb8b9[collection1]
main{ExitableDirectoryReader(UninvertingDirectoryReader(Uninverting(_0(7.0.0):c1)))}
   [junit4]   2> 94240 INFO  (TEST-SoftAutoCommitTest.testSoftAndHardCommitMaxTimeRapidAdds-seed#[5D9E29CB098AE9D5])
[    x:collection1] o.a.s.u.RandomMergePolicy RandomMergePolicy wrapping class org.apache.lucene.index.TieredMergePolicy:
[TieredMergePolicy: maxMergeAtOnce=13, maxMergeAtOnceExplicit=41, maxMergedSegmentMB=83.3115234375,
floorSegmentMB=1.8701171875, forceMergeDeletesPctAllowed=24.182426329116595, segmentsPerTier=40.0,
maxCFSSegmentSizeMB=8.796093022207999E12, noCFSRatio=0.3792995316748101
   [junit4]   2> 94242 INFO  (TEST-SoftAutoCommitTest.testSoftAndHardCommitMaxTimeRapidAdds-seed#[5D9E29CB098AE9D5])
[    x:collection1] o.a.s.u.DefaultSolrCoreState New IndexWriter is ready to be used.
   [junit4]   2> 94243 INFO  (TEST-SoftAutoCommitTest.testSoftAndHardCommitMaxTimeRapidAdds-seed#[5D9E29CB098AE9D5])
[    x:collection1] o.a.s.s.SolrIndexSearcher Opening [Searcher@3386e030[collection1] main]
   [junit4]   2> 94244 INFO  (TEST-SoftAutoCommitTest.testSoftAndHardCommitMaxTimeRapidAdds-seed#[5D9E29CB098AE9D5])
[    x:collection1] o.a.s.c.SolrCore [collection1]  CLOSING SolrCore org.apache.solr.core.SolrCore@4081106f
   [junit4]   2> 94245 INFO  (searcherExecutor-559-thread-1-processing-x:collection1) [
   x:collection1] o.a.s.c.SolrCore [collection1] Registered new searcher Searcher@3386e030[collection1]
main{ExitableDirectoryReader(UninvertingDirectoryReader(Uninverting(_0(7.0.0):c1)))}
   [junit4]   2> 94292 INFO  (TEST-SoftAutoCommitTest.testSoftAndHardCommitMaxTimeRapidAdds-seed#[5D9E29CB098AE9D5])
[    x:collection1] o.a.s.u.p.LogUpdateProcessorFactory [collection1]  webapp=null path=null
params={}{add=[5000 (1553786674264145920)]} 0 14
   [junit4]   2> 94294 INFO  (TEST-SoftAutoCommitTest.testSoftAndHardCommitMaxTimeRapidAdds-seed#[5D9E29CB098AE9D5])
[    x:collection1] o.a.s.u.p.LogUpdateProcessorFactory [collection1]  webapp=null path=null
params={}{add=[5001 (1553786674279874560)]} 0 1
   [junit4]   2> 94298 INFO  (TEST-SoftAutoCommitTest.testSoftAndHardCommitMaxTimeRapidAdds-seed#[5D9E29CB098AE9D5])
[    x:collection1] o.a.s.u.p.LogUpdateProcessorFactory [collection1]  webapp=null path=null
params={}{add=[5002 (1553786674285117440)]} 0 0
   [junit4]   2> 94302 INFO  (TEST-SoftAutoCommitTest.testSoftAndHardCommitMaxTimeRapidAdds-seed#[5D9E29CB098AE9D5])
[    x:collection1] o.a.s.u.p.LogUpdateProcessorFactory [collection1]  webapp=null path=null
params={}{add=[5003 (1553786674289311744)]} 0 0
   [junit4]   2> 94303 INFO  (TEST-SoftAutoCommitTest.testSoftAndHardCommitMaxTimeRapidAdds-seed#[5D9E29CB098AE9D5])
[    x:collection1] o.a.s.u.p.LogUpdateProcessorFactory [collection1]  webapp=null path=null
params={}{add=[5004 (1553786674290360320)]} 0 0
   [junit4]   2> 94304 INFO  (TEST-SoftAutoCommitTest.testSoftAndHardCommitMaxTimeRapidAdds-seed#[5D9E29CB098AE9D5])
[    x:collection1] o.a.s.SolrTestCaseJ4 ###Ending testSoftAndHardCommitMaxTimeRapidAdds
   [junit4]   2> 94329 INFO  (TEST-SoftAutoCommitTest.testSoftAndHardCommitMaxTimeDelete-seed#[5D9E29CB098AE9D5])
[    x:collection1] o.a.s.SolrTestCaseJ4 ###Starting testSoftAndHardCommitMaxTimeDelete
   [junit4]   2> 94330 INFO  (TEST-SoftAutoCommitTest.testSoftAndHardCommitMaxTimeDelete-seed#[5D9E29CB098AE9D5])
[    x:collection1] o.a.s.c.SolrResourceLoader [null] Added 2 libs to classloader, from paths:
[/Users/jenkins/workspace/Lucene-Solr-master-MacOSX/solr/core/src/test-files/solr/collection1/lib,
/Users/jenkins/workspace/Lucene-Solr-master-MacOSX/solr/core/src/test-files/solr/collection1/lib/classes]
   [junit4]   2> 94520 INFO  (TEST-SoftAutoCommitTest.testSoftAndHardCommitMaxTimeDelete-seed#[5D9E29CB098AE9D5])
[    x:collection1] o.a.s.c.SolrConfig Using Lucene MatchVersion: 7.0.0
   [junit4]   2> 94563 INFO  (TEST-SoftAutoCommitTest.testSoftAndHardCommitMaxTimeDelete-seed#[5D9E29CB098AE9D5])
[    x:collection1] o.a.s.s.IndexSchema [collection1] Schema name=test
   [junit4]   2> 94784 INFO  (commitScheduler-562-thread-1) [    x:collection1] o.a.s.u.DirectUpdateHandler2
start commit{,optimize=false,openSearcher=true,waitSearcher=true,expungeDeletes=false,softCommit=true,prepareCommit=false}
   [junit4]   2> 94834 WARN  (TEST-SoftAutoCommitTest.testSoftAndHardCommitMaxTimeDelete-seed#[5D9E29CB098AE9D5])
[    x:collection1] o.a.s.s.IndexSchema [collection1] default search field in schema is text.
WARNING: Deprecated, please use 'df' on request instead.
   [junit4]   2> 94837 INFO  (TEST-SoftAutoCommitTest.testSoftAndHardCommitMaxTimeDelete-seed#[5D9E29CB098AE9D5])
[    x:collection1] o.a.s.s.IndexSchema Loaded schema test/1.0 with uniqueid field id
   [junit4]   2> 94902 INFO  (TEST-SoftAutoCommitTest.testSoftAndHardCommitMaxTimeDelete-seed#[5D9E29CB098AE9D5])
[    x:collection1] o.a.s.c.CoreContainer Reloading SolrCore 'collection1' using configuration
from instancedir /Users/jenkins/workspace/Lucene-Solr-master-MacOSX/solr/core/src/test-files/solr/collection1
   [junit4]   2> 94916 INFO  (TEST-SoftAutoCommitTest.testSoftAndHardCommitMaxTimeDelete-seed#[5D9E29CB098AE9D5])
[    x:collection1] o.a.s.c.SolrCore [[collection1] ] Opening new SolrCore at [/Users/jenkins/workspace/Lucene-Solr-master-MacOSX/solr/core/src/test-files/solr/collection1],
dataDir=[/Users/jenkins/workspace/Lucene-Solr-master-MacOSX/solr/build/solr-core/test/J0/temp/solr.update.SoftAutoCommitTest_5D9E29CB098AE9D5-001/init-core-data-001/]
   [junit4]   2> 94916 INFO  (TEST-SoftAutoCommitTest.testSoftAndHardCommitMaxTimeDelete-seed#[5D9E29CB098AE9D5])
[    x:collection1] o.a.s.c.JmxMonitoredMap JMX monitoring is enabled. Adding Solr mbeans
to JMX Server: com.sun.jmx.mbeanserver.JmxMBeanServer@771cb9a7
   [junit4]   2> 95272 INFO  (TEST-SoftAutoCommitTest.testSoftAndHardCommitMaxTimeDelete-seed#[5D9E29CB098AE9D5])
[    x:collection1] o.a.s.u.CommitTracker Hard AutoCommit: disabled
   [junit4]   2> 95272 INFO  (TEST-SoftAutoCommitTest.testSoftAndHardCommitMaxTimeDelete-seed#[5D9E29CB098AE9D5])
[    x:collection1] o.a.s.u.CommitTracker Soft AutoCommit: disabled
   [junit4]   2> 95499 INFO  (commitScheduler-561-thread-1) [    x:collection1] o.a.s.u.DirectUpdateHandler2
start commit{,optimize=false,openSearcher=true,waitSearcher=true,expungeDeletes=false,softCommit=false,prepareCommit=false}
   [junit4]   2> 95571 INFO  (commitScheduler-562-thread-1) [    x:collection1] o.a.s.s.SolrIndexSearcher
Opening [Searcher@2f22cf41[collection1] main]
   [junit4]   2> 95571 INFO  (TEST-SoftAutoCommitTest.testSoftAndHardCommitMaxTimeDelete-seed#[5D9E29CB098AE9D5])
[    x:collection1] o.a.s.s.SolrIndexSearcher Opening [Searcher@375bb7aa[collection1] main]
   [junit4]   2> 95571 INFO  (commitScheduler-561-thread-1) [    x:collection1] o.a.s.u.SolrIndexWriter
Calling setCommitData with IW:org.apache.solr.update.SolrIndexWriter@5fd9a8f6
   [junit4]   2> 95582 INFO  (commitScheduler-562-thread-1) [    x:collection1] o.a.s.u.DirectUpdateHandler2
end_commit_flush
   [junit4]   2> 95582 INFO  (TEST-SoftAutoCommitTest.testSoftAndHardCommitMaxTimeDelete-seed#[5D9E29CB098AE9D5])
[    x:collection1] o.a.s.h.c.SpellCheckComponent Initializing spell checkers
   [junit4]   2> 95582 INFO  (searcherExecutor-559-thread-1-processing-x:collection1) [
   x:collection1] o.a.s.c.SolrCore [collection1] Registered new searcher Searcher@2f22cf41[collection1]
main{ExitableDirectoryReader(UninvertingDirectoryReader(Uninverting(_0(7.0.0):c1) Uninverting(_1(7.0.0):c5)))}
   [junit4]   2> 95593 INFO  (TEST-SoftAutoCommitTest.testSoftAndHardCommitMaxTimeDelete-seed#[5D9E29CB098AE9D5])
[    x:collection1] o.a.s.s.DirectSolrSpellChecker init: {name=direct,classname=DirectSolrSpellChecker,field=lowerfilt,minQueryLength=3}
   [junit4]   2> 95616 INFO  (commitScheduler-561-thread-1) [    x:collection1] o.a.s.s.SolrIndexSearcher
Opening [Searcher@611b0476[collection1] main]
   [junit4]   2> 95616 INFO  (commitScheduler-561-thread-1) [    x:collection1] o.a.s.u.DirectUpdateHandler2
end_commit_flush
   [junit4]   2> 95617 INFO  (searcherExecutor-559-thread-1-processing-x:collection1) [
   x:collection1] o.a.s.c.SolrCore [collection1] Registered new searcher Searcher@611b0476[collection1]
main{ExitableDirectoryReader(UninvertingDirectoryReader(Uninverting(_0(7.0.0):c1) Uninverting(_1(7.0.0):c5)))}
   [junit4]   2> 95649 INFO  (TEST-SoftAutoCommitTest.testSoftAndHardCommitMaxTimeDelete-seed#[5D9E29CB098AE9D5])
[    x:collection1] o.a.s.h.ReplicationHandler Commits will be reserved for  10000
   [junit4]   2> 95649 INFO  (searcherExecutor-563-thread-1-processing-x:collection1) [
   x:collection1] o.a.s.h.c.SpellCheckComponent Loading spell index for spellchecker: default
   [junit4]   2> 95660 INFO  (searcherExecutor-563-thread-1-processing-x:collection1) [
   x:collection1] o.a.s.h.c.SpellCheckComponent Loading spell index for spellchecker: direct
   [junit4]   2> 95660 INFO  (searcherExecutor-563-thread-1-processing-x:collection1) [
   x:collection1] o.a.s.h.c.SpellCheckComponent Loading spell index for spellchecker: wordbreak
   [junit4]   2> 95660 INFO  (searcherExecutor-563-thread-1-processing-x:collection1) [
   x:collection1] o.a.s.h.c.SpellCheckComponent Loading spell index for spellchecker: multipleFields
   [junit4]   2> 95671 INFO  (searcherExecutor-563-thread-1-processing-x:collection1) [
   x:collection1] o.a.s.h.c.SpellCheckComponent Loading spell index for spellchecker: jarowinkler
   [junit4]   2> 95681 INFO  (searcherExecutor-563-thread-1-processing-x:collection1) [
   x:collection1] o.a.s.h.c.SpellCheckComponent Loading spell index for spellchecker: external
   [junit4]   2> 95692 INFO  (searcherExecutor-563-thread-1-processing-x:collection1) [
   x:collection1] o.a.s.h.c.SpellCheckComponent Loading spell index for spellchecker: freq
   [junit4]   2> 95692 INFO  (TEST-SoftAutoCommitTest.testSoftAndHardCommitMaxTimeDelete-seed#[5D9E29CB098AE9D5])
[    x:collection1] o.a.s.u.RandomMergePolicy RandomMergePolicy wrapping class org.apache.lucene.index.LogDocMergePolicy:
[LogDocMergePolicy: minMergeSize=1000, mergeFactor=31, maxMergeSize=9223372036854775807, maxMergeSizeForForcedMerge=9223372036854775807,
calibrateSizeByDeletes=false, maxMergeDocs=2147483647, maxCFSSegmentSizeMB=8.796093022207999E12,
noCFSRatio=0.0]
   [junit4]   2> 95702 INFO  (searcherExecutor-563-thread-1-processing-x:collection1) [
   x:collection1] o.a.s.h.c.SpellCheckComponent Loading spell index for spellchecker: fqcn
   [junit4]   2> 95713 INFO  (searcherExecutor-563-thread-1-processing-x:collection1) [
   x:collection1] o.a.s.h.c.SpellCheckComponent Loading spell index for spellchecker: perDict
   [junit4]   2> 95714 INFO  (searcherExecutor-563-thread-1-processing-x:collection1) [
   x:collection1] o.a.s.c.SolrCore [collection1] Registered new searcher Searcher@375bb7aa[collection1]
main{ExitableDirectoryReader(UninvertingDirectoryReader(Uninverting(_0(7.0.0):c1) Uninverting(_1(7.0.0):c5)))}
   [junit4]   2> 95754 INFO  (TEST-SoftAutoCommitTest.testSoftAndHardCommitMaxTimeDelete-seed#[5D9E29CB098AE9D5])
[    x:collection1] o.a.s.u.DefaultSolrCoreState New IndexWriter is ready to be used.
   [junit4]   2> 95788 INFO  (TEST-SoftAutoCommitTest.testSoftAndHardCommitMaxTimeDelete-seed#[5D9E29CB098AE9D5])
[    x:collection1] o.a.s.s.SolrIndexSearcher Opening [Searcher@29a85a5c[collection1] main]
   [junit4]   2> 95788 INFO  (TEST-SoftAutoCommitTest.testSoftAndHardCommitMaxTimeDelete-seed#[5D9E29CB098AE9D5])
[    x:collection1] o.a.s.c.SolrCore [collection1]  CLOSING SolrCore org.apache.solr.core.SolrCore@2d08af78
   [junit4]   2> 95803 INFO  (searcherExecutor-563-thread-1-processing-x:collection1) [
   x:collection1] o.a.s.c.SolrCore [collection1] Registered new searcher Searcher@29a85a5c[collection1]
main{ExitableDirectoryReader(UninvertingDirectoryReader(Uninverting(_0(7.0.0):c1) Uninverting(_1(7.0.0):c5)))}
   [junit4]   2> 95894 INFO  (TEST-SoftAutoCommitTest.testSoftAndHardCommitMaxTimeDelete-seed#[5D9E29CB098AE9D5])
[    x:collection1] o.a.s.u.p.LogUpdateProcessorFactory [collection1]  webapp=null path=null
params={}{add=[529 (1553786675956547584)]} 0 2
   [junit4]   2> 95895 INFO  (TEST-SoftAutoCommitTest.testSoftAndHardCommitMaxTimeDelete-seed#[5D9E29CB098AE9D5])
[    x:collection1] o.a.s.u.DirectUpdateHandler2 start commit{,optimize=false,openSearcher=true,waitSearcher=true,expungeDeletes=false,softCommit=false,prepareCommit=false}
   [junit4]   2> 95895 INFO  (TEST-SoftAutoCommitTest.testSoftAndHardCommitMaxTimeDelete-seed#[5D9E29CB098AE9D5])
[    x:collection1] o.a.s.u.SolrIndexWriter Calling setCommitData with IW:org.apache.solr.update.SolrIndexWriter@4f6c340a
   [junit4]   2> 96625 INFO  (TEST-SoftAutoCommitTest.testSoftAndHardCommitMaxTimeDelete-seed#[5D9E29CB098AE9D5])
[    x:collection1] o.a.s.s.SolrIndexSearcher Opening [Searcher@5d1be2f4[collection1] main]
   [junit4]   2> 96626 INFO  (TEST-SoftAutoCommitTest.testSoftAndHardCommitMaxTimeDelete-seed#[5D9E29CB098AE9D5])
[    x:collection1] o.a.s.u.DirectUpdateHandler2 end_commit_flush
   [junit4]   2> 96626 INFO  (searcherExecutor-563-thread-1-processing-x:collection1) [
   x:collection1] o.a.s.c.SolrCore [collection1] Registered new searcher Searcher@5d1be2f4[collection1]
main{ExitableDirectoryReader(UninvertingDirectoryReader(Uninverting(_1(7.0.0):c5) Uninverting(_2(7.0.0):c1)))}
   [junit4]   2> 96637 INFO  (TEST-SoftAutoCommitTest.testSoftAndHardCommitMaxTimeDelete-seed#[5D9E29CB098AE9D5])
[    x:collection1] o.a.s.u.p.LogUpdateProcessorFactory [collection1]  webapp=null path=null
params={}{commit=} 0 742
   [junit4]   2> 96639 INFO  (TEST-SoftAutoCommitTest.testSoftAndHardCommitMaxTimeDelete-seed#[5D9E29CB098AE9D5])
[    x:collection1] o.a.s.u.p.LogUpdateProcessorFactory [collection1]  webapp=null path=null
params={}{delete=[529 (-1553786676738785280)]} 0 1
   [junit4]   2> 97139 INFO  (commitScheduler-566-thread-1) [    x:collection1] o.a.s.u.DirectUpdateHandler2
start commit{,optimize=false,openSearcher=true,waitSearcher=true,expungeDeletes=false,softCommit=true,prepareCommit=false}
   [junit4]   2> 97141 INFO  (commitScheduler-566-thread-1) [    x:collection1] o.a.s.s.SolrIndexSearcher
Opening [Searcher@76e272c3[collection1] main]
   [junit4]   2> 97142 INFO  (commitScheduler-566-thread-1) [    x:collection1] o.a.s.u.DirectUpdateHandler2
end_commit_flush
   [junit4]   2> 97143 INFO  (searcherExecutor-563-thread-1-processing-x:collection1) [
   x:collection1] o.a.s.c.SolrCore [collection1] Registered new searcher Searcher@76e272c3[collection1]
main{ExitableDirectoryReader(UninvertingDirectoryReader(Uninverting(_1(7.0.0):c5)))}
   [junit4]   2> 97144 INFO  (TEST-SoftAutoCommitTest.testSoftAndHardCommitMaxTimeDelete-seed#[5D9E29CB098AE9D5])
[    x:collection1] o.a.s.u.p.LogUpdateProcessorFactory [collection1]  webapp=null path=null
params={}{add=[550 (1553786677267267584)]} 0 1
   [junit4]   2> 97644 INFO  (commitScheduler-566-thread-1) [    x:collection1] o.a.s.u.DirectUpdateHandler2
start commit{,optimize=false,openSearcher=true,waitSearcher=true,expungeDeletes=false,softCommit=true,prepareCommit=false}
   [junit4]   2> 97678 INFO  (commitScheduler-566-thread-1) [    x:collection1] o.a.s.s.SolrIndexSearcher
Opening [Searcher@740b50d2[collection1] main]
   [junit4]   2> 97678 INFO  (commitScheduler-566-thread-1) [    x:collection1] o.a.s.u.DirectUpdateHandler2
end_commit_flush
   [junit4]   2> 97679 INFO  (searcherExecutor-563-thread-1-processing-x:collection1) [
   x:collection1] o.a.s.c.SolrCore [collection1] Registered new searcher Searcher@740b50d2[collection1]
main{ExitableDirectoryReader(UninvertingDirectoryReader(Uninverting(_1(7.0.0):c5) Uninverting(_3(7.0.0):c1)))}
   [junit4]   2> 97839 INFO  (commitScheduler-565-thread-1) [    x:collection1] o.a.s.u.DirectUpdateHandler2
start commit{,optimize=false,openSearcher=true,waitSearcher=true,expungeDeletes=false,softCommit=false,prepareCommit=false}
   [junit4]   2> 97839 INFO  (commitScheduler-565-thread-1) [    x:collection1] o.a.s.u.SolrIndexWriter
Calling setCommitData with IW:org.apache.solr.update.SolrIndexWriter@4f6c340a
   [junit4]   2> 97842 INFO  (commitScheduler-565-thread-1) [    x:collection1] o.a.s.s.SolrIndexSearcher
Opening [Searcher@65ad168d[collection1] main]
   [junit4]   2> 97842 INFO  (commitScheduler-565-thread-1) [    x:collection1] o.a.s.u.DirectUpdateHandler2
end_commit_flush
   [junit4]   2> 97843 INFO  (searcherExecutor-563-thread-1-processing-x:collection1) [
   x:collection1] o.a.s.c.SolrCore [collection1] Registered new searcher Searcher@65ad168d[collection1]
main{ExitableDirectoryReader(UninvertingDirectoryReader(Uninverting(_1(7.0.0):c5) Uninverting(_3(7.0.0):c1)))}
   [junit4]   2> 99842 INFO  (TEST-SoftAutoCommitTest.testSoftAndHardCommitMaxTimeDelete-seed#[5D9E29CB098AE9D5])
[    x:collection1] o.a.s.SolrTestCaseJ4 ###Ending testSoftAndHardCommitMaxTimeDelete
   [junit4]   2> 99842 INFO  (SUITE-SoftAutoCommitTest-seed#[5D9E29CB098AE9D5]-worker)
[    x:collection1] o.a.s.SolrTestCaseJ4 ###deleteCore
   [junit4]   2> 99842 INFO  (SUITE-SoftAutoCommitTest-seed#[5D9E29CB098AE9D5]-worker)
[    x:collection1] o.a.s.c.CoreContainer Shutting down CoreContainer instance=1735594967
   [junit4]   2> 99843 INFO  (coreCloseExecutor-567-thread-1-processing-x:collection1)
[    x:collection1] o.a.s.c.SolrCore [collection1]  CLOSING SolrCore org.apache.solr.core.SolrCore@53332bd
   [junit4]   2> NOTE: leaving temporary files on disk at: /Users/jenkins/workspace/Lucene-Solr-master-MacOSX/solr/build/solr-core/test/J0/temp/solr.update.SoftAutoCommitTest_5D9E29CB098AE9D5-001
   [junit4]   2> NOTE: test params are: codec=Asserting(Lucene70): {range_facet_l_dv=PostingsFormat(name=LuceneVarGapDocFreqInterval),
_version_=PostingsFormat(name=MockRandom), multiDefault=FST50, subject=FST50, intDefault=PostingsFormat(name=MockRandom),
id=PostingsFormat(name=LuceneVarGapDocFreqInterval), range_facet_i_dv=FST50, text=PostingsFormat(name=Direct),
range_facet_l=FST50, timestamp=FST50}, docValues:{range_facet_l_dv=DocValuesFormat(name=Lucene70),
range_facet_i_dv=DocValuesFormat(name=Lucene70), timestamp=DocValuesFormat(name=Lucene70)},
maxPointsInLeafNode=1483, maxMBSortInHeap=6.014524137290058, sim=RandomSimilarity(queryNorm=true):
{}, locale=uk-UA, timezone=Etc/UTC
   [junit4]   2> NOTE: Mac OS X 10.11.6 x86_64/Oracle Corporation 1.8.0_102 (64-bit)/cpus=3,threads=1,free=161033120,total=271056896
   [junit4]   2> NOTE: All tests run in this JVM: [TermsComponentTest, TestExactStatsCache,
TestCopyFieldCollectionResource, SampleTest, TlogReplayBufferedWhileIndexingTest, TestHashQParserPlugin,
HLLSerializationTest, TestManagedResourceStorage, BasicAuthIntegrationTest, AlternateDirectoryTest,
TestMissingGroups, SolrCoreTest, SimplePostToolTest, TestMacros, SecurityConfHandlerTest,
SuggestComponentContextFilterQueryTest, TestCustomDocTransformer, TestTolerantUpdateProcessorCloud,
TestSort, DistributedExpandComponentTest, SoftAutoCommitTest]
   [junit4] Completed [28/660 (1!)] on J0 in 9.68s, 3 tests, 1 failure <<< FAILURES!

[...truncated 64409 lines...]


Mime
View raw message