lucene-dev mailing list archives

Site index · List index
Message view « Date » · « Thread »
Top « Date » · « Thread »
From Policeman Jenkins Server <jenk...@thetaphi.de>
Subject [JENKINS] Lucene-Solr-master-Solaris (64bit/jdk1.8.0) - Build # 1001 - Still Unstable!
Date Sat, 10 Dec 2016 18:08:49 GMT
Build: https://jenkins.thetaphi.de/job/Lucene-Solr-master-Solaris/1001/
Java: 64bit/jdk1.8.0 -XX:-UseCompressedOops -XX:+UseG1GC

4 tests failed.
FAILED:  junit.framework.TestSuite.org.apache.solr.core.TestLazyCores

Error Message:
ObjectTracker found 5 object(s) that were not released!!! [MockDirectoryWrapper, MockDirectoryWrapper, SolrCore, MDCAwareThreadPoolExecutor, MockDirectoryWrapper] org.apache.solr.common.util.ObjectReleaseTracker$ObjectTrackerException  at org.apache.solr.common.util.ObjectReleaseTracker.track(ObjectReleaseTracker.java:43)  at org.apache.solr.core.CachingDirectoryFactory.get(CachingDirectoryFactory.java:347)  at org.apache.solr.core.SolrCore.initSnapshotMetaDataManager(SolrCore.java:433)  at org.apache.solr.core.SolrCore.<init>(SolrCore.java:858)  at org.apache.solr.core.SolrCore.<init>(SolrCore.java:792)  at org.apache.solr.core.CoreContainer.create(CoreContainer.java:868)  at org.apache.solr.core.CoreContainer.lambda$load$0(CoreContainer.java:517)  at java.util.concurrent.FutureTask.run(FutureTask.java:266)  at org.apache.solr.common.util.ExecutorUtil$MDCAwareThreadPoolExecutor.lambda$execute$0(ExecutorUtil.java:229)  at java.util.concurrent.ThreadPoolExecutor.runWorker(ThreadPoolExecutor.java:1142)  at java.util.concurrent.ThreadPoolExecutor$Worker.run(ThreadPoolExecutor.java:617)  at java.lang.Thread.run(Thread.java:745)  org.apache.solr.common.util.ObjectReleaseTracker$ObjectTrackerException  at org.apache.solr.common.util.ObjectReleaseTracker.track(ObjectReleaseTracker.java:43)  at org.apache.solr.core.CachingDirectoryFactory.get(CachingDirectoryFactory.java:347)  at org.apache.solr.core.SolrCore.getNewIndexDir(SolrCore.java:331)  at org.apache.solr.core.SolrCore.initIndex(SolrCore.java:658)  at org.apache.solr.core.SolrCore.<init>(SolrCore.java:864)  at org.apache.solr.core.SolrCore.<init>(SolrCore.java:792)  at org.apache.solr.core.CoreContainer.create(CoreContainer.java:868)  at org.apache.solr.core.CoreContainer.lambda$load$0(CoreContainer.java:517)  at java.util.concurrent.FutureTask.run(FutureTask.java:266)  at org.apache.solr.common.util.ExecutorUtil$MDCAwareThreadPoolExecutor.lambda$execute$0(ExecutorUtil.java:229)  at java.util.concurrent.ThreadPoolExecutor.runWorker(ThreadPoolExecutor.java:1142)  at java.util.concurrent.ThreadPoolExecutor$Worker.run(ThreadPoolExecutor.java:617)  at java.lang.Thread.run(Thread.java:745)  org.apache.solr.common.util.ObjectReleaseTracker$ObjectTrackerException  at org.apache.solr.common.util.ObjectReleaseTracker.track(ObjectReleaseTracker.java:43)  at org.apache.solr.core.SolrCore.<init>(SolrCore.java:954)  at org.apache.solr.core.SolrCore.<init>(SolrCore.java:792)  at org.apache.solr.core.CoreContainer.create(CoreContainer.java:868)  at org.apache.solr.core.CoreContainer.lambda$load$0(CoreContainer.java:517)  at java.util.concurrent.FutureTask.run(FutureTask.java:266)  at org.apache.solr.common.util.ExecutorUtil$MDCAwareThreadPoolExecutor.lambda$execute$0(ExecutorUtil.java:229)  at java.util.concurrent.ThreadPoolExecutor.runWorker(ThreadPoolExecutor.java:1142)  at java.util.concurrent.ThreadPoolExecutor$Worker.run(ThreadPoolExecutor.java:617)  at java.lang.Thread.run(Thread.java:745)  org.apache.solr.common.util.ObjectReleaseTracker$ObjectTrackerException  at org.apache.solr.common.util.ObjectReleaseTracker.track(ObjectReleaseTracker.java:43)  at org.apache.solr.core.SolrCore.<init>(SolrCore.java:815)  at org.apache.solr.core.SolrCore.<init>(SolrCore.java:792)  at org.apache.solr.core.CoreContainer.create(CoreContainer.java:868)  at org.apache.solr.core.CoreContainer.lambda$load$0(CoreContainer.java:517)  at java.util.concurrent.FutureTask.run(FutureTask.java:266)  at org.apache.solr.common.util.ExecutorUtil$MDCAwareThreadPoolExecutor.lambda$execute$0(ExecutorUtil.java:229)  at java.util.concurrent.ThreadPoolExecutor.runWorker(ThreadPoolExecutor.java:1142)  at java.util.concurrent.ThreadPoolExecutor$Worker.run(ThreadPoolExecutor.java:617)  at java.lang.Thread.run(Thread.java:745)  org.apache.solr.common.util.ObjectReleaseTracker$ObjectTrackerException  at org.apache.solr.common.util.ObjectReleaseTracker.track(ObjectReleaseTracker.java:43)  at org.apache.solr.core.CachingDirectoryFactory.get(CachingDirectoryFactory.java:347)  at org.apache.solr.update.SolrIndexWriter.create(SolrIndexWriter.java:66)  at org.apache.solr.core.SolrCore.initIndex(SolrCore.java:690)  at org.apache.solr.core.SolrCore.<init>(SolrCore.java:864)  at org.apache.solr.core.SolrCore.<init>(SolrCore.java:792)  at org.apache.solr.core.CoreContainer.create(CoreContainer.java:868)  at org.apache.solr.core.CoreContainer.lambda$load$0(CoreContainer.java:517)  at java.util.concurrent.FutureTask.run(FutureTask.java:266)  at org.apache.solr.common.util.ExecutorUtil$MDCAwareThreadPoolExecutor.lambda$execute$0(ExecutorUtil.java:229)  at java.util.concurrent.ThreadPoolExecutor.runWorker(ThreadPoolExecutor.java:1142)  at java.util.concurrent.ThreadPoolExecutor$Worker.run(ThreadPoolExecutor.java:617)  at java.lang.Thread.run(Thread.java:745)  

Stack Trace:
java.lang.AssertionError: ObjectTracker found 5 object(s) that were not released!!! [MockDirectoryWrapper, MockDirectoryWrapper, SolrCore, MDCAwareThreadPoolExecutor, MockDirectoryWrapper]
org.apache.solr.common.util.ObjectReleaseTracker$ObjectTrackerException
	at org.apache.solr.common.util.ObjectReleaseTracker.track(ObjectReleaseTracker.java:43)
	at org.apache.solr.core.CachingDirectoryFactory.get(CachingDirectoryFactory.java:347)
	at org.apache.solr.core.SolrCore.initSnapshotMetaDataManager(SolrCore.java:433)
	at org.apache.solr.core.SolrCore.<init>(SolrCore.java:858)
	at org.apache.solr.core.SolrCore.<init>(SolrCore.java:792)
	at org.apache.solr.core.CoreContainer.create(CoreContainer.java:868)
	at org.apache.solr.core.CoreContainer.lambda$load$0(CoreContainer.java:517)
	at java.util.concurrent.FutureTask.run(FutureTask.java:266)
	at org.apache.solr.common.util.ExecutorUtil$MDCAwareThreadPoolExecutor.lambda$execute$0(ExecutorUtil.java:229)
	at java.util.concurrent.ThreadPoolExecutor.runWorker(ThreadPoolExecutor.java:1142)
	at java.util.concurrent.ThreadPoolExecutor$Worker.run(ThreadPoolExecutor.java:617)
	at java.lang.Thread.run(Thread.java:745)

org.apache.solr.common.util.ObjectReleaseTracker$ObjectTrackerException
	at org.apache.solr.common.util.ObjectReleaseTracker.track(ObjectReleaseTracker.java:43)
	at org.apache.solr.core.CachingDirectoryFactory.get(CachingDirectoryFactory.java:347)
	at org.apache.solr.core.SolrCore.getNewIndexDir(SolrCore.java:331)
	at org.apache.solr.core.SolrCore.initIndex(SolrCore.java:658)
	at org.apache.solr.core.SolrCore.<init>(SolrCore.java:864)
	at org.apache.solr.core.SolrCore.<init>(SolrCore.java:792)
	at org.apache.solr.core.CoreContainer.create(CoreContainer.java:868)
	at org.apache.solr.core.CoreContainer.lambda$load$0(CoreContainer.java:517)
	at java.util.concurrent.FutureTask.run(FutureTask.java:266)
	at org.apache.solr.common.util.ExecutorUtil$MDCAwareThreadPoolExecutor.lambda$execute$0(ExecutorUtil.java:229)
	at java.util.concurrent.ThreadPoolExecutor.runWorker(ThreadPoolExecutor.java:1142)
	at java.util.concurrent.ThreadPoolExecutor$Worker.run(ThreadPoolExecutor.java:617)
	at java.lang.Thread.run(Thread.java:745)

org.apache.solr.common.util.ObjectReleaseTracker$ObjectTrackerException
	at org.apache.solr.common.util.ObjectReleaseTracker.track(ObjectReleaseTracker.java:43)
	at org.apache.solr.core.SolrCore.<init>(SolrCore.java:954)
	at org.apache.solr.core.SolrCore.<init>(SolrCore.java:792)
	at org.apache.solr.core.CoreContainer.create(CoreContainer.java:868)
	at org.apache.solr.core.CoreContainer.lambda$load$0(CoreContainer.java:517)
	at java.util.concurrent.FutureTask.run(FutureTask.java:266)
	at org.apache.solr.common.util.ExecutorUtil$MDCAwareThreadPoolExecutor.lambda$execute$0(ExecutorUtil.java:229)
	at java.util.concurrent.ThreadPoolExecutor.runWorker(ThreadPoolExecutor.java:1142)
	at java.util.concurrent.ThreadPoolExecutor$Worker.run(ThreadPoolExecutor.java:617)
	at java.lang.Thread.run(Thread.java:745)

org.apache.solr.common.util.ObjectReleaseTracker$ObjectTrackerException
	at org.apache.solr.common.util.ObjectReleaseTracker.track(ObjectReleaseTracker.java:43)
	at org.apache.solr.core.SolrCore.<init>(SolrCore.java:815)
	at org.apache.solr.core.SolrCore.<init>(SolrCore.java:792)
	at org.apache.solr.core.CoreContainer.create(CoreContainer.java:868)
	at org.apache.solr.core.CoreContainer.lambda$load$0(CoreContainer.java:517)
	at java.util.concurrent.FutureTask.run(FutureTask.java:266)
	at org.apache.solr.common.util.ExecutorUtil$MDCAwareThreadPoolExecutor.lambda$execute$0(ExecutorUtil.java:229)
	at java.util.concurrent.ThreadPoolExecutor.runWorker(ThreadPoolExecutor.java:1142)
	at java.util.concurrent.ThreadPoolExecutor$Worker.run(ThreadPoolExecutor.java:617)
	at java.lang.Thread.run(Thread.java:745)

org.apache.solr.common.util.ObjectReleaseTracker$ObjectTrackerException
	at org.apache.solr.common.util.ObjectReleaseTracker.track(ObjectReleaseTracker.java:43)
	at org.apache.solr.core.CachingDirectoryFactory.get(CachingDirectoryFactory.java:347)
	at org.apache.solr.update.SolrIndexWriter.create(SolrIndexWriter.java:66)
	at org.apache.solr.core.SolrCore.initIndex(SolrCore.java:690)
	at org.apache.solr.core.SolrCore.<init>(SolrCore.java:864)
	at org.apache.solr.core.SolrCore.<init>(SolrCore.java:792)
	at org.apache.solr.core.CoreContainer.create(CoreContainer.java:868)
	at org.apache.solr.core.CoreContainer.lambda$load$0(CoreContainer.java:517)
	at java.util.concurrent.FutureTask.run(FutureTask.java:266)
	at org.apache.solr.common.util.ExecutorUtil$MDCAwareThreadPoolExecutor.lambda$execute$0(ExecutorUtil.java:229)
	at java.util.concurrent.ThreadPoolExecutor.runWorker(ThreadPoolExecutor.java:1142)
	at java.util.concurrent.ThreadPoolExecutor$Worker.run(ThreadPoolExecutor.java:617)
	at java.lang.Thread.run(Thread.java:745)


	at __randomizedtesting.SeedInfo.seed([CE1D01E22C0FF0]:0)
	at org.junit.Assert.fail(Assert.java:93)
	at org.junit.Assert.assertTrue(Assert.java:43)
	at org.junit.Assert.assertNull(Assert.java:551)
	at org.apache.solr.SolrTestCaseJ4.teardownTestCases(SolrTestCaseJ4.java:266)
	at sun.reflect.GeneratedMethodAccessor29.invoke(Unknown Source)
	at sun.reflect.DelegatingMethodAccessorImpl.invoke(DelegatingMethodAccessorImpl.java:43)
	at java.lang.reflect.Method.invoke(Method.java:498)
	at com.carrotsearch.randomizedtesting.RandomizedRunner.invoke(RandomizedRunner.java:1713)
	at com.carrotsearch.randomizedtesting.RandomizedRunner$7.evaluate(RandomizedRunner.java:870)
	at com.carrotsearch.randomizedtesting.rules.StatementAdapter.evaluate(StatementAdapter.java:36)
	at com.carrotsearch.randomizedtesting.rules.SystemPropertiesRestoreRule$1.evaluate(SystemPropertiesRestoreRule.java:57)
	at org.apache.lucene.util.AbstractBeforeAfterRule$1.evaluate(AbstractBeforeAfterRule.java:45)
	at com.carrotsearch.randomizedtesting.rules.StatementAdapter.evaluate(StatementAdapter.java:36)
	at org.apache.lucene.util.TestRuleStoreClassName$1.evaluate(TestRuleStoreClassName.java:41)
	at com.carrotsearch.randomizedtesting.rules.NoShadowingOrOverridesOnMethodsRule$1.evaluate(NoShadowingOrOverridesOnMethodsRule.java:40)
	at com.carrotsearch.randomizedtesting.rules.NoShadowingOrOverridesOnMethodsRule$1.evaluate(NoShadowingOrOverridesOnMethodsRule.java:40)
	at com.carrotsearch.randomizedtesting.rules.StatementAdapter.evaluate(StatementAdapter.java:36)
	at com.carrotsearch.randomizedtesting.rules.StatementAdapter.evaluate(StatementAdapter.java:36)
	at com.carrotsearch.randomizedtesting.rules.StatementAdapter.evaluate(StatementAdapter.java:36)
	at org.apache.lucene.util.TestRuleAssertionsRequired$1.evaluate(TestRuleAssertionsRequired.java:53)
	at org.apache.lucene.util.TestRuleMarkFailure$1.evaluate(TestRuleMarkFailure.java:47)
	at org.apache.lucene.util.TestRuleIgnoreAfterMaxFailures$1.evaluate(TestRuleIgnoreAfterMaxFailures.java:64)
	at org.apache.lucene.util.TestRuleIgnoreTestSuites$1.evaluate(TestRuleIgnoreTestSuites.java:54)
	at com.carrotsearch.randomizedtesting.rules.StatementAdapter.evaluate(StatementAdapter.java:36)
	at com.carrotsearch.randomizedtesting.ThreadLeakControl$StatementRunner.run(ThreadLeakControl.java:367)
	at java.lang.Thread.run(Thread.java:745)


FAILED:  junit.framework.TestSuite.org.apache.solr.core.TestLazyCores

Error Message:
1 thread leaked from SUITE scope at org.apache.solr.core.TestLazyCores:     1) Thread[id=17031, name=searcherExecutor-6179-thread-1, state=WAITING, group=TGRP-TestLazyCores]         at sun.misc.Unsafe.park(Native Method)         at java.util.concurrent.locks.LockSupport.park(LockSupport.java:175)         at java.util.concurrent.locks.AbstractQueuedSynchronizer$ConditionObject.await(AbstractQueuedSynchronizer.java:2039)         at java.util.concurrent.LinkedBlockingQueue.take(LinkedBlockingQueue.java:442)         at java.util.concurrent.ThreadPoolExecutor.getTask(ThreadPoolExecutor.java:1067)         at java.util.concurrent.ThreadPoolExecutor.runWorker(ThreadPoolExecutor.java:1127)         at java.util.concurrent.ThreadPoolExecutor$Worker.run(ThreadPoolExecutor.java:617)         at java.lang.Thread.run(Thread.java:745)

Stack Trace:
com.carrotsearch.randomizedtesting.ThreadLeakError: 1 thread leaked from SUITE scope at org.apache.solr.core.TestLazyCores: 
   1) Thread[id=17031, name=searcherExecutor-6179-thread-1, state=WAITING, group=TGRP-TestLazyCores]
        at sun.misc.Unsafe.park(Native Method)
        at java.util.concurrent.locks.LockSupport.park(LockSupport.java:175)
        at java.util.concurrent.locks.AbstractQueuedSynchronizer$ConditionObject.await(AbstractQueuedSynchronizer.java:2039)
        at java.util.concurrent.LinkedBlockingQueue.take(LinkedBlockingQueue.java:442)
        at java.util.concurrent.ThreadPoolExecutor.getTask(ThreadPoolExecutor.java:1067)
        at java.util.concurrent.ThreadPoolExecutor.runWorker(ThreadPoolExecutor.java:1127)
        at java.util.concurrent.ThreadPoolExecutor$Worker.run(ThreadPoolExecutor.java:617)
        at java.lang.Thread.run(Thread.java:745)
	at __randomizedtesting.SeedInfo.seed([CE1D01E22C0FF0]:0)


FAILED:  junit.framework.TestSuite.org.apache.solr.core.TestLazyCores

Error Message:
There are still zombie threads that couldn't be terminated:    1) Thread[id=17031, name=searcherExecutor-6179-thread-1, state=WAITING, group=TGRP-TestLazyCores]         at sun.misc.Unsafe.park(Native Method)         at java.util.concurrent.locks.LockSupport.park(LockSupport.java:175)         at java.util.concurrent.locks.AbstractQueuedSynchronizer$ConditionObject.await(AbstractQueuedSynchronizer.java:2039)         at java.util.concurrent.LinkedBlockingQueue.take(LinkedBlockingQueue.java:442)         at java.util.concurrent.ThreadPoolExecutor.getTask(ThreadPoolExecutor.java:1067)         at java.util.concurrent.ThreadPoolExecutor.runWorker(ThreadPoolExecutor.java:1127)         at java.util.concurrent.ThreadPoolExecutor$Worker.run(ThreadPoolExecutor.java:617)         at java.lang.Thread.run(Thread.java:745)

Stack Trace:
com.carrotsearch.randomizedtesting.ThreadLeakError: There are still zombie threads that couldn't be terminated:
   1) Thread[id=17031, name=searcherExecutor-6179-thread-1, state=WAITING, group=TGRP-TestLazyCores]
        at sun.misc.Unsafe.park(Native Method)
        at java.util.concurrent.locks.LockSupport.park(LockSupport.java:175)
        at java.util.concurrent.locks.AbstractQueuedSynchronizer$ConditionObject.await(AbstractQueuedSynchronizer.java:2039)
        at java.util.concurrent.LinkedBlockingQueue.take(LinkedBlockingQueue.java:442)
        at java.util.concurrent.ThreadPoolExecutor.getTask(ThreadPoolExecutor.java:1067)
        at java.util.concurrent.ThreadPoolExecutor.runWorker(ThreadPoolExecutor.java:1127)
        at java.util.concurrent.ThreadPoolExecutor$Worker.run(ThreadPoolExecutor.java:617)
        at java.lang.Thread.run(Thread.java:745)
	at __randomizedtesting.SeedInfo.seed([CE1D01E22C0FF0]:0)


FAILED:  org.apache.solr.cloud.TestSolrCloudWithDelegationTokens.testDelegationTokenCancelFail

Error Message:
expected:<200> but was:<404>

Stack Trace:
java.lang.AssertionError: expected:<200> but was:<404>
	at __randomizedtesting.SeedInfo.seed([CE1D01E22C0FF0:6871282B32B61D1C]:0)
	at org.junit.Assert.fail(Assert.java:93)
	at org.junit.Assert.failNotEquals(Assert.java:647)
	at org.junit.Assert.assertEquals(Assert.java:128)
	at org.junit.Assert.assertEquals(Assert.java:472)
	at org.junit.Assert.assertEquals(Assert.java:456)
	at org.apache.solr.cloud.TestSolrCloudWithDelegationTokens.cancelDelegationToken(TestSolrCloudWithDelegationTokens.java:140)
	at org.apache.solr.cloud.TestSolrCloudWithDelegationTokens.testDelegationTokenCancelFail(TestSolrCloudWithDelegationTokens.java:294)
	at sun.reflect.NativeMethodAccessorImpl.invoke0(Native Method)
	at sun.reflect.NativeMethodAccessorImpl.invoke(NativeMethodAccessorImpl.java:62)
	at sun.reflect.DelegatingMethodAccessorImpl.invoke(DelegatingMethodAccessorImpl.java:43)
	at java.lang.reflect.Method.invoke(Method.java:498)
	at com.carrotsearch.randomizedtesting.RandomizedRunner.invoke(RandomizedRunner.java:1713)
	at com.carrotsearch.randomizedtesting.RandomizedRunner$8.evaluate(RandomizedRunner.java:907)
	at com.carrotsearch.randomizedtesting.RandomizedRunner$9.evaluate(RandomizedRunner.java:943)
	at com.carrotsearch.randomizedtesting.RandomizedRunner$10.evaluate(RandomizedRunner.java:957)
	at com.carrotsearch.randomizedtesting.rules.SystemPropertiesRestoreRule$1.evaluate(SystemPropertiesRestoreRule.java:57)
	at org.apache.lucene.util.TestRuleSetupTeardownChained$1.evaluate(TestRuleSetupTeardownChained.java:49)
	at org.apache.lucene.util.AbstractBeforeAfterRule$1.evaluate(AbstractBeforeAfterRule.java:45)
	at org.apache.lucene.util.TestRuleThreadAndTestName$1.evaluate(TestRuleThreadAndTestName.java:48)
	at org.apache.lucene.util.TestRuleIgnoreAfterMaxFailures$1.evaluate(TestRuleIgnoreAfterMaxFailures.java:64)
	at org.apache.lucene.util.TestRuleMarkFailure$1.evaluate(TestRuleMarkFailure.java:47)
	at com.carrotsearch.randomizedtesting.rules.StatementAdapter.evaluate(StatementAdapter.java:36)
	at com.carrotsearch.randomizedtesting.ThreadLeakControl$StatementRunner.run(ThreadLeakControl.java:367)
	at com.carrotsearch.randomizedtesting.ThreadLeakControl.forkTimeoutingTask(ThreadLeakControl.java:811)
	at com.carrotsearch.randomizedtesting.ThreadLeakControl$3.evaluate(ThreadLeakControl.java:462)
	at com.carrotsearch.randomizedtesting.RandomizedRunner.runSingleTest(RandomizedRunner.java:916)
	at com.carrotsearch.randomizedtesting.RandomizedRunner$5.evaluate(RandomizedRunner.java:802)
	at com.carrotsearch.randomizedtesting.RandomizedRunner$6.evaluate(RandomizedRunner.java:852)
	at com.carrotsearch.randomizedtesting.RandomizedRunner$7.evaluate(RandomizedRunner.java:863)
	at com.carrotsearch.randomizedtesting.rules.StatementAdapter.evaluate(StatementAdapter.java:36)
	at com.carrotsearch.randomizedtesting.rules.SystemPropertiesRestoreRule$1.evaluate(SystemPropertiesRestoreRule.java:57)
	at org.apache.lucene.util.AbstractBeforeAfterRule$1.evaluate(AbstractBeforeAfterRule.java:45)
	at com.carrotsearch.randomizedtesting.rules.StatementAdapter.evaluate(StatementAdapter.java:36)
	at org.apache.lucene.util.TestRuleStoreClassName$1.evaluate(TestRuleStoreClassName.java:41)
	at com.carrotsearch.randomizedtesting.rules.NoShadowingOrOverridesOnMethodsRule$1.evaluate(NoShadowingOrOverridesOnMethodsRule.java:40)
	at com.carrotsearch.randomizedtesting.rules.NoShadowingOrOverridesOnMethodsRule$1.evaluate(NoShadowingOrOverridesOnMethodsRule.java:40)
	at com.carrotsearch.randomizedtesting.rules.StatementAdapter.evaluate(StatementAdapter.java:36)
	at com.carrotsearch.randomizedtesting.rules.StatementAdapter.evaluate(StatementAdapter.java:36)
	at com.carrotsearch.randomizedtesting.rules.StatementAdapter.evaluate(StatementAdapter.java:36)
	at org.apache.lucene.util.TestRuleAssertionsRequired$1.evaluate(TestRuleAssertionsRequired.java:53)
	at org.apache.lucene.util.TestRuleMarkFailure$1.evaluate(TestRuleMarkFailure.java:47)
	at org.apache.lucene.util.TestRuleIgnoreAfterMaxFailures$1.evaluate(TestRuleIgnoreAfterMaxFailures.java:64)
	at org.apache.lucene.util.TestRuleIgnoreTestSuites$1.evaluate(TestRuleIgnoreTestSuites.java:54)
	at com.carrotsearch.randomizedtesting.rules.StatementAdapter.evaluate(StatementAdapter.java:36)
	at com.carrotsearch.randomizedtesting.ThreadLeakControl$StatementRunner.run(ThreadLeakControl.java:367)
	at java.lang.Thread.run(Thread.java:745)




Build Log:
[...truncated 10719 lines...]
   [junit4] Suite: org.apache.solr.cloud.TestSolrCloudWithDelegationTokens
   [junit4]   2> Creating dataDir: /export/home/jenkins/workspace/Lucene-Solr-master-Solaris/solr/build/solr-core/test/J0/temp/solr.cloud.TestSolrCloudWithDelegationTokens_CE1D01E22C0FF0-001/init-core-data-001
   [junit4]   2> 146563 INFO  (SUITE-TestSolrCloudWithDelegationTokens-seed#[CE1D01E22C0FF0]-worker) [    ] o.a.s.SolrTestCaseJ4 Randomized ssl (false) and clientAuth (false) via: @org.apache.solr.util.RandomizeSSL(reason=, value=NaN, ssl=NaN, clientAuth=NaN)
   [junit4]   2> 146563 INFO  (SUITE-TestSolrCloudWithDelegationTokens-seed#[CE1D01E22C0FF0]-worker) [    ] o.a.s.c.MiniSolrCloudCluster Starting cluster of 2 servers in /export/home/jenkins/workspace/Lucene-Solr-master-Solaris/solr/build/solr-core/test/J0/temp/solr.cloud.TestSolrCloudWithDelegationTokens_CE1D01E22C0FF0-001/tempDir-001
   [junit4]   2> 146563 INFO  (SUITE-TestSolrCloudWithDelegationTokens-seed#[CE1D01E22C0FF0]-worker) [    ] o.a.s.c.ZkTestServer STARTING ZK TEST SERVER
   [junit4]   2> 146563 INFO  (Thread-1498) [    ] o.a.s.c.ZkTestServer client port:0.0.0.0/0.0.0.0:0
   [junit4]   2> 146563 INFO  (Thread-1498) [    ] o.a.s.c.ZkTestServer Starting server
   [junit4]   2> 146663 INFO  (SUITE-TestSolrCloudWithDelegationTokens-seed#[CE1D01E22C0FF0]-worker) [    ] o.a.s.c.ZkTestServer start zk server on port:60251
   [junit4]   2> 146672 INFO  (jetty-launcher-222-thread-1) [    ] o.e.j.s.Server jetty-9.3.14.v20161028
   [junit4]   2> 146672 INFO  (jetty-launcher-222-thread-2) [    ] o.e.j.s.Server jetty-9.3.14.v20161028
   [junit4]   2> 146674 INFO  (jetty-launcher-222-thread-1) [    ] o.e.j.s.h.ContextHandler Started o.e.j.s.ServletContextHandler@67b7ea99{/solr,null,AVAILABLE}
   [junit4]   2> 146676 INFO  (jetty-launcher-222-thread-2) [    ] o.e.j.s.h.ContextHandler Started o.e.j.s.ServletContextHandler@5a6e37ab{/solr,null,AVAILABLE}
   [junit4]   2> 146676 INFO  (jetty-launcher-222-thread-1) [    ] o.e.j.s.AbstractConnector Started ServerConnector@4e7acf1b{HTTP/1.1,[http/1.1]}{127.0.0.1:45020}
   [junit4]   2> 146676 INFO  (jetty-launcher-222-thread-1) [    ] o.e.j.s.Server Started @150586ms
   [junit4]   2> 146676 INFO  (jetty-launcher-222-thread-1) [    ] o.a.s.c.s.e.JettySolrRunner Jetty properties: {hostContext=/solr, hostPort=45020}
   [junit4]   2> 146676 INFO  (jetty-launcher-222-thread-2) [    ] o.e.j.s.AbstractConnector Started ServerConnector@33e3bbd6{HTTP/1.1,[http/1.1]}{127.0.0.1:49106}
   [junit4]   2> 146676 INFO  (jetty-launcher-222-thread-2) [    ] o.e.j.s.Server Started @150586ms
   [junit4]   2> 146676 ERROR (jetty-launcher-222-thread-1) [    ] o.a.s.s.StartupLoggingUtils Missing Java Option solr.log.dir. Logging may be missing or incomplete.
   [junit4]   2> 146677 INFO  (jetty-launcher-222-thread-1) [    ] o.a.s.s.SolrDispatchFilter  ___      _       Welcome to Apache Solr™ version 7.0.0
   [junit4]   2> 146677 INFO  (jetty-launcher-222-thread-1) [    ] o.a.s.s.SolrDispatchFilter / __| ___| |_ _   Starting in cloud mode on port null
   [junit4]   2> 146676 INFO  (jetty-launcher-222-thread-2) [    ] o.a.s.c.s.e.JettySolrRunner Jetty properties: {hostContext=/solr, hostPort=49106}
   [junit4]   2> 146677 INFO  (jetty-launcher-222-thread-1) [    ] o.a.s.s.SolrDispatchFilter \__ \/ _ \ | '_|  Install dir: null
   [junit4]   2> 146677 INFO  (jetty-launcher-222-thread-1) [    ] o.a.s.s.SolrDispatchFilter |___/\___/_|_|    Start time: 2016-12-10T17:18:55.212Z
   [junit4]   2> 146678 ERROR (jetty-launcher-222-thread-2) [    ] o.a.s.s.StartupLoggingUtils Missing Java Option solr.log.dir. Logging may be missing or incomplete.
   [junit4]   2> 146678 INFO  (jetty-launcher-222-thread-2) [    ] o.a.s.s.SolrDispatchFilter  ___      _       Welcome to Apache Solr™ version 7.0.0
   [junit4]   2> 146678 INFO  (jetty-launcher-222-thread-2) [    ] o.a.s.s.SolrDispatchFilter / __| ___| |_ _   Starting in cloud mode on port null
   [junit4]   2> 146678 INFO  (jetty-launcher-222-thread-2) [    ] o.a.s.s.SolrDispatchFilter \__ \/ _ \ | '_|  Install dir: null
   [junit4]   2> 146678 INFO  (jetty-launcher-222-thread-2) [    ] o.a.s.s.SolrDispatchFilter |___/\___/_|_|    Start time: 2016-12-10T17:18:55.213Z
   [junit4]   2> 146681 INFO  (jetty-launcher-222-thread-1) [    ] o.a.s.s.SolrDispatchFilter solr.xml found in ZooKeeper. Loading...
   [junit4]   2> 146681 INFO  (jetty-launcher-222-thread-2) [    ] o.a.s.s.SolrDispatchFilter solr.xml found in ZooKeeper. Loading...
   [junit4]   2> 146692 INFO  (jetty-launcher-222-thread-1) [    ] o.a.s.c.ZkContainer Zookeeper client=127.0.0.1:60251/solr
   [junit4]   2> 146695 INFO  (jetty-launcher-222-thread-2) [    ] o.a.s.c.ZkContainer Zookeeper client=127.0.0.1:60251/solr
   [junit4]   2> 146734 INFO  (jetty-launcher-222-thread-2) [n:127.0.0.1:49106_solr    ] o.a.s.c.OverseerElectionContext I am going to be the leader 127.0.0.1:49106_solr
   [junit4]   2> 146735 INFO  (jetty-launcher-222-thread-1) [n:127.0.0.1:45020_solr    ] o.a.s.c.ZkController Register node as live in ZooKeeper:/live_nodes/127.0.0.1:45020_solr
   [junit4]   2> 146737 INFO  (jetty-launcher-222-thread-2) [n:127.0.0.1:49106_solr    ] o.a.s.c.Overseer Overseer (id=97084397001113606-127.0.0.1:49106_solr-n_0000000000) starting
   [junit4]   2> 146739 INFO  (zkCallback-233-thread-1-processing-n:127.0.0.1:49106_solr) [n:127.0.0.1:49106_solr    ] o.a.s.c.c.ZkStateReader Updated live nodes from ZooKeeper... (0) -> (1)
   [junit4]   2> 146739 INFO  (zkCallback-232-thread-1-processing-n:127.0.0.1:45020_solr) [n:127.0.0.1:45020_solr    ] o.a.s.c.c.ZkStateReader Updated live nodes from ZooKeeper... (0) -> (1)
   [junit4]   2> 146750 INFO  (jetty-launcher-222-thread-2) [n:127.0.0.1:49106_solr    ] o.a.s.c.ZkController Register node as live in ZooKeeper:/live_nodes/127.0.0.1:49106_solr
   [junit4]   2> 146752 INFO  (zkCallback-232-thread-1-processing-n:127.0.0.1:45020_solr) [n:127.0.0.1:45020_solr    ] o.a.s.c.c.ZkStateReader Updated live nodes from ZooKeeper... (1) -> (2)
   [junit4]   2> 146759 INFO  (zkCallback-233-thread-1-processing-n:127.0.0.1:49106_solr) [n:127.0.0.1:49106_solr    ] o.a.s.c.c.ZkStateReader Updated live nodes from ZooKeeper... (1) -> (2)
   [junit4]   2> 146844 INFO  (jetty-launcher-222-thread-2) [n:127.0.0.1:49106_solr    ] o.a.s.c.CoreContainer Initializing authentication plugin: org.apache.solr.security.HttpParamDelegationTokenPlugin
   [junit4]   2> 146844 INFO  (jetty-launcher-222-thread-2) [n:127.0.0.1:49106_solr    ] o.a.s.s.KerberosPlugin Params: {token.valid=30, delegation-token.token-kind=solr-dt, cookie.domain=127.0.0.1, cookie.path=/, zk-dt-secret-manager.znodeWorkingPath=solr/security/zkdtsm, token.validity=36000, signer.secret.provider.zookeeper.path=/token, type=kerberos, zk-dt-secret-manager.enable=true, kerberos.name.rules=DEFAULT, signer.secret.provider=zookeeper}
   [junit4]   2> 146844 INFO  (jetty-launcher-222-thread-2) [n:127.0.0.1:49106_solr    ] o.a.c.f.i.CuratorFrameworkImpl Starting
   [junit4]   2> 146847 INFO  (jetty-launcher-222-thread-2-EventThread) [n:127.0.0.1:49106_solr    ] o.a.c.f.s.ConnectionStateManager State change: CONNECTED
   [junit4]   2> 146868 INFO  (jetty-launcher-222-thread-2) [n:127.0.0.1:49106_solr    ] o.a.s.c.CorePropertiesLocator Found 0 core definitions underneath /export/home/jenkins/workspace/Lucene-Solr-master-Solaris/solr/build/solr-core/test/J0/temp/solr.cloud.TestSolrCloudWithDelegationTokens_CE1D01E22C0FF0-001/tempDir-001/node2/.
   [junit4]   2> 146903 INFO  (jetty-launcher-222-thread-1) [n:127.0.0.1:45020_solr    ] o.a.s.c.CoreContainer Initializing authentication plugin: org.apache.solr.security.HttpParamDelegationTokenPlugin
   [junit4]   2> 146904 INFO  (jetty-launcher-222-thread-1) [n:127.0.0.1:45020_solr    ] o.a.s.s.KerberosPlugin Params: {token.valid=30, delegation-token.token-kind=solr-dt, cookie.domain=127.0.0.1, cookie.path=/, zk-dt-secret-manager.znodeWorkingPath=solr/security/zkdtsm, token.validity=36000, signer.secret.provider.zookeeper.path=/token, type=kerberos, zk-dt-secret-manager.enable=true, kerberos.name.rules=DEFAULT, signer.secret.provider=zookeeper}
   [junit4]   2> 146904 INFO  (jetty-launcher-222-thread-1) [n:127.0.0.1:45020_solr    ] o.a.c.f.i.CuratorFrameworkImpl Starting
   [junit4]   2> 146908 INFO  (jetty-launcher-222-thread-1-EventThread) [n:127.0.0.1:45020_solr    ] o.a.c.f.s.ConnectionStateManager State change: CONNECTED
   [junit4]   2> 147000 INFO  (jetty-launcher-222-thread-1) [n:127.0.0.1:45020_solr    ] o.a.s.c.CorePropertiesLocator Found 0 core definitions underneath /export/home/jenkins/workspace/Lucene-Solr-master-Solaris/solr/build/solr-core/test/J0/temp/solr.cloud.TestSolrCloudWithDelegationTokens_CE1D01E22C0FF0-001/tempDir-001/node1/.
   [junit4]   2> 147010 WARN  (NIOServerCxn.Factory:0.0.0.0/0.0.0.0:0) [    ] o.a.z.s.NIOServerCnxn caught end of stream exception
   [junit4]   2> EndOfStreamException: Unable to read additional data from client sessionid 0x158e9bea47c0009, likely client has closed socket
   [junit4]   2> 	at org.apache.zookeeper.server.NIOServerCnxn.doIO(NIOServerCnxn.java:228)
   [junit4]   2> 	at org.apache.zookeeper.server.NIOServerCnxnFactory.run(NIOServerCnxnFactory.java:208)
   [junit4]   2> 	at java.lang.Thread.run(Thread.java:745)
   [junit4]   2> 147044 INFO  (TEST-TestSolrCloudWithDelegationTokens.testDelegationTokenSolrClient-seed#[CE1D01E22C0FF0]) [    ] o.a.s.SolrTestCaseJ4 ###Starting testDelegationTokenSolrClient
   [junit4]   2> 147081 WARN  (TEST-TestSolrCloudWithDelegationTokens.testDelegationTokenSolrClient-seed#[CE1D01E22C0FF0]) [    ] o.a.h.c.p.ResponseProcessCookies Invalid cookie header: "Set-Cookie: hadoop.auth=; Path=/; Domain=127.0.0.1; Expires=Cz, 01-sty-1970 00:00:00 GMT; HttpOnly". Invalid 'expires' attribute: Cz, 01-sty-1970 00:00:00 GMT
   [junit4]   2> 147090 INFO  (qtp1612945333-2623) [n:127.0.0.1:49106_solr    ] o.a.s.h.a.CollectionsHandler Invoked Collection Action :list with params action=LIST&delegation=GgADYmFyA2JhcgCKAVjpvqZligFZDcsqZQECFB9V7Y0kmbO5RhWpKIGUDTyvwvpiB3NvbHItZHQA&wt=javabin&version=2 and sendToOCPQueue=true
   [junit4]   2> 147090 INFO  (qtp1612945333-2623) [n:127.0.0.1:49106_solr    ] o.a.s.s.HttpSolrCall [admin] webapp=null path=/admin/collections params={action=LIST&delegation=GgADYmFyA2JhcgCKAVjpvqZligFZDcsqZQECFB9V7Y0kmbO5RhWpKIGUDTyvwvpiB3NvbHItZHQA&wt=javabin&version=2} status=0 QTime=0
   [junit4]   2> 147091 INFO  (TEST-TestSolrCloudWithDelegationTokens.testDelegationTokenSolrClient-seed#[CE1D01E22C0FF0]) [    ] o.a.s.SolrTestCaseJ4 ###Ending testDelegationTokenSolrClient
   [junit4]   2> 147135 INFO  (TEST-TestSolrCloudWithDelegationTokens.testDelegationTokenCancel-seed#[CE1D01E22C0FF0]) [    ] o.a.s.SolrTestCaseJ4 ###Starting testDelegationTokenCancel
   [junit4]   2> 147160 ERROR (qtp1612945333-2625) [    ] o.a.h.s.t.d.ZKDelegationTokenSecretManager No node in path [/ZKDTSMTokensRoot/DT_2]
   [junit4]   2> 147165 WARN  (TEST-TestSolrCloudWithDelegationTokens.testDelegationTokenCancel-seed#[CE1D01E22C0FF0]) [    ] o.a.h.c.p.ResponseProcessCookies Invalid cookie header: "Set-Cookie: hadoop.auth=; Path=/; Domain=127.0.0.1; Expires=Cz, 01-sty-1970 00:00:00 GMT; HttpOnly". Invalid 'expires' attribute: Cz, 01-sty-1970 00:00:00 GMT
   [junit4]   2> 147172 INFO  (TEST-TestSolrCloudWithDelegationTokens.testDelegationTokenCancel-seed#[CE1D01E22C0FF0]) [    ] o.a.s.c.c.ZkStateReader Updated live nodes from ZooKeeper... (0) -> (2)
   [junit4]   2> 147174 INFO  (TEST-TestSolrCloudWithDelegationTokens.testDelegationTokenCancel-seed#[CE1D01E22C0FF0]) [    ] o.a.s.c.s.i.ZkClientClusterStateProvider Cluster at 127.0.0.1:60251/solr ready
   [junit4]   2> 147176 WARN  (TEST-TestSolrCloudWithDelegationTokens.testDelegationTokenCancel-seed#[CE1D01E22C0FF0]) [    ] o.a.h.c.p.ResponseProcessCookies Invalid cookie header: "Set-Cookie: hadoop.auth=; Path=/; Domain=127.0.0.1; Expires=Cz, 01-sty-1970 00:00:00 GMT; HttpOnly". Invalid 'expires' attribute: Cz, 01-sty-1970 00:00:00 GMT
   [junit4]   2> 147195 INFO  (TEST-TestSolrCloudWithDelegationTokens.testDelegationTokenCancel-seed#[CE1D01E22C0FF0]) [    ] o.a.s.c.c.ZkStateReader Updated live nodes from ZooKeeper... (0) -> (2)
   [junit4]   2> 147197 INFO  (TEST-TestSolrCloudWithDelegationTokens.testDelegationTokenCancel-seed#[CE1D01E22C0FF0]) [    ] o.a.s.c.s.i.ZkClientClusterStateProvider Cluster at 127.0.0.1:60251/solr ready
   [junit4]   2> 147199 ERROR (qtp1612945333-2621) [    ] o.a.h.s.t.d.ZKDelegationTokenSecretManager No node in path [/ZKDTSMTokensRoot/DT_3]
   [junit4]   2> 147206 WARN  (TEST-TestSolrCloudWithDelegationTokens.testDelegationTokenCancel-seed#[CE1D01E22C0FF0]) [    ] o.a.h.c.p.ResponseProcessCookies Invalid cookie header: "Set-Cookie: hadoop.auth=; Path=/; Domain=127.0.0.1; Expires=Cz, 01-sty-1970 00:00:00 GMT; HttpOnly". Invalid 'expires' attribute: Cz, 01-sty-1970 00:00:00 GMT
   [junit4]   2> 147210 WARN  (TEST-TestSolrCloudWithDelegationTokens.testDelegationTokenCancel-seed#[CE1D01E22C0FF0]) [    ] o.a.h.c.p.ResponseProcessCookies Invalid cookie header: "Set-Cookie: hadoop.auth=; Path=/; Domain=127.0.0.1; Expires=Cz, 01-sty-1970 00:00:00 GMT; HttpOnly". Invalid 'expires' attribute: Cz, 01-sty-1970 00:00:00 GMT
   [junit4]   2> 147210 INFO  (TEST-TestSolrCloudWithDelegationTokens.testDelegationTokenCancel-seed#[CE1D01E22C0FF0]) [    ] o.a.s.SolrTestCaseJ4 ###Ending testDelegationTokenCancel
   [junit4]   2> 147233 INFO  (TEST-TestSolrCloudWithDelegationTokens.testDelegationTokenCancelFail-seed#[CE1D01E22C0FF0]) [    ] o.a.s.SolrTestCaseJ4 ###Starting testDelegationTokenCancelFail
   [junit4]   2> 147244 INFO  (TEST-TestSolrCloudWithDelegationTokens.testDelegationTokenCancelFail-seed#[CE1D01E22C0FF0]) [    ] o.a.s.SolrTestCaseJ4 ###Ending testDelegationTokenCancelFail
   [junit4]   2> NOTE: reproduce with: ant test  -Dtestcase=TestSolrCloudWithDelegationTokens -Dtests.method=testDelegationTokenCancelFail -Dtests.seed=CE1D01E22C0FF0 -Dtests.slow=true -Dtests.locale=pl -Dtests.timezone=PRT -Dtests.asserts=true -Dtests.file.encoding=UTF-8
   [junit4] FAILURE 0.04s J0 | TestSolrCloudWithDelegationTokens.testDelegationTokenCancelFail <<<
   [junit4]    > Throwable #1: java.lang.AssertionError: expected:<200> but was:<404>
   [junit4]    > 	at __randomizedtesting.SeedInfo.seed([CE1D01E22C0FF0:6871282B32B61D1C]:0)
   [junit4]    > 	at org.apache.solr.cloud.TestSolrCloudWithDelegationTokens.cancelDelegationToken(TestSolrCloudWithDelegationTokens.java:140)
   [junit4]    > 	at org.apache.solr.cloud.TestSolrCloudWithDelegationTokens.testDelegationTokenCancelFail(TestSolrCloudWithDelegationTokens.java:294)
   [junit4]    > 	at java.lang.Thread.run(Thread.java:745)
   [junit4]   2> 147269 INFO  (TEST-TestSolrCloudWithDelegationTokens.testDelegationTokenRenew-seed#[CE1D01E22C0FF0]) [    ] o.a.s.SolrTestCaseJ4 ###Starting testDelegationTokenRenew
   [junit4]   2> 147284 INFO  (TEST-TestSolrCloudWithDelegationTokens.testDelegationTokenRenew-seed#[CE1D01E22C0FF0]) [    ] o.a.s.c.c.ZkStateReader Updated live nodes from ZooKeeper... (0) -> (2)
   [junit4]   2> 147286 INFO  (TEST-TestSolrCloudWithDelegationTokens.testDelegationTokenRenew-seed#[CE1D01E22C0FF0]) [    ] o.a.s.c.s.i.ZkClientClusterStateProvider Cluster at 127.0.0.1:60251/solr ready
   [junit4]   2> 147288 INFO  (qtp1612945333-2623) [n:127.0.0.1:49106_solr    ] o.a.s.h.a.CollectionsHandler Invoked Collection Action :list with params action=LIST&delegation=GgADYmFyA2JhcgCKAVjpvqc8igFZDcsrPAUCFOplz_L8zB9zKhMoHvlP6IGzCU8wB3NvbHItZHQA&wt=javabin&version=2 and sendToOCPQueue=true
   [junit4]   2> 147288 INFO  (qtp1612945333-2623) [n:127.0.0.1:49106_solr    ] o.a.s.s.HttpSolrCall [admin] webapp=null path=/admin/collections params={action=LIST&delegation=GgADYmFyA2JhcgCKAVjpvqc8igFZDcsrPAUCFOplz_L8zB9zKhMoHvlP6IGzCU8wB3NvbHItZHQA&wt=javabin&version=2} status=0 QTime=0
   [junit4]   2> 147292 WARN  (TEST-TestSolrCloudWithDelegationTokens.testDelegationTokenRenew-seed#[CE1D01E22C0FF0]) [    ] o.a.h.c.p.ResponseProcessCookies Invalid cookie header: "Set-Cookie: hadoop.auth=; Path=/; Domain=127.0.0.1; Expires=Cz, 01-sty-1970 00:00:00 GMT; HttpOnly". Invalid 'expires' attribute: Cz, 01-sty-1970 00:00:00 GMT
   [junit4]   2> 147294 INFO  (qtp1094523782-2612) [n:127.0.0.1:45020_solr    ] o.a.s.h.a.CollectionsHandler Invoked Collection Action :list with params action=LIST&delegation=GgADYmFyA2JhcgCKAVjpvqc8igFZDcsrPAUCFOplz_L8zB9zKhMoHvlP6IGzCU8wB3NvbHItZHQA&wt=javabin&version=2 and sendToOCPQueue=true
   [junit4]   2> 147295 INFO  (qtp1094523782-2612) [n:127.0.0.1:45020_solr    ] o.a.s.s.HttpSolrCall [admin] webapp=null path=/admin/collections params={action=LIST&delegation=GgADYmFyA2JhcgCKAVjpvqc8igFZDcsrPAUCFOplz_L8zB9zKhMoHvlP6IGzCU8wB3NvbHItZHQA&wt=javabin&version=2} status=0 QTime=0
   [junit4]   2> 147300 INFO  (TEST-TestSolrCloudWithDelegationTokens.testDelegationTokenRenew-seed#[CE1D01E22C0FF0]) [    ] o.a.s.c.c.ZkStateReader Updated live nodes from ZooKeeper... (0) -> (2)
   [junit4]   2> 147301 INFO  (TEST-TestSolrCloudWithDelegationTokens.testDelegationTokenRenew-seed#[CE1D01E22C0FF0]) [    ] o.a.s.c.s.i.ZkClientClusterStateProvider Cluster at 127.0.0.1:60251/solr ready
   [junit4]   2> 147303 WARN  (TEST-TestSolrCloudWithDelegationTokens.testDelegationTokenRenew-seed#[CE1D01E22C0FF0]) [    ] o.a.h.c.p.ResponseProcessCookies Invalid cookie header: "Set-Cookie: hadoop.auth=; Path=/; Domain=127.0.0.1; Expires=Cz, 01-sty-1970 00:00:00 GMT; HttpOnly". Invalid 'expires' attribute: Cz, 01-sty-1970 00:00:00 GMT
   [junit4]   2> 147319 INFO  (qtp1612945333-2624) [n:127.0.0.1:49106_solr    ] o.a.s.h.a.CollectionsHandler Invoked Collection Action :list with params action=LIST&delegation=GgADYmFyA2JhcgCKAVjpvqdgigFZDcsrYAYCFOiFG3-ru3ZT3tafIO0gR9Qzv1Z5B3NvbHItZHQA&wt=javabin&version=2 and sendToOCPQueue=true
   [junit4]   2> 147319 INFO  (qtp1612945333-2624) [n:127.0.0.1:49106_solr    ] o.a.s.s.HttpSolrCall [admin] webapp=null path=/admin/collections params={action=LIST&delegation=GgADYmFyA2JhcgCKAVjpvqdgigFZDcsrYAYCFOiFG3-ru3ZT3tafIO0gR9Qzv1Z5B3NvbHItZHQA&wt=javabin&version=2} status=0 QTime=0
   [junit4]   2> 147324 INFO  (TEST-TestSolrCloudWithDelegationTokens.testDelegationTokenRenew-seed#[CE1D01E22C0FF0]) [    ] o.a.s.c.c.ZkStateReader Updated live nodes from ZooKeeper... (0) -> (2)
   [junit4]   2> 147326 INFO  (TEST-TestSolrCloudWithDelegationTokens.testDelegationTokenRenew-seed#[CE1D01E22C0FF0]) [    ] o.a.s.c.s.i.ZkClientClusterStateProvider Cluster at 127.0.0.1:60251/solr ready
   [junit4]   2> 147328 WARN  (TEST-TestSolrCloudWithDelegationTokens.testDelegationTokenRenew-seed#[CE1D01E22C0FF0]) [    ] o.a.h.c.p.ResponseProcessCookies Invalid cookie header: "Set-Cookie: hadoop.auth=; Path=/; Domain=127.0.0.1; Expires=Cz, 01-sty-1970 00:00:00 GMT; HttpOnly". Invalid 'expires' attribute: Cz, 01-sty-1970 00:00:00 GMT
   [junit4]   2> 147336 INFO  (TEST-TestSolrCloudWithDelegationTokens.testDelegationTokenRenew-seed#[CE1D01E22C0FF0]) [    ] o.a.s.c.c.ZkStateReader Updated live nodes from ZooKeeper... (0) -> (2)
   [junit4]   2> 147337 INFO  (TEST-TestSolrCloudWithDelegationTokens.testDelegationTokenRenew-seed#[CE1D01E22C0FF0]) [    ] o.a.s.c.s.i.ZkClientClusterStateProvider Cluster at 127.0.0.1:60251/solr ready
   [junit4]   2> 147339 INFO  (qtp1612945333-2623) [n:127.0.0.1:49106_solr    ] o.a.s.h.a.CollectionsHandler Invoked Collection Action :list with params action=LIST&delegation=GgADYmFyA2JhcgCKAVjpvqdgigFZDcsrYAYCFOiFG3-ru3ZT3tafIO0gR9Qzv1Z5B3NvbHItZHQA&wt=javabin&version=2 and sendToOCPQueue=true
   [junit4]   2> 147339 INFO  (qtp1612945333-2623) [n:127.0.0.1:49106_solr    ] o.a.s.s.HttpSolrCall [admin] webapp=null path=/admin/collections params={action=LIST&delegation=GgADYmFyA2JhcgCKAVjpvqdgigFZDcsrYAYCFOiFG3-ru3ZT3tafIO0gR9Qzv1Z5B3NvbHItZHQA&wt=javabin&version=2} status=0 QTime=0
   [junit4]   2> 147346 INFO  (TEST-TestSolrCloudWithDelegationTokens.testDelegationTokenRenew-seed#[CE1D01E22C0FF0]) [    ] o.a.s.c.c.ZkStateReader Updated live nodes from ZooKeeper... (0) -> (2)
   [junit4]   2> 147348 INFO  (TEST-TestSolrCloudWithDelegationTokens.testDelegationTokenRenew-seed#[CE1D01E22C0FF0]) [    ] o.a.s.c.s.i.ZkClientClusterStateProvider Cluster at 127.0.0.1:60251/solr ready
   [junit4]   2> 147350 WARN  (TEST-TestSolrCloudWithDelegationTokens.testDelegationTokenRenew-seed#[CE1D01E22C0FF0]) [    ] o.a.h.c.p.ResponseProcessCookies Invalid cookie header: "Set-Cookie: hadoop.auth=; Path=/; Domain=127.0.0.1; Expires=Cz, 01-sty-1970 00:00:00 GMT; HttpOnly". Invalid 'expires' attribute: Cz, 01-sty-1970 00:00:00 GMT
   [junit4]   2> 147374 INFO  (TEST-TestSolrCloudWithDelegationTokens.testDelegationTokenRenew-seed#[CE1D01E22C0FF0]) [    ] o.a.s.c.c.ZkStateReader Updated live nodes from ZooKeeper... (0) -> (2)
   [junit4]   2> 147375 INFO  (TEST-TestSolrCloudWithDelegationTokens.testDelegationTokenRenew-seed#[CE1D01E22C0FF0]) [    ] o.a.s.c.s.i.ZkClientClusterStateProvider Cluster at 127.0.0.1:60251/solr ready
   [junit4]   2> 147376 INFO  (qtp1612945333-2624) [n:127.0.0.1:49106_solr    ] o.a.s.h.a.CollectionsHandler Invoked Collection Action :list with params action=LIST&delegation=GgADYmFyA2JhcgCKAVjpvqePigFZDcsrjwcCFBwj52VNkuCCSYsNLGgGS9Pax5qhB3NvbHItZHQA&wt=javabin&version=2 and sendToOCPQueue=true
   [junit4]   2> 147377 INFO  (qtp1612945333-2624) [n:127.0.0.1:49106_solr    ] o.a.s.s.HttpSolrCall [admin] webapp=null path=/admin/collections params={action=LIST&delegation=GgADYmFyA2JhcgCKAVjpvqePigFZDcsrjwcCFBwj52VNkuCCSYsNLGgGS9Pax5qhB3NvbHItZHQA&wt=javabin&version=2} status=0 QTime=0
   [junit4]   2> 147378 WARN  (NIOServerCxn.Factory:0.0.0.0/0.0.0.0:0) [    ] o.a.z.s.NIOServerCnxn caught end of stream exception
   [junit4]   2> EndOfStreamException: Unable to read additional data from client sessionid 0x158e9bea47c0011, likely client has closed socket
   [junit4]   2> 	at org.apache.zookeeper.server.NIOServerCnxn.doIO(NIOServerCnxn.java:228)
   [junit4]   2> 	at org.apache.zookeeper.server.NIOServerCnxnFactory.run(NIOServerCnxnFactory.java:208)
   [junit4]   2> 	at java.lang.Thread.run(Thread.java:745)
   [junit4]   2> 147383 INFO  (TEST-TestSolrCloudWithDelegationTokens.testDelegationTokenRenew-seed#[CE1D01E22C0FF0]) [    ] o.a.s.c.c.ZkStateReader Updated live nodes from ZooKeeper... (0) -> (2)
   [junit4]   2> 147384 INFO  (TEST-TestSolrCloudWithDelegationTokens.testDelegationTokenRenew-seed#[CE1D01E22C0FF0]) [    ] o.a.s.c.s.i.ZkClientClusterStateProvider Cluster at 127.0.0.1:60251/solr ready
   [junit4]   2> 147386 WARN  (TEST-TestSolrCloudWithDelegationTokens.testDelegationTokenRenew-seed#[CE1D01E22C0FF0]) [    ] o.a.h.c.p.ResponseProcessCookies Invalid cookie header: "Set-Cookie: hadoop.auth=; Path=/; Domain=127.0.0.1; Expires=Cz, 01-sty-1970 00:00:00 GMT; HttpOnly". Invalid 'expires' attribute: Cz, 01-sty-1970 00:00:00 GMT
   [junit4]   2> 147389 WARN  (NIOServerCxn.Factory:0.0.0.0/0.0.0.0:0) [    ] o.a.z.s.NIOServerCnxn caught end of stream exception
   [junit4]   2> EndOfStreamException: Unable to read additional data from client sessionid 0x158e9bea47c0012, likely client has closed socket
   [junit4]   2> 	at org.apache.zookeeper.server.NIOServerCnxn.doIO(NIOServerCnxn.java:228)
   [junit4]   2> 	at org.apache.zookeeper.server.NIOServerCnxnFactory.run(NIOServerCnxnFactory.java:208)
   [junit4]   2> 	at java.lang.Thread.run(Thread.java:745)
   [junit4]   2> 147395 INFO  (TEST-TestSolrCloudWithDelegationTokens.testDelegationTokenRenew-seed#[CE1D01E22C0FF0]) [    ] o.a.s.c.c.ZkStateReader Updated live nodes from ZooKeeper... (0) -> (2)
   [junit4]   2> 147397 INFO  (TEST-TestSolrCloudWithDelegationTokens.testDelegationTokenRenew-seed#[CE1D01E22C0FF0]) [    ] o.a.s.c.s.i.ZkClientClusterStateProvider Cluster at 127.0.0.1:60251/solr ready
   [junit4]   2> 147399 INFO  (qtp1612945333-2623) [n:127.0.0.1:49106_solr    ] o.a.s.h.a.CollectionsHandler Invoked Collection Action :list with params action=LIST&delegation=GgADYmFyA2JhcgCKAVjpvqePigFZDcsrjwcCFBwj52VNkuCCSYsNLGgGS9Pax5qhB3NvbHItZHQA&wt=javabin&version=2 and sendToOCPQueue=true
   [junit4]   2> 147399 INFO  (qtp1612945333-2623) [n:127.0.0.1:49106_solr    ] o.a.s.s.HttpSolrCall [admin] webapp=null path=/admin/collections params={action=LIST&delegation=GgADYmFyA2JhcgCKAVjpvqePigFZDcsrjwcCFBwj52VNkuCCSYsNLGgGS9Pax5qhB3NvbHItZHQA&wt=javabin&version=2} status=0 QTime=0
   [junit4]   2> 147404 WARN  (TEST-TestSolrCloudWithDelegationTokens.testDelegationTokenRenew-seed#[CE1D01E22C0FF0]) [    ] o.a.h.c.p.ResponseProcessCookies Invalid cookie header: "Set-Cookie: hadoop.auth=; Path=/; Domain=127.0.0.1; Expires=Cz, 01-sty-1970 00:00:00 GMT; HttpOnly". Invalid 'expires' attribute: Cz, 01-sty-1970 00:00:00 GMT
   [junit4]   2> 147429 INFO  (TEST-TestSolrCloudWithDelegationTokens.testDelegationTokenRenew-seed#[CE1D01E22C0FF0]) [    ] o.a.s.c.c.ZkStateReader Updated live nodes from ZooKeeper... (0) -> (2)
   [junit4]   2> 147430 INFO  (TEST-TestSolrCloudWithDelegationTokens.testDelegationTokenRenew-seed#[CE1D01E22C0FF0]) [    ] o.a.s.c.s.i.ZkClientClusterStateProvider Cluster at 127.0.0.1:60251/solr ready
   [junit4]   2> 147432 INFO  (qtp1612945333-2615) [n:127.0.0.1:49106_solr    ] o.a.s.h.a.CollectionsHandler Invoked Collection Action :list with params action=LIST&delegation=GgADYmFyA2JhcgCKAVjpvqfEigFZDcsrxAgCFLzwCFlEjzHdUfbKgY4DOCmPvb1HB3NvbHItZHQA&wt=javabin&version=2 and sendToOCPQueue=true
   [junit4]   2> 147432 INFO  (qtp1612945333-2615) [n:127.0.0.1:49106_solr    ] o.a.s.s.HttpSolrCall [admin] webapp=null path=/admin/collections params={action=LIST&delegation=GgADYmFyA2JhcgCKAVjpvqfEigFZDcsrxAgCFLzwCFlEjzHdUfbKgY4DOCmPvb1HB3NvbHItZHQA&wt=javabin&version=2} status=0 QTime=0
   [junit4]   2> 147438 INFO  (TEST-TestSolrCloudWithDelegationTokens.testDelegationTokenRenew-seed#[CE1D01E22C0FF0]) [    ] o.a.s.c.c.ZkStateReader Updated live nodes from ZooKeeper... (0) -> (2)
   [junit4]   2> 147439 INFO  (TEST-TestSolrCloudWithDelegationTokens.testDelegationTokenRenew-seed#[CE1D01E22C0FF0]) [    ] o.a.s.c.s.i.ZkClientClusterStateProvider Cluster at 127.0.0.1:60251/solr ready
   [junit4]   2> 147450 WARN  (TEST-TestSolrCloudWithDelegationTokens.testDelegationTokenRenew-seed#[CE1D01E22C0FF0]) [    ] o.a.h.c.p.ResponseProcessCookies Invalid cookie header: "Set-Cookie: hadoop.auth=; Path=/; Domain=127.0.0.1; Expires=Cz, 01-sty-1970 00:00:00 GMT; HttpOnly". Invalid 'expires' attribute: Cz, 01-sty-1970 00:00:00 GMT
   [junit4]   2> 147455 INFO  (qtp1094523782-2613) [n:127.0.0.1:45020_solr    ] o.a.s.h.a.CollectionsHandler Invoked Collection Action :list with params action=LIST&delegation=GgADYmFyA2JhcgCKAVjpvqfEigFZDcsrxAgCFLzwCFlEjzHdUfbKgY4DOCmPvb1HB3NvbHItZHQA&wt=javabin&version=2 and sendToOCPQueue=true
   [junit4]   2> 147455 INFO  (qtp1094523782-2613) [n:127.0.0.1:45020_solr    ] o.a.s.s.HttpSolrCall [admin] webapp=null path=/admin/collections params={action=LIST&delegation=GgADYmFyA2JhcgCKAVjpvqfEigFZDcsrxAgCFLzwCFlEjzHdUfbKgY4DOCmPvb1HB3NvbHItZHQA&wt=javabin&version=2} status=0 QTime=0
   [junit4]   2> 147459 WARN  (TEST-TestSolrCloudWithDelegationTokens.testDelegationTokenRenew-seed#[CE1D01E22C0FF0]) [    ] o.a.h.c.p.ResponseProcessCookies Invalid cookie header: "Set-Cookie: hadoop.auth=; Path=/; Domain=127.0.0.1; Expires=Cz, 01-sty-1970 00:00:00 GMT; HttpOnly". Invalid 'expires' attribute: Cz, 01-sty-1970 00:00:00 GMT
   [junit4]   2> 147459 INFO  (TEST-TestSolrCloudWithDelegationTokens.testDelegationTokenRenew-seed#[CE1D01E22C0FF0]) [    ] o.a.s.SolrTestCaseJ4 ###Ending testDelegationTokenRenew
   [junit4]   2> 147483 INFO  (TEST-TestSolrCloudWithDelegationTokens.testDelegationTokenRenewFail-seed#[CE1D01E22C0FF0]) [    ] o.a.s.SolrTestCaseJ4 ###Starting testDelegationTokenRenewFail
   [junit4]   2> 147490 WARN  (qtp1612945333-2615) [n:127.0.0.1:49106_solr    ] o.a.h.s.a.s.AuthenticationFilter Authentication exception: org.apache.hadoop.security.AccessControlException: foo tries to renew a token with renewer bar
   [junit4]   2> 147490 WARN  (qtp1612945333-2615) [n:127.0.0.1:49106_solr    ] o.a.s.s.KerberosPlugin Could not find org.apache.solr.security.kerberosplugin.requestcontinues
   [junit4]   2> 147495 WARN  (TEST-TestSolrCloudWithDelegationTokens.testDelegationTokenRenewFail-seed#[CE1D01E22C0FF0]) [    ] o.a.h.c.p.ResponseProcessCookies Invalid cookie header: "Set-Cookie: hadoop.auth=; Path=/; Domain=127.0.0.1; Expires=Cz, 01-sty-1970 00:00:00 GMT; HttpOnly". Invalid 'expires' attribute: Cz, 01-sty-1970 00:00:00 GMT
   [junit4]   2> 147496 WARN  (qtp1094523782-2612) [n:127.0.0.1:45020_solr    ] o.a.h.s.a.s.AuthenticationFilter Authentication exception: org.apache.hadoop.security.AccessControlException: foo tries to renew a token with renewer bar
   [junit4]   2> 147496 WARN  (qtp1094523782-2612) [n:127.0.0.1:45020_solr    ] o.a.s.s.KerberosPlugin Could not find org.apache.solr.security.kerberosplugin.requestcontinues
   [junit4]   2> 147496 WARN  (TEST-TestSolrCloudWithDelegationTokens.testDelegationTokenRenewFail-seed#[CE1D01E22C0FF0]) [    ] o.a.h.c.p.ResponseProcessCookies Invalid cookie header: "Set-Cookie: hadoop.auth=; Path=/; Domain=127.0.0.1; Expires=Cz, 01-sty-1970 00:00:00 GMT; HttpOnly". Invalid 'expires' attribute: Cz, 01-sty-1970 00:00:00 GMT
   [junit4]   2> 147505 WARN  (qtp1612945333-2625) [    ] o.a.h.s.a.s.AuthenticationFilter Authentication exception: org.apache.hadoop.security.AccessControlException: notRenewUser tries to renew a token with renewer renewUser
   [junit4]   2> 147505 WARN  (qtp1612945333-2625) [    ] o.a.s.s.KerberosPlugin Could not find org.apache.solr.security.kerberosplugin.requestcontinues
   [junit4]   2> 147509 WARN  (TEST-TestSolrCloudWithDelegationTokens.testDelegationTokenRenewFail-seed#[CE1D01E22C0FF0]) [    ] o.a.h.c.p.ResponseProcessCookies Invalid cookie header: "Set-Cookie: hadoop.auth=; Path=/; Domain=127.0.0.1; Expires=Cz, 01-sty-1970 00:00:00 GMT; HttpOnly". Invalid 'expires' attribute: Cz, 01-sty-1970 00:00:00 GMT
   [junit4]   2> 147511 WARN  (qtp1094523782-2616) [    ] o.a.h.s.a.s.AuthenticationFilter Authentication exception: org.apache.hadoop.security.AccessControlException: notRenewUser tries to renew a token with renewer renewUser
   [junit4]   2> 147511 WARN  (qtp1094523782-2616) [    ] o.a.s.s.KerberosPlugin Could not find org.apache.solr.security.kerberosplugin.requestcontinues
   [junit4]   2> 147518 WARN  (TEST-TestSolrCloudWithDelegationTokens.testDelegationTokenRenewFail-seed#[CE1D01E22C0FF0]) [    ] o.a.h.c.p.ResponseProcessCookies Invalid cookie header: "Set-Cookie: hadoop.auth=; Path=/; Domain=127.0.0.1; Expires=Cz, 01-sty-1970 00:00:00 GMT; HttpOnly". Invalid 'expires' attribute: Cz, 01-sty-1970 00:00:00 GMT
   [junit4]   2> 147518 INFO  (TEST-TestSolrCloudWithDelegationTokens.testDelegationTokenRenewFail-seed#[CE1D01E22C0FF0]) [    ] o.a.s.SolrTestCaseJ4 ###Ending testDelegationTokenRenewFail
   [junit4]   2> 147545 INFO  (TEST-TestSolrCloudWithDelegationTokens.testZNodePaths-seed#[CE1D01E22C0FF0]) [    ] o.a.s.SolrTestCaseJ4 ###Starting testZNodePaths
   [junit4]   2> 147582 INFO  (TEST-TestSolrCloudWithDelegationTokens.testZNodePaths-seed#[CE1D01E22C0FF0]) [    ] o.a.s.SolrTestCaseJ4 ###Ending testZNodePaths
   [junit4]   2> 147611 INFO  (TEST-TestSolrCloudWithDelegationTokens.testDelegationTokenVerify-seed#[CE1D01E22C0FF0]) [    ] o.a.s.SolrTestCaseJ4 ###Starting testDelegationTokenVerify
   [junit4]   2> 147620 INFO  (TEST-TestSolrCloudWithDelegationTokens.testDelegationTokenVerify-seed#[CE1D01E22C0FF0]) [    ] o.a.s.c.c.ZkStateReader Updated live nodes from ZooKeeper... (0) -> (2)
   [junit4]   2> 147622 INFO  (TEST-TestSolrCloudWithDelegationTokens.testDelegationTokenVerify-seed#[CE1D01E22C0FF0]) [    ] o.a.s.c.s.i.ZkClientClusterStateProvider Cluster at 127.0.0.1:60251/solr ready
   [junit4]   2> 147624 INFO  (qtp1612945333-2621) [n:127.0.0.1:49106_solr    ] o.a.s.h.a.CollectionsHandler Invoked Collection Action :list with params action=LIST&delegation=GgADYmFyA2JhcgCKAVjpvqiSigFZDcsskgwCFOf8O5BwLgPec8UXGwrZ2vduDPnTB3NvbHItZHQA&wt=javabin&version=2 and sendToOCPQueue=true
   [junit4]   2> 147624 INFO  (qtp1612945333-2621) [n:127.0.0.1:49106_solr    ] o.a.s.s.HttpSolrCall [admin] webapp=null path=/admin/collections params={action=LIST&delegation=GgADYmFyA2JhcgCKAVjpvqiSigFZDcsskgwCFOf8O5BwLgPec8UXGwrZ2vduDPnTB3NvbHItZHQA&wt=javabin&version=2} status=0 QTime=0
   [junit4]   2> 147629 WARN  (TEST-TestSolrCloudWithDelegationTokens.testDelegationTokenVerify-seed#[CE1D01E22C0FF0]) [    ] o.a.h.c.p.ResponseProcessCookies Invalid cookie header: "Set-Cookie: hadoop.auth=; Path=/; Domain=127.0.0.1; Expires=Cz, 01-sty-1970 00:00:00 GMT; HttpOnly". Invalid 'expires' attribute: Cz, 01-sty-1970 00:00:00 GMT
   [junit4]   2> 147632 INFO  (qtp1094523782-2614) [n:127.0.0.1:45020_solr    ] o.a.s.h.a.CollectionsHandler Invoked Collection Action :list with params action=LIST&delegation=GgADYmFyA2JhcgCKAVjpvqiSigFZDcsskgwCFOf8O5BwLgPec8UXGwrZ2vduDPnTB3NvbHItZHQA&wt=javabin&version=2 and sendToOCPQueue=true
   [junit4]   2> 147632 INFO  (qtp1094523782-2614) [n:127.0.0.1:45020_solr    ] o.a.s.s.HttpSolrCall [admin] webapp=null path=/admin/collections params={action=LIST&delegation=GgADYmFyA2JhcgCKAVjpvqiSigFZDcsskgwCFOf8O5BwLgPec8UXGwrZ2vduDPnTB3NvbHItZHQA&wt=javabin&version=2} status=0 QTime=0
   [junit4]   2> 147635 WARN  (TEST-TestSolrCloudWithDelegationTokens.testDelegationTokenVerify-seed#[CE1D01E22C0FF0]) [    ] o.a.h.c.p.ResponseProcessCookies Invalid cookie header: "Set-Cookie: hadoop.auth=; Path=/; Domain=127.0.0.1; Expires=Cz, 01-sty-1970 00:00:00 GMT; HttpOnly". Invalid 'expires' attribute: Cz, 01-sty-1970 00:00:00 GMT
   [junit4]   2> 147635 INFO  (TEST-TestSolrCloudWithDelegationTokens.testDelegationTokenVerify-seed#[CE1D01E22C0FF0]) [    ] o.a.s.SolrTestCaseJ4 ###Ending testDelegationTokenVerify
   [junit4]   2> 147658 INFO  (TEST-TestSolrCloudWithDelegationTokens.testDelegationOtherOp-seed#[CE1D01E22C0FF0]) [    ] o.a.s.SolrTestCaseJ4 ###Starting testDelegationOtherOp
   [junit4]   2> 147660 INFO  (qtp1612945333-2621) [n:127.0.0.1:49106_solr    ] o.a.s.h.a.CollectionsHandler Invoked Collection Action :list with params op=someSolrOperation&action=LIST&wt=javabin&version=2 and sendToOCPQueue=true
   [junit4]   2> 147660 INFO  (qtp1612945333-2621) [n:127.0.0.1:49106_solr    ] o.a.s.s.HttpSolrCall [admin] webapp=null path=/admin/collections params={op=someSolrOperation&action=LIST&wt=javabin&version=2} status=0 QTime=0
   [junit4]   2> 147661 WARN  (TEST-TestSolrCloudWithDelegationTokens.testDelegationOtherOp-seed#[CE1D01E22C0FF0]) [    ] o.a.h.c.p.ResponseProcessCookies Invalid cookie header: "Set-Cookie: hadoop.auth="u=bar&p=bar&t=test&e=1481426336195&s=/IbRUtb/48ATBq8m6iZGupU8h8U="; Path=/; Domain=127.0.0.1; Expires=N, 11-gru-2016 03:18:56 GMT; HttpOnly". Invalid 'expires' attribute: N, 11-gru-2016 03:18:56 GMT
   [junit4]   2> 147661 INFO  (TEST-TestSolrCloudWithDelegationTokens.testDelegationOtherOp-seed#[CE1D01E22C0FF0]) [    ] o.a.s.SolrTestCaseJ4 ###Ending testDelegationOtherOp
   [junit4]   2> 147663 INFO  (jetty-launcher-222-thread-2) [    ] o.e.j.s.AbstractConnector Stopped ServerConnector@4e7acf1b{HTTP/1.1,[http/1.1]}{127.0.0.1:0}
   [junit4]   2> 147664 INFO  (jetty-launcher-222-thread-1) [    ] o.e.j.s.AbstractConnector Stopped ServerConnector@33e3bbd6{HTTP/1.1,[http/1.1]}{127.0.0.1:0}
   [junit4]   2> 147665 INFO  (jetty-launcher-222-thread-2) [    ] o.a.s.c.CoreContainer Shutting down CoreContainer instance=1016281743
   [junit4]   2> 147665 INFO  (jetty-launcher-222-thread-1) [    ] o.a.s.c.CoreContainer Shutting down CoreContainer instance=2091482052
   [junit4]   2> 147671 INFO  (jetty-launcher-222-thread-1) [    ] o.a.s.c.Overseer Overseer (id=97084397001113606-127.0.0.1:49106_solr-n_0000000000) closing
   [junit4]   2> 147672 INFO  (OverseerStateUpdate-97084397001113606-127.0.0.1:49106_solr-n_0000000000) [n:127.0.0.1:49106_solr    ] o.a.s.c.Overseer Overseer Loop exiting : 127.0.0.1:49106_solr
   [junit4]   2> 147674 ERROR (Thread[Thread-1518,5,TGRP-TestSolrCloudWithDelegationTokens]) [n:127.0.0.1:45020_solr    ] o.a.h.s.t.d.AbstractDelegationTokenSecretManager ExpiredTokenRemover received java.lang.InterruptedException: sleep interrupted
   [junit4]   2> 147679 INFO  (jetty-launcher-222-thread-2) [    ] o.e.j.s.h.ContextHandler Stopped o.e.j.s.ServletContextHandler@67b7ea99{/solr,null,UNAVAILABLE}
   [junit4]   2> 149177 WARN  (zkCallback-233-thread-1-processing-n:127.0.0.1:49106_solr) [n:127.0.0.1:49106_solr    ] o.a.s.c.c.ZkStateReader ZooKeeper watch triggered, but Solr cannot talk to ZK: [KeeperErrorCode = Session expired for /live_nodes]
   [junit4]   2> 149177 ERROR (Thread[Thread-1515,5,TGRP-TestSolrCloudWithDelegationTokens]) [n:127.0.0.1:49106_solr    ] o.a.h.s.t.d.AbstractDelegationTokenSecretManager ExpiredTokenRemover received java.lang.InterruptedException: sleep interrupted
   [junit4]   2> 149182 INFO  (jetty-launcher-222-thread-1) [    ] o.e.j.s.h.ContextHandler Stopped o.e.j.s.ServletContextHandler@5a6e37ab{/solr,null,UNAVAILABLE}
   [junit4]   2> 149183 INFO  (SUITE-TestSolrCloudWithDelegationTokens-seed#[CE1D01E22C0FF0]-worker) [    ] o.a.s.c.ZkTestServer connecting to 127.0.0.1:60251 60251
   [junit4]   2> 149197 INFO  (Thread-1498) [    ] o.a.s.c.ZkTestServer connecting to 127.0.0.1:60251 60251
   [junit4]   2> 149198 WARN  (Thread-1498) [    ] o.a.s.c.ZkTestServer Watch limit violations: 
   [junit4]   2> Maximum concurrent create/delete watches above limit:
   [junit4]   2> 
   [junit4]   2> 	15	/solr/aliases.json
   [junit4]   2> 	15	/solr/clusterprops.json
   [junit4]   2> 	2	/solr/security.json
   [junit4]   2> 
   [junit4]   2> Maximum concurrent data watches above limit:
   [junit4]   2> 
   [junit4]   2> 	15	/solr/clusterstate.json
   [junit4]   2> 	2	/solr/security/zkdtsm/ZKDTSMRoot/ZKDTSMTokensRoot/DT_7
   [junit4]   2> 	2	/solr/security/zkdtsm/ZKDTSMRoot/ZKDTSMTokensRoot/DT_6
   [junit4]   2> 	2	/solr/security/zkdtsm/ZKDTSMRoot/ZKDTSMTokensRoot/DT_9
   [junit4]   2> 	2	/solr/security/zkdtsm/ZKDTSMRoot/ZKDTSMTokensRoot/DT_8
   [junit4]   2> 	2	/solr/security/zkdtsm/ZKDTSMRoot/ZKDTSMKeyIdRoot
   [junit4]   2> 	2	/solr/security/zkdtsm/ZKDTSMRoot/ZKDTSMMasterKeyRoot/DK_1
   [junit4]   2> 	2	/solr/security/zkdtsm/ZKDTSMRoot/ZKDTSMTokensRoot/DT_1
   [junit4]   2> 	2	/solr/security/zkdtsm/ZKDTSMRoot/ZKDTSMMasterKeyRoot/DK_3
   [junit4]   2> 	2	/solr/security/zkdtsm/ZKDTSMRoot/ZKDTSMTokensRoot/DT_3
   [junit4]   2> 	2	/solr/security/zkdtsm/ZKDTSMRoot/ZKDTSMMasterKeyRoot/DK_2
   [junit4]   2> 	2	/solr/security/zkdtsm/ZKDTSMRoot/ZKDTSMTokensRoot/DT_2
   [junit4]   2> 	2	/solr/security/zkdtsm/ZKDTSMRoot/ZKDTSMTokensRoot/DT_5
   [junit4]   2> 	2	/solr/security/zkdtsm/ZKDTSMRoot/ZKDTSMMasterKeyRoot/DK_4
   [junit4]   2> 	2	/solr/security/zkdtsm/ZKDTSMRoot/ZKDTSMTokensRoot/DT_4
   [junit4]   2> 	2	/solr/security/zkdtsm/ZKDTSMRoot/ZKDTSMTokensRoot/DT_12
   [junit4]   2> 	2	/solr/security/zkdtsm/ZKDTSMRoot/ZKDTSMSeqNumRoot
   [junit4]   2> 	2	/solr/security/zkdtsm/ZKDTSMRoot/ZKDTSMTokensRoot/DT_11
   [junit4]   2> 	2	/solr/security/zkdtsm/ZKDTSMRoot/ZKDTSMTokensRoot/DT_10
   [junit4]   2> 
   [junit4]   2> Maximum concurrent children watches above limit:
   [junit4]   2> 
   [junit4]   2> 	15	/solr/live_nodes
   [junit4]   2> 	15	/solr/collections
   [junit4]   2> 	2	/solr/overseer/queue
   [junit4]   2> 	2	/solr/security/zkdtsm/ZKDTSMRoot/ZKDTSMMasterKeyRoot
   [junit4]   2> 	2	/solr/overseer/queue-work
   [junit4]   2> 	2	/solr/security/zkdtsm/ZKDTSMRoot/ZKDTSMTokensRoot
   [junit4]   2> 
   [junit4]   2> 149199 INFO  (SUITE-TestSolrCloudWithDelegationTokens-seed#[CE1D01E22C0FF0]-worker) [    ] o.a.s.SolrTestCaseJ4 ###deleteCore
   [junit4]   2> NOTE: leaving temporary files on disk at: /export/home/jenkins/workspace/Lucene-Solr-master-Solaris/solr/build/solr-core/test/J0/temp/solr.cloud.TestSolrCloudWithDelegationTokens_CE1D01E22C0FF0-001
   [junit4]   2> Dec 10, 2016 5:18:57 PM com.carrotsearch.randomizedtesting.ThreadLeakControl checkThreadLeaks
   [junit4]   2> WARNING: Will linger awaiting termination of 2 leaked thread(s).
   [junit4]   2> NOTE: test params are: codec=CheapBastard, sim=RandomSimilarity(queryNorm=false): {}, locale=pl, timezone=PRT
   [junit4]   2> NOTE: SunOS 5.11 amd64/Oracle Corporation 1.8.0_112 (64-bit)/cpus=3,threads=1,free=421601568,total=536870912
   [junit4]   2> NOTE: All tests run in this JVM: [TestSlowCompositeReaderWrapper, TestBulkSchemaConcurrent, TestLeaderElectionWithEmptyReplica, SimpleFacetsTest, PreAnalyzedFieldManagedSchemaCloudTest, ZkControllerTest, TestSchemaResource, TestSchemaManager, QueryResultKeyTest, DocValuesNotIndexedTest, DeleteStatusTest, DisMaxRequestHandlerTest, TestQueryWrapperFilter, TestRawTransformer, TestFreeTextSuggestions, DistributedQueryElevationComponentTest, ReplicaListTransformerTest, TestHdfsUpdateLog, TestSolrJ, TestCharFilters, TimerUtilsTest, TestScoreJoinQPNoScore, TestIBSimilarityFactory, TestSmileRequest, TestRuleBasedAuthorizationPlugin, TestSolrFieldCacheMBean, TestSolrCloudWithSecureImpersonation, TimeZoneUtilsTest, DocExpirationUpdateProcessorFactoryTest, PathHierarchyTokenizerFactoryTest, DirectSolrConnectionTest, TestSolrCloudWithDelegationTokens]
   [junit4] Completed [50/659 (1!)] on J0 in 3.16s, 8 tests, 1 failure <<< FAILURES!

[...truncated 1353 lines...]
   [junit4] Suite: org.apache.solr.core.TestLazyCores
   [junit4]   2> Creating dataDir: /export/home/jenkins/workspace/Lucene-Solr-master-Solaris/solr/build/solr-core/test/J0/temp/solr.core.TestLazyCores_CE1D01E22C0FF0-001/init-core-data-001
   [junit4]   2> 1654520 INFO  (SUITE-TestLazyCores-seed#[CE1D01E22C0FF0]-worker) [    ] o.a.s.SolrTestCaseJ4 Randomized ssl (false) and clientAuth (false) via: @org.apache.solr.util.RandomizeSSL(reason=, value=NaN, ssl=NaN, clientAuth=NaN)
   [junit4]   2> 1654521 INFO  (TEST-TestLazyCores.testLazySearch-seed#[CE1D01E22C0FF0]) [    ] o.a.s.SolrTestCaseJ4 ###Starting testLazySearch
   [junit4]   2> 1654543 INFO  (TEST-TestLazyCores.testLazySearch-seed#[CE1D01E22C0FF0]) [    ] o.a.s.c.SolrCores Allocating transient cache for 4 transient cores
   [junit4]   2> 1654564 INFO  (coreLoadExecutor-6153-thread-1) [    ] o.a.s.c.SolrConfig Using Lucene MatchVersion: 7.0.0
   [junit4]   2> 1654564 INFO  (coreLoadExecutor-6153-thread-2) [    ] o.a.s.c.SolrConfig Using Lucene MatchVersion: 7.0.0
   [junit4]   2> 1654589 INFO  (coreLoadExecutor-6153-thread-2) [    ] o.a.s.s.IndexSchema [collection2] Schema name=tiny
   [junit4]   2> 1654589 INFO  (coreLoadExecutor-6153-thread-1) [    ] o.a.s.s.IndexSchema [collection1] Schema name=tiny
   [junit4]   2> 1654592 INFO  (coreLoadExecutor-6153-thread-3) [    ] o.a.s.c.SolrConfig Using Lucene MatchVersion: 7.0.0
   [junit4]   2> 1654592 INFO  (coreLoadExecutor-6153-thread-1) [    ] o.a.s.s.IndexSchema Loaded schema tiny/1.1 with uniqueid field id
   [junit4]   2> 1654595 INFO  (coreLoadExecutor-6153-thread-1) [    ] o.a.s.c.CoreContainer Creating SolrCore 'collection1' using configuration from instancedir /export/home/jenkins/workspace/Lucene-Solr-master-Solaris/solr/build/solr-core/test/J0/temp/solr.core.TestLazyCores_CE1D01E22C0FF0-001/tempDir-001/collection1
   [junit4]   2> 1654595 INFO  (coreLoadExecutor-6153-thread-1) [    x:collection1] o.a.s.c.SolrCore [[collection1] ] Opening new SolrCore at [/export/home/jenkins/workspace/Lucene-Solr-master-Solaris/solr/build/solr-core/test/J0/temp/solr.core.TestLazyCores_CE1D01E22C0FF0-001/tempDir-001/collection1], dataDir=[/export/home/jenkins/workspace/Lucene-Solr-master-Solaris/solr/build/solr-core/test/J0/temp/solr.core.TestLazyCores_CE1D01E22C0FF0-001/tempDir-001/collection1/data/]
   [junit4]   2> 1654596 INFO  (coreLoadExecutor-6153-thread-1) [    x:collection1] o.a.s.u.RandomMergePolicy RandomMergePolicy wrapping class org.apache.lucene.index.LogDocMergePolicy: [LogDocMergePolicy: minMergeSize=1000, mergeFactor=17, maxMergeSize=9223372036854775807, maxMergeSizeForForcedMerge=9223372036854775807, calibrateSizeByDeletes=false, maxMergeDocs=2147483647, maxCFSSegmentSizeMB=8.796093022207999E12, noCFSRatio=0.5794747768530669]
   [junit4]   2> 1654599 INFO  (coreLoadExecutor-6153-thread-3) [    ] o.a.s.s.IndexSchema [collection5] Schema name=tiny
   [junit4]   2> 1654602 INFO  (coreLoadExecutor-6153-thread-3) [    ] o.a.s.s.IndexSchema Loaded schema tiny/1.1 with uniqueid field id
   [junit4]   2> 1654603 INFO  (coreLoadExecutor-6153-thread-3) [    ] o.a.s.c.CoreContainer Creating SolrCore 'collection5' using configuration from instancedir /export/home/jenkins/workspace/Lucene-Solr-master-Solaris/solr/build/solr-core/test/J0/temp/solr.core.TestLazyCores_CE1D01E22C0FF0-001/tempDir-001/collection5
   [junit4]   2> 1654603 INFO  (coreLoadExecutor-6153-thread-3) [    x:collection5] o.a.s.c.SolrCore [[collection5] ] Opening new SolrCore at [/export/home/jenkins/workspace/Lucene-Solr-master-Solaris/solr/build/solr-core/test/J0/temp/solr.core.TestLazyCores_CE1D01E22C0FF0-001/tempDir-001/collection5], dataDir=[/export/home/jenkins/workspace/Lucene-Solr-master-Solaris/solr/build/solr-core/test/J0/temp/solr.core.TestLazyCores_CE1D01E22C0FF0-001/tempDir-001/collection5/data/]
   [junit4]   2> 1654604 INFO  (coreLoadExecutor-6153-thread-3) [    x:collection5] o.a.s.u.RandomMergePolicy RandomMergePolicy wrapping class org.apache.lucene.index.LogDocMergePolicy: [LogDocMergePolicy: minMergeSize=1000, mergeFactor=17, maxMergeSize=9223372036854775807, maxMergeSizeForForcedMerge=9223372036854775807, calibrateSizeByDeletes=false, maxMergeDocs=2147483647, maxCFSSegmentSizeMB=8.796093022207999E12, noCFSRatio=0.5794747768530669]
   [junit4]   2> 1654607 INFO  (coreLoadExecutor-6153-thread-1) [    x:collection1] o.a.s.u.CommitTracker Hard AutoCommit: disabled
   [junit4]   2> 1654607 INFO  (coreLoadExecutor-6153-thread-1) [    x:collection1] o.a.s.u.CommitTracker Soft AutoCommit: disabled
   [junit4]   2> 1654611 INFO  (coreLoadExecutor-6153-thread-1) [    x:collection1] o.a.s.u.RandomMergePolicy RandomMergePolicy wrapping class org.apache.lucene.index.TieredMergePolicy: [TieredMergePolicy: maxMergeAtOnce=14, maxMergeAtOnceExplicit=31, maxMergedSegmentMB=84.1455078125, floorSegmentMB=1.0986328125, forceMergeDeletesPctAllowed=1.8750330145486216, segmentsPerTier=11.0, maxCFSSegmentSizeMB=8.796093022207999E12, noCFSRatio=0.5423337188511159
   [junit4]   2> 1654611 INFO  (coreLoadExecutor-6153-thread-3) [    x:collection5] o.a.s.u.CommitTracker Hard AutoCommit: disabled
   [junit4]   2> 1654611 INFO  (coreLoadExecutor-6153-thread-3) [    x:collection5] o.a.s.u.CommitTracker Soft AutoCommit: disabled
   [junit4]   2> 1654611 INFO  (coreLoadExecutor-6153-thread-3) [    x:collection5] o.a.s.u.RandomMergePolicy RandomMergePolicy wrapping class org.apache.lucene.index.TieredMergePolicy: [TieredMergePolicy: maxMergeAtOnce=14, maxMergeAtOnceExplicit=31, maxMergedSegmentMB=84.1455078125, floorSegmentMB=1.0986328125, forceMergeDeletesPctAllowed=1.8750330145486216, segmentsPerTier=11.0, maxCFSSegmentSizeMB=8.796093022207999E12, noCFSRatio=0.5423337188511159
   [junit4]   2> 1654611 INFO  (coreLoadExecutor-6153-thread-1) [    x:collection1] o.a.s.s.SolrIndexSearcher Opening [Searcher@52ab12a5[collection1] main]
   [junit4]   2> 1654611 INFO  (coreLoadExecutor-6153-thread-3) [    x:collection5] o.a.s.s.SolrIndexSearcher Opening [Searcher@602febc8[collection5] main]
   [junit4]   2> 1654611 INFO  (coreLoadExecutor-6153-thread-3) [    x:collection5] o.a.s.r.ManagedResourceStorage File-based storage initialized to use dir: /export/home/jenkins/workspace/Lucene-Solr-master-Solaris/solr/build/solr-core/test/J0/temp/solr.core.TestLazyCores_CE1D01E22C0FF0-001/tempDir-001/collection5/conf
   [junit4]   2> 1654611 INFO  (coreLoadExecutor-6153-thread-1) [    x:collection1] o.a.s.r.ManagedResourceStorage File-based storage initialized to use dir: /export/home/jenkins/workspace/Lucene-Solr-master-Solaris/solr/build/solr-core/test/J0/temp/solr.core.TestLazyCores_CE1D01E22C0FF0-001/tempDir-001/collection1/conf
   [junit4]   2> 1654612 INFO  (coreLoadExecutor-6153-thread-3) [    x:collection5] o.a.s.h.ReplicationHandler Commits will be reserved for  10000
   [junit4]   2> 1654612 INFO  (coreLoadExecutor-6153-thread-1) [    x:collection1] o.a.s.h.ReplicationHandler Commits will be reserved for  10000
   [junit4]   2> 1654612 INFO  (searcherExecutor-6154-thread-1-processing-x:collection1) [    x:collection1] o.a.s.c.SolrCore [collection1] Registered new searcher Searcher@52ab12a5[collection1] main{ExitableDirectoryReader(UninvertingDirectoryReader())}
   [junit4]   2> 1654612 INFO  (searcherExecutor-6155-thread-1-processing-x:collection5) [    x:collection5] o.a.s.c.SolrCore [collection5] Registered new searcher Searcher@602febc8[collection5] main{ExitableDirectoryReader(UninvertingDirectoryReader())}
   [junit4]   2> 1654618 INFO  (coreLoadExecutor-6153-thread-2) [    ] o.a.s.s.IndexSchema Loaded schema tiny/1.1 with uniqueid field id
   [junit4]   2> 1654619 INFO  (coreLoadExecutor-6153-thread-2) [    ] o.a.s.c.CoreContainer Creating SolrCore 'collection2' using configuration from instancedir /export/home/jenkins/workspace/Lucene-Solr-master-Solaris/solr/build/solr-core/test/J0/temp/solr.core.TestLazyCores_CE1D01E22C0FF0-001/tempDir-001/collection2
   [junit4]   2> 1654620 INFO  (coreLoadExecutor-6153-thread-2) [    x:collection2] o.a.s.c.SolrCore [[collection2] ] Opening new SolrCore at [/export/home/jenkins/workspace/Lucene-Solr-master-Solaris/solr/build/solr-core/test/J0/temp/solr.core.TestLazyCores_CE1D01E22C0FF0-001/tempDir-001/collection2], dataDir=[/export/home/jenkins/workspace/Lucene-Solr-master-Solaris/solr/build/solr-core/test/J0/temp/solr.core.TestLazyCores_CE1D01E22C0FF0-001/tempDir-001/collection2/data/]
   [junit4]   2> 1654620 INFO  (coreLoadExecutor-6153-thread-2) [    x:collection2] o.a.s.u.RandomMergePolicy RandomMergePolicy wrapping class org.apache.lucene.index.LogDocMergePolicy: [LogDocMergePolicy: minMergeSize=1000, mergeFactor=17, maxMergeSize=9223372036854775807, maxMergeSizeForForcedMerge=9223372036854775807, calibrateSizeByDeletes=false, maxMergeDocs=2147483647, maxCFSSegmentSizeMB=8.796093022207999E12, noCFSRatio=0.5794747768530669]
   [junit4]   2> 1654628 INFO  (coreLoadExecutor-6153-thread-2) [    x:collection2] o.a.s.u.CommitTracker Hard AutoCommit: disabled
   [junit4]   2> 1654628 INFO  (coreLoadExecutor-6153-thread-2) [    x:collection2] o.a.s.u.CommitTracker Soft AutoCommit: disabled
   [junit4]   2> 1654629 INFO  (coreLoadExecutor-6153-thread-2) [    x:collection2] o.a.s.u.RandomMergePolicy RandomMergePolicy wrapping class org.apache.lucene.index.TieredMergePolicy: [TieredMergePolicy: maxMergeAtOnce=14, maxMergeAtOnceExplicit=31, maxMergedSegmentMB=84.1455078125, floorSegmentMB=1.0986328125, forceMergeDeletesPctAllowed=1.8750330145486216, segmentsPerTier=11.0, maxCFSSegmentSizeMB=8.796093022207999E12, noCFSRatio=0.5423337188511159
   [junit4]   2> 1654629 INFO  (coreLoadExecutor-6153-thread-2) [    x:collection2] o.a.s.s.SolrIndexSearcher Opening [Searcher@4619639d[collection2] main]
   [junit4]   2> 1654629 INFO  (coreLoadExecutor-6153-thread-2) [    x:collection2] o.a.s.r.ManagedResourceStorage File-based storage initialized to use dir: /export/home/jenkins/workspace/Lucene-Solr-master-Solaris/solr/build/solr-core/test/J0/temp/solr.core.TestLazyCores_CE1D01E22C0FF0-001/tempDir-001/collection2/conf
   [junit4]   2> 1654629 INFO  (coreLoadExecutor-6153-thread-2) [    x:collection2] o.a.s.h.ReplicationHandler Commits will be reserved for  10000
   [junit4]   2> 1654629 INFO  (searcherExecutor-6162-thread-1-processing-x:collection2) [    x:collection2] o.a.s.c.SolrCore [collection2] Registered new searcher Searcher@4619639d[collection2] main{ExitableDirectoryReader(UninvertingDirectoryReader())}
   [junit4]   2> 1654630 INFO  (coreLoadExecutor-6153-thread-2) [    x:collection2] o.a.s.c.SolrCores Opening transient core collection2
   [junit4]   2> 1654637 INFO  (TEST-TestLazyCores.testLazySearch-seed#[CE1D01E22C0FF0]) [    ] o.a.s.c.SolrConfig Using Lucene MatchVersion: 7.0.0
   [junit4]   2> 1654647 INFO  (TEST-TestLazyCores.testLazySearch-seed#[CE1D01E22C0FF0]) [    ] o.a.s.s.IndexSchema [collection4] Schema name=tiny
   [junit4]   2> 1654649 INFO  (TEST-TestLazyCores.testLazySearch-seed#[CE1D01E22C0FF0]) [    ] o.a.s.s.IndexSchema Loaded schema tiny/1.1 with uniqueid field id
   [junit4]   2> 1654650 INFO  (TEST-TestLazyCores.testLazySearch-seed#[CE1D01E22C0FF0]) [    ] o.a.s.c.CoreContainer Creating SolrCore 'collection4' using configuration from instancedir /export/home/jenkins/workspace/Lucene-Solr-master-Solaris/solr/build/solr-core/test/J0/temp/solr.core.TestLazyCores_CE1D01E22C0FF0-001/tempDir-001/collection4
   [junit4]   2> 1654651 INFO  (TEST-TestLazyCores.testLazySearch-seed#[CE1D01E22C0FF0]) [    x:collection4] o.a.s.c.SolrCore [[collection4] ] Opening new SolrCore at [/export/home/jenkins/workspace/Lucene-Solr-master-Solaris/solr/build/solr-core/test/J0/temp/solr.core.TestLazyCores_CE1D01E22C0FF0-001/tempDir-001/collection4], dataDir=[/export/home/jenkins/workspace/Lucene-Solr-master-Solaris/solr/build/solr-core/test/J0/temp/solr.core.TestLazyCores_CE1D01E22C0FF0-001/tempDir-001/collection4/data/]
   [junit4]   2> 1654652 INFO  (TEST-TestLazyCores.testLazySearch-seed#[CE1D01E22C0FF0]) [    x:collection4] o.a.s.u.RandomMergePolicy RandomMergePolicy wrapping class org.apache.lucene.index.LogDocMergePolicy: [LogDocMergePolicy: minMergeSize=1000, mergeFactor=27, maxMergeSize=9223372036854775807, maxMergeSizeForForcedMerge=9223372036854775807, calibrateSizeByDeletes=false, maxMergeDocs=2147483647, maxCFSSegmentSizeMB=8.796093022207999E12, noCFSRatio=0.0]
   [junit4]   2> 1654659 INFO  (TEST-TestLazyCores.testLazySearch-seed#[CE1D01E22C0FF0]) [    x:collection4] o.a.s.u.CommitTracker Hard AutoCommit: disabled
   [junit4]   2> 1654659 INFO  (TEST-TestLazyCores.testLazySearch-seed#[CE1D01E22C0FF0]) [    x:collection4] o.a.s.u.CommitTracker Soft AutoCommit: disabled
   [junit4]   2> 1654659 INFO  (TEST-TestLazyCores.testLazySearch-seed#[CE1D01E22C0FF0]) [    x:collection4] o.a.s.u.RandomMergePolicy RandomMergePolicy wrapping class org.apache.lucene.index.TieredMergePolicy: [TieredMergePolicy: maxMergeAtOnce=32, maxMergeAtOnceExplicit=15, maxMergedSegmentMB=50.70703125, floorSegmentMB=1.4794921875, forceMergeDeletesPctAllowed=15.849105699686323, segmentsPerTier=48.0, maxCFSSegmentSizeMB=8.796093022207999E12, noCFSRatio=1.0
   [junit4]   2> 1654660 INFO  (TEST-TestLazyCores.testLazySearch-seed#[CE1D01E22C0FF0]) [    x:collection4] o.a.s.s.SolrIndexSearcher Opening [Searcher@3e2f1317[collection4] main]
   [junit4]   2> 1654660 INFO  (TEST-TestLazyCores.testLazySearch-seed#[CE1D01E22C0FF0]) [    x:collection4] o.a.s.r.ManagedResourceStorage File-based storage initialized to use dir: /export/home/jenkins/workspace/Lucene-Solr-master-Solaris/solr/build/solr-core/test/J0/temp/solr.core.TestLazyCores_CE1D01E22C0FF0-001/tempDir-001/collection4/conf
   [junit4]   2> 1654660 INFO  (TEST-TestLazyCores.testLazySearch-seed#[CE1D01E22C0FF0]) [    x:collection4] o.a.s.h.ReplicationHandler Commits will be reserved for  10000
   [junit4]   2> 1654660 INFO  (searcherExecutor-6166-thread-1-processing-x:collection4) [    x:collection4] o.a.s.c.SolrCore [collection4] Registered new searcher Searcher@3e2f1317[collection4] main{ExitableDirectoryReader(UninvertingDirectoryReader())}
   [junit4]   2> 1654661 INFO  (TEST-TestLazyCores.testLazySearch-seed#[CE1D01E22C0FF0]) [    x:collection4] o.a.s.u.DirectUpdateHandler2 start commit{,optimize=false,openSearcher=true,waitSearcher=true,expungeDeletes=false,softCommit=false,prepareCommit=false}
   [junit4]   2> 1654661 INFO  (TEST-TestLazyCores.testLazySearch-seed#[CE1D01E22C0FF0]) [    x:collection4] o.a.s.u.SolrIndexWriter Calling setCommitData with IW:org.apache.solr.update.SolrIndexWriter@2525ae1d
   [junit4]   2> 1654664 INFO  (TEST-TestLazyCores.testLazySearch-seed#[CE1D01E22C0FF0]) [    x:collection4] o.a.s.s.SolrIndexSearcher Opening [Searcher@4532d68c[collection4] main]
   [junit4]   2> 1654664 INFO  (TEST-TestLazyCores.testLazySearch-seed#[CE1D01E22C0FF0]) [    x:collection4] o.a.s.u.DirectUpdateHandler2 end_commit_flush
   [junit4]   2> 1654664 INFO  (searcherExecutor-6166-thread-1-processing-x:collection4) [    x:collection4] o.a.s.c.SolrCore [collection4] Registered new searcher Searcher@4532d68c[collection4] main{ExitableDirectoryReader(UninvertingDirectoryReader(Uninverting(_0(7.0.0):C7)))}
   [junit4]   2> 1654665 INFO  (TEST-TestLazyCores.testLazySearch-seed#[CE1D01E22C0FF0]) [    x:collection4] o.a.s.c.S.Request [collection4]  webapp=null path=null params={q={!prefix+f%3Dv_t}hel&wt=xml} hits=2 status=0 QTime=0
   [junit4]   2> 1654668 INFO  (TEST-TestLazyCores.testLazySearch-seed#[CE1D01E22C0FF0]) [    x:collection4] o.a.s.c.S.Request [collection4]  webapp=null path=null params={q={!raw+f%3Dv_t}hello&wt=xml} hits=2 status=0 QTime=0
   [junit4]   2> 1654668 INFO  (TEST-TestLazyCores.testLazySearch-seed#[CE1D01E22C0FF0]) [    x:collection4] o.a.s.c.S.Request [collection4]  webapp=null path=null params={q={!raw+f%3Dv_t}Hello&wt=xml} hits=0 status=0 QTime=0
   [junit4]   2> 1654668 INFO  (TEST-TestLazyCores.testLazySearch-seed#[CE1D01E22C0FF0]) [    x:collection4] o.a.s.c.S.Request [collection4]  webapp=null path=null params={q={!raw+f%3Dv_f}1.5&wt=xml} hits=0 status=0 QTime=0
   [junit4]   2> 1654669 INFO  (TEST-TestLazyCores.testLazySearch-seed#[CE1D01E22C0FF0]) [    x:collection4] o.a.s.c.S.Request [collection1]  webapp=null path=null params={q={!raw+f%3Dv_t}hello&wt=xml} hits=0 status=0 QTime=0
   [junit4]   2> 1654669 INFO  (TEST-TestLazyCores.testLazySearch-seed#[CE1D01E22C0FF0]) [    x:collection4] o.a.s.c.CoreContainer Shutting down CoreContainer instance=443457003
   [junit4]   2> 1654672 INFO  (coreCloseExecutor-6170-thread-1-processing-x:collection4) [    x:collection5] o.a.s.c.SolrCore [collection5]  CLOSING SolrCore org.apache.solr.core.SolrCore@14161e37
   [junit4]   2> 1654673 INFO  (coreCloseExecutor-6170-thread-4-processing-x:collection4) [    x:collection2] o.a.s.c.SolrCore [collection2]  CLOSING SolrCore org.apache.solr.core.SolrCore@7ab8392
   [junit4]   2> 1654684 INFO  (coreCloseExecutor-6170-thread-3-processing-x:collection4) [    x:collection4] o.a.s.c.SolrCore [collection4]  CLOSING SolrCore org.apache.solr.core.SolrCore@51da20c3
   [junit4]   2> 1654695 INFO  (coreCloseExecutor-6170-thread-2-processing-x:collection4) [    x:collection1] o.a.s.c.SolrCore [collection1]  CLOSING SolrCore org.apache.solr.core.SolrCore@2747d547
   [junit4]   2> 1654696 INFO  (TEST-TestLazyCores.testLazySearch-seed#[CE1D01E22C0FF0]) [    x:collection4] o.a.s.SolrTestCaseJ4 ###Ending testLazySearch
   [junit4]   2> 1654697 INFO  (TEST-TestLazyCores.testCachingLimit-seed#[CE1D01E22C0FF0]) [    x:collection4] o.a.s.SolrTestCaseJ4 ###Starting testCachingLimit
   [junit4]   2> 1654719 INFO  (TEST-TestLazyCores.testCachingLimit-seed#[CE1D01E22C0FF0]) [    x:collection4] o.a.s.c.SolrCores Allocating transient cache for 4 transient cores
   [junit4]   2> 1654746 INFO  (coreLoadExecutor-6177-thread-2-processing-x:collection4) [    x:collection4] o.a.s.c.SolrConfig Using Lucene MatchVersion: 7.0.0
   [junit4]   2> 1654746 INFO  (coreLoadExecutor-6177-thread-3-processing-x:collection4) [    x:collection4] o.a.s.c.SolrConfig Using Lucene MatchVersion: 7.0.0
   [junit4]   2> 1654746 INFO  (coreLoadExecutor-6177-thread-1-processing-x:collection4) [    x:collection4] o.a.s.c.SolrConfig Using Lucene MatchVersion: 7.0.0
   [junit4]   2> 1654770 INFO  (coreLoadExecutor-6177-thread-3-processing-x:collection4) [    x:collection4] o.a.s.s.IndexSchema [collection5] Schema name=tiny
   [junit4]   2> 1654770 INFO  (coreLoadExecutor-6177-thread-1-processing-x:collection4) [    x:collection4] o.a.s.s.IndexSchema [collection1] Schema name=tiny
   [junit4]   2> 1654775 INFO  (coreLoadExecutor-6177-thread-1-processing-x:collection4) [    x:collection4] o.a.s.s.IndexSchema Loaded schema tiny/1.1 with uniqueid field id
   [junit4]   2> 1654776 INFO  (coreLoadExecutor-6177-thread-1-processing-x:collection4) [    x:collection4] o.a.s.c.CoreContainer Creating SolrCore 'collection1' using configuration from instancedir /export/home/jenkins/workspace/Lucene-Solr-master-Solaris/solr/build/solr-core/test/J0/temp/solr.core.TestLazyCores_CE1D01E22C0FF0-001/tempDir-002/collection1
   [junit4]   2> 1654777 INFO  (coreLoadExecutor-6177-thread-1-processing-x:collection4) [    x:collection1] o.a.s.c.SolrCore [[collection1] ] Opening new SolrCore at [/export/home/jenkins/workspace/Lucene-Solr-master-Solaris/solr/build/solr-core/test/J0/temp/solr.core.TestLazyCores_CE1D01E22C0FF0-001/tempDir-002/collection1], dataDir=[/export/home/jenkins/workspace/Lucene-Solr-master-Solaris/solr/build/solr-core/test/J0/temp/solr.core.TestLazyCores_CE1D01E22C0FF0-001/tempDir-002/collection1/data/]
   [junit4]   2> 1654777 INFO  (coreLoadExecutor-6177-thread-1-processing-x:collection4) [    x:collection1] o.a.s.u.RandomMergePolicy RandomMergePolicy wrapping class org.apache.lucene.index.LogDocMergePolicy: [LogDocMergePolicy: minMergeSize=1000, mergeFactor=17, maxMergeSize=9223372036854775807, maxMergeSizeForForcedMerge=9223372036854775807, calibrateSizeByDeletes=false, maxMergeDocs=2147483647, maxCFSSegmentSizeMB=8.796093022207999E12, noCFSRatio=0.5794747768530669]
   [junit4]   2> 1654785 INFO  (coreLoadExecutor-6177-thread-2-processing-x:collection4) [    x:collection4] o.a.s.s.IndexSchema [collection2] Schema name=tiny
   [junit4]   2> 1654788 INFO  (coreLoadExecutor-6177-thread-2-processing-x:collection4) [    x:collection4] o.a.s.s.IndexSchema Loaded schema tiny/1.1 with uniqueid field id
   [junit4]   2> 1654789 INFO  (coreLoadExecutor-6177-thread-2-processing-x:collection4) [    x:collection4] o.a.s.c.CoreContainer Creating SolrCore 'collection2' using configuration from instancedir /export/home/jenkins/workspace/Lucene-Solr-master-Solaris/solr/build/solr-core/test/J0/temp/solr.core.TestLazyCores_CE1D01E22C0FF0-001/tempDir-002/collection2
   [junit4]   2> 1654789 INFO  (coreLoadExecutor-6177-thread-2-processing-x:collection4) [    x:collection2] o.a.s.c.SolrCore [[collection2] ] Opening new SolrCore at [/export/home/jenkins/workspace/Lucene-Solr-master-Solaris/solr/build/solr-core/test/J0/temp/solr.core.TestLazyCores_CE1D01E22C0FF0-001/tempDir-002/collection2], dataDir=[/export/home/jenkins/workspace/Lucene-Solr-master-Solaris/solr/build/solr-core/test/J0/temp/solr.core.TestLazyCores_CE1D01E22C0FF0-001/tempDir-002/collection2/data/]
   [junit4]   2> 1654795 INFO  (coreLoadExecutor-6177-thread-1-processing-x:collection4) [    x:collection1] o.a.s.u.CommitTracker Hard AutoCommit: disabled
   [junit4]   2> 1654795 INFO  (coreLoadExecutor-6177-thread-1-processing-x:collection4) [    x:collection1] o.a.s.u.CommitTracker Soft AutoCommit: disabled
   [junit4]   2> 1654795 INFO  (coreLoadExecutor-6177-thread-1-processing-x:collection4) [    x:collection1] o.a.s.u.RandomMergePolicy RandomMergePolicy wrapping class org.apache.lucene.index.TieredMergePolicy: [TieredMergePolicy: maxMergeAtOnce=14, maxMergeAtOnceExplicit=31, maxMergedSegmentMB=84.1455078125, floorSegmentMB=1.0986328125, forceMergeDeletesPctAllowed=1.8750330145486216, segmentsPerTier=11.0, maxCFSSegmentSizeMB=8.796093022207999E12, noCFSRatio=0.5423337188511159
   [junit4]   2> 1654795 INFO  (coreLoadExecutor-6177-thread-1-processing-x:collection4) [    x:collection1] o.a.s.s.SolrIndexSearcher Opening [Searcher@6745a2cd[collection1] main]
   [junit4]   2> 1654795 INFO  (coreLoadExecutor-6177-thread-1-processing-x:collection4) [    x:collection1] o.a.s.r.ManagedResourceStorage File-based storage initialized to use dir: /export/home/jenkins/workspace/Lucene-Solr-master-Solaris/solr/build/solr-core/test/J0/temp/solr.core.TestLazyCores_CE1D01E22C0FF0-001/tempDir-002/collection1/conf
   [junit4]   2> 1654795 INFO  (coreLoadExecutor-6177-thread-1-processing-x:collection4) [    x:collection1] o.a.s.h.ReplicationHandler Commits will be reserved for  10000
   [junit4]   2> 1654796 INFO  (searcherExecutor-6178-thread-1-processing-x:collection1) [    x:collection1] o.a.s.c.SolrCore [collection1] Registered new searcher Searcher@6745a2cd[collection1] main{ExitableDirectoryReader(UninvertingDirectoryReader())}
   [junit4]   2> 1654796 INFO  (coreLoadExecutor-6177-thread-2-processing-x:collection4) [    x:collection2] o.a.s.u.RandomMergePolicy RandomMergePolicy wrapping class org.apache.lucene.index.LogDocMergePolicy: [LogDocMergePolicy: minMergeSize=1000, mergeFactor=17, maxMergeSize=9223372036854775807, maxMergeSizeForForcedMerge=9223372036854775807, calibrateSizeByDeletes=false, maxMergeDocs=2147483647, maxCFSSegmentSizeMB=8.796093022207999E12, noCFSRatio=0.5794747768530669]
   [junit4]   2> 1654818 INFO  (coreLoadExecutor-6177-thread-3-processing-x:collection4) [    x:collection4] o.a.s.s.IndexSchema Loaded schema tiny/1.1 with uniqueid field id
   [junit4]   2> 1654830 INFO  (coreLoadExecutor-6177-thread-3-processing-x:collection4) [    x:collection4] o.a.s.c.CoreContainer Creating SolrCore 'collection5' using configuration from instancedir /export/home/jenkins/workspace/Lucene-Solr-master-Solaris/solr/build/solr-core/test/J0/temp/solr.core.TestLazyCores_CE1D01E22C0FF0-001/tempDir-002/collection5
   [junit4]   2> 1654831 INFO  (coreLoadExecutor-6177-thread-3-processing-x:collection4) [    x:collection5] o.a.s.c.SolrCore [[collection5] ] Opening new SolrCore at [/export/home/jenkins/workspace/Lucene-Solr-master-Solaris/solr/build/solr-core/test/J0/temp/solr.core.TestLazyCores_CE1D01E22C0FF0-001/tempDir-002/collection5], dataDir=[/export/home/jenkins/workspace/Lucene-Solr-master-Solaris/solr/build/solr-core/test/J0/temp/solr.core.TestLazyCores_CE1D01E22C0FF0-001/tempDir-002/collection5/data/]
   [junit4]   2> 1654859 INFO  (coreLoadExecutor-6177-thread-3-processing-x:collection4) [    x:collection5] o.a.s.u.RandomMergePolicy RandomMergePolicy wrapping class org.apache.lucene.index.LogDocMergePolicy: [LogDocMergePolicy: minMergeSize=1000, mergeFactor=17, maxMergeSize=9223372036854775807, maxMergeSizeForForcedMerge=9223372036854775807, calibrateSizeByDeletes=false, maxMergeDocs=2147483647, maxCFSSegmentSizeMB=8.796093022207999E12, noCFSRatio=0.5794747768530669]
   [junit4]   2> 1654875 INFO  (coreLoadExecutor-6177-thread-2-processing-x:collection4) [    x:collection2] o.a.s.u.CommitTracker Hard AutoCommit: disabled
   [junit4]   2> 1654875 INFO  (coreLoadExecutor-6177-thread-2-processing-x:collection4) [    x:collection2] o.a.s.u.CommitTracker Soft AutoCommit: disabled
   [junit4]   2> 1654875 INFO  (coreLoadExecutor-6177-thread-2-processing-x:collection4) [    x:collection2] o.a.s.u.RandomMergePolicy RandomMergePolicy wrapping class org.apache.lucene.index.TieredMergePolicy: [TieredMergePolicy: maxMergeAtOnce=14, maxMergeAtOnceExplicit=31, maxMergedSegmentMB=84.1455078125, floorSegmentMB=1.0986328125, forceMergeDeletesPctAllowed=1.8750330145486216, segmentsPerTier=11.0, maxCFSSegmentSizeMB=8.796093022207999E12, noCFSRatio=0.5423337188511159
   [junit4]   2> 1654875 INFO  (coreLoadExecutor-6177-thread-2-processing-x:collection4) [    x:collection2] o.a.s.s.SolrIndexSearcher Opening [Searcher@39ae018d[collection2] main]
   [junit4]   2> 1654876 INFO  (coreLoadExecutor-6177-thread-2-processing-x:collection4) [    x:collection2] o.a.s.r.ManagedResourceStorage File-based storage initialized to use dir: /export/home/jenkins/workspace/Lucene-Solr-master-Solaris/solr/build/solr-core/test/J0/temp/solr.core.TestLazyCores_CE1D01E22C0FF0-001/tempDir-002/collection2/conf
   [junit4]   2> 1654876 INFO  (coreLoadExecutor-6177-thread-2-processing-x:collection4) [    x:collection2] o.a.s.h.ReplicationHandler Commits will be reserved for  10000
   [junit4]   2> 1654876 INFO  (coreLoadExecutor-6177-thread-2-processing-x:collection4) [    x:collection2] o.a.s.c.SolrCores Opening transient core collection2
   [junit4]   2> 1654876 INFO  (searcherExecutor-6179-thread-1-processing-x:collection2) [    x:collection2] o.a.s.c.SolrCore [collection2] Registered new searcher Searcher@39ae018d[collection2] main{ExitableDirectoryReader(UninvertingDirectoryReader())}
   [junit4]   2> 1654889 INFO  (coreLoadExecutor-6177-thread-3-processing-x:collection4) [    x:collection5] o.a.s.u.CommitTracker Hard AutoCommit: disabled
   [junit4]   2> 1654890 INFO  (coreLoadExecutor-6177-thread-3-processing-x:collection4) [    x:collection5] o.a.s.u.CommitTracker Soft AutoCommit: disabled
   [junit4]   2> 1654890 INFO  (coreLoadExecutor-6177-thread-3-processing-x:collection4) [    x:collection5] o.a.s.u.RandomMergePolicy RandomMergePolicy wrapping class org.apache.lucene.index.TieredMergePolicy: [TieredMergePolicy: maxMergeAtOnce=14, maxMergeAtOnceExplicit=31, maxMergedSegmentMB=84.1455078125, floorSegmentMB=1.0986328125, forceMergeDeletesPctAllowed=1.8750330145486216, segmentsPerTier=11.0, maxCFSSegmentSizeMB=8.796093022207999E12, noCFSRatio=0.5423337188511159
   [junit4]   2> 1654890 INFO  (coreLoadExecutor-6177-thread-3-processing-x:collection4) [    x:collection5] o.a.s.s.SolrIndexSearcher O

[...truncated too long message...]

 PrimUtilsTest, DeleteReplicaTest, ZkNodePropsTest, TestXIncludeConfig, HdfsChaosMonkeyNothingIsSafeTest, TestHighlightDedupGrouping, TestUseDocValuesAsStored2, TestFastLRUCache, DistributedQueryComponentCustomSortTest, TestSortByMinMaxFunction, TestSearcherReuse, TestTolerantSearch, TestGroupingSearch, DirectUpdateHandlerTest, TestSubQueryTransformerCrossCore, OverseerCollectionConfigSetProcessorTest, MBeansHandlerTest, FastVectorHighlighterTest, CustomCollectionTest, OutOfBoxZkACLAndCredentialsProvidersTest, TestConfigSetProperties, DateRangeFieldTest, TestMaxScoreQueryParser, TestReplicaProperties, SyncSliceTest, AlternateDirectoryTest, TestBinaryResponseWriter, TestCloudRecovery, BlockJoinFacetDistribTest, TestDistributedSearch, TestPseudoReturnFields, BlockCacheTest, StressHdfsTest, TestGraphMLResponseWriter, BaseCdcrDistributedZkTest, MoreLikeThisHandlerTest, BasicDistributedZkTest, ChaosMonkeySafeLeaderTest, UnloadDistributedZkTest, OverseerTest, TestReplicationHandler, ZkCLITest, DistributedSpellCheckComponentTest, TestStressReorder, TestReload, DistributedTermsComponentTest, SolrCmdDistributorTest, BadIndexSchemaTest, TestSort, TestLazyCores]
   [junit4]   2> NOTE: reproduce with: ant test  -Dtestcase=TestLazyCores -Dtests.seed=CE1D01E22C0FF0 -Dtests.slow=true -Dtests.locale=lt-LT -Dtests.timezone=Antarctica/Palmer -Dtests.asserts=true -Dtests.file.encoding=UTF-8
   [junit4] ERROR   0.00s J0 | TestLazyCores (suite) <<<
   [junit4]    > Throwable #1: java.lang.AssertionError: ObjectTracker found 5 object(s) that were not released!!! [MockDirectoryWrapper, MockDirectoryWrapper, SolrCore, MDCAwareThreadPoolExecutor, MockDirectoryWrapper]
   [junit4]    > org.apache.solr.common.util.ObjectReleaseTracker$ObjectTrackerException
   [junit4]    > 	at org.apache.solr.common.util.ObjectReleaseTracker.track(ObjectReleaseTracker.java:43)
   [junit4]    > 	at org.apache.solr.core.CachingDirectoryFactory.get(CachingDirectoryFactory.java:347)
   [junit4]    > 	at org.apache.solr.core.SolrCore.initSnapshotMetaDataManager(SolrCore.java:433)
   [junit4]    > 	at org.apache.solr.core.SolrCore.<init>(SolrCore.java:858)
   [junit4]    > 	at org.apache.solr.core.SolrCore.<init>(SolrCore.java:792)
   [junit4]    > 	at org.apache.solr.core.CoreContainer.create(CoreContainer.java:868)
   [junit4]    > 	at org.apache.solr.core.CoreContainer.lambda$load$0(CoreContainer.java:517)
   [junit4]    > 	at java.util.concurrent.FutureTask.run(FutureTask.java:266)
   [junit4]    > 	at org.apache.solr.common.util.ExecutorUtil$MDCAwareThreadPoolExecutor.lambda$execute$0(ExecutorUtil.java:229)
   [junit4]    > 	at java.util.concurrent.ThreadPoolExecutor.runWorker(ThreadPoolExecutor.java:1142)
   [junit4]    > 	at java.util.concurrent.ThreadPoolExecutor$Worker.run(ThreadPoolExecutor.java:617)
   [junit4]    > 	at java.lang.Thread.run(Thread.java:745)
   [junit4]    > org.apache.solr.common.util.ObjectReleaseTracker$ObjectTrackerException
   [junit4]    > 	at org.apache.solr.common.util.ObjectReleaseTracker.track(ObjectReleaseTracker.java:43)
   [junit4]    > 	at org.apache.solr.core.CachingDirectoryFactory.get(CachingDirectoryFactory.java:347)
   [junit4]    > 	at org.apache.solr.core.SolrCore.getNewIndexDir(SolrCore.java:331)
   [junit4]    > 	at org.apache.solr.core.SolrCore.initIndex(SolrCore.java:658)
   [junit4]    > 	at org.apache.solr.core.SolrCore.<init>(SolrCore.java:864)
   [junit4]    > 	at org.apache.solr.core.SolrCore.<init>(SolrCore.java:792)
   [junit4]    > 	at org.apache.solr.core.CoreContainer.create(CoreContainer.java:868)
   [junit4]    > 	at org.apache.solr.core.CoreContainer.lambda$load$0(CoreContainer.java:517)
   [junit4]    > 	at java.util.concurrent.FutureTask.run(FutureTask.java:266)
   [junit4]    > 	at org.apache.solr.common.util.ExecutorUtil$MDCAwareThreadPoolExecutor.lambda$execute$0(ExecutorUtil.java:229)
   [junit4]    > 	at java.util.concurrent.ThreadPoolExecutor.runWorker(ThreadPoolExecutor.java:1142)
   [junit4]    > 	at java.util.concurrent.ThreadPoolExecutor$Worker.run(ThreadPoolExecutor.java:617)
   [junit4]    > 	at java.lang.Thread.run(Thread.java:745)
   [junit4]    > org.apache.solr.common.util.ObjectReleaseTracker$ObjectTrackerException
   [junit4]    > 	at org.apache.solr.common.util.ObjectReleaseTracker.track(ObjectReleaseTracker.java:43)
   [junit4]    > 	at org.apache.solr.core.SolrCore.<init>(SolrCore.java:954)
   [junit4]    > 	at org.apache.solr.core.SolrCore.<init>(SolrCore.java:792)
   [junit4]    > 	at org.apache.solr.core.CoreContainer.create(CoreContainer.java:868)
   [junit4]    > 	at org.apache.solr.core.CoreContainer.lambda$load$0(CoreContainer.java:517)
   [junit4]    > 	at java.util.concurrent.FutureTask.run(FutureTask.java:266)
   [junit4]    > 	at org.apache.solr.common.util.ExecutorUtil$MDCAwareThreadPoolExecutor.lambda$execute$0(ExecutorUtil.java:229)
   [junit4]    > 	at java.util.concurrent.ThreadPoolExecutor.runWorker(ThreadPoolExecutor.java:1142)
   [junit4]    > 	at java.util.concurrent.ThreadPoolExecutor$Worker.run(ThreadPoolExecutor.java:617)
   [junit4]    > 	at java.lang.Thread.run(Thread.java:745)
   [junit4]    > org.apache.solr.common.util.ObjectReleaseTracker$ObjectTrackerException
   [junit4]    > 	at org.apache.solr.common.util.ObjectReleaseTracker.track(ObjectReleaseTracker.java:43)
   [junit4]    > 	at org.apache.solr.core.SolrCore.<init>(SolrCore.java:815)
   [junit4]    > 	at org.apache.solr.core.SolrCore.<init>(SolrCore.java:792)
   [junit4]    > 	at org.apache.solr.core.CoreContainer.create(CoreContainer.java:868)
   [junit4]    > 	at org.apache.solr.core.CoreContainer.lambda$load$0(CoreContainer.java:517)
   [junit4]    > 	at java.util.concurrent.FutureTask.run(FutureTask.java:266)
   [junit4]    > 	at org.apache.solr.common.util.ExecutorUtil$MDCAwareThreadPoolExecutor.lambda$execute$0(ExecutorUtil.java:229)
   [junit4]    > 	at java.util.concurrent.ThreadPoolExecutor.runWorker(ThreadPoolExecutor.java:1142)
   [junit4]    > 	at java.util.concurrent.ThreadPoolExecutor$Worker.run(ThreadPoolExecutor.java:617)
   [junit4]    > 	at java.lang.Thread.run(Thread.java:745)
   [junit4]    > org.apache.solr.common.util.ObjectReleaseTracker$ObjectTrackerException
   [junit4]    > 	at org.apache.solr.common.util.ObjectReleaseTracker.track(ObjectReleaseTracker.java:43)
   [junit4]    > 	at org.apache.solr.core.CachingDirectoryFactory.get(CachingDirectoryFactory.java:347)
   [junit4]    > 	at org.apache.solr.update.SolrIndexWriter.create(SolrIndexWriter.java:66)
   [junit4]    > 	at org.apache.solr.core.SolrCore.initIndex(SolrCore.java:690)
   [junit4]    > 	at org.apache.solr.core.SolrCore.<init>(SolrCore.java:864)
   [junit4]    > 	at org.apache.solr.core.SolrCore.<init>(SolrCore.java:792)
   [junit4]    > 	at org.apache.solr.core.CoreContainer.create(CoreContainer.java:868)
   [junit4]    > 	at org.apache.solr.core.CoreContainer.lambda$load$0(CoreContainer.java:517)
   [junit4]    > 	at java.util.concurrent.FutureTask.run(FutureTask.java:266)
   [junit4]    > 	at org.apache.solr.common.util.ExecutorUtil$MDCAwareThreadPoolExecutor.lambda$execute$0(ExecutorUtil.java:229)
   [junit4]    > 	at java.util.concurrent.ThreadPoolExecutor.runWorker(ThreadPoolExecutor.java:1142)
   [junit4]    > 	at java.util.concurrent.ThreadPoolExecutor$Worker.run(ThreadPoolExecutor.java:617)
   [junit4]    > 	at java.lang.Thread.run(Thread.java:745)
   [junit4]    > 	at __randomizedtesting.SeedInfo.seed([CE1D01E22C0FF0]:0)
   [junit4]    > 	at org.apache.solr.SolrTestCaseJ4.teardownTestCases(SolrTestCaseJ4.java:266)
   [junit4]    > 	at java.lang.Thread.run(Thread.java:745)Throwable #2: com.carrotsearch.randomizedtesting.ThreadLeakError: 1 thread leaked from SUITE scope at org.apache.solr.core.TestLazyCores: 
   [junit4]    >    1) Thread[id=17031, name=searcherExecutor-6179-thread-1, state=WAITING, group=TGRP-TestLazyCores]
   [junit4]    >         at sun.misc.Unsafe.park(Native Method)
   [junit4]    >         at java.util.concurrent.locks.LockSupport.park(LockSupport.java:175)
   [junit4]    >         at java.util.concurrent.locks.AbstractQueuedSynchronizer$ConditionObject.await(AbstractQueuedSynchronizer.java:2039)
   [junit4]    >         at java.util.concurrent.LinkedBlockingQueue.take(LinkedBlockingQueue.java:442)
   [junit4]    >         at java.util.concurrent.ThreadPoolExecutor.getTask(ThreadPoolExecutor.java:1067)
   [junit4]    >         at java.util.concurrent.ThreadPoolExecutor.runWorker(ThreadPoolExecutor.java:1127)
   [junit4]    >         at java.util.concurrent.ThreadPoolExecutor$Worker.run(ThreadPoolExecutor.java:617)
   [junit4]    >         at java.lang.Thread.run(Thread.java:745)
   [junit4]    > 	at __randomizedtesting.SeedInfo.seed([CE1D01E22C0FF0]:0)Throwable #3: com.carrotsearch.randomizedtesting.ThreadLeakError: There are still zombie threads that couldn't be terminated:
   [junit4]    >    1) Thread[id=17031, name=searcherExecutor-6179-thread-1, state=WAITING, group=TGRP-TestLazyCores]
   [junit4]    >         at sun.misc.Unsafe.park(Native Method)
   [junit4]    >         at java.util.concurrent.locks.LockSupport.park(LockSupport.java:175)
   [junit4]    >         at java.util.concurrent.locks.AbstractQueuedSynchronizer$ConditionObject.await(AbstractQueuedSynchronizer.java:2039)
   [junit4]    >         at java.util.concurrent.LinkedBlockingQueue.take(LinkedBlockingQueue.java:442)
   [junit4]    >         at java.util.concurrent.ThreadPoolExecutor.getTask(ThreadPoolExecutor.java:1067)
   [junit4]    >         at java.util.concurrent.ThreadPoolExecutor.runWorker(ThreadPoolExecutor.java:1127)
   [junit4]    >         at java.util.concurrent.ThreadPoolExecutor$Worker.run(ThreadPoolExecutor.java:617)
   [junit4]    >         at java.lang.Thread.run(Thread.java:745)
   [junit4]    > 	at __randomizedtesting.SeedInfo.seed([CE1D01E22C0FF0]:0)
   [junit4] Completed [465/659 (2!)] on J0 in 181.88s, 8 tests, 1 failure, 2 errors <<< FAILURES!

[...truncated 63002 lines...]


Mime
View raw message