lucene-dev mailing list archives

Site index · List index
Message view « Date » · « Thread »
Top « Date » · « Thread »
From Policeman Jenkins Server <jenk...@thetaphi.de>
Subject [JENKINS-EA] Lucene-Solr-master-Linux (32bit/jdk-9-ea+147) - Build # 18568 - Still Unstable!
Date Mon, 19 Dec 2016 20:59:33 GMT
Build: https://jenkins.thetaphi.de/job/Lucene-Solr-master-Linux/18568/
Java: 32bit/jdk-9-ea+147 -client -XX:+UseParallelGC

2 tests failed.
FAILED:  junit.framework.TestSuite.org.apache.solr.security.hadoop.TestSolrCloudWithHadoopAuthPlugin

Error Message:
FIXME: SOLR-8182: This test fails under Java 9

Stack Trace:
com.carrotsearch.randomizedtesting.InternalAssumptionViolatedException: FIXME: SOLR-8182:
This test fails under Java 9
	at __randomizedtesting.SeedInfo.seed([C87E6BC58541BAA1]:0)
	at com.carrotsearch.randomizedtesting.RandomizedTest.assumeTrue(RandomizedTest.java:667)
	at com.carrotsearch.randomizedtesting.RandomizedTest.assumeFalse(RandomizedTest.java:675)
	at org.apache.lucene.util.LuceneTestCase.assumeFalse(LuceneTestCase.java:850)
	at org.apache.solr.security.hadoop.TestSolrCloudWithHadoopAuthPlugin.setupClass(TestSolrCloudWithHadoopAuthPlugin.java:45)
	at java.base/jdk.internal.reflect.NativeMethodAccessorImpl.invoke0(Native Method)
	at java.base/jdk.internal.reflect.NativeMethodAccessorImpl.invoke(NativeMethodAccessorImpl.java:62)
	at java.base/jdk.internal.reflect.DelegatingMethodAccessorImpl.invoke(DelegatingMethodAccessorImpl.java:43)
	at java.base/java.lang.reflect.Method.invoke(Method.java:538)
	at com.carrotsearch.randomizedtesting.RandomizedRunner.invoke(RandomizedRunner.java:1713)
	at com.carrotsearch.randomizedtesting.RandomizedRunner$6.evaluate(RandomizedRunner.java:847)
	at com.carrotsearch.randomizedtesting.RandomizedRunner$7.evaluate(RandomizedRunner.java:863)
	at com.carrotsearch.randomizedtesting.rules.StatementAdapter.evaluate(StatementAdapter.java:36)
	at com.carrotsearch.randomizedtesting.rules.SystemPropertiesRestoreRule$1.evaluate(SystemPropertiesRestoreRule.java:57)
	at org.apache.lucene.util.AbstractBeforeAfterRule$1.evaluate(AbstractBeforeAfterRule.java:45)
	at com.carrotsearch.randomizedtesting.rules.StatementAdapter.evaluate(StatementAdapter.java:36)
	at org.apache.lucene.util.TestRuleStoreClassName$1.evaluate(TestRuleStoreClassName.java:41)
	at com.carrotsearch.randomizedtesting.rules.NoShadowingOrOverridesOnMethodsRule$1.evaluate(NoShadowingOrOverridesOnMethodsRule.java:40)
	at com.carrotsearch.randomizedtesting.rules.NoShadowingOrOverridesOnMethodsRule$1.evaluate(NoShadowingOrOverridesOnMethodsRule.java:40)
	at com.carrotsearch.randomizedtesting.rules.StatementAdapter.evaluate(StatementAdapter.java:36)
	at com.carrotsearch.randomizedtesting.rules.StatementAdapter.evaluate(StatementAdapter.java:36)
	at com.carrotsearch.randomizedtesting.rules.StatementAdapter.evaluate(StatementAdapter.java:36)
	at org.apache.lucene.util.TestRuleAssertionsRequired$1.evaluate(TestRuleAssertionsRequired.java:53)
	at org.apache.lucene.util.TestRuleMarkFailure$1.evaluate(TestRuleMarkFailure.java:47)
	at org.apache.lucene.util.TestRuleIgnoreAfterMaxFailures$1.evaluate(TestRuleIgnoreAfterMaxFailures.java:64)
	at org.apache.lucene.util.TestRuleIgnoreTestSuites$1.evaluate(TestRuleIgnoreTestSuites.java:54)
	at com.carrotsearch.randomizedtesting.rules.StatementAdapter.evaluate(StatementAdapter.java:36)
	at com.carrotsearch.randomizedtesting.ThreadLeakControl$StatementRunner.run(ThreadLeakControl.java:367)
	at java.base/java.lang.Thread.run(Thread.java:844)


FAILED:  junit.framework.TestSuite.org.apache.solr.security.hadoop.TestSolrCloudWithHadoopAuthPlugin

Error Message:


Stack Trace:
java.lang.NullPointerException
	at __randomizedtesting.SeedInfo.seed([C87E6BC58541BAA1]:0)
	at org.apache.solr.security.hadoop.TestSolrCloudWithHadoopAuthPlugin.tearDownClass(TestSolrCloudWithHadoopAuthPlugin.java:62)
	at java.base/jdk.internal.reflect.NativeMethodAccessorImpl.invoke0(Native Method)
	at java.base/jdk.internal.reflect.NativeMethodAccessorImpl.invoke(NativeMethodAccessorImpl.java:62)
	at java.base/jdk.internal.reflect.DelegatingMethodAccessorImpl.invoke(DelegatingMethodAccessorImpl.java:43)
	at java.base/java.lang.reflect.Method.invoke(Method.java:538)
	at com.carrotsearch.randomizedtesting.RandomizedRunner.invoke(RandomizedRunner.java:1713)
	at com.carrotsearch.randomizedtesting.RandomizedRunner$7.evaluate(RandomizedRunner.java:870)
	at com.carrotsearch.randomizedtesting.rules.StatementAdapter.evaluate(StatementAdapter.java:36)
	at com.carrotsearch.randomizedtesting.rules.SystemPropertiesRestoreRule$1.evaluate(SystemPropertiesRestoreRule.java:57)
	at org.apache.lucene.util.AbstractBeforeAfterRule$1.evaluate(AbstractBeforeAfterRule.java:45)
	at com.carrotsearch.randomizedtesting.rules.StatementAdapter.evaluate(StatementAdapter.java:36)
	at org.apache.lucene.util.TestRuleStoreClassName$1.evaluate(TestRuleStoreClassName.java:41)
	at com.carrotsearch.randomizedtesting.rules.NoShadowingOrOverridesOnMethodsRule$1.evaluate(NoShadowingOrOverridesOnMethodsRule.java:40)
	at com.carrotsearch.randomizedtesting.rules.NoShadowingOrOverridesOnMethodsRule$1.evaluate(NoShadowingOrOverridesOnMethodsRule.java:40)
	at com.carrotsearch.randomizedtesting.rules.StatementAdapter.evaluate(StatementAdapter.java:36)
	at com.carrotsearch.randomizedtesting.rules.StatementAdapter.evaluate(StatementAdapter.java:36)
	at com.carrotsearch.randomizedtesting.rules.StatementAdapter.evaluate(StatementAdapter.java:36)
	at org.apache.lucene.util.TestRuleAssertionsRequired$1.evaluate(TestRuleAssertionsRequired.java:53)
	at org.apache.lucene.util.TestRuleMarkFailure$1.evaluate(TestRuleMarkFailure.java:47)
	at org.apache.lucene.util.TestRuleIgnoreAfterMaxFailures$1.evaluate(TestRuleIgnoreAfterMaxFailures.java:64)
	at org.apache.lucene.util.TestRuleIgnoreTestSuites$1.evaluate(TestRuleIgnoreTestSuites.java:54)
	at com.carrotsearch.randomizedtesting.rules.StatementAdapter.evaluate(StatementAdapter.java:36)
	at com.carrotsearch.randomizedtesting.ThreadLeakControl$StatementRunner.run(ThreadLeakControl.java:367)
	at java.base/java.lang.Thread.run(Thread.java:844)




Build Log:
[...truncated 12676 lines...]
   [junit4] Suite: org.apache.solr.security.hadoop.TestSolrCloudWithHadoopAuthPlugin
   [junit4]   2> Creating dataDir: /home/jenkins/workspace/Lucene-Solr-master-Linux/solr/build/solr-core/test/J2/temp/solr.security.hadoop.TestSolrCloudWithHadoopAuthPlugin_C87E6BC58541BAA1-001/init-core-data-001
   [junit4]   2> 1955815 INFO  (SUITE-TestSolrCloudWithHadoopAuthPlugin-seed#[C87E6BC58541BAA1]-worker)
[    ] o.a.s.SolrTestCaseJ4 Randomized ssl (false) and clientAuth (true) via: @org.apache.solr.util.RandomizeSSL(reason="",
ssl=0.0/0.0, value=0.0/0.0, clientAuth=0.0/0.0)
   [junit4]   2> 1955815 INFO  (SUITE-TestSolrCloudWithHadoopAuthPlugin-seed#[C87E6BC58541BAA1]-worker)
[    ] o.a.s.SolrTestCaseJ4 ###deleteCore
   [junit4]   2> NOTE: test params are: codec=Asserting(Lucene70): {}, docValues:{}, maxPointsInLeafNode=229,
maxMBSortInHeap=5.154355916271849, sim=RandomSimilarity(queryNorm=true): {}, locale=qu, timezone=Asia/Aqtau
   [junit4]   2> NOTE: Linux 4.4.0-53-generic i386/Oracle Corporation 9-ea (32-bit)/cpus=12,threads=1,free=277787600,total=533200896
   [junit4]   2> NOTE: All tests run in this JVM: [DirectUpdateHandlerOptimizeTest, CdcrBootstrapTest,
TestManagedStopFilterFactory, RecoveryZkTest, TestDistribDocBasedVersion, TestShardHandlerFactory,
TestSolrQueryParser, BinaryUpdateRequestHandlerTest, HdfsDirectoryTest, TestFieldCache, TestManagedResource,
StatelessScriptUpdateProcessorFactoryTest, TestIndexSearcher, AutoCommitTest, TestDocSet,
SolrCloudExampleTest, SolrTestCaseJ4Test, IgnoreCommitOptimizeUpdateProcessorFactoryTest,
RequestHandlersTest, TestManagedSchemaThreadSafety, TestCloudPseudoReturnFields, SolrPluginUtilsTest,
LeaderFailoverAfterPartitionTest, SuggesterTest, ConjunctionSolrSpellCheckerTest, TestSchemaSimilarityResource,
HighlighterConfigTest, TestExportWriter, TestSolrDeletionPolicy1, CoreAdminHandlerTest, CleanupOldIndexTest,
TestOverriddenPrefixQueryForCustomFieldType, TestConfig, CdcrRequestHandlerTest, TestOnReconnectListenerSupport,
TestJsonFacets, TestFieldCollectionResource, TestCollectionAPI, TestStandardQParsers, TestExtendedDismaxParser,
TestNumericTerms64, BitVectorTest, TestSolrQueryParserDefaultOperatorResource, ResourceLoaderTest,
UpdateParamsTest, PrimitiveFieldTypeTest, TestTolerantSearch, SimpleFacetsTest, HdfsBasicDistributedZk2Test,
TestLuceneMatchVersion, URLClassifyProcessorTest, TestFieldCacheWithThreads, ClassificationUpdateProcessorTest,
DocValuesMultiTest, TestFieldTypeResource, TestUseDocValuesAsStored2, SliceStateTest, SecurityConfHandlerTest,
CoreSorterTest, TestConfigOverlay, FieldAnalysisRequestHandlerTest, TestAuthorizationFramework,
PreAnalyzedFieldManagedSchemaCloudTest, TestSolrJ, TestBinaryField, BlockJoinFacetRandomTest,
TestSolrConfigHandlerCloud, BasicAuthIntegrationTest, DistributedFacetPivotLargeTest, DistribCursorPagingTest,
TestComponentsName, TestRequestStatusCollectionAPI, FieldMutatingUpdateProcessorTest, TestIndexingPerformance,
TestDynamicLoading, TestSmileRequest, OverseerTaskQueueTest, TestIBSimilarityFactory, JavabinLoaderTest,
LukeRequestHandlerTest, TlogReplayBufferedWhileIndexingTest, TestGroupingSearch, TestReversedWildcardFilterFactory,
BlockCacheTest, CursorMarkTest, DeleteInactiveReplicaTest, TestCloudManagedSchema, UnloadDistributedZkTest,
TestRecovery, HdfsChaosMonkeySafeLeaderTest, AssignTest, CollectionStateFormat2Test, DistributedDebugComponentTest,
RemoteQueryErrorTest, RestartWhileUpdatingTest, PreAnalyzedFieldTest, TestBulkSchemaAPI, BasicDistributedZk2Test,
SuggesterTSTTest, TestUtils, BadIndexSchemaTest, TestSolrCloudWithKerberosAlt, NoCacheHeaderTest,
LeaderInitiatedRecoveryOnShardRestartTest, ForceLeaderTest, TestMergePolicyConfig, StatsComponentTest,
TestFastOutputStream, TestRebalanceLeaders, TestSystemIdResolver, PrimUtilsTest, TestSuggestSpellingConverter,
DateFieldTest, SpellingQueryConverterTest, DOMUtilTest, RAMDirectoryFactoryTest, ClusterStateTest,
ZkNodePropsTest, UUIDFieldTest, FileUtilsTest, CircularListTest, DistributedMLTComponentTest,
TestDistributedMissingSort, CdcrReplicationHandlerTest, CdcrVersionReplicationTest, DeleteReplicaTest,
DistribDocExpirationUpdateProcessorTest, OverseerRolesTest, SaslZkACLProviderTest, ShardSplitTest,
SuggestComponentTest, TestExpandComponent, TestPivotHelperCode, TestTrackingShardHandlerFactory,
TestSlowCompositeReaderWrapper, WrapperMergePolicyFactoryTest, CheckHdfsIndexTest, TestIntervalFaceting,
TestMacroExpander, TestMacros, SmileWriterTest, TestGraphMLResponseWriter, TestSubQueryTransformer,
TestDefaultSearchFieldResource, TestSchemaVersionResource, TestSolrQueryParserResource, TestManagedSynonymFilterFactory,
BadCopyFieldTest, BooleanFieldTest, ChangedSchemaMergeTest, DateRangeFieldTest, DocValuesMissingTest,
ManagedSchemaRoundRobinCloudTest, TestCollationFieldDocValues, AnalyticsMergeStrategyTest,
AnalyticsQueryTest, SortSpecParsingTest, TestAddFieldRealTimeGet, TestCollapseQParserPlugin,
TestComplexPhraseQParserPlugin, TestCustomSort, TestFieldSortValues, TestLegacyNumericRangeQueryBuilder,
TestMaxScoreQueryParser, TestNoOpRegenerator, TestReRankQParserPlugin, TestSearcherReuse,
TestTrieFacet, TestOrdValues, TestSortByMinMaxFunction, BlockJoinFacetDistribTest, TestScoreJoinQPScore,
TestJsonRequest, CloudMLTQParserTest, TestExactSharedStatsCache, TestDelegationWithHadoopAuth,
TestSolrCloudWithHadoopAuthPlugin]
   [junit4]   2> NOTE: reproduce with: ant test  -Dtestcase=TestSolrCloudWithHadoopAuthPlugin
-Dtests.seed=C87E6BC58541BAA1 -Dtests.multiplier=3 -Dtests.slow=true -Dtests.locale=qu -Dtests.timezone=Asia/Aqtau
-Dtests.asserts=true -Dtests.file.encoding=UTF-8
   [junit4] ERROR   0.00s J2 | TestSolrCloudWithHadoopAuthPlugin (suite) <<<
   [junit4]    > Assumption #1: FIXME: SOLR-8182: This test fails under Java 9Throwable
#2: java.lang.NullPointerException
   [junit4]    > 	at __randomizedtesting.SeedInfo.seed([C87E6BC58541BAA1]:0)
   [junit4]    > 	at org.apache.solr.security.hadoop.TestSolrCloudWithHadoopAuthPlugin.tearDownClass(TestSolrCloudWithHadoopAuthPlugin.java:62)
   [junit4]    > 	at java.base/jdk.internal.reflect.NativeMethodAccessorImpl.invoke0(Native
Method)
   [junit4]    > 	at java.base/jdk.internal.reflect.NativeMethodAccessorImpl.invoke(NativeMethodAccessorImpl.java:62)
   [junit4]    > 	at java.base/jdk.internal.reflect.DelegatingMethodAccessorImpl.invoke(DelegatingMethodAccessorImpl.java:43)
   [junit4]    > 	at java.base/java.lang.reflect.Method.invoke(Method.java:538)
   [junit4]    > 	at java.base/java.lang.Thread.run(Thread.java:844)
   [junit4] Completed [630/663 (1!)] on J2 in 0.03s, 0 tests, 1 error <<< FAILURES!

[...truncated 51574 lines...]


Mime
View raw message