lucene-dev mailing list archives

Site index · List index
Message view « Date » · « Thread »
Top « Date » · « Thread »
From Policeman Jenkins Server <jenk...@thetaphi.de>
Subject [JENKINS-EA] Lucene-Solr-master-Linux (64bit/jdk-9-ea+147) - Build # 18567 - Unstable!
Date Mon, 19 Dec 2016 17:38:25 GMT
Build: https://jenkins.thetaphi.de/job/Lucene-Solr-master-Linux/18567/
Java: 64bit/jdk-9-ea+147 -XX:+UseCompressedOops -XX:+UseParallelGC

2 tests failed.
FAILED:  junit.framework.TestSuite.org.apache.solr.security.hadoop.TestSolrCloudWithHadoopAuthPlugin

Error Message:
FIXME: SOLR-8182: This test fails under Java 9

Stack Trace:
com.carrotsearch.randomizedtesting.InternalAssumptionViolatedException: FIXME: SOLR-8182:
This test fails under Java 9
	at __randomizedtesting.SeedInfo.seed([B735FBCB962BF86A]:0)
	at com.carrotsearch.randomizedtesting.RandomizedTest.assumeTrue(RandomizedTest.java:667)
	at com.carrotsearch.randomizedtesting.RandomizedTest.assumeFalse(RandomizedTest.java:675)
	at org.apache.lucene.util.LuceneTestCase.assumeFalse(LuceneTestCase.java:850)
	at org.apache.solr.security.hadoop.TestSolrCloudWithHadoopAuthPlugin.setupClass(TestSolrCloudWithHadoopAuthPlugin.java:45)
	at java.base/jdk.internal.reflect.NativeMethodAccessorImpl.invoke0(Native Method)
	at java.base/jdk.internal.reflect.NativeMethodAccessorImpl.invoke(NativeMethodAccessorImpl.java:62)
	at java.base/jdk.internal.reflect.DelegatingMethodAccessorImpl.invoke(DelegatingMethodAccessorImpl.java:43)
	at java.base/java.lang.reflect.Method.invoke(Method.java:538)
	at com.carrotsearch.randomizedtesting.RandomizedRunner.invoke(RandomizedRunner.java:1713)
	at com.carrotsearch.randomizedtesting.RandomizedRunner$6.evaluate(RandomizedRunner.java:847)
	at com.carrotsearch.randomizedtesting.RandomizedRunner$7.evaluate(RandomizedRunner.java:863)
	at com.carrotsearch.randomizedtesting.rules.StatementAdapter.evaluate(StatementAdapter.java:36)
	at com.carrotsearch.randomizedtesting.rules.SystemPropertiesRestoreRule$1.evaluate(SystemPropertiesRestoreRule.java:57)
	at org.apache.lucene.util.AbstractBeforeAfterRule$1.evaluate(AbstractBeforeAfterRule.java:45)
	at com.carrotsearch.randomizedtesting.rules.StatementAdapter.evaluate(StatementAdapter.java:36)
	at org.apache.lucene.util.TestRuleStoreClassName$1.evaluate(TestRuleStoreClassName.java:41)
	at com.carrotsearch.randomizedtesting.rules.NoShadowingOrOverridesOnMethodsRule$1.evaluate(NoShadowingOrOverridesOnMethodsRule.java:40)
	at com.carrotsearch.randomizedtesting.rules.NoShadowingOrOverridesOnMethodsRule$1.evaluate(NoShadowingOrOverridesOnMethodsRule.java:40)
	at com.carrotsearch.randomizedtesting.rules.StatementAdapter.evaluate(StatementAdapter.java:36)
	at com.carrotsearch.randomizedtesting.rules.StatementAdapter.evaluate(StatementAdapter.java:36)
	at com.carrotsearch.randomizedtesting.rules.StatementAdapter.evaluate(StatementAdapter.java:36)
	at org.apache.lucene.util.TestRuleAssertionsRequired$1.evaluate(TestRuleAssertionsRequired.java:53)
	at org.apache.lucene.util.TestRuleMarkFailure$1.evaluate(TestRuleMarkFailure.java:47)
	at org.apache.lucene.util.TestRuleIgnoreAfterMaxFailures$1.evaluate(TestRuleIgnoreAfterMaxFailures.java:64)
	at org.apache.lucene.util.TestRuleIgnoreTestSuites$1.evaluate(TestRuleIgnoreTestSuites.java:54)
	at com.carrotsearch.randomizedtesting.rules.StatementAdapter.evaluate(StatementAdapter.java:36)
	at com.carrotsearch.randomizedtesting.ThreadLeakControl$StatementRunner.run(ThreadLeakControl.java:367)
	at java.base/java.lang.Thread.run(Thread.java:844)


FAILED:  junit.framework.TestSuite.org.apache.solr.security.hadoop.TestSolrCloudWithHadoopAuthPlugin

Error Message:


Stack Trace:
java.lang.NullPointerException
	at __randomizedtesting.SeedInfo.seed([B735FBCB962BF86A]:0)
	at org.apache.solr.security.hadoop.TestSolrCloudWithHadoopAuthPlugin.tearDownClass(TestSolrCloudWithHadoopAuthPlugin.java:62)
	at java.base/jdk.internal.reflect.NativeMethodAccessorImpl.invoke0(Native Method)
	at java.base/jdk.internal.reflect.NativeMethodAccessorImpl.invoke(NativeMethodAccessorImpl.java:62)
	at java.base/jdk.internal.reflect.DelegatingMethodAccessorImpl.invoke(DelegatingMethodAccessorImpl.java:43)
	at java.base/java.lang.reflect.Method.invoke(Method.java:538)
	at com.carrotsearch.randomizedtesting.RandomizedRunner.invoke(RandomizedRunner.java:1713)
	at com.carrotsearch.randomizedtesting.RandomizedRunner$7.evaluate(RandomizedRunner.java:870)
	at com.carrotsearch.randomizedtesting.rules.StatementAdapter.evaluate(StatementAdapter.java:36)
	at com.carrotsearch.randomizedtesting.rules.SystemPropertiesRestoreRule$1.evaluate(SystemPropertiesRestoreRule.java:57)
	at org.apache.lucene.util.AbstractBeforeAfterRule$1.evaluate(AbstractBeforeAfterRule.java:45)
	at com.carrotsearch.randomizedtesting.rules.StatementAdapter.evaluate(StatementAdapter.java:36)
	at org.apache.lucene.util.TestRuleStoreClassName$1.evaluate(TestRuleStoreClassName.java:41)
	at com.carrotsearch.randomizedtesting.rules.NoShadowingOrOverridesOnMethodsRule$1.evaluate(NoShadowingOrOverridesOnMethodsRule.java:40)
	at com.carrotsearch.randomizedtesting.rules.NoShadowingOrOverridesOnMethodsRule$1.evaluate(NoShadowingOrOverridesOnMethodsRule.java:40)
	at com.carrotsearch.randomizedtesting.rules.StatementAdapter.evaluate(StatementAdapter.java:36)
	at com.carrotsearch.randomizedtesting.rules.StatementAdapter.evaluate(StatementAdapter.java:36)
	at com.carrotsearch.randomizedtesting.rules.StatementAdapter.evaluate(StatementAdapter.java:36)
	at org.apache.lucene.util.TestRuleAssertionsRequired$1.evaluate(TestRuleAssertionsRequired.java:53)
	at org.apache.lucene.util.TestRuleMarkFailure$1.evaluate(TestRuleMarkFailure.java:47)
	at org.apache.lucene.util.TestRuleIgnoreAfterMaxFailures$1.evaluate(TestRuleIgnoreAfterMaxFailures.java:64)
	at org.apache.lucene.util.TestRuleIgnoreTestSuites$1.evaluate(TestRuleIgnoreTestSuites.java:54)
	at com.carrotsearch.randomizedtesting.rules.StatementAdapter.evaluate(StatementAdapter.java:36)
	at com.carrotsearch.randomizedtesting.ThreadLeakControl$StatementRunner.run(ThreadLeakControl.java:367)
	at java.base/java.lang.Thread.run(Thread.java:844)




Build Log:
[...truncated 12632 lines...]
   [junit4] Suite: org.apache.solr.security.hadoop.TestSolrCloudWithHadoopAuthPlugin
   [junit4]   2> Creating dataDir: /home/jenkins/workspace/Lucene-Solr-master-Linux/solr/build/solr-core/test/J0/temp/solr.security.hadoop.TestSolrCloudWithHadoopAuthPlugin_B735FBCB962BF86A-001/init-core-data-001
   [junit4]   2> 1946875 INFO  (SUITE-TestSolrCloudWithHadoopAuthPlugin-seed#[B735FBCB962BF86A]-worker)
[    ] o.a.s.SolrTestCaseJ4 Randomized ssl (true) and clientAuth (true) via: @org.apache.solr.util.RandomizeSSL(reason="",
ssl=0.0/0.0, value=0.0/0.0, clientAuth=0.0/0.0)
   [junit4]   2> 1946879 INFO  (SUITE-TestSolrCloudWithHadoopAuthPlugin-seed#[B735FBCB962BF86A]-worker)
[    ] o.a.s.SolrTestCaseJ4 ###deleteCore
   [junit4]   2> NOTE: test params are: codec=Asserting(Lucene70): {}, docValues:{}, maxPointsInLeafNode=1531,
maxMBSortInHeap=6.648506087836484, sim=RandomSimilarity(queryNorm=true): {}, locale=lu-CD,
timezone=Pacific/Wallis
   [junit4]   2> NOTE: Linux 4.4.0-53-generic amd64/Oracle Corporation 9-ea (64-bit)/cpus=12,threads=1,free=157885176,total=458752000
   [junit4]   2> NOTE: All tests run in this JVM: [SolrCoreTest, SimpleMLTQParserTest,
ConcurrentDeleteAndCreateCollectionTest, TestBinaryResponseWriter, TestSchemaNameResource,
TestPKIAuthenticationPlugin, TestReRankQParserPlugin, TestDelegationWithHadoopAuth, TestDownShardTolerantSearch,
MigrateRouteKeyTest, SearchHandlerTest, TestAddFieldRealTimeGet, ReturnFieldsTest, SuggestComponentTest,
DistributedVersionInfoTest, TestCorePropertiesReload, LeaderFailureAfterFreshStartTest, TestImplicitCoreProperties,
DeleteShardTest, QueryResultKeyTest, SegmentsInfoRequestHandlerTest, TestDefaultStatsCache,
TestAtomicUpdateErrorCases, MergeStrategyTest, TestAnalyzedSuggestions, TestQueryWrapperFilter,
TestCSVLoader, TestMacros, SimpleCollectionCreateDeleteTest, CloudExitableDirectoryReaderTest,
NumericFieldsTest, HdfsRecoveryZkTest, LeaderElectionIntegrationTest, ShufflingReplicaListTransformerTest,
TestCloudInspectUtil, DistribDocExpirationUpdateProcessorTest, CursorPagingTest, FastVectorHighlighterTest,
ZkStateReaderTest, TestSQLHandler, HdfsThreadLeakTest, TestCodecSupport, BigEndianAscendingWordDeserializerTest,
HttpSolrCallGetCoreTest, PingRequestHandlerTest, TestSchemaVersionResource, PeerSyncTest,
TestSolrDeletionPolicy2, TestSolrCLIRunExample, DocumentAnalysisRequestHandlerTest, ChangedSchemaMergeTest,
TestValueSourceCache, PathHierarchyTokenizerFactoryTest, CdcrVersionReplicationTest, ScriptEngineTest,
CacheHeaderTest, ReplaceNodeTest, TestUninvertingReader, SyncSliceTest, BlockDirectoryTest,
DistanceUnitsTest, OverriddenZkACLAndCredentialsProvidersTest, TestSizeLimitedDistributedMap,
TestConfigSetImmutable, AsyncCallRequestStatusResponseTest, TestBadConfig, CdcrReplicationDistributedZkTest,
MultiTermTest, TestFieldResource, ActionThrottleTest, TestStressLucene, CoreMergeIndexesAdminHandlerTest,
TestRangeQuery, TestDFRSimilarityFactory, TestRandomDVFaceting, ShardSplitTest, DistributedFacetPivotWhiteBoxTest,
HLLUtilTest, TestLRUCache, TestLeaderElectionWithEmptyReplica, DeleteLastCustomShardedReplicaTest,
TriLevelCompositeIdRoutingTest, DistributedQueryElevationComponentTest, HdfsWriteToMultipleCollectionsTest,
TestConfigSetsAPI, TestReplicationHandler, XsltUpdateRequestHandlerTest, DefaultValueUpdateProcessorTest,
TestBlobHandler, RuleEngineTest, DistributedExpandComponentTest, TestSubQueryTransformerCrossCore,
DistributedSuggestComponentTest, OverseerRolesTest, DistributedFacetPivotLongTailTest, PluginInfoTest,
TestRemoteStreaming, AnalyticsMergeStrategyTest, TestLazyCores, ResponseLogComponentTest,
TestExactStatsCache, QueryElevationComponentTest, TestSolrCloudSnapshots, PolyFieldTest, TestSolrQueryParserResource,
TestFreeTextSuggestions, TestDistributedSearch, DistributedSpellCheckComponentTest, TestJoin,
TestCoreContainer, SimpleFacetsTest, SolrCmdDistributorTest, TestFunctionQuery, BasicFunctionalityTest,
TestIndexSearcher, CurrencyFieldOpenExchangeTest, AnalysisAfterCoreReloadTest, SolrRequestParserTest,
TestFoldingMultitermQuery, SuggesterTSTTest, TestTrie, SpatialFilterTest, TestPseudoReturnFields,
TestUpdate, FieldMutatingUpdateProcessorTest, QueryEqualityTest, DirectUpdateHandlerOptimizeTest,
DocValuesMultiTest, TestSolrDeletionPolicy1, LukeRequestHandlerTest, TestWriterPerf, TestQueryTypes,
FileBasedSpellCheckerTest, RegexBoostProcessorTest, TestJmxIntegration, JsonLoaderTest, TestLFUCache,
TestHighlightDedupGrouping, CollectionTooManyReplicasTest, ConfigSetsAPITest, ConnectionManagerTest,
DistributedQueueTest, DocValuesNotIndexedTest, HttpPartitionTest, SolrXmlInZkTest, TestCloudPivotFacet,
TestConfigSetsAPIExclusivity, TestCryptoKeys, TestRandomFlRTGCloud, TestSolrCloudWithDelegationTokens,
TestSolrCloudWithKerberosAlt, TestSolrCloudWithSecureImpersonation, TestStressLiveNodes, InfoHandlerTest,
SecurityConfHandlerTest, DistributedFacetExistsSmallTest, FacetPivotSmallTest, SuggestComponentContextFilterQueryTest,
TestPivotHelperCode, HighlighterMaxOffsetTest, TestUnifiedSolrHighlighter, WrapperMergePolicyFactoryTest,
CheckHdfsIndexTest, TestMacroExpander, JSONWriterTest, SmileWriterTest, TestExportWriter,
TestGeoJSONResponseWriter, TestPushWriter, TestChildDocTransformer, TestManagedResourceStorage,
TestRestManager, TestBulkSchemaAPI, EnumFieldTest, ManagedSchemaRoundRobinCloudTest, TestCollationFieldDocValues,
TestManagedSchema, TestManagedSchemaThreadSafety, TestSchemaManager, TestUseDocValuesAsStored,
TestMinMaxOnMultiValuedField, TestOrdValues, BJQParserTest, BlockJoinFacetRandomTest, BlockJoinFacetSimpleTest,
GraphQueryTest, TestScoreJoinQPScore, CloudMLTQParserTest, TestExactSharedStatsCache, TestSolrCloudWithHadoopAuthPlugin]
   [junit4]   2> NOTE: reproduce with: ant test  -Dtestcase=TestSolrCloudWithHadoopAuthPlugin
-Dtests.seed=B735FBCB962BF86A -Dtests.multiplier=3 -Dtests.slow=true -Dtests.locale=lu-CD
-Dtests.timezone=Pacific/Wallis -Dtests.asserts=true -Dtests.file.encoding=ISO-8859-1
   [junit4] ERROR   0.00s J0 | TestSolrCloudWithHadoopAuthPlugin (suite) <<<
   [junit4]    > Assumption #1: FIXME: SOLR-8182: This test fails under Java 9Throwable
#2: java.lang.NullPointerException
   [junit4]    > 	at __randomizedtesting.SeedInfo.seed([B735FBCB962BF86A]:0)
   [junit4]    > 	at org.apache.solr.security.hadoop.TestSolrCloudWithHadoopAuthPlugin.tearDownClass(TestSolrCloudWithHadoopAuthPlugin.java:62)
   [junit4]    > 	at java.base/jdk.internal.reflect.NativeMethodAccessorImpl.invoke0(Native
Method)
   [junit4]    > 	at java.base/jdk.internal.reflect.NativeMethodAccessorImpl.invoke(NativeMethodAccessorImpl.java:62)
   [junit4]    > 	at java.base/jdk.internal.reflect.DelegatingMethodAccessorImpl.invoke(DelegatingMethodAccessorImpl.java:43)
   [junit4]    > 	at java.base/java.lang.reflect.Method.invoke(Method.java:538)
   [junit4]    > 	at java.base/java.lang.Thread.run(Thread.java:844)
   [junit4] Completed [623/663 (1!)] on J0 in 0.02s, 0 tests, 1 error <<< FAILURES!

[...truncated 51595 lines...]


Mime
View raw message