lucene-dev mailing list archives

Site index · List index
Message view « Date » · « Thread »
Top « Date » · « Thread »
From Policeman Jenkins Server <jenk...@thetaphi.de>
Subject [JENKINS] Lucene-Solr-master-Linux (32bit/jdk1.8.0_112) - Build # 18558 - Unstable!
Date Sun, 18 Dec 2016 14:30:22 GMT
Build: https://jenkins.thetaphi.de/job/Lucene-Solr-master-Linux/18558/
Java: 32bit/jdk1.8.0_112 -server -XX:+UseSerialGC

2 tests failed.
FAILED:  junit.framework.TestSuite.org.apache.lucene.codecs.asserting.TestAssertingDocValuesFormat

Error Message:
Suite timeout exceeded (>= 7200000 msec).

Stack Trace:
java.lang.Exception: Suite timeout exceeded (>= 7200000 msec).
	at __randomizedtesting.SeedInfo.seed([194980C6EDC6ABB6]:0)


FAILED:  org.apache.lucene.codecs.asserting.TestAssertingDocValuesFormat.testByteNumericsVsStoredFields

Error Message:
Test abandoned because suite timeout was reached.

Stack Trace:
java.lang.Exception: Test abandoned because suite timeout was reached.
	at __randomizedtesting.SeedInfo.seed([194980C6EDC6ABB6]:0)




Build Log:
[...truncated 2058 lines...]
   [junit4] Suite: org.apache.lucene.codecs.asserting.TestAssertingDocValuesFormat
   [junit4]   2> NOTE: reproduce with: ant test  -Dtestcase=TestAssertingDocValuesFormat
-Dtests.method=testByteNumericsVsStoredFields -Dtests.seed=194980C6EDC6ABB6 -Dtests.multiplier=3
-Dtests.slow=true -Dtests.locale=th-TH -Dtests.timezone=Asia/Bangkok -Dtests.asserts=true
-Dtests.file.encoding=ISO-8859-1
   [junit4] ERROR   7164s J2 | TestAssertingDocValuesFormat.testByteNumericsVsStoredFields
<<<
   [junit4]    > Throwable #1: java.lang.Exception: Test abandoned because suite timeout
was reached.
   [junit4]    > 	at __randomizedtesting.SeedInfo.seed([194980C6EDC6ABB6]:0)
   [junit4]   2> NOTE: leaving temporary files on disk at: /home/jenkins/workspace/Lucene-Solr-master-Linux/lucene/build/test-framework/test/J2/temp/lucene.codecs.asserting.TestAssertingDocValuesFormat_194980C6EDC6ABB6-001
   [junit4]   2> NOTE: test params are: codec=Asserting(Lucene70): {}, docValues:{}, maxPointsInLeafNode=1060,
maxMBSortInHeap=6.125408522133297, sim=RandomSimilarity(queryNorm=false): {fieldname=DFR I(n)3(800.0),
docId=DFR I(n)BZ(0.3), id=DFI(Saturated)}, locale=th-TH, timezone=Asia/Bangkok
   [junit4]   2> NOTE: Linux 4.4.0-53-generic i386/Oracle Corporation 1.8.0_112 (32-bit)/cpus=12,threads=1,free=34204656,total=65011712
   [junit4]   2> NOTE: All tests run in this JVM: [TestCompressingStoredFieldsFormat, TestAssertingPostingsFormat,
Nested, TestLookaheadTokenFilter, Nested, TestVirusCheckingFS, TestExtrasFS, TestMockAnalyzer,
Nested, Nested2, TestAssertingDocValuesFormat]
   [junit4]   2> NOTE: reproduce with: ant test  -Dtestcase=TestAssertingDocValuesFormat
-Dtests.seed=194980C6EDC6ABB6 -Dtests.multiplier=3 -Dtests.slow=true -Dtests.locale=th-TH
-Dtests.timezone=Asia/Bangkok -Dtests.asserts=true -Dtests.file.encoding=ISO-8859-1
   [junit4] ERROR   0.00s J2 | TestAssertingDocValuesFormat (suite) <<<
   [junit4]    > Throwable #1: java.lang.Exception: Suite timeout exceeded (>= 7200000
msec).
   [junit4]    > 	at __randomizedtesting.SeedInfo.seed([194980C6EDC6ABB6]:0)
   [junit4] Completed [42/42 (1!)] on J2 in 7220.06s, 64 tests, 2 errors <<< FAILURES!

[...truncated 65356 lines...]


Mime
View raw message