lucene-dev mailing list archives

Site index · List index
Message view « Date » · « Thread »
Top « Date » · « Thread »
From Policeman Jenkins Server <jenk...@thetaphi.de>
Subject [JENKINS-EA] Lucene-Solr-6.x-Linux (32bit/jdk-9-ea+147) - Build # 2402 - Unstable!
Date Mon, 12 Dec 2016 12:03:03 GMT
Build: https://jenkins.thetaphi.de/job/Lucene-Solr-6.x-Linux/2402/
Java: 32bit/jdk-9-ea+147 -server -XX:+UseG1GC

1 tests failed.
FAILED:  org.apache.solr.cloud.SyncSliceTest.test

Error Message:
timeout waiting to see all nodes active

Stack Trace:
java.lang.AssertionError: timeout waiting to see all nodes active
	at __randomizedtesting.SeedInfo.seed([3C0525BE77B818F3:B4511A64D944750B]:0)
	at org.junit.Assert.fail(Assert.java:93)
	at org.apache.solr.cloud.SyncSliceTest.waitTillAllNodesActive(SyncSliceTest.java:235)
	at org.apache.solr.cloud.SyncSliceTest.test(SyncSliceTest.java:164)
	at java.base/jdk.internal.reflect.NativeMethodAccessorImpl.invoke0(Native Method)
	at java.base/jdk.internal.reflect.NativeMethodAccessorImpl.invoke(NativeMethodAccessorImpl.java:62)
	at java.base/jdk.internal.reflect.DelegatingMethodAccessorImpl.invoke(DelegatingMethodAccessorImpl.java:43)
	at java.base/java.lang.reflect.Method.invoke(Method.java:538)
	at com.carrotsearch.randomizedtesting.RandomizedRunner.invoke(RandomizedRunner.java:1713)
	at com.carrotsearch.randomizedtesting.RandomizedRunner$8.evaluate(RandomizedRunner.java:907)
	at com.carrotsearch.randomizedtesting.RandomizedRunner$9.evaluate(RandomizedRunner.java:943)
	at com.carrotsearch.randomizedtesting.RandomizedRunner$10.evaluate(RandomizedRunner.java:957)
	at org.apache.solr.BaseDistributedSearchTestCase$ShardsRepeatRule$ShardsFixedStatement.callStatement(BaseDistributedSearchTestCase.java:992)
	at org.apache.solr.BaseDistributedSearchTestCase$ShardsRepeatRule$ShardsStatement.evaluate(BaseDistributedSearchTestCase.java:967)
	at com.carrotsearch.randomizedtesting.rules.SystemPropertiesRestoreRule$1.evaluate(SystemPropertiesRestoreRule.java:57)
	at org.apache.lucene.util.TestRuleSetupTeardownChained$1.evaluate(TestRuleSetupTeardownChained.java:49)
	at org.apache.lucene.util.AbstractBeforeAfterRule$1.evaluate(AbstractBeforeAfterRule.java:45)
	at org.apache.lucene.util.TestRuleThreadAndTestName$1.evaluate(TestRuleThreadAndTestName.java:48)
	at org.apache.lucene.util.TestRuleIgnoreAfterMaxFailures$1.evaluate(TestRuleIgnoreAfterMaxFailures.java:64)
	at org.apache.lucene.util.TestRuleMarkFailure$1.evaluate(TestRuleMarkFailure.java:47)
	at com.carrotsearch.randomizedtesting.rules.StatementAdapter.evaluate(StatementAdapter.java:36)
	at com.carrotsearch.randomizedtesting.ThreadLeakControl$StatementRunner.run(ThreadLeakControl.java:367)
	at com.carrotsearch.randomizedtesting.ThreadLeakControl.forkTimeoutingTask(ThreadLeakControl.java:811)
	at com.carrotsearch.randomizedtesting.ThreadLeakControl$3.evaluate(ThreadLeakControl.java:462)
	at com.carrotsearch.randomizedtesting.RandomizedRunner.runSingleTest(RandomizedRunner.java:916)
	at com.carrotsearch.randomizedtesting.RandomizedRunner$5.evaluate(RandomizedRunner.java:802)
	at com.carrotsearch.randomizedtesting.RandomizedRunner$6.evaluate(RandomizedRunner.java:852)
	at com.carrotsearch.randomizedtesting.RandomizedRunner$7.evaluate(RandomizedRunner.java:863)
	at com.carrotsearch.randomizedtesting.rules.StatementAdapter.evaluate(StatementAdapter.java:36)
	at com.carrotsearch.randomizedtesting.rules.SystemPropertiesRestoreRule$1.evaluate(SystemPropertiesRestoreRule.java:57)
	at org.apache.lucene.util.AbstractBeforeAfterRule$1.evaluate(AbstractBeforeAfterRule.java:45)
	at com.carrotsearch.randomizedtesting.rules.StatementAdapter.evaluate(StatementAdapter.java:36)
	at org.apache.lucene.util.TestRuleStoreClassName$1.evaluate(TestRuleStoreClassName.java:41)
	at com.carrotsearch.randomizedtesting.rules.NoShadowingOrOverridesOnMethodsRule$1.evaluate(NoShadowingOrOverridesOnMethodsRule.java:40)
	at com.carrotsearch.randomizedtesting.rules.NoShadowingOrOverridesOnMethodsRule$1.evaluate(NoShadowingOrOverridesOnMethodsRule.java:40)
	at com.carrotsearch.randomizedtesting.rules.StatementAdapter.evaluate(StatementAdapter.java:36)
	at com.carrotsearch.randomizedtesting.rules.StatementAdapter.evaluate(StatementAdapter.java:36)
	at com.carrotsearch.randomizedtesting.rules.StatementAdapter.evaluate(StatementAdapter.java:36)
	at org.apache.lucene.util.TestRuleAssertionsRequired$1.evaluate(TestRuleAssertionsRequired.java:53)
	at org.apache.lucene.util.TestRuleMarkFailure$1.evaluate(TestRuleMarkFailure.java:47)
	at org.apache.lucene.util.TestRuleIgnoreAfterMaxFailures$1.evaluate(TestRuleIgnoreAfterMaxFailures.java:64)
	at org.apache.lucene.util.TestRuleIgnoreTestSuites$1.evaluate(TestRuleIgnoreTestSuites.java:54)
	at com.carrotsearch.randomizedtesting.rules.StatementAdapter.evaluate(StatementAdapter.java:36)
	at com.carrotsearch.randomizedtesting.ThreadLeakControl$StatementRunner.run(ThreadLeakControl.java:367)
	at java.base/java.lang.Thread.run(Thread.java:844)




Build Log:
[...truncated 11268 lines...]
   [junit4] Suite: org.apache.solr.cloud.SyncSliceTest
   [junit4]   2> Creating dataDir: /home/jenkins/workspace/Lucene-Solr-6.x-Linux/solr/build/solr-core/test/J0/temp/solr.cloud.SyncSliceTest_3C0525BE77B818F3-001/init-core-data-001
   [junit4]   2> 330096 INFO  (SUITE-SyncSliceTest-seed#[3C0525BE77B818F3]-worker) [    ] o.a.s.SolrTestCaseJ4 Randomized ssl (false) and clientAuth (true) via: @org.apache.solr.util.RandomizeSSL(reason="", ssl=0.0/0.0, value=0.0/0.0, clientAuth=0.0/0.0)
   [junit4]   2> 330096 INFO  (SUITE-SyncSliceTest-seed#[3C0525BE77B818F3]-worker) [    ] o.a.s.BaseDistributedSearchTestCase Setting hostContext system property: /
   [junit4]   2> 330097 INFO  (TEST-SyncSliceTest.test-seed#[3C0525BE77B818F3]) [    ] o.a.s.c.ZkTestServer STARTING ZK TEST SERVER
   [junit4]   2> 330097 INFO  (Thread-585) [    ] o.a.s.c.ZkTestServer client port:0.0.0.0/0.0.0.0:0
   [junit4]   2> 330097 INFO  (Thread-585) [    ] o.a.s.c.ZkTestServer Starting server
   [junit4]   2> 330197 INFO  (TEST-SyncSliceTest.test-seed#[3C0525BE77B818F3]) [    ] o.a.s.c.ZkTestServer start zk server on port:34322
   [junit4]   2> 330207 INFO  (TEST-SyncSliceTest.test-seed#[3C0525BE77B818F3]) [    ] o.a.s.c.AbstractZkTestCase put /home/jenkins/workspace/Lucene-Solr-6.x-Linux/solr/core/src/test-files/solr/collection1/conf/solrconfig-tlog.xml to /configs/conf1/solrconfig.xml
   [junit4]   2> 330209 INFO  (TEST-SyncSliceTest.test-seed#[3C0525BE77B818F3]) [    ] o.a.s.c.AbstractZkTestCase put /home/jenkins/workspace/Lucene-Solr-6.x-Linux/solr/core/src/test-files/solr/collection1/conf/schema.xml to /configs/conf1/schema.xml
   [junit4]   2> 330211 INFO  (TEST-SyncSliceTest.test-seed#[3C0525BE77B818F3]) [    ] o.a.s.c.AbstractZkTestCase put /home/jenkins/workspace/Lucene-Solr-6.x-Linux/solr/core/src/test-files/solr/collection1/conf/solrconfig.snippet.randomindexconfig.xml to /configs/conf1/solrconfig.snippet.randomindexconfig.xml
   [junit4]   2> 330213 INFO  (TEST-SyncSliceTest.test-seed#[3C0525BE77B818F3]) [    ] o.a.s.c.AbstractZkTestCase put /home/jenkins/workspace/Lucene-Solr-6.x-Linux/solr/core/src/test-files/solr/collection1/conf/stopwords.txt to /configs/conf1/stopwords.txt
   [junit4]   2> 330216 INFO  (TEST-SyncSliceTest.test-seed#[3C0525BE77B818F3]) [    ] o.a.s.c.AbstractZkTestCase put /home/jenkins/workspace/Lucene-Solr-6.x-Linux/solr/core/src/test-files/solr/collection1/conf/protwords.txt to /configs/conf1/protwords.txt
   [junit4]   2> 330218 INFO  (TEST-SyncSliceTest.test-seed#[3C0525BE77B818F3]) [    ] o.a.s.c.AbstractZkTestCase put /home/jenkins/workspace/Lucene-Solr-6.x-Linux/solr/core/src/test-files/solr/collection1/conf/currency.xml to /configs/conf1/currency.xml
   [junit4]   2> 330220 INFO  (TEST-SyncSliceTest.test-seed#[3C0525BE77B818F3]) [    ] o.a.s.c.AbstractZkTestCase put /home/jenkins/workspace/Lucene-Solr-6.x-Linux/solr/core/src/test-files/solr/collection1/conf/enumsConfig.xml to /configs/conf1/enumsConfig.xml
   [junit4]   2> 330222 INFO  (TEST-SyncSliceTest.test-seed#[3C0525BE77B818F3]) [    ] o.a.s.c.AbstractZkTestCase put /home/jenkins/workspace/Lucene-Solr-6.x-Linux/solr/core/src/test-files/solr/collection1/conf/open-exchange-rates.json to /configs/conf1/open-exchange-rates.json
   [junit4]   2> 330225 INFO  (TEST-SyncSliceTest.test-seed#[3C0525BE77B818F3]) [    ] o.a.s.c.AbstractZkTestCase put /home/jenkins/workspace/Lucene-Solr-6.x-Linux/solr/core/src/test-files/solr/collection1/conf/mapping-ISOLatin1Accent.txt to /configs/conf1/mapping-ISOLatin1Accent.txt
   [junit4]   2> 330229 INFO  (TEST-SyncSliceTest.test-seed#[3C0525BE77B818F3]) [    ] o.a.s.c.AbstractZkTestCase put /home/jenkins/workspace/Lucene-Solr-6.x-Linux/solr/core/src/test-files/solr/collection1/conf/old_synonyms.txt to /configs/conf1/old_synonyms.txt
   [junit4]   2> 330233 INFO  (TEST-SyncSliceTest.test-seed#[3C0525BE77B818F3]) [    ] o.a.s.c.AbstractZkTestCase put /home/jenkins/workspace/Lucene-Solr-6.x-Linux/solr/core/src/test-files/solr/collection1/conf/synonyms.txt to /configs/conf1/synonyms.txt
   [junit4]   2> 331014 INFO  (TEST-SyncSliceTest.test-seed#[3C0525BE77B818F3]) [    ] o.a.s.SolrTestCaseJ4 Writing core.properties file to /home/jenkins/workspace/Lucene-Solr-6.x-Linux/solr/build/solr-core/test/J0/temp/solr.cloud.SyncSliceTest_3C0525BE77B818F3-001/control-001/cores/collection1
   [junit4]   2> 331016 INFO  (TEST-SyncSliceTest.test-seed#[3C0525BE77B818F3]) [    ] o.e.j.s.Server jetty-9.3.14.v20161028
   [junit4]   2> 331017 INFO  (TEST-SyncSliceTest.test-seed#[3C0525BE77B818F3]) [    ] o.e.j.s.h.ContextHandler Started o.e.j.s.ServletContextHandler@1cbae12{/,null,AVAILABLE}
   [junit4]   2> 331017 INFO  (TEST-SyncSliceTest.test-seed#[3C0525BE77B818F3]) [    ] o.e.j.s.AbstractConnector Started ServerConnector@15ce7dd{HTTP/1.1,[http/1.1]}{127.0.0.1:42398}
   [junit4]   2> 331018 INFO  (TEST-SyncSliceTest.test-seed#[3C0525BE77B818F3]) [    ] o.e.j.s.Server Started @332678ms
   [junit4]   2> 331018 INFO  (TEST-SyncSliceTest.test-seed#[3C0525BE77B818F3]) [    ] o.a.s.c.s.e.JettySolrRunner Jetty properties: {hostContext=/, solr.data.dir=/home/jenkins/workspace/Lucene-Solr-6.x-Linux/solr/build/solr-core/test/J0/temp/solr.cloud.SyncSliceTest_3C0525BE77B818F3-001/tempDir-001/control/data, hostPort=42398, coreRootDirectory=/home/jenkins/workspace/Lucene-Solr-6.x-Linux/solr/build/solr-core/test/J0/../../../../../../../../../home/jenkins/workspace/Lucene-Solr-6.x-Linux/solr/build/solr-core/test/J0/temp/solr.cloud.SyncSliceTest_3C0525BE77B818F3-001/control-001/cores}
   [junit4]   2> 331018 ERROR (TEST-SyncSliceTest.test-seed#[3C0525BE77B818F3]) [    ] o.a.s.s.StartupLoggingUtils Missing Java Option solr.log.dir. Logging may be missing or incomplete.
   [junit4]   2> 331018 INFO  (TEST-SyncSliceTest.test-seed#[3C0525BE77B818F3]) [    ] o.a.s.s.SolrDispatchFilter  ___      _       Welcome to Apache Solr™ version 6.4.0
   [junit4]   2> 331018 INFO  (TEST-SyncSliceTest.test-seed#[3C0525BE77B818F3]) [    ] o.a.s.s.SolrDispatchFilter / __| ___| |_ _   Starting in cloud mode on port null
   [junit4]   2> 331018 INFO  (TEST-SyncSliceTest.test-seed#[3C0525BE77B818F3]) [    ] o.a.s.s.SolrDispatchFilter \__ \/ _ \ | '_|  Install dir: null
   [junit4]   2> 331018 INFO  (TEST-SyncSliceTest.test-seed#[3C0525BE77B818F3]) [    ] o.a.s.s.SolrDispatchFilter |___/\___/_|_|    Start time: 2016-12-12T11:19:22.231529Z
   [junit4]   2> 331022 INFO  (TEST-SyncSliceTest.test-seed#[3C0525BE77B818F3]) [    ] o.a.s.s.SolrDispatchFilter Loading solr.xml from SolrHome (not found in ZooKeeper)
   [junit4]   2> 331022 INFO  (TEST-SyncSliceTest.test-seed#[3C0525BE77B818F3]) [    ] o.a.s.c.SolrXmlConfig Loading container configuration from /home/jenkins/workspace/Lucene-Solr-6.x-Linux/solr/build/solr-core/test/J0/temp/solr.cloud.SyncSliceTest_3C0525BE77B818F3-001/control-001/solr.xml
   [junit4]   2> 331031 INFO  (TEST-SyncSliceTest.test-seed#[3C0525BE77B818F3]) [    ] o.a.s.u.UpdateShardHandler Creating UpdateShardHandler HTTP client with params: socketTimeout=340000&connTimeout=45000&retry=true
   [junit4]   2> 331033 INFO  (TEST-SyncSliceTest.test-seed#[3C0525BE77B818F3]) [    ] o.a.s.c.ZkContainer Zookeeper client=127.0.0.1:34322/solr
   [junit4]   2> 331054 INFO  (TEST-SyncSliceTest.test-seed#[3C0525BE77B818F3]) [    ] o.a.s.c.OverseerElectionContext I am going to be the leader 127.0.0.1:42398_
   [junit4]   2> 331056 INFO  (TEST-SyncSliceTest.test-seed#[3C0525BE77B818F3]) [    ] o.a.s.c.Overseer Overseer (id=97094307762208772-127.0.0.1:42398_-n_0000000000) starting
   [junit4]   2> 331060 INFO  (TEST-SyncSliceTest.test-seed#[3C0525BE77B818F3]) [    ] o.a.s.c.ZkController Register node as live in ZooKeeper:/live_nodes/127.0.0.1:42398_
   [junit4]   2> 331061 INFO  (zkCallback-427-thread-1) [    ] o.a.s.c.c.ZkStateReader Updated live nodes from ZooKeeper... (0) -> (1)
   [junit4]   2> 331145 INFO  (TEST-SyncSliceTest.test-seed#[3C0525BE77B818F3]) [    ] o.a.s.c.CorePropertiesLocator Found 1 core definitions underneath /home/jenkins/workspace/Lucene-Solr-6.x-Linux/solr/build/solr-core/test/J0/../../../../../../../../../home/jenkins/workspace/Lucene-Solr-6.x-Linux/solr/build/solr-core/test/J0/temp/solr.cloud.SyncSliceTest_3C0525BE77B818F3-001/control-001/cores
   [junit4]   2> 331145 INFO  (TEST-SyncSliceTest.test-seed#[3C0525BE77B818F3]) [    ] o.a.s.c.CorePropertiesLocator Cores are: [collection1]
   [junit4]   2> 331147 INFO  (OverseerStateUpdate-97094307762208772-127.0.0.1:42398_-n_0000000000) [    ] o.a.s.c.o.ReplicaMutator Assigning new node to shard shard=shard1
   [junit4]   2> 332155 INFO  (coreLoadExecutor-1081-thread-1) [    ] o.a.s.c.SolrConfig Using Lucene MatchVersion: 6.4.0
   [junit4]   2> 332167 INFO  (coreLoadExecutor-1081-thread-1) [    ] o.a.s.s.IndexSchema [collection1] Schema name=test
   [junit4]   2> 332263 WARN  (coreLoadExecutor-1081-thread-1) [    ] o.a.s.s.IndexSchema [collection1] default search field in schema is text. WARNING: Deprecated, please use 'df' on request instead.
   [junit4]   2> 332267 INFO  (coreLoadExecutor-1081-thread-1) [    ] o.a.s.s.IndexSchema Loaded schema test/1.0 with uniqueid field id
   [junit4]   2> 332283 INFO  (coreLoadExecutor-1081-thread-1) [    ] o.a.s.c.CoreContainer Creating SolrCore 'collection1' using configuration from collection control_collection
   [junit4]   2> 332283 INFO  (coreLoadExecutor-1081-thread-1) [    ] o.a.s.c.SolrCore [[collection1] ] Opening new SolrCore at [/home/jenkins/workspace/Lucene-Solr-6.x-Linux/solr/build/solr-core/test/J0/temp/solr.cloud.SyncSliceTest_3C0525BE77B818F3-001/control-001/cores/collection1], dataDir=[/home/jenkins/workspace/Lucene-Solr-6.x-Linux/solr/build/solr-core/test/J0/../../../../../../../../../home/jenkins/workspace/Lucene-Solr-6.x-Linux/solr/build/solr-core/test/J0/temp/solr.cloud.SyncSliceTest_3C0525BE77B818F3-001/control-001/cores/collection1/data/]
   [junit4]   2> 332283 INFO  (coreLoadExecutor-1081-thread-1) [    ] o.a.s.c.JmxMonitoredMap JMX monitoring is enabled. Adding Solr mbeans to JMX Server: com.sun.jmx.mbeanserver.JmxMBeanServer@da8b15
   [junit4]   2> 332285 INFO  (coreLoadExecutor-1081-thread-1) [    ] o.a.s.u.RandomMergePolicy RandomMergePolicy wrapping class org.apache.lucene.index.TieredMergePolicy: [TieredMergePolicy: maxMergeAtOnce=18, maxMergeAtOnceExplicit=27, maxMergedSegmentMB=55.154296875, floorSegmentMB=1.2783203125, forceMergeDeletesPctAllowed=4.897934600205254, segmentsPerTier=14.0, maxCFSSegmentSizeMB=8.796093022207999E12, noCFSRatio=0.13720607069182647
   [junit4]   2> 332287 WARN  (coreLoadExecutor-1081-thread-1) [    ] o.a.s.c.RequestHandlers INVALID paramSet a in requestHandler {type = requestHandler,name = /dump,class = DumpRequestHandler,args = {defaults={a=A,b=B}}}
   [junit4]   2> 332294 INFO  (coreLoadExecutor-1081-thread-1) [    ] o.a.s.u.UpdateHandler Using UpdateLog implementation: org.apache.solr.update.UpdateLog
   [junit4]   2> 332294 INFO  (coreLoadExecutor-1081-thread-1) [    ] o.a.s.u.UpdateLog Initializing UpdateLog: dataDir= defaultSyncLevel=FLUSH numRecordsToKeep=100 maxNumLogsToKeep=10 numVersionBuckets=65536
   [junit4]   2> 332297 INFO  (coreLoadExecutor-1081-thread-1) [    ] o.a.s.u.CommitTracker Hard AutoCommit: disabled
   [junit4]   2> 332297 INFO  (coreLoadExecutor-1081-thread-1) [    ] o.a.s.u.CommitTracker Soft AutoCommit: disabled
   [junit4]   2> 332297 INFO  (coreLoadExecutor-1081-thread-1) [    ] o.a.s.u.RandomMergePolicy RandomMergePolicy wrapping class org.apache.lucene.index.TieredMergePolicy: [TieredMergePolicy: maxMergeAtOnce=31, maxMergeAtOnceExplicit=18, maxMergedSegmentMB=2.0556640625, floorSegmentMB=1.5126953125, forceMergeDeletesPctAllowed=21.572092098393757, segmentsPerTier=39.0, maxCFSSegmentSizeMB=8.796093022207999E12, noCFSRatio=0.3882967066599602
   [junit4]   2> 332298 INFO  (coreLoadExecutor-1081-thread-1) [    ] o.a.s.s.SolrIndexSearcher Opening [Searcher@8a4b2a[collection1] main]
   [junit4]   2> 332298 INFO  (coreLoadExecutor-1081-thread-1) [    ] o.a.s.r.ManagedResourceStorage Configured ZooKeeperStorageIO with znodeBase: /configs/conf1
   [junit4]   2> 332299 INFO  (coreLoadExecutor-1081-thread-1) [    ] o.a.s.r.ManagedResourceStorage Loaded null at path _rest_managed.json using ZooKeeperStorageIO:path=/configs/conf1
   [junit4]   2> 332299 INFO  (coreLoadExecutor-1081-thread-1) [    ] o.a.s.h.ReplicationHandler Commits will be reserved for  10000
   [junit4]   2> 332299 INFO  (coreLoadExecutor-1081-thread-1) [    ] o.a.s.u.UpdateLog Could not find max version in index or recent updates, using new clock 1553508926501158912
   [junit4]   2> 332304 INFO  (searcherExecutor-1082-thread-1) [    ] o.a.s.c.SolrCore [collection1] Registered new searcher Searcher@8a4b2a[collection1] main{ExitableDirectoryReader(UninvertingDirectoryReader())}
   [junit4]   2> 332305 INFO  (coreZkRegister-1074-thread-1) [    ] o.a.s.c.ShardLeaderElectionContext Enough replicas found to continue.
   [junit4]   2> 332305 INFO  (coreZkRegister-1074-thread-1) [    ] o.a.s.c.ShardLeaderElectionContext I may be the new leader - try and sync
   [junit4]   2> 332305 INFO  (coreZkRegister-1074-thread-1) [    ] o.a.s.c.SyncStrategy Sync replicas to http://127.0.0.1:42398/collection1/
   [junit4]   2> 332305 INFO  (coreZkRegister-1074-thread-1) [    ] o.a.s.c.SyncStrategy Sync Success - now sync replicas to me
   [junit4]   2> 332305 INFO  (coreZkRegister-1074-thread-1) [    ] o.a.s.c.SyncStrategy http://127.0.0.1:42398/collection1/ has no replicas
   [junit4]   2> 332307 INFO  (coreZkRegister-1074-thread-1) [    ] o.a.s.c.ShardLeaderElectionContext I am the new leader: http://127.0.0.1:42398/collection1/ shard1
   [junit4]   2> 332458 INFO  (coreZkRegister-1074-thread-1) [    ] o.a.s.c.ZkController I am the leader, no recovery necessary
   [junit4]   2> 332650 INFO  (TEST-SyncSliceTest.test-seed#[3C0525BE77B818F3]) [    ] o.a.s.c.c.ZkStateReader Updated live nodes from ZooKeeper... (0) -> (1)
   [junit4]   2> 332652 INFO  (TEST-SyncSliceTest.test-seed#[3C0525BE77B818F3]) [    ] o.a.s.c.s.i.ZkClientClusterStateProvider Cluster at 127.0.0.1:34322/solr ready
   [junit4]   2> 332652 INFO  (TEST-SyncSliceTest.test-seed#[3C0525BE77B818F3]) [    ] o.a.s.c.ChaosMonkey monkey: init - expire sessions:false cause connection loss:false
   [junit4]   2> 332652 INFO  (TEST-SyncSliceTest.test-seed#[3C0525BE77B818F3]) [    ] o.a.s.c.AbstractFullDistribZkTestBase Creating collection1 with stateFormat=2
   [junit4]   2> 333592 INFO  (TEST-SyncSliceTest.test-seed#[3C0525BE77B818F3]) [    ] o.a.s.SolrTestCaseJ4 Writing core.properties file to /home/jenkins/workspace/Lucene-Solr-6.x-Linux/solr/build/solr-core/test/J0/temp/solr.cloud.SyncSliceTest_3C0525BE77B818F3-001/shard-1-001/cores/collection1
   [junit4]   2> 333594 INFO  (TEST-SyncSliceTest.test-seed#[3C0525BE77B818F3]) [    ] o.a.s.c.AbstractFullDistribZkTestBase create jetty 1 in directory /home/jenkins/workspace/Lucene-Solr-6.x-Linux/solr/build/solr-core/test/J0/temp/solr.cloud.SyncSliceTest_3C0525BE77B818F3-001/shard-1-001
   [junit4]   2> 333595 INFO  (TEST-SyncSliceTest.test-seed#[3C0525BE77B818F3]) [    ] o.e.j.s.Server jetty-9.3.14.v20161028
   [junit4]   2> 333600 INFO  (TEST-SyncSliceTest.test-seed#[3C0525BE77B818F3]) [    ] o.e.j.s.h.ContextHandler Started o.e.j.s.ServletContextHandler@141cf27{/,null,AVAILABLE}
   [junit4]   2> 333601 INFO  (TEST-SyncSliceTest.test-seed#[3C0525BE77B818F3]) [    ] o.e.j.s.AbstractConnector Started ServerConnector@522668{HTTP/1.1,[http/1.1]}{127.0.0.1:37288}
   [junit4]   2> 333601 INFO  (TEST-SyncSliceTest.test-seed#[3C0525BE77B818F3]) [    ] o.e.j.s.Server Started @335261ms
   [junit4]   2> 333601 INFO  (TEST-SyncSliceTest.test-seed#[3C0525BE77B818F3]) [    ] o.a.s.c.s.e.JettySolrRunner Jetty properties: {hostContext=/, solrconfig=solrconfig.xml, solr.data.dir=/home/jenkins/workspace/Lucene-Solr-6.x-Linux/solr/build/solr-core/test/J0/temp/solr.cloud.SyncSliceTest_3C0525BE77B818F3-001/tempDir-001/jetty1, hostPort=37288, coreRootDirectory=/home/jenkins/workspace/Lucene-Solr-6.x-Linux/solr/build/solr-core/test/J0/../../../../../../../../../home/jenkins/workspace/Lucene-Solr-6.x-Linux/solr/build/solr-core/test/J0/temp/solr.cloud.SyncSliceTest_3C0525BE77B818F3-001/shard-1-001/cores}
   [junit4]   2> 333601 ERROR (TEST-SyncSliceTest.test-seed#[3C0525BE77B818F3]) [    ] o.a.s.s.StartupLoggingUtils Missing Java Option solr.log.dir. Logging may be missing or incomplete.
   [junit4]   2> 333601 INFO  (TEST-SyncSliceTest.test-seed#[3C0525BE77B818F3]) [    ] o.a.s.s.SolrDispatchFilter  ___      _       Welcome to Apache Solr™ version 6.4.0
   [junit4]   2> 333602 INFO  (TEST-SyncSliceTest.test-seed#[3C0525BE77B818F3]) [    ] o.a.s.s.SolrDispatchFilter / __| ___| |_ _   Starting in cloud mode on port null
   [junit4]   2> 333602 INFO  (TEST-SyncSliceTest.test-seed#[3C0525BE77B818F3]) [    ] o.a.s.s.SolrDispatchFilter \__ \/ _ \ | '_|  Install dir: null
   [junit4]   2> 333602 INFO  (TEST-SyncSliceTest.test-seed#[3C0525BE77B818F3]) [    ] o.a.s.s.SolrDispatchFilter |___/\___/_|_|    Start time: 2016-12-12T11:19:24.815150Z
   [junit4]   2> 333610 INFO  (TEST-SyncSliceTest.test-seed#[3C0525BE77B818F3]) [    ] o.a.s.s.SolrDispatchFilter Loading solr.xml from SolrHome (not found in ZooKeeper)
   [junit4]   2> 333610 INFO  (TEST-SyncSliceTest.test-seed#[3C0525BE77B818F3]) [    ] o.a.s.c.SolrXmlConfig Loading container configuration from /home/jenkins/workspace/Lucene-Solr-6.x-Linux/solr/build/solr-core/test/J0/temp/solr.cloud.SyncSliceTest_3C0525BE77B818F3-001/shard-1-001/solr.xml
   [junit4]   2> 333617 INFO  (TEST-SyncSliceTest.test-seed#[3C0525BE77B818F3]) [    ] o.a.s.u.UpdateShardHandler Creating UpdateShardHandler HTTP client with params: socketTimeout=340000&connTimeout=45000&retry=true
   [junit4]   2> 333619 INFO  (TEST-SyncSliceTest.test-seed#[3C0525BE77B818F3]) [    ] o.a.s.c.ZkContainer Zookeeper client=127.0.0.1:34322/solr
   [junit4]   2> 333626 INFO  (TEST-SyncSliceTest.test-seed#[3C0525BE77B818F3]) [    ] o.a.s.c.c.ZkStateReader Updated live nodes from ZooKeeper... (0) -> (1)
   [junit4]   2> 333628 INFO  (TEST-SyncSliceTest.test-seed#[3C0525BE77B818F3]) [    ] o.a.s.c.ZkController Register node as live in ZooKeeper:/live_nodes/127.0.0.1:37288_
   [junit4]   2> 333629 INFO  (zkCallback-431-thread-1) [    ] o.a.s.c.c.ZkStateReader Updated live nodes from ZooKeeper... (1) -> (2)
   [junit4]   2> 333629 INFO  (zkCallback-427-thread-1) [    ] o.a.s.c.c.ZkStateReader Updated live nodes from ZooKeeper... (1) -> (2)
   [junit4]   2> 333631 INFO  (zkCallback-437-thread-1) [    ] o.a.s.c.c.ZkStateReader Updated live nodes from ZooKeeper... (1) -> (2)
   [junit4]   2> 333814 INFO  (TEST-SyncSliceTest.test-seed#[3C0525BE77B818F3]) [    ] o.a.s.c.CorePropertiesLocator Found 1 core definitions underneath /home/jenkins/workspace/Lucene-Solr-6.x-Linux/solr/build/solr-core/test/J0/../../../../../../../../../home/jenkins/workspace/Lucene-Solr-6.x-Linux/solr/build/solr-core/test/J0/temp/solr.cloud.SyncSliceTest_3C0525BE77B818F3-001/shard-1-001/cores
   [junit4]   2> 333814 INFO  (TEST-SyncSliceTest.test-seed#[3C0525BE77B818F3]) [    ] o.a.s.c.CorePropertiesLocator Cores are: [collection1]
   [junit4]   2> 333816 INFO  (OverseerStateUpdate-97094307762208772-127.0.0.1:42398_-n_0000000000) [    ] o.a.s.c.o.ReplicaMutator Assigning new node to shard shard=shard1
   [junit4]   2> 333918 INFO  (zkCallback-437-thread-1) [    ] o.a.s.c.c.ZkStateReader A cluster state change: [WatchedEvent state:SyncConnected type:NodeDataChanged path:/collections/collection1/state.json] for collection [collection1] has occurred - updating... (live nodes size: [2])
   [junit4]   2> 334827 INFO  (coreLoadExecutor-1092-thread-1) [    ] o.a.s.c.SolrConfig Using Lucene MatchVersion: 6.4.0
   [junit4]   2> 334837 INFO  (coreLoadExecutor-1092-thread-1) [    ] o.a.s.s.IndexSchema [collection1] Schema name=test
   [junit4]   2> 334911 WARN  (coreLoadExecutor-1092-thread-1) [    ] o.a.s.s.IndexSchema [collection1] default search field in schema is text. WARNING: Deprecated, please use 'df' on request instead.
   [junit4]   2> 334913 INFO  (coreLoadExecutor-1092-thread-1) [    ] o.a.s.s.IndexSchema Loaded schema test/1.0 with uniqueid field id
   [junit4]   2> 334922 INFO  (coreLoadExecutor-1092-thread-1) [    ] o.a.s.c.CoreContainer Creating SolrCore 'collection1' using configuration from collection collection1
   [junit4]   2> 334922 INFO  (coreLoadExecutor-1092-thread-1) [    ] o.a.s.c.SolrCore [[collection1] ] Opening new SolrCore at [/home/jenkins/workspace/Lucene-Solr-6.x-Linux/solr/build/solr-core/test/J0/temp/solr.cloud.SyncSliceTest_3C0525BE77B818F3-001/shard-1-001/cores/collection1], dataDir=[/home/jenkins/workspace/Lucene-Solr-6.x-Linux/solr/build/solr-core/test/J0/../../../../../../../../../home/jenkins/workspace/Lucene-Solr-6.x-Linux/solr/build/solr-core/test/J0/temp/solr.cloud.SyncSliceTest_3C0525BE77B818F3-001/shard-1-001/cores/collection1/data/]
   [junit4]   2> 334922 INFO  (coreLoadExecutor-1092-thread-1) [    ] o.a.s.c.JmxMonitoredMap JMX monitoring is enabled. Adding Solr mbeans to JMX Server: com.sun.jmx.mbeanserver.JmxMBeanServer@da8b15
   [junit4]   2> 334924 INFO  (coreLoadExecutor-1092-thread-1) [    ] o.a.s.u.RandomMergePolicy RandomMergePolicy wrapping class org.apache.lucene.index.TieredMergePolicy: [TieredMergePolicy: maxMergeAtOnce=18, maxMergeAtOnceExplicit=27, maxMergedSegmentMB=55.154296875, floorSegmentMB=1.2783203125, forceMergeDeletesPctAllowed=4.897934600205254, segmentsPerTier=14.0, maxCFSSegmentSizeMB=8.796093022207999E12, noCFSRatio=0.13720607069182647
   [junit4]   2> 334927 WARN  (coreLoadExecutor-1092-thread-1) [    ] o.a.s.c.RequestHandlers INVALID paramSet a in requestHandler {type = requestHandler,name = /dump,class = DumpRequestHandler,args = {defaults={a=A,b=B}}}
   [junit4]   2> 334935 INFO  (coreLoadExecutor-1092-thread-1) [    ] o.a.s.u.UpdateHandler Using UpdateLog implementation: org.apache.solr.update.UpdateLog
   [junit4]   2> 334935 INFO  (coreLoadExecutor-1092-thread-1) [    ] o.a.s.u.UpdateLog Initializing UpdateLog: dataDir= defaultSyncLevel=FLUSH numRecordsToKeep=100 maxNumLogsToKeep=10 numVersionBuckets=65536
   [junit4]   2> 334937 INFO  (coreLoadExecutor-1092-thread-1) [    ] o.a.s.u.CommitTracker Hard AutoCommit: disabled
   [junit4]   2> 334938 INFO  (coreLoadExecutor-1092-thread-1) [    ] o.a.s.u.CommitTracker Soft AutoCommit: disabled
   [junit4]   2> 334938 INFO  (coreLoadExecutor-1092-thread-1) [    ] o.a.s.u.RandomMergePolicy RandomMergePolicy wrapping class org.apache.lucene.index.TieredMergePolicy: [TieredMergePolicy: maxMergeAtOnce=31, maxMergeAtOnceExplicit=18, maxMergedSegmentMB=2.0556640625, floorSegmentMB=1.5126953125, forceMergeDeletesPctAllowed=21.572092098393757, segmentsPerTier=39.0, maxCFSSegmentSizeMB=8.796093022207999E12, noCFSRatio=0.3882967066599602
   [junit4]   2> 334938 INFO  (coreLoadExecutor-1092-thread-1) [    ] o.a.s.s.SolrIndexSearcher Opening [Searcher@97072f[collection1] main]
   [junit4]   2> 334939 INFO  (coreLoadExecutor-1092-thread-1) [    ] o.a.s.r.ManagedResourceStorage Configured ZooKeeperStorageIO with znodeBase: /configs/conf1
   [junit4]   2> 334939 INFO  (coreLoadExecutor-1092-thread-1) [    ] o.a.s.r.ManagedResourceStorage Loaded null at path _rest_managed.json using ZooKeeperStorageIO:path=/configs/conf1
   [junit4]   2> 334939 INFO  (coreLoadExecutor-1092-thread-1) [    ] o.a.s.h.ReplicationHandler Commits will be reserved for  10000
   [junit4]   2> 334940 INFO  (searcherExecutor-1093-thread-1) [    ] o.a.s.c.SolrCore [collection1] Registered new searcher Searcher@97072f[collection1] main{ExitableDirectoryReader(UninvertingDirectoryReader())}
   [junit4]   2> 334940 INFO  (coreLoadExecutor-1092-thread-1) [    ] o.a.s.u.UpdateLog Could not find max version in index or recent updates, using new clock 1553508929270448128
   [junit4]   2> 334945 INFO  (coreZkRegister-1087-thread-1) [    ] o.a.s.c.ShardLeaderElectionContext Enough replicas found to continue.
   [junit4]   2> 334945 INFO  (coreZkRegister-1087-thread-1) [    ] o.a.s.c.ShardLeaderElectionContext I may be the new leader - try and sync
   [junit4]   2> 334945 INFO  (coreZkRegister-1087-thread-1) [    ] o.a.s.c.SyncStrategy Sync replicas to http://127.0.0.1:37288/collection1/
   [junit4]   2> 334945 INFO  (coreZkRegister-1087-thread-1) [    ] o.a.s.c.SyncStrategy Sync Success - now sync replicas to me
   [junit4]   2> 334945 INFO  (coreZkRegister-1087-thread-1) [    ] o.a.s.c.SyncStrategy http://127.0.0.1:37288/collection1/ has no replicas
   [junit4]   2> 334947 INFO  (coreZkRegister-1087-thread-1) [    ] o.a.s.c.ShardLeaderElectionContext I am the new leader: http://127.0.0.1:37288/collection1/ shard1
   [junit4]   2> 335049 INFO  (zkCallback-437-thread-1) [    ] o.a.s.c.c.ZkStateReader A cluster state change: [WatchedEvent state:SyncConnected type:NodeDataChanged path:/collections/collection1/state.json] for collection [collection1] has occurred - updating... (live nodes size: [2])
   [junit4]   2> 335098 INFO  (coreZkRegister-1087-thread-1) [    ] o.a.s.c.ZkController I am the leader, no recovery necessary
   [junit4]   2> 335201 INFO  (zkCallback-437-thread-1) [    ] o.a.s.c.c.ZkStateReader A cluster state change: [WatchedEvent state:SyncConnected type:NodeDataChanged path:/collections/collection1/state.json] for collection [collection1] has occurred - updating... (live nodes size: [2])
   [junit4]   2> 335994 INFO  (TEST-SyncSliceTest.test-seed#[3C0525BE77B818F3]) [    ] o.a.s.SolrTestCaseJ4 Writing core.properties file to /home/jenkins/workspace/Lucene-Solr-6.x-Linux/solr/build/solr-core/test/J0/temp/solr.cloud.SyncSliceTest_3C0525BE77B818F3-001/shard-2-001/cores/collection1
   [junit4]   2> 335995 INFO  (TEST-SyncSliceTest.test-seed#[3C0525BE77B818F3]) [    ] o.a.s.c.AbstractFullDistribZkTestBase create jetty 2 in directory /home/jenkins/workspace/Lucene-Solr-6.x-Linux/solr/build/solr-core/test/J0/temp/solr.cloud.SyncSliceTest_3C0525BE77B818F3-001/shard-2-001
   [junit4]   2> 335996 INFO  (TEST-SyncSliceTest.test-seed#[3C0525BE77B818F3]) [    ] o.e.j.s.Server jetty-9.3.14.v20161028
   [junit4]   2> 335997 INFO  (TEST-SyncSliceTest.test-seed#[3C0525BE77B818F3]) [    ] o.e.j.s.h.ContextHandler Started o.e.j.s.ServletContextHandler@e72e4d{/,null,AVAILABLE}
   [junit4]   2> 335997 INFO  (TEST-SyncSliceTest.test-seed#[3C0525BE77B818F3]) [    ] o.e.j.s.AbstractConnector Started ServerConnector@1d76be1{HTTP/1.1,[http/1.1]}{127.0.0.1:41900}
   [junit4]   2> 335998 INFO  (TEST-SyncSliceTest.test-seed#[3C0525BE77B818F3]) [    ] o.e.j.s.Server Started @337658ms
   [junit4]   2> 335998 INFO  (TEST-SyncSliceTest.test-seed#[3C0525BE77B818F3]) [    ] o.a.s.c.s.e.JettySolrRunner Jetty properties: {hostContext=/, solrconfig=solrconfig.xml, solr.data.dir=/home/jenkins/workspace/Lucene-Solr-6.x-Linux/solr/build/solr-core/test/J0/temp/solr.cloud.SyncSliceTest_3C0525BE77B818F3-001/tempDir-001/jetty2, hostPort=41900, coreRootDirectory=/home/jenkins/workspace/Lucene-Solr-6.x-Linux/solr/build/solr-core/test/J0/../../../../../../../../../home/jenkins/workspace/Lucene-Solr-6.x-Linux/solr/build/solr-core/test/J0/temp/solr.cloud.SyncSliceTest_3C0525BE77B818F3-001/shard-2-001/cores}
   [junit4]   2> 335998 ERROR (TEST-SyncSliceTest.test-seed#[3C0525BE77B818F3]) [    ] o.a.s.s.StartupLoggingUtils Missing Java Option solr.log.dir. Logging may be missing or incomplete.
   [junit4]   2> 335998 INFO  (TEST-SyncSliceTest.test-seed#[3C0525BE77B818F3]) [    ] o.a.s.s.SolrDispatchFilter  ___      _       Welcome to Apache Solr™ version 6.4.0
   [junit4]   2> 335998 INFO  (TEST-SyncSliceTest.test-seed#[3C0525BE77B818F3]) [    ] o.a.s.s.SolrDispatchFilter / __| ___| |_ _   Starting in cloud mode on port null
   [junit4]   2> 335998 INFO  (TEST-SyncSliceTest.test-seed#[3C0525BE77B818F3]) [    ] o.a.s.s.SolrDispatchFilter \__ \/ _ \ | '_|  Install dir: null
   [junit4]   2> 335998 INFO  (TEST-SyncSliceTest.test-seed#[3C0525BE77B818F3]) [    ] o.a.s.s.SolrDispatchFilter |___/\___/_|_|    Start time: 2016-12-12T11:19:27.211975Z
   [junit4]   2> 336001 WARN  (NIOServerCxn.Factory:0.0.0.0/0.0.0.0:0) [    ] o.a.z.s.NIOServerCnxn caught end of stream exception
   [junit4]   2> EndOfStreamException: Unable to read additional data from client sessionid 0x158f2c22be1000a, likely client has closed socket
   [junit4]   2> 	at org.apache.zookeeper.server.NIOServerCnxn.doIO(NIOServerCnxn.java:228)
   [junit4]   2> 	at org.apache.zookeeper.server.NIOServerCnxnFactory.run(NIOServerCnxnFactory.java:208)
   [junit4]   2> 	at java.base/java.lang.Thread.run(Thread.java:844)
   [junit4]   2> 336001 INFO  (TEST-SyncSliceTest.test-seed#[3C0525BE77B818F3]) [    ] o.a.s.s.SolrDispatchFilter Loading solr.xml from SolrHome (not found in ZooKeeper)
   [junit4]   2> 336001 INFO  (TEST-SyncSliceTest.test-seed#[3C0525BE77B818F3]) [    ] o.a.s.c.SolrXmlConfig Loading container configuration from /home/jenkins/workspace/Lucene-Solr-6.x-Linux/solr/build/solr-core/test/J0/temp/solr.cloud.SyncSliceTest_3C0525BE77B818F3-001/shard-2-001/solr.xml
   [junit4]   2> 336007 INFO  (TEST-SyncSliceTest.test-seed#[3C0525BE77B818F3]) [    ] o.a.s.u.UpdateShardHandler Creating UpdateShardHandler HTTP client with params: socketTimeout=340000&connTimeout=45000&retry=true
   [junit4]   2> 336009 INFO  (TEST-SyncSliceTest.test-seed#[3C0525BE77B818F3]) [    ] o.a.s.c.ZkContainer Zookeeper client=127.0.0.1:34322/solr
   [junit4]   2> 336015 INFO  (TEST-SyncSliceTest.test-seed#[3C0525BE77B818F3]) [    ] o.a.s.c.c.ZkStateReader Updated live nodes from ZooKeeper... (0) -> (2)
   [junit4]   2> 336016 INFO  (TEST-SyncSliceTest.test-seed#[3C0525BE77B818F3]) [    ] o.a.s.c.ZkController Register node as live in ZooKeeper:/live_nodes/127.0.0.1:41900_
   [junit4]   2> 336017 INFO  (zkCallback-443-thread-1) [    ] o.a.s.c.c.ZkStateReader Updated live nodes from ZooKeeper... (2) -> (3)
   [junit4]   2> 336017 INFO  (zkCallback-437-thread-1) [    ] o.a.s.c.c.ZkStateReader Updated live nodes from ZooKeeper... (2) -> (3)
   [junit4]   2> 336017 INFO  (zkCallback-427-thread-3) [    ] o.a.s.c.c.ZkStateReader Updated live nodes from ZooKeeper... (2) -> (3)
   [junit4]   2> 336018 INFO  (zkCallback-431-thread-1) [    ] o.a.s.c.c.ZkStateReader Updated live nodes from ZooKeeper... (2) -> (3)
   [junit4]   2> 336120 INFO  (zkCallback-437-thread-1) [    ] o.a.s.c.c.ZkStateReader A cluster state change: [WatchedEvent state:SyncConnected type:NodeDataChanged path:/collections/collection1/state.json] for collection [collection1] has occurred - updating... (live nodes size: [3])
   [junit4]   2> 336120 INFO  (TEST-SyncSliceTest.test-seed#[3C0525BE77B818F3]) [    ] o.a.s.c.CorePropertiesLocator Found 1 core definitions underneath /home/jenkins/workspace/Lucene-Solr-6.x-Linux/solr/build/solr-core/test/J0/../../../../../../../../../home/jenkins/workspace/Lucene-Solr-6.x-Linux/solr/build/solr-core/test/J0/temp/solr.cloud.SyncSliceTest_3C0525BE77B818F3-001/shard-2-001/cores
   [junit4]   2> 336120 INFO  (TEST-SyncSliceTest.test-seed#[3C0525BE77B818F3]) [    ] o.a.s.c.CorePropertiesLocator Cores are: [collection1]
   [junit4]   2> 336122 INFO  (OverseerStateUpdate-97094307762208772-127.0.0.1:42398_-n_0000000000) [    ] o.a.s.c.o.ReplicaMutator Assigning new node to shard shard=shard1
   [junit4]   2> 336223 INFO  (zkCallback-437-thread-1) [    ] o.a.s.c.c.ZkStateReader A cluster state change: [WatchedEvent state:SyncConnected type:NodeDataChanged path:/collections/collection1/state.json] for collection [collection1] has occurred - updating... (live nodes size: [3])
   [junit4]   2> 336223 INFO  (zkCallback-443-thread-1) [    ] o.a.s.c.c.ZkStateReader A cluster state change: [WatchedEvent state:SyncConnected type:NodeDataChanged path:/collections/collection1/state.json] for collection [collection1] has occurred - updating... (live nodes size: [3])
   [junit4]   2> 337134 INFO  (coreLoadExecutor-1103-thread-1) [    ] o.a.s.c.SolrConfig Using Lucene MatchVersion: 6.4.0
   [junit4]   2> 337144 INFO  (coreLoadExecutor-1103-thread-1) [    ] o.a.s.s.IndexSchema [collection1] Schema name=test
   [junit4]   2> 337201 WARN  (coreLoadExecutor-1103-thread-1) [    ] o.a.s.s.IndexSchema [collection1] default search field in schema is text. WARNING: Deprecated, please use 'df' on request instead.
   [junit4]   2> 337203 INFO  (coreLoadExecutor-1103-thread-1) [    ] o.a.s.s.IndexSchema Loaded schema test/1.0 with uniqueid field id
   [junit4]   2> 337210 INFO  (coreLoadExecutor-1103-thread-1) [    ] o.a.s.c.CoreContainer Creating SolrCore 'collection1' using configuration from collection collection1
   [junit4]   2> 337211 INFO  (coreLoadExecutor-1103-thread-1) [    ] o.a.s.c.SolrCore [[collection1] ] Opening new SolrCore at [/home/jenkins/workspace/Lucene-Solr-6.x-Linux/solr/build/solr-core/test/J0/temp/solr.cloud.SyncSliceTest_3C0525BE77B818F3-001/shard-2-001/cores/collection1], dataDir=[/home/jenkins/workspace/Lucene-Solr-6.x-Linux/solr/build/solr-core/test/J0/../../../../../../../../../home/jenkins/workspace/Lucene-Solr-6.x-Linux/solr/build/solr-core/test/J0/temp/solr.cloud.SyncSliceTest_3C0525BE77B818F3-001/shard-2-001/cores/collection1/data/]
   [junit4]   2> 337211 INFO  (coreLoadExecutor-1103-thread-1) [    ] o.a.s.c.JmxMonitoredMap JMX monitoring is enabled. Adding Solr mbeans to JMX Server: com.sun.jmx.mbeanserver.JmxMBeanServer@da8b15
   [junit4]   2> 337212 INFO  (coreLoadExecutor-1103-thread-1) [    ] o.a.s.u.RandomMergePolicy RandomMergePolicy wrapping class org.apache.lucene.index.TieredMergePolicy: [TieredMergePolicy: maxMergeAtOnce=18, maxMergeAtOnceExplicit=27, maxMergedSegmentMB=55.154296875, floorSegmentMB=1.2783203125, forceMergeDeletesPctAllowed=4.897934600205254, segmentsPerTier=14.0, maxCFSSegmentSizeMB=8.796093022207999E12, noCFSRatio=0.13720607069182647
   [junit4]   2> 337215 WARN  (coreLoadExecutor-1103-thread-1) [    ] o.a.s.c.RequestHandlers INVALID paramSet a in requestHandler {type = requestHandler,name = /dump,class = DumpRequestHandler,args = {defaults={a=A,b=B}}}
   [junit4]   2> 337221 INFO  (coreLoadExecutor-1103-thread-1) [    ] o.a.s.u.UpdateHandler Using UpdateLog implementation: org.apache.solr.update.UpdateLog
   [junit4]   2> 337221 INFO  (coreLoadExecutor-1103-thread-1) [    ] o.a.s.u.UpdateLog Initializing UpdateLog: dataDir= defaultSyncLevel=FLUSH numRecordsToKeep=100 maxNumLogsToKeep=10 numVersionBuckets=65536
   [junit4]   2> 337224 INFO  (coreLoadExecutor-1103-thread-1) [    ] o.a.s.u.CommitTracker Hard AutoCommit: disabled
   [junit4]   2> 337224 INFO  (coreLoadExecutor-1103-thread-1) [    ] o.a.s.u.CommitTracker Soft AutoCommit: disabled
   [junit4]   2> 337224 INFO  (coreLoadExecutor-1103-thread-1) [    ] o.a.s.u.RandomMergePolicy RandomMergePolicy wrapping class org.apache.lucene.index.TieredMergePolicy: [TieredMergePolicy: maxMergeAtOnce=31, maxMergeAtOnceExplicit=18, maxMergedSegmentMB=2.0556640625, floorSegmentMB=1.5126953125, forceMergeDeletesPctAllowed=21.572092098393757, segmentsPerTier=39.0, maxCFSSegmentSizeMB=8.796093022207999E12, noCFSRatio=0.3882967066599602
   [junit4]   2> 337225 INFO  (coreLoadExecutor-1103-thread-1) [    ] o.a.s.s.SolrIndexSearcher Opening [Searcher@ce37d4[collection1] main]
   [junit4]   2> 337225 INFO  (coreLoadExecutor-1103-thread-1) [    ] o.a.s.r.ManagedResourceStorage Configured ZooKeeperStorageIO with znodeBase: /configs/conf1
   [junit4]   2> 337226 INFO  (coreLoadExecutor-1103-thread-1) [    ] o.a.s.r.ManagedResourceStorage Loaded null at path _rest_managed.json using ZooKeeperStorageIO:path=/configs/conf1
   [junit4]   2> 337226 INFO  (coreLoadExecutor-1103-thread-1) [    ] o.a.s.h.ReplicationHandler Commits will be reserved for  10000
   [junit4]   2> 337227 INFO  (searcherExecutor-1104-thread-1) [    ] o.a.s.c.SolrCore [collection1] Registered new searcher Searcher@ce37d4[collection1] main{ExitableDirectoryReader(UninvertingDirectoryReader())}
   [junit4]   2> 337227 INFO  (coreLoadExecutor-1103-thread-1) [    ] o.a.s.u.UpdateLog Could not find max version in index or recent updates, using new clock 1553508931668541440
   [junit4]   2> 337230 INFO  (coreZkRegister-1098-thread-1) [    ] o.a.s.c.ZkController Core needs to recover:collection1
   [junit4]   2> 337230 INFO  (updateExecutor-440-thread-1) [    ] o.a.s.u.DefaultSolrCoreState Running recovery
   [junit4]   2> 337230 INFO  (recoveryExecutor-441-thread-1) [    ] o.a.s.c.RecoveryStrategy Starting recovery process. recoveringAfterStartup=true
   [junit4]   2> 337231 INFO  (recoveryExecutor-441-thread-1) [    ] o.a.s.c.RecoveryStrategy ###### startupVersions=[[]]
   [junit4]   2> 337231 INFO  (recoveryExecutor-441-thread-1) [    ] o.a.s.c.RecoveryStrategy Begin buffering updates. core=[collection1]
   [junit4]   2> 337231 INFO  (recoveryExecutor-441-thread-1) [    ] o.a.s.u.UpdateLog Starting to buffer updates. FSUpdateLog{state=ACTIVE, tlog=null}
   [junit4]   2> 337231 INFO  (recoveryExecutor-441-thread-1) [    ] o.a.s.c.RecoveryStrategy Publishing state of core [collection1] as recovering, leader is [http://127.0.0.1:37288/collection1/] and I am [http://127.0.0.1:41900/collection1/]
   [junit4]   2> 337233 INFO  (recoveryExecutor-441-thread-1) [    ] o.a.s.c.RecoveryStrategy Sending prep recovery command to [http://127.0.0.1:37288]; [WaitForState: action=PREPRECOVERY&core=collection1&nodeName=127.0.0.1:41900_&coreNodeName=core_node2&state=recovering&checkLive=true&onlyIfLeader=true&onlyIfLeaderActive=true]
   [junit4]   2> 337237 INFO  (qtp27912932-2453) [    ] o.a.s.h.a.PrepRecoveryOp Going to wait for coreNodeName: core_node2, state: recovering, checkLive: true, onlyIfLeader: true, onlyIfLeaderActive: true
   [junit4]   2> 337237 INFO  (qtp27912932-2453) [    ] o.a.s.h.a.PrepRecoveryOp Will wait a max of 183 seconds to see collection1 (shard1 of collection1) have state: recovering
   [junit4]   2> 337237 INFO  (qtp27912932-2453) [    ] o.a.s.h.a.PrepRecoveryOp In WaitForState(recovering): collection=collection1, shard=shard1, thisCore=collection1, leaderDoesNotNeedRecovery=false, isLeader? true, live=true, checkLive=true, currentState=down, localState=active, nodeName=127.0.0.1:41900_, coreNodeName=core_node2, onlyIfActiveCheckResult=false, nodeProps: core_node2:{"core":"collection1","base_url":"http://127.0.0.1:41900","node_name":"127.0.0.1:41900_","state":"down"}
   [junit4]   2> 337333 INFO  (zkCallback-443-thread-1) [    ] o.a.s.c.c.ZkStateReader A cluster state change: [WatchedEvent state:SyncConnected type:NodeDataChanged path:/collections/collection1/state.json] for collection [collection1] has occurred - updating... (live nodes size: [3])
   [junit4]   2> 337333 INFO  (zkCallback-437-thread-1) [    ] o.a.s.c.c.ZkStateReader A cluster state change: [WatchedEvent state:SyncConnected type:NodeDataChanged path:/collections/collection1/state.json] for collection [collection1] has occurred - updating... (live nodes size: [3])
   [junit4]   2> 338238 INFO  (qtp27912932-2453) [    ] o.a.s.h.a.PrepRecoveryOp In WaitForState(recovering): collection=collection1, shard=shard1, thisCore=collection1, leaderDoesNotNeedRecovery=false, isLeader? true, live=true, checkLive=true, currentState=recovering, localState=active, nodeName=127.0.0.1:41900_, coreNodeName=core_node2, onlyIfActiveCheckResult=false, nodeProps: core_node2:{"core":"collection1","base_url":"http://127.0.0.1:41900","node_name":"127.0.0.1:41900_","state":"recovering"}
   [junit4]   2> 338238 INFO  (qtp27912932-2453) [    ] o.a.s.h.a.PrepRecoveryOp Waited coreNodeName: core_node2, state: recovering, checkLive: true, onlyIfLeader: true for: 1 seconds.
   [junit4]   2> 338238 INFO  (qtp27912932-2453) [    ] o.a.s.s.HttpSolrCall [admin] webapp=null path=/admin/cores params={nodeName=127.0.0.1:41900_&onlyIfLeaderActive=true&core=collection1&coreNodeName=core_node2&action=PREPRECOVERY&checkLive=true&state=recovering&onlyIfLeader=true&wt=javabin&version=2} status=0 QTime=1000
   [junit4]   2> 338429 INFO  (TEST-SyncSliceTest.test-seed#[3C0525BE77B818F3]) [    ] o.a.s.SolrTestCaseJ4 Writing core.properties file to /home/jenkins/workspace/Lucene-Solr-6.x-Linux/solr/build/solr-core/test/J0/temp/solr.cloud.SyncSliceTest_3C0525BE77B818F3-001/shard-3-001/cores/collection1
   [junit4]   2> 338431 INFO  (TEST-SyncSliceTest.test-seed#[3C0525BE77B818F3]) [    ] o.a.s.c.AbstractFullDistribZkTestBase create jetty 3 in directory /home/jenkins/workspace/Lucene-Solr-6.x-Linux/solr/build/solr-core/test/J0/temp/solr.cloud.SyncSliceTest_3C0525BE77B818F3-001/shard-3-001
   [junit4]   2> 338431 INFO  (TEST-SyncSliceTest.test-seed#[3C0525BE77B818F3]) [    ] o.e.j.s.Server jetty-9.3.14.v20161028
   [junit4]   2> 338432 INFO  (TEST-SyncSliceTest.test-seed#[3C0525BE77B818F3]) [    ] o.e.j.s.h.ContextHandler Started o.e.j.s.ServletContextHandler@1d74b5a{/,null,AVAILABLE}
   [junit4]   2> 338432 INFO  (TEST-SyncSliceTest.test-seed#[3C0525BE77B818F3]) [    ] o.e.j.s.AbstractConnector Started ServerConnector@1eda3c4{HTTP/1.1,[http/1.1]}{127.0.0.1:35182}
   [junit4]   2> 338432 INFO  (TEST-SyncSliceTest.test-seed#[3C0525BE77B818F3]) [    ] o.e.j.s.Server Started @340093ms
   [junit4]   2> 338432 INFO  (TEST-SyncSliceTest.test-seed#[3C0525BE77B818F3]) [    ] o.a.s.c.s.e.JettySolrRunner Jetty properties: {hostContext=/, solrconfig=solrconfig.xml, solr.data.dir=/home/jenkins/workspace/Lucene-Solr-6.x-Linux/solr/build/solr-core/test/J0/temp/solr.cloud.SyncSliceTest_3C0525BE77B818F3-001/tempDir-001/jetty3, hostPort=35182, coreRootDirectory=/home/jenkins/workspace/Lucene-Solr-6.x-Linux/solr/build/solr-core/test/J0/temp/solr.cloud.SyncSliceTest_3C0525BE77B818F3-001/shard-3-001/cores}
   [junit4]   2> 338433 ERROR (TEST-SyncSliceTest.test-seed#[3C0525BE77B818F3]) [    ] o.a.s.s.StartupLoggingUtils Missing Java Option solr.log.dir. Logging may be missing or incomplete.
   [junit4]   2> 338433 INFO  (TEST-SyncSliceTest.test-seed#[3C0525BE77B818F3]) [    ] o.a.s.s.SolrDispatchFilter  ___      _       Welcome to Apache Solr™ version 6.4.0
   [junit4]   2> 338433 INFO  (TEST-SyncSliceTest.test-seed#[3C0525BE77B818F3]) [    ] o.a.s.s.SolrDispatchFilter / __| ___| |_ _   Starting in cloud mode on port null
   [junit4]   2> 338433 INFO  (TEST-SyncSliceTest.test-seed#[3C0525BE77B818F3]) [    ] o.a.s.s.SolrDispatchFilter \__ \/ _ \ | '_|  Install dir: null
   [junit4]   2> 338433 INFO  (TEST-SyncSliceTest.test-seed#[3C0525BE77B818F3]) [    ] o.a.s.s.SolrDispatchFilter |___/\___/_|_|    Start time: 2016-12-12T11:19:29.646519Z
   [junit4]   2> 338436 INFO  (TEST-SyncSliceTest.test-seed#[3C0525BE77B818F3]) [    ] o.a.s.s.SolrDispatchFilter Loading solr.xml from SolrHome (not found in ZooKeeper)
   [junit4]   2> 338436 INFO  (TEST-SyncSliceTest.test-seed#[3C0525BE77B818F3]) [    ] o.a.s.c.SolrXmlConfig Loading container configuration from /home/jenkins/workspace/Lucene-Solr-6.x-Linux/solr/build/solr-core/test/J0/temp/solr.cloud.SyncSliceTest_3C0525BE77B818F3-001/shard-3-001/solr.xml
   [junit4]   2> 338441 INFO  (TEST-SyncSliceTest.test-seed#[3C0525BE77B818F3]) [    ] o.a.s.u.UpdateShardHandler Creating UpdateShardHandler HTTP client with params: socketTimeout=340000&connTimeout=45000&retry=true
   [junit4]   2> 338443 INFO  (TEST-SyncSliceTest.test-seed#[3C0525BE77B818F3]) [    ] o.a.s.c.ZkContainer Zookeeper client=127.0.0.1:34322/solr
   [junit4]   2> 338449 INFO  (TEST-SyncSliceTest.test-seed#[3C0525BE77B818F3]) [    ] o.a.s.c.c.ZkStateReader Updated live nodes from ZooKeeper... (0) -> (3)
   [junit4]   2> 338451 INFO  (TEST-SyncSliceTest.test-seed#[3C0525BE77B818F3]) [    ] o.a.s.c.ZkController Register node as live in ZooKeeper:/live_nodes/127.0.0.1:35182_
   [junit4]   2> 338451 INFO  (zkCallback-427-thread-3) [    ] o.a.s.c.c.ZkStateReader Updated live nodes from ZooKeeper... (3) -> (4)
   [junit4]   2> 338452 INFO  (zkCallback-450-thread-1) [    ] o.a.s.c.c.ZkStateReader Updated live nodes from ZooKeeper... (3) -> (4)
   [junit4]   2> 338452 INFO  (zkCallback-437-thread-1) [    ] o.a.s.c.c.ZkStateReader Updated live nodes from ZooKeeper... (3) -> (4)
   [junit4]   2> 338452 INFO  (zkCallback-443-thread-1) [    ] o.a.s.c.c.ZkStateReader Updated live nodes from ZooKeeper... (3) -> (4)
   [junit4]   2> 338452 INFO  (zkCallback-431-thread-1) [    ] o.a.s.c.c.ZkStateReader Updated live nodes from ZooKeeper... (3) -> (4)
   [junit4]   2> 338554 INFO  (zkCallback-437-thread-1) [    ] o.a.s.c.c.ZkStateReader A cluster state change: [WatchedEvent state:SyncConnected type:NodeDataChanged path:/collections/collection1/state.json] for collection [collection1] has occurred - updating... (live nodes size: [4])
   [junit4]   2> 338554 INFO  (zkCallback-443-thread-1) [    ] o.a.s.c.c.ZkStateReader A cluster state change: [WatchedEvent state:SyncConnected type:NodeDataChanged path:/collections/collection1/state.json] for collection [collection1] has occurred - updating... (live nodes size: [4])
   [junit4]   2> 338612 INFO  (TEST-SyncSliceTest.test-seed#[3C0525BE77B818F3]) [    ] o.a.s.c.CorePropertiesLocator Found 1 core definitions underneath /home/jenkins/workspace/Lucene-Solr-6.x-Linux/solr/build/solr-core/test/J0/temp/solr.cloud.SyncSliceTest_3C0525BE77B818F3-001/shard-3-001/cores
   [junit4]   2> 338612 INFO  (TEST-SyncSliceTest.test-seed#[3C0525BE77B818F3]) [    ] o.a.s.c.CorePropertiesLocator Cores are: [collection1]
   [junit4]   2> 338615 INFO  (OverseerStateUpdate-97094307762208772-127.0.0.1:42398_-n_0000000000) [    ] o.a.s.c.o.ReplicaMutator Assigning new node to shard shard=shard1
   [junit4]   2> 338716 INFO  (zkCallback-443-thread-1) [    ] o.a.s.c.c.ZkStateReader A cluster state change: [WatchedEvent state:SyncConnected type:NodeDataChanged path:/collections/collection1/state.json] for collection [collection1] has occurred - updating... (live nodes size: [4])
   [junit4]   2> 338716 INFO  (zkCallback-450-thread-1) [    ] o.a.s.c.c.ZkStateReader A cluster state change: [WatchedEvent state:SyncConnected type:NodeDataChanged path:/collections/collection1/state.json] for collection [collection1] has occurred - updating... (live nodes size: [4])
   [junit4]   2> 338716 INFO  (zkCallback-437-thread-1) [    ] o.a.s.c.c.ZkStateReader A cluster state change: [WatchedEvent state:SyncConnected type:NodeDataChanged path:/collections/collection1/state.json] for collection [collection1] has occurred - updating... (live nodes size: [4])
   [junit4]   2> 339634 INFO  (coreLoadExecutor-1114-thread-1) [    ] o.a.s.c.SolrConfig Using Lucene MatchVersion: 6.4.0
   [junit4]   2> 339646 INFO  (coreLoadExecutor-1114-thread-1) [    ] o.a.s.s.IndexSchema [collection1] Schema name=test
   [junit4]   2> 339699 WARN  (coreLoadExecutor-1114-thread-1) [    ] o.a.s.s.IndexSchema [collection1] default search field in schema is text. WARNING: Deprecated, please use 'df' on request instead.
   [junit4]   2> 339700 INFO  (coreLoadExecutor-1114-thread-1) [    ] o.a.s.s.IndexSchema Loaded schema test/1.0 with uniqueid field id
   [junit4]   2> 339708 INFO  (coreLoadExecutor-1114-thread-1) [    ] o.a.s.c.CoreContainer Creating SolrCore 'collection1' using configuration from collection collection1
   [junit4]   2> 339708 INFO  (coreLoadExecutor-1114-thread-1) [    ] o.a.s.c.SolrCore [[collection1] ] Opening new SolrCore at [/home/jenkins/workspace/Lucene-Solr-6.x-Linux/solr/build/solr-core/test/J0/temp/solr.cloud.SyncSliceTest_3C0525BE77B818F3-001/shard-3-001/cores/collection1], dataDir=[/home/jenkins/workspace/Lucene-Solr-6.x-Linux/solr/build/solr-core/test/J0/temp/solr.cloud.SyncSliceTest_3C0525BE77B818F3-001/shard-3-001/cores/collection1/data/]
   [junit4]   2> 339708 INFO  (coreLoadExecutor-1114-thread-1) [    ] o.a.s.c.JmxMonitoredMap JMX monitoring is enabled. Adding Solr mbeans to JMX Server: com.sun.jmx.mbeanserver.JmxMBeanServer@da8b15
   [junit4]   2> 339709 INFO  (coreLoadExecutor-1114-thread-1) [    ] o.a.s.u.RandomMergePolicy RandomMergePolicy wrapping class org.apache.lucene.index.TieredMergePolicy: [TieredMergePolicy: maxMergeAtOnce=18, maxMergeAtOnceExplicit=27, maxMergedSegmentMB=55.154296875, floorSegmentMB=1.2783203125, forceMergeDeletesPctAllowed=4.897934600205254, segmentsPerTier=14.0, maxCFSSegmentSizeMB=8.796093022207999E12, noCFSRatio=0.13720607069182647
   [junit4]   2> 339712 WARN  (coreLoadExecutor-1114-thread-1) [    ] o.a.s.c.RequestHandlers INVALID paramSet a in requestHandler {type = requestHandler,name = /dump,class = DumpRequestHandler,args = {defaults={a=A,b=B}}}
   [junit4]   2> 339719 INFO  (coreLoadExecutor-1114-thread-1) [    ] o.a.s.u.UpdateHandler Using UpdateLog implementation: org.apache.solr.update.UpdateLog
   [junit4]   2> 339719 INFO  (coreLoadExecutor-1114-thread-1) [    ] o.a.s.u.UpdateLog Initializing UpdateLog: dataDir= defaultSyncLevel=FLUSH numRecordsToKeep=100 maxNumLogsToKeep=10 numVersionBuckets=65536
   [junit4]   2> 339721 INFO  (coreLoadExecutor-1114-thread-1) [    ] o.a.s.u.CommitTracker Hard AutoCommit: disabled
   [junit4]   2> 339721 INFO  (coreLoadExecutor-1114-thread-1) [    ] o.a.s.u.CommitTracker Soft AutoCommit: disabled
   [junit4]   2> 339721 INFO  (coreLoadExecutor-1114-thread-1) [    ] o.a.s.u.RandomMergePolicy RandomMergePolicy wrapping class org.apache.lucene.index.TieredMergePolicy: [TieredMergePolicy: maxMergeAtOnce=31, maxMergeAtOnceExplicit=18, maxMergedSegmentMB=2.0556640625, floorSegmentMB=1.5126953125, forceMergeDeletesPctAllowed=21.572092098393757, segmentsPerTier=39.0, maxCFSSegmentSizeMB=8.796093022207999E12, noCFSRatio=0.3882967066599602
   [junit4]   2> 339721 INFO  (coreLoadExecutor-1114-thread-1) [    ] o.a.s.s.SolrIndexSearcher Opening [Searcher@dc563a[collection1] main]
   [junit4]   2> 339722 INFO  (coreLoadExecutor-1114-thread-1) [    ] o.a.s.r.ManagedResourceStorage Configured ZooKeeperStorageIO with znodeBase: /configs/conf1
   [junit4]   2> 339722 INFO  (coreLoadExecutor-1114-thread-1) [    ] o.a.s.r.ManagedResourceStorage Loaded null at path _rest_managed.json using ZooKeeperStorageIO:path=/configs/conf1
   [junit4]   2> 339722 INFO  (coreLoadExecutor-1114-thread-1) [    ] o.a.s.h.ReplicationHandler Commits will be reserved for  10000
   [junit4]   2> 339723 INFO  (searcherExecutor-1115-thread-1) [    ] o.a.s.c.SolrCore [collection1] Registered new searcher Searcher@dc563a[collection1] main{ExitableDirectoryReader(UninvertingDirectoryReader())}
   [junit4]   2> 339723 INFO  (coreLoadExecutor-1114-thread-1) [    ] o.a.s.u.UpdateLog Could not find max version in index or recent updates, using new clock 1553508934285787136
   [junit4]   2> 339726 INFO  (coreZkRegister-1109-thread-1) [    ] o.a.s.c.ZkController Core needs to recover:collection1
   [junit4]   2> 339726 INFO  (updateExecutor-447-thread-1) [    ] o.a.s.u.DefaultSolrCoreState Running recovery
   [junit4]   2> 339726 INFO  (recoveryExecutor-448-thread-1) [    ] o.a.s.c.RecoveryStrategy Starting recovery process. recoveringAfterStartup=true
   [junit4]   2> 339726 INFO  (recoveryExecutor-448-thread-1) [    ] o.a.s.c.RecoveryStrategy ###### startupVersions=[[]]
   [junit4]   2> 339727 INFO  (recoveryExecutor-448-thread-1) [    ] o.a.s.c.RecoveryStrategy Begin buffering updates. core=[collection1]
   [junit4]   2> 339727 INFO  (recoveryExecutor-448-thread-1) [    ] o.a.s.u.UpdateLog Starting to buffer updates. FSUpdateLog{state=ACTIVE, tlog=null}
   [junit4]   2> 339727 INFO  (recoveryExecutor-448-thread-1) [    ] o.a.s.c.RecoveryStrategy Publishing state of core [collection1] as recovering, leader is [http://127.0.0.1:37288/collection1/] and I am [http://127.0.0.1:35182/collection1/]
   [junit4]   2> 339728 INFO  (recoveryExecutor-448-thread-1) [    ] o.a.s.c.RecoveryStrategy Sending prep recovery command to [http://127.0.0.1:37288]; [WaitForState: action=PREPRECOVERY&core=collection1&nodeName=127.0.0.1:35182_&coreNodeName=core_node3&state=recovering&checkLive=true&onlyIfLeader=true&onlyIfLeaderActive=true]
   [junit4]   2> 339729 INFO  (qtp27912932-2453) [    ] o.a.s.h.a.PrepRecoveryOp Going to wait for coreNodeName: core_node3, state: recovering, checkLive: true, onlyIfLeader: true, onlyIfLeaderActive: true
   [junit4]   2> 339730 INFO  (qtp27912932-2453) [    ] o.a.s.h.a.PrepRecoveryOp Will wait a max of 183 seconds to see collection1 (shard1 of collection1) have state: recovering
   [junit4]   2> 339730 INFO  (qtp27912932-2453) [    ] o.a.s.h.a.PrepRecoveryOp In WaitForState(recovering): collection=collection1, shard=shard1, thisCore=collection1, leaderDoesNotNeedRecovery=false, isLeader? true, live=true, checkLive=true, currentState=down, localState=active, nodeName=127.0.0.1:35182_, coreNodeName=core_node3, onlyIfActiveCheckResult=false, nodeProps: core_node3:{"core":"collection1","base_url":"http://127.0.0.1:35182","node_name":"127.0.0.1:35182_","state":"down"}
   [junit4]   2> 339829 INFO  (zkCallback-437-thread-1) [    ] o.a.s.c.c.ZkStateReader A cluster state change: [WatchedEvent state:SyncConnected type:NodeDataChanged path:/collections/collection1/state.json] for collection [collection1] has occurred - updating... (live nodes size: [4])
   [junit4]   2> 339829 INFO  (zkCallback-450-thread-1) [    ] o.a.s.c.c.ZkStateReader A cluster state change: [WatchedEvent state:SyncConnected type:NodeDataChanged path:/collections/collection1/state.json] for collection [collection1] has occurred - updating... (live nodes size: [4])
   [junit4]   2> 339829 INFO  (zkCallback-443-thread-1) [    ] o.a.s.c.c.ZkStateReader A cluster state change: [WatchedEvent state:SyncConnected type:NodeDataChanged path:/collections/collection1/state.json] for collection [collection1] has occurred - updating... (live nodes size: [4])
   [junit4]   2> 340730 INFO  (qtp27912932-2453) [    ] o.a.s.h.a.PrepRecoveryOp In WaitForState(recovering): collection=collection1, shard=shard1, thisCore=collection1, leaderDoesNotNeedRecovery=false, isLeader? true, live=true, checkLive=true, currentState=recovering, localState=active, nodeName=127.0.0.1:35182_, coreNodeName=core_node3, onlyIfActiveCheckResult=false, nodeProps: core_node3:{"core":"collection1","base_url":"http://127.0.0.1:35182","node_name":"127.0.0.1:35182_","state":"recovering"}
   [junit4]   2> 340730 INFO  (qtp27912932-2453) [    ] o.a.s.h.a.PrepRecoveryOp Waited coreNodeName: core_node3, state: recovering, checkLive: true, onlyIfLeader: true for: 1 seconds.
   [junit4]   2> 340730 INFO  (qtp27912932-2453) [    ] o.a.s.s.HttpSolrCall [admin] webapp=null path=/admin/cores params={nodeName=127.0.0.1:35182_&onlyIfLeaderActive=true&core=collection1&coreNodeName=core_node3&action=PREPRECOVERY&checkLive=true&state=recovering&onlyIfLeader=true&wt=javabin&version=2} status=0 QTime=1000
   [junit4]   2> 340798 INFO  (TEST-SyncSliceTest.test-seed#[3C0525BE77B818F3]) [    ] o.a.s.SolrTestCaseJ4 Writing core.properties file to /home/jenkins/workspace/Lucene-Solr-6.x-Linux/solr/build/solr-core/test/J0/temp/solr.cloud.SyncSliceTest_3C0525BE77B818F3-001/shard-4-001/cores/collection1
   [junit4]   2> 340799 INFO  (TEST-SyncSliceTest.test-seed#[3C0525BE77B818F3]) [    ] o.a.s.c.AbstractFullDistribZkTestBase create jetty 4 in directory /home/jenkins/workspace/Lucene-Solr-6.x-Linux/solr/build/solr-core/test/J0/temp/solr.cloud.SyncSliceTest_3C0525BE77B818F3-001/shard-4-001
   [junit4]   2> 340800 INFO  (TEST-SyncSliceTest.test-seed#[3C0525BE77B818F3]) [    ] o.e.j.s.Server jetty-9.3.14.v20161028
   [junit4]   2> 340801 INFO  (TEST-SyncSliceTest.test-seed#[3C0525BE77B818F3]) [    ] o.e.j.s.h.ContextHandler Started o.e.j.s.ServletContextHandler@cd4049{/,null,AVAILABLE}
   [junit4]   2> 340801 INFO  (TEST-SyncSliceTest.test-seed#[3C0525BE77B818F3]) [    ] o.e.j.s.AbstractConnector Started ServerConnector@1b3cbc9{HTTP/1.1,[http/1.1]}{127.0.0.1:44477}
   [junit4]   2> 340802 INFO  (TEST-SyncSliceTest.test-seed#[3C0525BE77B818F3]) [    ] o.e.j.s.Server Started @342462ms
   [junit4]   2> 340802 INFO  (TEST-SyncSliceTest.test-seed#[3C0525BE77B818F3]) [    ] o.a.s.c.s.e.JettySolrRunner Jetty properties: {hostContext=/, solrconfig=solrconfig.xml, solr.data.dir=/home/jenkins/workspace/Lucene-Solr-6.x-Linux/solr/build/solr-core/test/J0/temp/solr.cloud.SyncSliceTest_3C0525BE77B818F3-001/tempDir-001/jetty4, hostPort=44477, coreRootDirectory=/home/jenkins/workspace/Lucene-Solr-6.x-Linux/solr/build/solr-core/test/J0/../../../../../../../../../home/jenkins/workspace/Lucene-Solr-6.x-Linux/solr/build/solr-core/test/J0/temp/solr.cloud.SyncSliceTest_3C0525BE77B818F3-001/shard-4-001/cores}
   [junit4]   2> 340802 ERROR (TEST-SyncSliceTest.test-seed#[3C0525BE77B818F3]) [    ] o.a.s.s.StartupLoggingUtils Missing Java Option solr.log.dir. Logging may be missing or incomplete.
   [junit4]   2> 340802 INFO  (TEST-SyncSliceTest.test-seed#[3C0525BE77B818F3]) [    ] o.a.s.s.SolrDispatchFilter  ___      _       Welcome to Apache Solr™ version 6.4.0
   [junit4]   2> 340802 INFO  (TEST-SyncSliceTest.test-seed#[3C0525BE77B818F3]) [    ] o.a.s.s.SolrDispatchFilter / __| ___| |_ _   Starting in cloud mode on port null
   [junit4]   2> 340802 INFO  (TEST-SyncSliceTest.test-seed#[3C0525BE77B818F3]) [    ] o.a.s.s.SolrDispatchFilter \__ \/ _ \ | '_|  Install dir: null
   [junit4]   2> 340802 INFO  (TEST-SyncSliceTest.test-seed#[3C0525BE77B818F3]) [    ] o.a.s.s.SolrDispatchFilter |___/\___/_|_|    Start time: 2016-12-12T11:19:32.015688Z
   [junit4]   2> 340805 INFO  (TEST-SyncSliceTest.test-seed#[3C0525BE77B818F3]) [    ] o.a.s.s.SolrDispatchFilter Loading solr.xml from SolrHome (not found in ZooKeeper)
   [junit4]   2> 340806 INFO  (TEST-SyncSliceTest.test-seed#[3C0525BE77B818F3]) [    ] o.a.s.c.SolrXmlConfig Loading container configuration from /home/jenkins/workspace/Lucene-Solr-6.x-Linux/solr/build/solr-core/test/J0/temp/solr.cloud.SyncSliceTest_3C0525BE77B818F3-001/shard-4-001/solr.xml
   [junit4]   2> 340813 INFO  (TEST-SyncSliceTest.test-seed#[3C0525BE77B818F3]) [    ] o.a.s.u.UpdateShardHandler Creating UpdateShardHandler HTTP client with params: socketTimeout=340000&connTimeout=45000&retry=true
   [junit4]   2> 340814 INFO  (TEST-SyncSliceTest.test-seed#[3C0525BE77B818F3]) [    ] o.a.s.c.ZkContainer Zookeeper client=127.0.0.1:34322/solr
   [junit4]   2> 340822 INFO  (TEST-SyncSliceTest.test-seed#[3C0525BE77B818F3]) [    ] o.a.s.c.c.ZkStateReader Updated live nodes from ZooKeeper... (0) -> (4)
   [junit4]   2> 340825 INFO  (TEST-SyncSliceTest.test-seed#[3C0525BE77B818F3]) [    ] o.a.s.c.ZkController Register node as live in ZooKeeper:/live_nodes/127.0.0.1:44477_
   [junit4]   2> 340826 INFO  (zkCallback-437-thread-1) [    ] o.a.s.c.c.ZkStateReader Updated live nodes from ZooKeeper... (4) -> (5)
   [junit4]   2> 340826 INFO  (zkCallback-443-thread-1) [    ] o.a.s.c.c.ZkStateReader Updated live nodes from ZooKeeper... (4) -> (5)
   [junit4]   2> 340827 INFO  (zkCallback-427-thread-3) [    ] o.a.s.c.c.ZkStateReader Updated live nodes from ZooKeeper... (4) -> (5)
   [junit4]   2> 340827 INFO  (zkCallback-450-thread-1) [    ] o.a.s.c.c.ZkStateReader Updated live nodes from ZooKeeper... (4) -> (5)
   [junit4]   2> 340827 INFO  (zkCallback-457-thread-1) [    ] o.a.s.c.c.ZkStateReader Updated live nodes from ZooKeeper... (4) -> (5)
   [junit4]   2> 340827 INFO  (zkCallback-431-thread-1) [    ] o.a.s.c.c.ZkStateReader Updated live nodes from ZooKeeper... (4) -> (5)
   [junit4]   2> 340917 INFO  (TEST-SyncSliceTest.test-seed#[3C0525BE77B818F3]) [    ] o.a.s.c.CorePropertiesLocator Found 1 core definitions underneath /home/jenkins/workspace/Lucene-Solr-6.x-Linux/solr/build/solr-core/test/J0/../../../../../../../../../home/jenkins/workspace/Lucene-Solr-6.x-Linux/solr/build/solr-core/test/J0/temp/solr.cloud.SyncSliceTest_3C0525BE77B818F3-001/shard-4-001/cores
   [junit4]   2> 340917 INFO  (TEST-SyncSliceTest.test-seed#[3C0525BE77B818F3]) [    ] o.a.s.c.CorePropertiesLocator Cores are: [collection1]
   [junit4]   2> 340921 INFO  (OverseerStateUpdate-97094307762208772-127.0.0.1:42398_-n_0000000000) [    ] o.a.s.c.o.ReplicaMutator Assigning new node to shard shard=shard1
   [junit4]   2> 341022 INFO  (zkCallback-443-thread-1) [    ] o.a.s.c.c.ZkStateReader A cluster state change: [WatchedEvent state:SyncConnected type:NodeDataChanged path:/collections/collection1/state.json] for collection [collection1] has occurred - updating... (live nodes size: [5])
   [junit4]   2> 341022 INFO  (zkCallback-437-thread-1) [    ] o.a.s.c.c.ZkStateReader A cluster state change: [WatchedEvent state:SyncConnected type:NodeDataChanged path:/collections/collection1/state.json] for collection [collection1] has occurred - updating... (live nodes size: [5])
   [junit4]   2> 341022 INFO  (zkCallback-450-thread-1) [    ] o.a.s.c.c.ZkStateReader A cluster state change: [WatchedEvent state:SyncConnected type:NodeDataChanged path:/collections/collection1/state.json] for collection [collection1] has occurred - updating... (live nodes size: [5])
   [junit4]   2> 341023 INFO  (zkCallback-457-thread-1) [    ] o.a.s.c.c.ZkStateReader A cluster state change: [WatchedEvent state:SyncConnected type:NodeDataChanged path:/collections/collection1/state.json] for collection [collection1] has occurred - updating... (live nodes size: [5])
   [junit4]   2> 341930 INFO  (coreLoadExecutor-1125-thread-1) [    ] o.a.s.c.SolrConfig Using Lucene MatchVersion: 6.4.0
   [junit4]   2> 341940 INFO  (coreLoadExecutor-1125-thread-1) [    ] o.a.s.s.IndexSchema [collection1] Schema name=test
   [junit4]   2> 342020 WARN  (coreLoadExecutor-1125-thread-1) [    ] o.a.s.s.IndexSchema [collection1] default search field in schema is text. WARNING: Deprecated, please use 'df' on request instead.
   [junit4]   2> 342022 INFO  (coreLoadExecutor-1125-thread-1) [    ] o.a.s.s.IndexSchema Loaded schema test/1.0 with uniqueid field id
   [junit4]   2> 342028 INFO  (coreLoadExecutor-1125-thread-1) [    ] o.a.s.c.CoreContainer Creating SolrCore 'collection1' using configuration from collection collection1
   [junit4]   2> 342028 INFO  (coreLoadExecutor-1125-thread-1) [    ] o.a.s.c.SolrCore [[collection1] ] Opening new SolrCore at [/home/jenkins/workspace/Lucene-Solr-6.x-Linux/solr/build/solr-core/test/J0/temp/solr.cloud.SyncSliceTest_3C0525BE77B818F3-001/shard-4-001/cores/collection1], dataDir=[/home/jenkins/workspace/Lucene-Solr-6.x-Linux/solr/build/solr-core/test/J0/../../../../../../../../../home/jenkins/workspace/Lucene-Solr-6.x-Linux/solr/build/solr-core/test/J0/temp/solr.cloud.SyncSliceTest_3C0525BE77B818F3-001/shard-4-001/cores/collection1/data/]
   [junit4]   2> 342028 INFO  (coreLoadExecutor-1125-thread-1) [    ] o.a.s.c.JmxMonitoredMap JMX monitoring is enabled. Adding Solr mbeans to JMX Server: com.sun.jmx.mbeanserver.JmxMBeanServer@da8b15
   [junit4]   2> 342029 INFO  (coreLoadExecutor-1125-thread-1) [    ] o.a.s.u.RandomMergePolicy RandomMergePolicy wrapping class org.apache.lucene.index.TieredMergePolicy: [TieredMergePolicy: maxMergeAtOnce=18, maxMergeAtOnceExplicit=27, maxMergedSegmentMB=55.154296875, floorSegmentMB=1.2783203125, forceMergeDeletesPctAllowed=4.897934600205254, segmentsPerTier=14.0, maxCFSSegmentSizeMB=8.796093022207999E12, noCFSRatio=0.13720607069182647
   [junit4]   2> 342032 WARN  (coreLoadExecutor-1125-thread-1) [    ] o.a.s.c.RequestHandlers INVALID paramSet a in requestHandler {type = requestHandler,name = /dump,class = DumpRequestHandler,args = {defaults={a=A,b=B}}}
   [junit4]   2> 342039 INFO  (coreLoadExecutor-1125-thread-1) [    ] o.a.s.u.UpdateHandler Using UpdateLog implementation: org.apache.solr.update.UpdateLog
   [junit4]   2> 342039 INFO  (coreLoadExecutor-1125-thread-1) [    ] o.a.s.u.UpdateLog Initializing UpdateLog: dataDir= defaultSyncLevel=FLUSH numRecordsToKeep=100 maxNumLogsToKeep=10 numVersionBuckets=65536
   [junit4]   2> 342041 INFO  (coreLoadExecutor-1125-thread-1) [    ] o.a.s.u.CommitTracker Hard AutoCommit: disabled
   [junit4]   2> 342041 INFO  (coreLoadExecutor-1125-thread-1) [    ] o.a.s.u.CommitTracker Soft AutoCommit: disabled
   [junit4]   2> 342041 INFO  (coreLoadExecutor-1125-thread-1) [    ] o.a.s.u.RandomMergePolicy RandomMergePolicy wrapping class org.apache.lucene.index.TieredMergePolicy: [TieredMergePolicy: maxMergeAtOnce=31, maxMergeAtOnceExplicit=18, maxMergedSegmentMB=2.0556640625, floorSegmentMB=1.5126953125, forceMergeDeletesPctAllowed=21.572092098393757, segmentsPerTier=39.0, maxCFSSegmentSizeMB=8.796093022207999E12, noCFSRatio=0.3882967066599602
   [junit4]   2> 342042 INFO  (coreLoadExecutor-1125-thread-1) [    ] o.a.s.s.SolrIndexSearcher Opening [Searcher@cd0bc1[collection1] main]
   [junit4]   2> 342042 INFO  (coreLoadExecutor-1125-thread-1) [    ] o.a.s.r.ManagedResourceStorage Configured ZooKeeperStorageIO with znodeBase: /configs/conf1
   [junit4]   2> 342042 INFO  (coreLoadExecutor-1125-thread-1) [    ] o.a.s.r.ManagedResourceStorage Loaded null at path _rest_managed.json using ZooKeeperStorageIO:path=/configs/conf1
   [junit4]   2> 342042 INFO  (coreLoadExecutor-1125-thread-1) [    ] o.a.s.h.ReplicationHandler Commits will be reserved for  10000
   [junit4]   2> 342043 INFO  (searcherExecutor-1126-thread-1) [    ] o.a.s.c.SolrCore [collection1] Registered new searcher Searcher@cd0bc1[collection1] main{ExitableDirectoryReader(UninvertingDirectoryReader())}
   [junit4]   2> 342043 INFO  (coreLoadExecutor-1125-thread-1) [    ] o.a.s.u.UpdateLog Could not find max version in index or recent updates, using new clock 1553508936718483456
   [junit4]   2> 342046 INFO  (coreZkRegister-1120-thread-1) [    ] o.a.s.c.ZkController Core needs to recover:collection1
   [junit4]   2> 342046 INFO  (updateExecutor-454-thread-1) [    ] o.a.s.u.DefaultSolrCoreState Running recovery
   [junit4]   2> 342046 INFO  (recoveryExecutor-455-thread-1) [    ] o.a.s.c.RecoveryStrategy Starting recovery process. recoveringAfterStartup=true
   [junit4]   2> 342047 INFO  (recoveryExecutor-455-thread-1) [    ] o.a.s.c.RecoveryStrategy ###### startupVersions=[[]]
   [junit4]   2> 342047 INFO  (recoveryExecutor-455-thread-1) [    ] o.a.s.c.RecoveryStrategy Begin buffering updates. core=[collection1]
   [junit4]   2> 342047 INFO  (recoveryExecutor-455-thread-1) [    ] o.a.s.u.UpdateLog Starting to buffer updates. FSUpdateLog{state=ACTIVE, tlog=null}
   [junit4]   2> 342047 INFO  (recoveryExecutor-455-thread-1) [    ] o.a.s.c.RecoveryStrategy Publishing state of core [collection1] as recovering, leader is [http://127.0.0.1:37288/collection1/] and I am [http://127.0.0.1:44477/collection1/]
   [junit4]   2> 342049 INFO  (recoveryExecutor-455-thread-1) [    ] o.a.s.c.RecoveryStrategy Sending prep recovery command to [http://127.0.0.1:37288]; [WaitForState: action=PREPRECOVERY&core=collection1&nodeName=127.0.0.1:44477_&coreNodeName=core_node4&state=recovering&checkLive=true&onlyIfLeader=true&onlyIfLeaderActive=true]
   [junit4]   2> 342051 INFO  (qtp27912932-2453) [    ] o.a.s.h.a.PrepRecoveryOp Going to wait for coreNodeName: core_node4, state: recovering, checkLive: true, onlyIfLeader: true, onlyIfLeaderActive: true
   [junit4]   2> 342051 INFO  (qtp27912932-2453) [    ] o.a.s.h.a.PrepRecoveryOp Will wait a max of 183 seconds to see collection1 (shard1 of collection1) have state: recovering
   [junit4]   2> 342051 INFO  (qtp27912932-2453) [    ] o.a.s.h.a.PrepRecoveryOp In WaitForState(recovering): collection=collection1, shard=shard1, thisCore=collection1, leaderDoesNotNeedRecovery=false, isLeader? true, live=true, checkLive=true, currentState=down, localState=active, nodeName=127.0.0.1:44477_, coreNodeName=core_node4, onlyIfActiveCheckResult=false, nodeProps: core_node4:{"core":"collection1","base_url":"http://127.0.0.1:44477","node_name":"127.0.0.1:44477_","state":"down"}
   [junit4]   2> 342149 INFO  (zkCallback-437-thread-1) [    ] o.a.s.c.c.ZkStateReader A cluster state change: [WatchedEvent state:SyncConnected type:NodeDataChanged path:/collections/collection1/state.json] for collection [collection1] has occurred - updating... (live nodes size: [5])
   [junit4]   2> 342149 INFO  (zkCallback-457-thread-1) [    ] o.a.s.c.c.ZkStateReader A cluster state change: [WatchedEvent state:SyncConnected type:NodeDataChanged path:/collections/collection1/state.json] for collection [collection1] has occurred - updating... (live nodes size: [5])
   [junit4]   2> 342149 INFO  (zkCallback-443-thread-1) [    ] o.a.s.c.c.ZkStateReader A cluster state change: [WatchedEvent state:SyncConnected type:NodeDataChanged path:/collections/collection1/state.json] for collection [collection1] has occurred - updating... (live nodes size: [5])
   [junit4]   2> 342149 INFO  (zkCallback-450-thread-1) [    ] o.a.s.c.c.ZkStateReader A cluster state change: [WatchedEvent state:SyncConnected type:NodeDataChanged path:/collections/collection1/state.json] for collection [collection1] has occurred - updating... (live nodes size: [5])
   [junit4]   2> 342423 INFO  (TEST-SyncSliceTest.test-seed#[3C0525BE77B818F3]) [    ] o.a.s.SolrTestCaseJ4 ###Starting test
   [junit4]   2> 342423 INFO  (TEST-SyncSliceTest.test-seed#[3C0525BE77B818F3]) [    ] o.a.s.c.AbstractFullDistribZkTestBase Wait for recoveries to finish - wait 30 for each attempt
   [junit4]   2> 342423 INFO  (TEST-SyncSliceTest.test-seed#[3C0525BE77B818F3]) [    ] o.a.s.c.AbstractDistribZkTestBase Wait for recoveries to finish - collection: collection1 failOnTimeout:true timeout (sec):30
   [junit4]   2> 343051 INFO  (qtp27912932-2453) [    ] o.a.s.h.a.PrepRecoveryOp In WaitForState(recovering): collection=collection1, shard=shard1, thisCore=collection1, leaderDoesNotNeedRecovery=false, isLeader? true, live=true, checkLive=true, currentState=recovering, localState=active, nodeName=127.0.0.1:44477_, coreNodeName=core_node4, onlyIfActiveCheckResult=false, nodeProps: core_node4:{"core":"collection1","base_url":"http://127.0.0.1:44477","node_name":"127.0.0.1:44477_","state":"recovering"}
   [junit4]   2> 343051 INFO  (qtp27912932-2453) [    ] o.a.s.h.a.PrepRecoveryOp Waited coreNodeName: core_node4, state: recovering, checkLive: true, onlyIfLeader: true for: 1 seconds.
   [junit4]   2> 343051 INFO  (qtp27912932-2453) [    ] o.a.s.s.HttpSolrCall [admin] webapp=null path=/admin/cores params={nodeName=127.0.0.1:44477_&onlyIfLeaderActive=true&core=collection1&coreNodeName=core_node4&action=PREPRECOVERY&checkLive=true&state=recovering&onlyIfLeader=true&wt=javabin&version=2} status=0 QTime=1000
   [junit4]   2> 345238 INFO  (recoveryExecutor-441-thread-1) [    ] o.a.s.c.RecoveryStrategy Attempting to PeerSync from [http://127.0.0.1:37288/collection1/] - recoveringAfterStartup=[true]
   [junit4]   2> 345238 INFO  (recoveryExecutor-441-thread-1) [    ] o.a.s.u.PeerSync PeerSync: core=collection1 url=http://127.0.0.1:41900 START replicas=[http://127.0.0.1:37288/collection1/] nUpdates=100
   [junit4]   2> 345241 INFO  (qtp27912932-2453) [    ] o.a.s.u.IndexFingerprint IndexFingerprint millis:0.0 result:{maxVersionSpecified=9223372036854775807, maxVersionEncountered=0, maxInHash=0, versionsHash=0, numVersions=0, numDocs=0, maxDoc=0}
   [junit4]   2> 345241 INFO  (qtp27912932-2453) [    ] o.a.s.c.S.Request [collection1]  webapp= path=/get params={distrib=false&qt=/get&getFingerprint=9223372036854775807&wt=javabin&version=2} status=0 QTime=0
   [junit4]   2> 345242 INFO  (recoveryExecutor-441-thread-1) [    ] o.a.s.u.IndexFingerprint IndexFingerprint millis:0.0 result:{maxVersionSpecified=9223372036854775807, maxVersionEncountered=0, maxInHash=0, versionsHash=0, numVersions=0, numDocs=0, maxDoc=0}
   [junit4]   2> 345242 INFO  (recoveryExecutor-441-thread-1) [    ] o.a.s.u.PeerSync We are already in sync. No need to do a PeerSync 
   [junit4]   2> 345242 INFO  (recoveryExecutor-441-thread-1) [    ] o.a.s.u.DirectUpdateHandler2 start commit{,optimize=false,openSearcher=true,waitSearcher=true,expungeDeletes=false,softCommit=false,prepareCommit=false}
   [junit4]   2> 345242 INFO  (recoveryExecutor-441-thread-1) [    ] o.a.s.u.DirectUpdateHandler2 No uncommitted changes. Skipping IW.commit.
   [junit4]   2> 345243 INFO  (recoveryExecutor-441-thread-1) [    ] o.a.s.u.DirectUpdateHandler2 end_commit_flush
   [junit4]   2> 345243 INFO  (recoveryExecutor-441-thread-1) [    ] o.a.s.c.RecoveryStrategy PeerSync stage of recovery was successful.
   [junit4]   2> 345243 INFO  (recoveryExecutor-441-thread-1) [    ] o.a.s.c.RecoveryStrategy Replaying updates buffered during PeerSync.
   [junit4]   2> 345243 INFO  (recoveryExecutor-441-thread-1) [    ] o.a.s.c.RecoveryStrategy No replay needed.
   [junit4]   2> 345243 INFO  (recoveryExecutor-441-thread-1) [    ] o.a.s.c.RecoveryStrategy Registering as Active after recovery.
   [junit4]   2> 345245 INFO  (zkCallback-457-thread-1) [    ] o.a.s.c.c.ZkStateReader A cluster state change: [WatchedEvent state:SyncConnected type:NodeDataChanged path:/collections/collection1/state.json] for collection [collection1] has occurred - updating... (live nodes size: [5])
   [junit4]   2> 345245 INFO  (zkCallback-450-thread-1) [    ] o.a.s.c.c.ZkStateReader A cluster state change: [WatchedEvent state:SyncConnected type:NodeDataChanged path:/collections/collection1/state.json] for collection [collection1] has occurred - updating... (live nodes size: [5])
   [junit4]   2> 345249 INFO  (zkCallback-443-thread-1) [    ] o.a.s.c.c.ZkStateReader A cluster state change: [WatchedEvent state:SyncConnected type:NodeDataChanged path:/collections/collection1/state.json] for collection [collection1] has occurred - updating... (live nodes size: [5])
   [junit4]   2> 345249 INFO  (zkCallback-437-thread-1) [    ] o.a.s.c.c.ZkStateReader A cluster state change: [WatchedEvent state:SyncConnected type:NodeDataChanged path:/collections/collection1/state.json] for collection [collection1] has occurred - updating... (live nodes size: [5])
   [junit4]   2> 347731 INFO  (recoveryExecutor-448-thread-1) [    ] o.a.s.c.RecoveryStrategy Attempting to PeerSync from [http://127.0.0.1:37288/collection1/] - recoveringAfterStartup=[true]
   [junit4]   2> 347731 INFO  (recoveryExecutor-448-thread-1) [    ] o.a.s.u.PeerSync PeerSync: core=collection1 url=http://127.0.0.1:35182 START replicas=[http://127.0.0.1:37288/collection1/] nUpdates=100
   [junit4]   2> 347732 INFO  (qtp27912932-2455) [    ] o.a.s.u.IndexFingerprint IndexFingerprint millis:0.0 result:{maxVersionSpecified=9223372036854775807, maxVersionEncountered=0, maxInHash=0, versionsHash=0, numVersions=0, numDocs=0, maxDoc=0}
   [junit4]   2> 347732 INFO  (qtp27912932-2455) [    ] o.a.s.c.S.Request [collection1]  webapp= path=/get params={distrib=false&qt=/get&getFingerprint=9223372036854775807&wt=javabin&version=2} status=0 QTime=0
   [junit4]   2> 347733 INFO  (recoveryExecutor-448-thread-1) [    ] o.a.s.u.IndexFingerprint IndexFingerprint millis:0.0 result:{maxVersionSpecified=9223372036854775807, maxVersionEncountered=0, maxInHash=0, versionsHash=0, numVersions=0, numDocs=0, maxDoc=0}
   [junit4]   2> 347733 INFO  (recoveryExecutor-448-thread-1) [    ] o.a.s.u.PeerSync We are already in sync. No need to do a PeerSync 
   [junit4]   2> 347733 INFO  (recoveryExecutor-448-thread-1) [    ] o.a.s.u.DirectUpdateHandler2 start commit{,optimize=false,openSearcher=true,waitSearcher=true,expungeDeletes=false,softCommit=false,prepareCommit=false}
   [junit4]   2> 347733 INFO  (recoveryExecutor-448-thread-1) [    ] o.a.s.u.DirectUpdateHandler2 No uncommitted changes. Skipping IW.commit.
   [junit4]   2> 347733 INFO  (recoveryExecutor-448-thread-1) [    ] o.a.s.u.DirectUpdateHandler2 end_commit_flush
   [junit4]   2> 347733 INFO  (recoveryExecutor-448-thread-1) [    ] o.a.s.c.RecoveryStrategy PeerSync stage of recovery was successful.
   [junit4]   2> 347733 INFO  (recoveryExecutor-448-thread-1) [    ] o.a.s.c.RecoveryStrategy Replaying updates buffered during PeerSync.
   [junit4]   2> 347733 INFO  (recoveryExecutor-448-thread-1) [    ] o.a.s.c.RecoveryStrategy No replay needed.
   [junit4]   2> 347733 INFO  (recoveryExecutor-448-thread-1) [    ] o.a.s.c.RecoveryStrategy Registering as Active after recovery.
   [junit4]   2> 347736 INFO  (zkCallback-437-thread-1) [    ] o.a.s.c.c.ZkStateReader A cluster state change: [WatchedEvent state:SyncConnected type:NodeDataChanged path:/collections/collection1/state.json] for collection [collection1] has occurred - updating... (live nodes size: [5])
   [junit4]   2> 347736 INFO  (zkCallback-457-thread-1) [    ] o.a.s.c.c.ZkStateReader A cluster state change: [WatchedEvent state:SyncConnected type:NodeDataChanged path:/collections/collection1/state.json] for collection [collection1] has occurred - updating... (live nodes size: [5])
   [junit4]   2> 347737 INFO  (zkCallback-443-thread-1) [    ] o.a.s.c.c.ZkStateReader A cluster state change: [WatchedEvent state:SyncConnected type:NodeDataChanged path:/collections/collection1/state.json] for collection [collection1] has occurred - updating... (live nodes size: [5])
   [junit4]   2> 347738 INFO  (zkCallback-450-thread-1) [    ] o.a.s.c.c.ZkStateReader A cluster state change: [WatchedEvent state:SyncConnected type:NodeDataChanged path:/collections/collection1/state.json] for collection [collection1] has occurred - updating... (live nodes size: [5])
   [junit4]   2> 350052 INFO  (recoveryExecutor-455-thread-1) [    ] o.a.s.c.RecoveryStrategy Attempting to PeerSync from [http://127.0.0.1:37288/collection1/] - recoveringAfterStartup=[true]
   [junit4]   2> 350052 INFO  (recoveryExecutor-455-thread-1) [    ] o.a.s.u.PeerSync PeerSync: core=collection1 url=http://127.0.0.1:44477 START replicas=[http://127.0.0.1:37288/collection1/] nUpdates=100
   [junit4]   2> 350054 INFO  (qtp27912932-2453) [    ] o.a.s.u.IndexFingerprint IndexFingerprint millis:0.0 result:{maxVersionSpecified=9223372036854775807, maxVersionEncountered=0, maxInHash=0, versionsHash=0, numVersions=0, numDocs=0, maxDoc=0}
   [junit4]   2> 350054 INFO  (qtp27912932-2453) [    ] o.a.s.c.S.Request [collection1]  webapp= path=/get params={distrib=false&qt=/get&getFingerprint=9223372036854775807&wt=javabin&version=2} status=0 QTime=0
   [junit4]   2> 350055 INFO  (recoveryExecutor-455-thread-1) [    ] o.a.s.u.IndexFingerprint IndexFingerprint millis:0.0 result:{maxVersionSpecified=9223372036854775807, maxVersionEncountered=0, maxInHash=0, versionsHash=0, numVersions=0, numDocs=0, maxDoc=0}
   [junit4]   2> 350055 INFO  (recoveryExecutor-455-thread-1) [    ] o.a.s.u.PeerSync We are already in sync. No need to do a PeerSync 
   [junit4]   2> 350055 INFO  (recoveryExecutor-455-thread-1) [    ] o.a.s.u.DirectUpdateHandler2 start commit{,optimize=false,openSearcher=true,waitSearcher=true,expungeDeletes=false,softCommit=false,prepareCommit=false}
   [junit4]   2> 350055 INFO  (recoveryExecutor-455-thread-1) [    ] o.a.s.u.DirectUpdateHandler2 No uncommitted changes. Skipping IW.commit.
   [junit4]   2> 350055 INFO  (recoveryExecutor-455-thread-1) [    ] o.a.s.u.DirectUpdateHandler2 end_commit_flush
   [junit4]   2> 350058 INFO  (recoveryExecutor-455-thread-1) [    ] o.a.s.c.RecoveryStrategy PeerSync stage of recovery was successful.
   [junit4]   2> 350058 INFO  (recoveryExecutor-455-thread-1) [    ] o.a.s.c.RecoveryStrategy Replaying updates buffered during PeerSync.
   [junit4]   2> 350058 INFO  (recoveryExecutor-455-thread-1) [    ] o.a.s.c.RecoveryStrategy No replay needed.
   [junit4]   2> 350058 INFO  (recoveryExecutor-455-thread-1) [    ] o.a.s.c.RecoveryStrategy Registering as Active after recovery.
   [junit4]   2> 350064 INFO  (zkCallback-450-thread-1) [    ] o.a.s.c.c.ZkStateReader A cluster state change: [WatchedEvent state:SyncConnected type:NodeDataChanged path:/collections/collection1/state.json] for collection [collection1] has occurred - updating... (live nodes size: [5])
   [junit4]   2> 350064 INFO  (zkCallback-443-thread-1) [    ] o.a.s.c.c.ZkStateReader A cluster state change: [WatchedEvent state:SyncConnected type:NodeDataChanged path:/collections/collection1/state.json] for collection [collection1] has occurred - updating... (live nodes size: [5])
   [junit4]   2> 350064 INFO  (zkCallback-437-thread-1) [    ] o.a.s.c.c.ZkStateReader A cluster state change: [WatchedEvent state:SyncConnected type:NodeDataChanged path:/collections/collection1/state.json] for collection [collection1] has occurred - updating... (live nodes size: [5])
   [junit4]   2> 350070 INFO  (zkCallback-457-thread-1) [    ] o.a.s.c.c.ZkStateReader A cluster state change: [WatchedEvent state:SyncConnected type:NodeDataChanged path:/collections/collection1/state.json] for collection [collection1] has occurred - updating... (live nodes size: [5])
   [junit4]   2> 350428 INFO  (TEST-SyncSliceTest.test-seed#[3C0525BE77B818F3]) [    ] o.a.s.c.AbstractDistribZkTestBase Recoveries finished - collection: collection1
   [junit4]   2> 350431 INFO  (qtp21405619-2414) [    ] o.a.s.u.DirectUpdateHandler2 start commit{,optimize=false,openSearcher=true,waitSearcher=true,expungeDeletes=false,softCommit=false,prepareCommit=false}
   [junit4]   2> 350440 INFO  (qtp21405619-2414) [    ] o.a.s.u.DirectUpdateHandler2 No uncommitted changes. Skipping IW.commit.
   [junit4]   2> 350441 INFO  (qtp21405619-2414) [    ] o.a.s.u.DirectUpdateHandler2 end_commit_flush
   [junit4]   2> 350442 INFO  (qtp21405619-2414) [    ] o.a.s.u.p.LogUpdateProcessorFactory [collection1]  webapp= path=/update params={waitSearcher=true&commit=true&softCommit=false&wt=javabin&version=2}{commit=} 0 11
   [junit4]   2> 350453 INFO  (qtp27912932-2448) [    ] o.a.s.u.DirectUpdateHandler2 start commit{,optimize=false,openSearcher=true,waitSearcher=true,expungeDeletes=false,softCommit=false,prepareCommit=false}
   [junit4]   2> 350453 INFO  (qtp27912932-2448) [    ] o.a.s.u.DirectUpdateHandler2 No uncommitted changes. Skipping IW.commit.
   [junit4]   2> 350453 INFO  (qtp27912932-2448) [    ] o.a.s.u.DirectUpdateHandler2 end_commit_flush
   [junit4]   2> 350456 INFO  (qtp27912932-2448) [    ] o.a.s.u.p.LogUpdateProcessorFactory [collection1]  webapp= path=/update params={update.distrib=FROMLEADER&waitSearcher=true&openSearcher=true&commit=true&softCommit=false&distrib.from=http://127.0.0.1:37288/collection1/&commit_end_point=true&wt=javabin&version=2&expungeDeletes=false}{commit=} 0 3
   [junit4]   2> 350457 INFO  (qtp21756396-2516) [    ] o.a.s.u.DirectUpdateHandler2 start commit{,optimize=false,openSearcher=true,waitSearcher=true,expungeDeletes=false,softCommit=false,prepareCommit=false}
   [junit4]   2> 350457 INFO  (qtp21756396-2516) [    ] o.a.s.u.DirectUpdateHandler2 No uncommitted changes. Skipping IW.commit.
   [junit4]   2> 350457 INFO  (qtp21756396-2516) [    ] o.a.s.u.DirectUpdateHandler2 end_commit_flush
   [junit4]   2> 350457 INFO  (qtp21756396-2516) [    ] o.a.s.u.p.LogUpdateProcessorFactory [collection1]  webapp= path=/update params={update.distrib=FROMLEADER&waitSearcher=true&openSearcher=true&commit=true&softCommit=false&distrib.from=http://127.0.0.1:37288/collection1/&commit_end_point=true&wt=javabin&version=2&expungeDeletes=false}{commit=} 0 0
   [junit4]   2> 350457 INFO  (qtp29883380-2548) [    ] o.a.s.u.DirectUpdateHandler2 start commit{,optimize=false,openSearcher=true,waitSearcher=true,expungeDeletes=false,softCommit=false,prepareCommit=false}
   [junit4]   2> 350457 INFO  (qtp29883380-2548) [    ] o.a.s.u.DirectUpdateHandler2 No uncommitted changes. Skipping IW.commit.
   [junit4]   2> 350457 INFO  (qtp29883380-2548) [    ] o.a.s.u.DirectUpdateHandler2 end_commit_flush
   [junit4]   2> 350458 INFO  (qtp16537815-2481) [    ] o.a.s.u.DirectUpdateHandler2 start commit{,optimize=false,openSearcher=true,waitSearcher=true,expungeDeletes=false,softCommit=false,prepareCommit=false}
   [junit4]   2> 350458 INFO  (qtp16537815-2481) [    ] o.a.s.u.DirectUpdateHandler2 No uncommitted changes. Skipping IW.commit.
   [junit4]   2> 350458 INFO  (qtp16537815-2481) [    ] o.a.s.u.DirectUpdateHandler2 end_commit_flush
   [junit4]   2> 350458 INFO  (qtp16537815-2481) [    ] o.a.s.u.p.LogUpdateProcessorFactory [collection1]  webapp= path=/update params={update.distrib=FROMLEADER&waitSearcher=true&openSearcher=true&commit=true&softCommit=false&distrib.from=http://127.0.0.1:37288/collection1/&commit_end_point=true&wt=javabin&version=2&expungeDeletes=false}{commit=} 0 0
   [junit4]   2> 350461 INFO  (qtp29883380-2548) [    ] o.a.s.u.p.LogUpdateProcessorFactory [collection1]  webapp= path=/update params={update.distrib=FROMLEADER&waitSearcher=true&openSearcher=true&commit=true&softCommit=false&distrib.from=http://127.0.0.1:37288/collection1/&commit_end_point=true&wt=javabin&version=2&expungeDeletes=false}{commit=} 0 3
   [junit4]   2> 350462 INFO  (qtp27912932-2450) [    ] o.a.s.u.p.LogUpdateProcessorFactory [collection1]  webapp= path=/update params={_stateVer_=collection1:15&waitSearcher=true&commit=true&softCommit=false&wt=javabin&version=2}{commit=} 0 18
   [junit4]   2> 350464 INFO  (qtp27912932-2451) [    ] o.a.s.c.S.Request [collection1]  webapp= path=/select params={q=*:*&distrib=false&tests=checkShardConsistency&rows=0&wt=javabin&version=2} hits=0 status=0 QTime=0
   [junit4]   2> 350466 INFO  (qtp16537815-2477) [    ] o.a.s.c.S.Request [collection1]  webapp= path=/select params={q=*:*&distrib=false&tests=checkShardConsistency&rows=0&wt=javabin&version=2} hits=0 status=0 QTime=0
   [

[...truncated too long message...]

t4]   2> 585466 INFO  (zkCallback-457-thread-2) [    ] o.a.s.c.c.ZkStateReader A cluster state change: [WatchedEvent state:SyncConnected type:NodeDataChanged path:/collections/collection1/state.json] for collection [collection1] has occurred - updating... (live nodes size: [2])
   [junit4]   2> 585466 INFO  (zkCallback-450-thread-2) [    ] o.a.s.c.c.ZkStateReader A cluster state change: [WatchedEvent state:SyncConnected type:NodeDataChanged path:/collections/collection1/state.json] for collection [collection1] has occurred - updating... (live nodes size: [2])
   [junit4]   2> 586853 WARN  (zkCallback-443-thread-4) [    ] o.a.s.c.c.ZkStateReader ZooKeeper watch triggered, but Solr cannot talk to ZK: [KeeperErrorCode = Session expired for /live_nodes]
   [junit4]   2> 586854 INFO  (TEST-SyncSliceTest.test-seed#[3C0525BE77B818F3]) [    ] o.e.j.s.AbstractConnector Stopped ServerConnector@1d76be1{HTTP/1.1,[http/1.1]}{127.0.0.1:0}
   [junit4]   2> 586854 INFO  (TEST-SyncSliceTest.test-seed#[3C0525BE77B818F3]) [    ] o.e.j.s.h.ContextHandler Stopped o.e.j.s.ServletContextHandler@e72e4d{/,null,UNAVAILABLE}
   [junit4]   2> 586854 INFO  (TEST-SyncSliceTest.test-seed#[3C0525BE77B818F3]) [    ] o.a.s.c.ChaosMonkey monkey: stop shard! 35182
   [junit4]   2> 586854 INFO  (TEST-SyncSliceTest.test-seed#[3C0525BE77B818F3]) [    ] o.a.s.c.CoreContainer Shutting down CoreContainer instance=712532
   [junit4]   2> 586855 INFO  (TEST-SyncSliceTest.test-seed#[3C0525BE77B818F3]) [    ] o.a.s.c.Overseer Overseer (id=97094307762208783-127.0.0.1:35182_-n_0000000003) closing
   [junit4]   2> 586856 INFO  (OverseerStateUpdate-97094307762208783-127.0.0.1:35182_-n_0000000003) [    ] o.a.s.c.Overseer Overseer Loop exiting : 127.0.0.1:35182_
   [junit4]   2> 586856 INFO  (zkCallback-457-thread-3) [    ] o.a.s.c.OverseerElectionContext I am going to be the leader 127.0.0.1:44477_
   [junit4]   2> 586856 INFO  (zkCallback-457-thread-4) [    ] o.a.s.c.c.ZkStateReader Updated live nodes from ZooKeeper... (2) -> (1)
   [junit4]   2> 586857 INFO  (zkCallback-457-thread-2) [    ] o.a.s.c.ShardLeaderElectionContext I may be the new leader - try and sync
   [junit4]   2> 586857 INFO  (zkCallback-457-thread-3) [    ] o.a.s.c.Overseer Overseer (id=97094307762208786-127.0.0.1:44477_-n_0000000004) starting
   [junit4]   2> 586979 INFO  (zkCallback-457-thread-4) [    ] o.a.s.c.c.ZkStateReader A cluster state change: [WatchedEvent state:SyncConnected type:NodeDataChanged path:/collections/collection1/state.json] for collection [collection1] has occurred - updating... (live nodes size: [1])
   [junit4]   2> 587855 WARN  (zkCallback-450-thread-3) [    ] o.a.s.c.SyncStrategy Closed, skipping sync up.
   [junit4]   2> 587855 INFO  (zkCallback-450-thread-3) [    ] o.a.s.c.SolrCore [collection1]  CLOSING SolrCore org.apache.solr.core.SolrCore@147f73b
   [junit4]   2> 588356 WARN  (zkCallback-450-thread-4) [    ] o.a.s.c.c.ZkStateReader ZooKeeper watch triggered, but Solr cannot talk to ZK: [KeeperErrorCode = Session expired for /live_nodes]
   [junit4]   2> 588357 INFO  (TEST-SyncSliceTest.test-seed#[3C0525BE77B818F3]) [    ] o.e.j.s.AbstractConnector Stopped ServerConnector@1eda3c4{HTTP/1.1,[http/1.1]}{127.0.0.1:0}
   [junit4]   2> 588357 INFO  (TEST-SyncSliceTest.test-seed#[3C0525BE77B818F3]) [    ] o.e.j.s.h.ContextHandler Stopped o.e.j.s.ServletContextHandler@1d74b5a{/,null,UNAVAILABLE}
   [junit4]   2> 588357 INFO  (TEST-SyncSliceTest.test-seed#[3C0525BE77B818F3]) [    ] o.a.s.c.ChaosMonkey monkey: stop shard! 44477
   [junit4]   2> 588357 INFO  (TEST-SyncSliceTest.test-seed#[3C0525BE77B818F3]) [    ] o.a.s.c.CoreContainer Shutting down CoreContainer instance=25489234
   [junit4]   2> 588359 INFO  (TEST-SyncSliceTest.test-seed#[3C0525BE77B818F3]) [    ] o.a.s.c.Overseer Overseer (id=97094307762208786-127.0.0.1:44477_-n_0000000004) closing
   [junit4]   2> 588359 INFO  (OverseerStateUpdate-97094307762208786-127.0.0.1:44477_-n_0000000004) [    ] o.a.s.c.Overseer Overseer Loop exiting : 127.0.0.1:44477_
   [junit4]   2> 588359 WARN  (zkCallback-457-thread-4) [    ] o.a.s.c.c.ZkStateReader ZooKeeper watch triggered, but Solr cannot talk to ZK: [KeeperErrorCode = Session expired for /live_nodes]
   [junit4]   2> 589357 WARN  (zkCallback-457-thread-2) [    ] o.a.s.c.SyncStrategy Closed, skipping sync up.
   [junit4]   2> 589357 INFO  (zkCallback-457-thread-2) [    ] o.a.s.c.SolrCore [collection1]  CLOSING SolrCore org.apache.solr.core.SolrCore@1c6823c
   [junit4]   2> 589367 INFO  (TEST-SyncSliceTest.test-seed#[3C0525BE77B818F3]) [    ] o.e.j.s.AbstractConnector Stopped ServerConnector@1b3cbc9{HTTP/1.1,[http/1.1]}{127.0.0.1:0}
   [junit4]   2> 589367 INFO  (TEST-SyncSliceTest.test-seed#[3C0525BE77B818F3]) [    ] o.e.j.s.h.ContextHandler Stopped o.e.j.s.ServletContextHandler@cd4049{/,null,UNAVAILABLE}
   [junit4]   2> 589368 INFO  (TEST-SyncSliceTest.test-seed#[3C0525BE77B818F3]) [    ] o.a.s.c.ZkTestServer connecting to 127.0.0.1:34322 34322
   [junit4]   2> 589472 INFO  (Thread-585) [    ] o.a.s.c.ZkTestServer connecting to 127.0.0.1:34322 34322
   [junit4]   2> 589473 WARN  (Thread-585) [    ] o.a.s.c.ZkTestServer Watch limit violations: 
   [junit4]   2> Maximum concurrent create/delete watches above limit:
   [junit4]   2> 
   [junit4]   2> 	6	/solr/aliases.json
   [junit4]   2> 	6	/solr/clusterprops.json
   [junit4]   2> 	5	/solr/security.json
   [junit4]   2> 	5	/solr/configs/conf1
   [junit4]   2> 
   [junit4]   2> Maximum concurrent data watches above limit:
   [junit4]   2> 
   [junit4]   2> 	6	/solr/clusterstate.json
   [junit4]   2> 	4	/solr/collections/collection1/state.json
   [junit4]   2> 	2	/solr/overseer_elect/election/97094307762208772-127.0.0.1:42398_-n_0000000000
   [junit4]   2> 
   [junit4]   2> Maximum concurrent children watches above limit:
   [junit4]   2> 
   [junit4]   2> 	256	/solr/overseer/collection-queue-work
   [junit4]   2> 	30	/solr/overseer/queue
   [junit4]   2> 	19	/solr/overseer/queue-work
   [junit4]   2> 	6	/solr/live_nodes
   [junit4]   2> 	6	/solr/collections
   [junit4]   2> 
   [junit4]   2> NOTE: reproduce with: ant test  -Dtestcase=SyncSliceTest -Dtests.method=test -Dtests.seed=3C0525BE77B818F3 -Dtests.multiplier=3 -Dtests.slow=true -Dtests.locale=en-001 -Dtests.timezone=America/Bahia -Dtests.asserts=true -Dtests.file.encoding=UTF-8
   [junit4] FAILURE  259s J0 | SyncSliceTest.test <<<
   [junit4]    > Throwable #1: java.lang.AssertionError: timeout waiting to see all nodes active
   [junit4]    > 	at __randomizedtesting.SeedInfo.seed([3C0525BE77B818F3:B4511A64D944750B]:0)
   [junit4]    > 	at org.apache.solr.cloud.SyncSliceTest.waitTillAllNodesActive(SyncSliceTest.java:235)
   [junit4]    > 	at org.apache.solr.cloud.SyncSliceTest.test(SyncSliceTest.java:164)
   [junit4]    > 	at java.base/jdk.internal.reflect.NativeMethodAccessorImpl.invoke0(Native Method)
   [junit4]    > 	at java.base/jdk.internal.reflect.NativeMethodAccessorImpl.invoke(NativeMethodAccessorImpl.java:62)
   [junit4]    > 	at java.base/jdk.internal.reflect.DelegatingMethodAccessorImpl.invoke(DelegatingMethodAccessorImpl.java:43)
   [junit4]    > 	at java.base/java.lang.reflect.Method.invoke(Method.java:538)
   [junit4]    > 	at org.apache.solr.BaseDistributedSearchTestCase$ShardsRepeatRule$ShardsFixedStatement.callStatement(BaseDistributedSearchTestCase.java:992)
   [junit4]    > 	at org.apache.solr.BaseDistributedSearchTestCase$ShardsRepeatRule$ShardsStatement.evaluate(BaseDistributedSearchTestCase.java:967)
   [junit4]    > 	at java.base/java.lang.Thread.run(Thread.java:844)
   [junit4]   2> 589476 INFO  (SUITE-SyncSliceTest-seed#[3C0525BE77B818F3]-worker) [    ] o.a.s.SolrTestCaseJ4 ###deleteCore
   [junit4]   2> NOTE: leaving temporary files on disk at: /home/jenkins/workspace/Lucene-Solr-6.x-Linux/solr/build/solr-core/test/J0/temp/solr.cloud.SyncSliceTest_3C0525BE77B818F3-001
   [junit4]   2> Dec 12, 2016 11:23:40 AM com.carrotsearch.randomizedtesting.ThreadLeakControl checkThreadLeaks
   [junit4]   2> WARNING: Will linger awaiting termination of 1 leaked thread(s).
   [junit4]   2> NOTE: test params are: codec=Asserting(Lucene62): {other_tl1=Lucene50(blocksize=128), range_facet_l_dv=FST50, multiDefault=PostingsFormat(name=Direct), intDefault=Lucene50(blocksize=128), a_i1=Lucene50(blocksize=128), range_facet_l=Lucene50(blocksize=128), rnd_b=FST50, _version_=Lucene50(blocksize=128), a_t=Lucene50(blocksize=128), id=FST50, range_facet_i_dv=Lucene50(blocksize=128), text=PostingsFormat(name=Memory doPackFST= false), timestamp=Lucene50(blocksize=128)}, docValues:{range_facet_l_dv=DocValuesFormat(name=Direct), range_facet_i_dv=DocValuesFormat(name=Lucene54), timestamp=DocValuesFormat(name=Lucene54)}, maxPointsInLeafNode=722, maxMBSortInHeap=5.704939320917155, sim=RandomSimilarity(queryNorm=true,coord=no): {}, locale=en-001, timezone=America/Bahia
   [junit4]   2> NOTE: Linux 4.4.0-53-generic i386/Oracle Corporation 9-ea (32-bit)/cpus=12,threads=1,free=259564336,total=530579456
   [junit4]   2> NOTE: All tests run in this JVM: [AtomicUpdatesTest, ExternalFileFieldSortTest, ChaosMonkeyNothingIsSafeTest, TestCloudSchemaless, TestBadConfig, QueryElevationComponentTest, TestStressCloudBlindAtomicUpdates, TestSolrQueryParserResource, TestSolrCloudWithDelegationTokens, TestStressLucene, SolrXmlInZkTest, PolyFieldTest, TestHdfsUpdateLog, TestCustomStream, OutputWriterTest, ChangedSchemaMergeTest, TestPseudoReturnFields, TestJoin, CloudExitableDirectoryReaderTest, NotRequiredUniqueKeyTest, CursorPagingTest, TestManagedSchemaAPI, EnumFieldTest, TestDynamicFieldCollectionResource, DistributedVersionInfoTest, TestSQLHandlerNonCloud, TestFunctionQuery, TestRTimerTree, DistributedFacetExistsSmallTest, TestAtomicUpdateErrorCases, TestSolrQueryResponse, TestSchemaNameResource, TestRangeQuery, TestJmxIntegration, HLLSerializationTest, SyncSliceTest]
   [junit4] Completed [184/660 (1!)] on J0 in 259.90s, 1 test, 1 failure <<< FAILURES!

[...truncated 53019 lines...]


Mime
View raw message