lucene-dev mailing list archives

Site index · List index
Message view « Date » · « Thread »
Top « Date » · « Thread »
From Policeman Jenkins Server <jenk...@thetaphi.de>
Subject [JENKINS] Lucene-Solr-master-Linux (32bit/jdk1.8.0_112) - Build # 18513 - Unstable!
Date Mon, 12 Dec 2016 22:53:28 GMT
Build: https://jenkins.thetaphi.de/job/Lucene-Solr-master-Linux/18513/
Java: 32bit/jdk1.8.0_112 -client -XX:+UseConcMarkSweepGC

1 tests failed.
FAILED:  junit.framework.TestSuite.org.apache.solr.cloud.TestSolrCloudWithSecureImpersonation

Error Message:
2 threads leaked from SUITE scope at org.apache.solr.cloud.TestSolrCloudWithSecureImpersonation:     1) Thread[id=529, name=jetty-launcher-170-thread-1-EventThread, state=TIMED_WAITING, group=TGRP-TestSolrCloudWithSecureImpersonation]         at sun.misc.Unsafe.park(Native Method)         at java.util.concurrent.locks.LockSupport.parkNanos(LockSupport.java:215)         at java.util.concurrent.locks.AbstractQueuedSynchronizer.doAcquireSharedNanos(AbstractQueuedSynchronizer.java:1037)         at java.util.concurrent.locks.AbstractQueuedSynchronizer.tryAcquireSharedNanos(AbstractQueuedSynchronizer.java:1328)         at java.util.concurrent.CountDownLatch.await(CountDownLatch.java:277)         at org.apache.curator.CuratorZookeeperClient.internalBlockUntilConnectedOrTimedOut(CuratorZookeeperClient.java:323)         at org.apache.curator.RetryLoop.callWithRetry(RetryLoop.java:105)         at org.apache.curator.framework.imps.GetDataBuilderImpl.pathInForeground(GetDataBuilderImpl.java:288)         at org.apache.curator.framework.imps.GetDataBuilderImpl.forPath(GetDataBuilderImpl.java:279)         at org.apache.curator.framework.imps.GetDataBuilderImpl.forPath(GetDataBuilderImpl.java:41)         at org.apache.curator.framework.recipes.shared.SharedValue.readValue(SharedValue.java:244)         at org.apache.curator.framework.recipes.shared.SharedValue.access$100(SharedValue.java:44)         at org.apache.curator.framework.recipes.shared.SharedValue$1.process(SharedValue.java:61)         at org.apache.curator.framework.imps.NamespaceWatcher.process(NamespaceWatcher.java:67)         at org.apache.zookeeper.ClientCnxn$EventThread.processEvent(ClientCnxn.java:522)         at org.apache.zookeeper.ClientCnxn$EventThread.run(ClientCnxn.java:498)    2) Thread[id=530, name=jetty-launcher-170-thread-2-EventThread, state=TIMED_WAITING, group=TGRP-TestSolrCloudWithSecureImpersonation]         at sun.misc.Unsafe.park(Native Method)         at java.util.concurrent.locks.LockSupport.parkNanos(LockSupport.java:215)         at java.util.concurrent.locks.AbstractQueuedSynchronizer.doAcquireSharedNanos(AbstractQueuedSynchronizer.java:1037)         at java.util.concurrent.locks.AbstractQueuedSynchronizer.tryAcquireSharedNanos(AbstractQueuedSynchronizer.java:1328)         at java.util.concurrent.CountDownLatch.await(CountDownLatch.java:277)         at org.apache.curator.CuratorZookeeperClient.internalBlockUntilConnectedOrTimedOut(CuratorZookeeperClient.java:323)         at org.apache.curator.RetryLoop.callWithRetry(RetryLoop.java:105)         at org.apache.curator.framework.imps.GetDataBuilderImpl.pathInForeground(GetDataBuilderImpl.java:288)         at org.apache.curator.framework.imps.GetDataBuilderImpl.forPath(GetDataBuilderImpl.java:279)         at org.apache.curator.framework.imps.GetDataBuilderImpl.forPath(GetDataBuilderImpl.java:41)         at org.apache.curator.framework.recipes.shared.SharedValue.readValue(SharedValue.java:244)         at org.apache.curator.framework.recipes.shared.SharedValue.access$100(SharedValue.java:44)         at org.apache.curator.framework.recipes.shared.SharedValue$1.process(SharedValue.java:61)         at org.apache.curator.framework.imps.NamespaceWatcher.process(NamespaceWatcher.java:67)         at org.apache.zookeeper.ClientCnxn$EventThread.processEvent(ClientCnxn.java:522)         at org.apache.zookeeper.ClientCnxn$EventThread.run(ClientCnxn.java:498)

Stack Trace:
com.carrotsearch.randomizedtesting.ThreadLeakError: 2 threads leaked from SUITE scope at org.apache.solr.cloud.TestSolrCloudWithSecureImpersonation: 
   1) Thread[id=529, name=jetty-launcher-170-thread-1-EventThread, state=TIMED_WAITING, group=TGRP-TestSolrCloudWithSecureImpersonation]
        at sun.misc.Unsafe.park(Native Method)
        at java.util.concurrent.locks.LockSupport.parkNanos(LockSupport.java:215)
        at java.util.concurrent.locks.AbstractQueuedSynchronizer.doAcquireSharedNanos(AbstractQueuedSynchronizer.java:1037)
        at java.util.concurrent.locks.AbstractQueuedSynchronizer.tryAcquireSharedNanos(AbstractQueuedSynchronizer.java:1328)
        at java.util.concurrent.CountDownLatch.await(CountDownLatch.java:277)
        at org.apache.curator.CuratorZookeeperClient.internalBlockUntilConnectedOrTimedOut(CuratorZookeeperClient.java:323)
        at org.apache.curator.RetryLoop.callWithRetry(RetryLoop.java:105)
        at org.apache.curator.framework.imps.GetDataBuilderImpl.pathInForeground(GetDataBuilderImpl.java:288)
        at org.apache.curator.framework.imps.GetDataBuilderImpl.forPath(GetDataBuilderImpl.java:279)
        at org.apache.curator.framework.imps.GetDataBuilderImpl.forPath(GetDataBuilderImpl.java:41)
        at org.apache.curator.framework.recipes.shared.SharedValue.readValue(SharedValue.java:244)
        at org.apache.curator.framework.recipes.shared.SharedValue.access$100(SharedValue.java:44)
        at org.apache.curator.framework.recipes.shared.SharedValue$1.process(SharedValue.java:61)
        at org.apache.curator.framework.imps.NamespaceWatcher.process(NamespaceWatcher.java:67)
        at org.apache.zookeeper.ClientCnxn$EventThread.processEvent(ClientCnxn.java:522)
        at org.apache.zookeeper.ClientCnxn$EventThread.run(ClientCnxn.java:498)
   2) Thread[id=530, name=jetty-launcher-170-thread-2-EventThread, state=TIMED_WAITING, group=TGRP-TestSolrCloudWithSecureImpersonation]
        at sun.misc.Unsafe.park(Native Method)
        at java.util.concurrent.locks.LockSupport.parkNanos(LockSupport.java:215)
        at java.util.concurrent.locks.AbstractQueuedSynchronizer.doAcquireSharedNanos(AbstractQueuedSynchronizer.java:1037)
        at java.util.concurrent.locks.AbstractQueuedSynchronizer.tryAcquireSharedNanos(AbstractQueuedSynchronizer.java:1328)
        at java.util.concurrent.CountDownLatch.await(CountDownLatch.java:277)
        at org.apache.curator.CuratorZookeeperClient.internalBlockUntilConnectedOrTimedOut(CuratorZookeeperClient.java:323)
        at org.apache.curator.RetryLoop.callWithRetry(RetryLoop.java:105)
        at org.apache.curator.framework.imps.GetDataBuilderImpl.pathInForeground(GetDataBuilderImpl.java:288)
        at org.apache.curator.framework.imps.GetDataBuilderImpl.forPath(GetDataBuilderImpl.java:279)
        at org.apache.curator.framework.imps.GetDataBuilderImpl.forPath(GetDataBuilderImpl.java:41)
        at org.apache.curator.framework.recipes.shared.SharedValue.readValue(SharedValue.java:244)
        at org.apache.curator.framework.recipes.shared.SharedValue.access$100(SharedValue.java:44)
        at org.apache.curator.framework.recipes.shared.SharedValue$1.process(SharedValue.java:61)
        at org.apache.curator.framework.imps.NamespaceWatcher.process(NamespaceWatcher.java:67)
        at org.apache.zookeeper.ClientCnxn$EventThread.processEvent(ClientCnxn.java:522)
        at org.apache.zookeeper.ClientCnxn$EventThread.run(ClientCnxn.java:498)
	at __randomizedtesting.SeedInfo.seed([B275B86A96613E88]:0)




Build Log:
[...truncated 10754 lines...]
   [junit4] Suite: org.apache.solr.cloud.TestSolrCloudWithSecureImpersonation
   [junit4]   2> Creating dataDir: /home/jenkins/workspace/Lucene-Solr-master-Linux/solr/build/solr-core/test/J2/temp/solr.cloud.TestSolrCloudWithSecureImpersonation_B275B86A96613E88-001/init-core-data-001
   [junit4]   2> 89771 INFO  (SUITE-TestSolrCloudWithSecureImpersonation-seed#[B275B86A96613E88]-worker) [    ] o.a.s.SolrTestCaseJ4 Randomized ssl (true) and clientAuth (true) via: @org.apache.solr.util.RandomizeSSL(reason=, ssl=NaN, value=NaN, clientAuth=NaN)
   [junit4]   2> 89828 WARN  (SUITE-TestSolrCloudWithSecureImpersonation-seed#[B275B86A96613E88]-worker) [    ] o.a.h.u.NativeCodeLoader Unable to load native-hadoop library for your platform... using builtin-java classes where applicable
   [junit4]   2> 89946 INFO  (SUITE-TestSolrCloudWithSecureImpersonation-seed#[B275B86A96613E88]-worker) [    ] o.a.s.c.MiniSolrCloudCluster Starting cluster of 2 servers in /home/jenkins/workspace/Lucene-Solr-master-Linux/solr/build/solr-core/test/J2/temp/solr.cloud.TestSolrCloudWithSecureImpersonation_B275B86A96613E88-001/tempDir-001
   [junit4]   2> 89946 INFO  (SUITE-TestSolrCloudWithSecureImpersonation-seed#[B275B86A96613E88]-worker) [    ] o.a.s.c.ZkTestServer STARTING ZK TEST SERVER
   [junit4]   2> 89947 INFO  (Thread-114) [    ] o.a.s.c.ZkTestServer client port:0.0.0.0/0.0.0.0:0
   [junit4]   2> 89947 INFO  (Thread-114) [    ] o.a.s.c.ZkTestServer Starting server
   [junit4]   2> 90047 INFO  (SUITE-TestSolrCloudWithSecureImpersonation-seed#[B275B86A96613E88]-worker) [    ] o.a.s.c.ZkTestServer start zk server on port:42465
   [junit4]   2> 90060 INFO  (jetty-launcher-170-thread-1) [    ] o.e.j.s.Server jetty-9.3.14.v20161028
   [junit4]   2> 90060 INFO  (jetty-launcher-170-thread-2) [    ] o.e.j.s.Server jetty-9.3.14.v20161028
   [junit4]   2> 90061 INFO  (jetty-launcher-170-thread-1) [    ] o.e.j.s.h.ContextHandler Started o.e.j.s.ServletContextHandler@311b17{/solr,null,AVAILABLE}
   [junit4]   2> 90061 INFO  (jetty-launcher-170-thread-2) [    ] o.e.j.s.h.ContextHandler Started o.e.j.s.ServletContextHandler@1be2239{/solr,null,AVAILABLE}
   [junit4]   2> 90062 INFO  (jetty-launcher-170-thread-2) [    ] o.e.j.s.AbstractConnector Started ServerConnector@11186d5{SSL,[ssl, http/1.1]}{127.0.0.1:40928}
   [junit4]   2> 90062 INFO  (jetty-launcher-170-thread-1) [    ] o.e.j.s.AbstractConnector Started ServerConnector@1299633{SSL,[ssl, http/1.1]}{127.0.0.1:35045}
   [junit4]   2> 90062 INFO  (jetty-launcher-170-thread-2) [    ] o.e.j.s.Server Started @91545ms
   [junit4]   2> 90062 INFO  (jetty-launcher-170-thread-1) [    ] o.e.j.s.Server Started @91545ms
   [junit4]   2> 90062 INFO  (jetty-launcher-170-thread-2) [    ] o.a.s.c.s.e.JettySolrRunner Jetty properties: {hostContext=/solr, hostPort=40928}
   [junit4]   2> 90062 INFO  (jetty-launcher-170-thread-1) [    ] o.a.s.c.s.e.JettySolrRunner Jetty properties: {hostContext=/solr, hostPort=35045}
   [junit4]   2> 90063 ERROR (jetty-launcher-170-thread-2) [    ] o.a.s.s.StartupLoggingUtils Missing Java Option solr.log.dir. Logging may be missing or incomplete.
   [junit4]   2> 90063 ERROR (jetty-launcher-170-thread-1) [    ] o.a.s.s.StartupLoggingUtils Missing Java Option solr.log.dir. Logging may be missing or incomplete.
   [junit4]   2> 90063 INFO  (jetty-launcher-170-thread-2) [    ] o.a.s.s.SolrDispatchFilter  ___      _       Welcome to Apache Solr? version 7.0.0
   [junit4]   2> 90063 INFO  (jetty-launcher-170-thread-1) [    ] o.a.s.s.SolrDispatchFilter  ___      _       Welcome to Apache Solr? version 7.0.0
   [junit4]   2> 90063 INFO  (jetty-launcher-170-thread-2) [    ] o.a.s.s.SolrDispatchFilter / __| ___| |_ _   Starting in cloud mode on port null
   [junit4]   2> 90063 INFO  (jetty-launcher-170-thread-1) [    ] o.a.s.s.SolrDispatchFilter / __| ___| |_ _   Starting in cloud mode on port null
   [junit4]   2> 90063 INFO  (jetty-launcher-170-thread-2) [    ] o.a.s.s.SolrDispatchFilter \__ \/ _ \ | '_|  Install dir: null
   [junit4]   2> 90063 INFO  (jetty-launcher-170-thread-1) [    ] o.a.s.s.SolrDispatchFilter \__ \/ _ \ | '_|  Install dir: null
   [junit4]   2> 90063 INFO  (jetty-launcher-170-thread-2) [    ] o.a.s.s.SolrDispatchFilter |___/\___/_|_|    Start time: 2016-12-12T22:08:56.385Z
   [junit4]   2> 90063 INFO  (jetty-launcher-170-thread-1) [    ] o.a.s.s.SolrDispatchFilter |___/\___/_|_|    Start time: 2016-12-12T22:08:56.385Z
   [junit4]   2> 90067 INFO  (jetty-launcher-170-thread-1) [    ] o.a.s.s.SolrDispatchFilter solr.xml found in ZooKeeper. Loading...
   [junit4]   2> 90067 INFO  (jetty-launcher-170-thread-2) [    ] o.a.s.s.SolrDispatchFilter solr.xml found in ZooKeeper. Loading...
   [junit4]   2> 90074 WARN  (NIOServerCxn.Factory:0.0.0.0/0.0.0.0:0) [    ] o.a.z.s.NIOServerCnxn caught end of stream exception
   [junit4]   2> EndOfStreamException: Unable to read additional data from client sessionid 0x158f514e1ce0001, likely client has closed socket
   [junit4]   2> 	at org.apache.zookeeper.server.NIOServerCnxn.doIO(NIOServerCnxn.java:228)
   [junit4]   2> 	at org.apache.zookeeper.server.NIOServerCnxnFactory.run(NIOServerCnxnFactory.java:208)
   [junit4]   2> 	at java.lang.Thread.run(Thread.java:745)
   [junit4]   2> 90077 INFO  (jetty-launcher-170-thread-1) [    ] o.a.s.c.ZkContainer Zookeeper client=127.0.0.1:42465/solr
   [junit4]   2> 90077 INFO  (jetty-launcher-170-thread-2) [    ] o.a.s.c.ZkContainer Zookeeper client=127.0.0.1:42465/solr
   [junit4]   2> 90106 INFO  (jetty-launcher-170-thread-1) [n:127.0.0.1:35045_solr    ] o.a.s.c.OverseerElectionContext I am going to be the leader 127.0.0.1:35045_solr
   [junit4]   2> 90107 INFO  (jetty-launcher-170-thread-2) [n:127.0.0.1:40928_solr    ] o.a.s.c.ZkController Register node as live in ZooKeeper:/live_nodes/127.0.0.1:40928_solr
   [junit4]   2> 90107 INFO  (jetty-launcher-170-thread-1) [n:127.0.0.1:35045_solr    ] o.a.s.c.Overseer Overseer (id=97096862024990725-127.0.0.1:35045_solr-n_0000000000) starting
   [junit4]   2> 90108 INFO  (zkCallback-180-thread-1-processing-n:127.0.0.1:35045_solr) [n:127.0.0.1:35045_solr    ] o.a.s.c.c.ZkStateReader Updated live nodes from ZooKeeper... (0) -> (1)
   [junit4]   2> 90108 INFO  (zkCallback-181-thread-1-processing-n:127.0.0.1:40928_solr) [n:127.0.0.1:40928_solr    ] o.a.s.c.c.ZkStateReader Updated live nodes from ZooKeeper... (0) -> (1)
   [junit4]   2> 90116 INFO  (jetty-launcher-170-thread-1) [n:127.0.0.1:35045_solr    ] o.a.s.c.ZkController Register node as live in ZooKeeper:/live_nodes/127.0.0.1:35045_solr
   [junit4]   2> 90118 INFO  (zkCallback-181-thread-1-processing-n:127.0.0.1:40928_solr) [n:127.0.0.1:40928_solr    ] o.a.s.c.c.ZkStateReader Updated live nodes from ZooKeeper... (1) -> (2)
   [junit4]   2> 90118 INFO  (zkCallback-180-thread-1-processing-n:127.0.0.1:35045_solr) [n:127.0.0.1:35045_solr    ] o.a.s.c.c.ZkStateReader Updated live nodes from ZooKeeper... (1) -> (2)
   [junit4]   2> 90239 INFO  (jetty-launcher-170-thread-2) [n:127.0.0.1:40928_solr    ] o.a.s.c.CoreContainer Initializing authentication plugin: org.apache.solr.security.HttpParamDelegationTokenPlugin
   [junit4]   2> 90257 INFO  (jetty-launcher-170-thread-2) [n:127.0.0.1:40928_solr    ] o.a.s.s.KerberosPlugin Params: {solr.kerberos.impersonator.user.noGroups.hosts=*, solr.kerberos.impersonator.user.bogusGroup.groups=__some_bogus_group, token.valid=30, cookie.domain=127.0.0.1, solr.kerberos.impersonator.user.anyHostAnyUser.groups=*, solr.kerberos.impersonator.user.bogusGroup.hosts=*, solr.kerberos.impersonator.user.anyHostAnyUser.hosts=*, token.validity=36000, solr.kerberos.impersonator.user.noHosts.groups=*, type=kerberos, solr.kerberos.impersonator.user.localHostAnyGroup.groups=*, delegation-token.token-kind=solr-dt, solr.kerberos.impersonator.user.wrongHost.hosts=1.1.1.1.1.1, cookie.path=/, zk-dt-secret-manager.znodeWorkingPath=solr/security/zkdtsm, solr.kerberos.impersonator.user.localHostAnyGroup.hosts=localhost.localdomain,localhost,127.0.0.1, signer.secret.provider.zookeeper.path=/token, solr.kerberos.impersonator.user.anyHostUsersGroup.groups=jenkins, zk-dt-secret-manager.enable=true, solr.kerberos.impersonator.user.wrongHost.groups=*, kerberos.name.rules=DEFAULT, signer.secret.provider=zookeeper, solr.kerberos.impersonator.user.anyHostUsersGroup.hosts=*}
   [junit4]   2> 90276 INFO  (jetty-launcher-170-thread-1) [n:127.0.0.1:35045_solr    ] o.a.s.c.CoreContainer Initializing authentication plugin: org.apache.solr.security.HttpParamDelegationTokenPlugin
   [junit4]   2> 90276 INFO  (jetty-launcher-170-thread-1) [n:127.0.0.1:35045_solr    ] o.a.s.s.KerberosPlugin Params: {solr.kerberos.impersonator.user.noGroups.hosts=*, solr.kerberos.impersonator.user.bogusGroup.groups=__some_bogus_group, token.valid=30, cookie.domain=127.0.0.1, solr.kerberos.impersonator.user.anyHostAnyUser.groups=*, solr.kerberos.impersonator.user.bogusGroup.hosts=*, solr.kerberos.impersonator.user.anyHostAnyUser.hosts=*, token.validity=36000, solr.kerberos.impersonator.user.noHosts.groups=*, type=kerberos, solr.kerberos.impersonator.user.localHostAnyGroup.groups=*, delegation-token.token-kind=solr-dt, solr.kerberos.impersonator.user.wrongHost.hosts=1.1.1.1.1.1, cookie.path=/, zk-dt-secret-manager.znodeWorkingPath=solr/security/zkdtsm, solr.kerberos.impersonator.user.localHostAnyGroup.hosts=localhost.localdomain,localhost,127.0.0.1, signer.secret.provider.zookeeper.path=/token, solr.kerberos.impersonator.user.anyHostUsersGroup.groups=jenkins, zk-dt-secret-manager.enable=true, solr.kerberos.impersonator.user.wrongHost.groups=*, kerberos.name.rules=DEFAULT, signer.secret.provider=zookeeper, solr.kerberos.impersonator.user.anyHostUsersGroup.hosts=*}
   [junit4]   2> 90335 INFO  (jetty-launcher-170-thread-1) [n:127.0.0.1:35045_solr    ] o.a.c.f.i.CuratorFrameworkImpl Starting
   [junit4]   2> 90335 INFO  (jetty-launcher-170-thread-2) [n:127.0.0.1:40928_solr    ] o.a.c.f.i.CuratorFrameworkImpl Starting
   [junit4]   2> 90351 INFO  (jetty-launcher-170-thread-1-EventThread) [n:127.0.0.1:35045_solr    ] o.a.c.f.s.ConnectionStateManager State change: CONNECTED
   [junit4]   2> 90351 INFO  (jetty-launcher-170-thread-2-EventThread) [n:127.0.0.1:40928_solr    ] o.a.c.f.s.ConnectionStateManager State change: CONNECTED
   [junit4]   2> 90487 INFO  (jetty-launcher-170-thread-1) [n:127.0.0.1:35045_solr    ] o.a.s.c.CorePropertiesLocator Found 0 core definitions underneath /home/jenkins/workspace/Lucene-Solr-master-Linux/solr/build/solr-core/test/J2/temp/solr.cloud.TestSolrCloudWithSecureImpersonation_B275B86A96613E88-001/tempDir-001/node1/.
   [junit4]   2> 90487 INFO  (jetty-launcher-170-thread-2) [n:127.0.0.1:40928_solr    ] o.a.s.c.CorePropertiesLocator Found 0 core definitions underneath /home/jenkins/workspace/Lucene-Solr-master-Linux/solr/build/solr-core/test/J2/temp/solr.cloud.TestSolrCloudWithSecureImpersonation_B275B86A96613E88-001/tempDir-001/node2/.
   [junit4]   2> 90509 INFO  (TEST-TestSolrCloudWithSecureImpersonation.testProxyNoConfigGroups-seed#[B275B86A96613E88]) [    ] o.a.s.SolrTestCaseJ4 ###Starting testProxyNoConfigGroups
   [junit4]   2> 90957 WARN  (TEST-TestSolrCloudWithSecureImpersonation.testProxyNoConfigGroups-seed#[B275B86A96613E88]) [    ] o.a.h.c.p.ResponseProcessCookies Invalid cookie header: "Set-Cookie: hadoop.auth="u=noGroups&p=noGroups&t=test&e=1481616536967&s=kgLTRrbBagkMdWgKB5zQchhBOlM="; Path=/; Domain=127.0.0.1; Expires=ti, 13-des-2016 08:08:56 GMT; Secure; HttpOnly". Invalid 'expires' attribute: ti, 13-des-2016 08:08:56 GMT
   [junit4]   2> 90958 INFO  (TEST-TestSolrCloudWithSecureImpersonation.testProxyNoConfigGroups-seed#[B275B86A96613E88]) [    ] o.a.s.SolrTestCaseJ4 ###Ending testProxyNoConfigGroups
   [junit4]   2> 90969 INFO  (TEST-TestSolrCloudWithSecureImpersonation.testProxyValidateHost-seed#[B275B86A96613E88]) [    ] o.a.s.SolrTestCaseJ4 ###Starting testProxyValidateHost
   [junit4]   2> 90975 INFO  (qtp11194981-490) [n:127.0.0.1:35045_solr    ] o.a.s.h.a.CollectionsHandler Invoked Collection Action :list with params doAs=bar&action=LIST&wt=javabin&version=2 and sendToOCPQueue=true
   [junit4]   2> 90975 INFO  (qtp11194981-490) [n:127.0.0.1:35045_solr    ] o.a.s.s.HttpSolrCall [admin] webapp=null path=/admin/collections params={doAs=bar&action=LIST&wt=javabin&version=2} status=0 QTime=0
   [junit4]   2> 90976 WARN  (TEST-TestSolrCloudWithSecureImpersonation.testProxyValidateHost-seed#[B275B86A96613E88]) [    ] o.a.h.c.p.ResponseProcessCookies Invalid cookie header: "Set-Cookie: hadoop.auth="u=localHostAnyGroup&p=localHostAnyGroup&t=test&e=1481616537293&s=xq5BiIU9HZzSY8MU/dknGZlJfSw="; Path=/; Domain=127.0.0.1; Expires=ti, 13-des-2016 08:08:57 GMT; Secure; HttpOnly". Invalid 'expires' attribute: ti, 13-des-2016 08:08:57 GMT
   [junit4]   2> 90976 INFO  (TEST-TestSolrCloudWithSecureImpersonation.testProxyValidateHost-seed#[B275B86A96613E88]) [    ] o.a.s.SolrTestCaseJ4 ###Ending testProxyValidateHost
   [junit4]   2> 90986 INFO  (TEST-TestSolrCloudWithSecureImpersonation.testProxyInvalidRemote-seed#[B275B86A96613E88]) [    ] o.a.s.SolrTestCaseJ4 ###Starting testProxyInvalidRemote
   [junit4]   2> 90994 WARN  (TEST-TestSolrCloudWithSecureImpersonation.testProxyInvalidRemote-seed#[B275B86A96613E88]) [    ] o.a.h.c.p.ResponseProcessCookies Invalid cookie header: "Set-Cookie: hadoop.auth="u=localHostAnyGroup&p=localHostAnyGroup&t=test&e=1481616537310&s=5dOnfuAD44x145Ic/3bRiPS5xEA="; Path=/; Domain=127.0.0.1; Expires=ti, 13-des-2016 08:08:57 GMT; Secure; HttpOnly". Invalid 'expires' attribute: ti, 13-des-2016 08:08:57 GMT
   [junit4]   2> 90994 INFO  (TEST-TestSolrCloudWithSecureImpersonation.testProxyInvalidRemote-seed#[B275B86A96613E88]) [    ] o.a.s.SolrTestCaseJ4 ###Ending testProxyInvalidRemote
   [junit4]   2> 91005 INFO  (TEST-TestSolrCloudWithSecureImpersonation.testProxyWrongHost-seed#[B275B86A96613E88]) [    ] o.a.s.SolrTestCaseJ4 ###Starting testProxyWrongHost
   [junit4]   2> 91012 WARN  (TEST-TestSolrCloudWithSecureImpersonation.testProxyWrongHost-seed#[B275B86A96613E88]) [    ] o.a.h.c.p.ResponseProcessCookies Invalid cookie header: "Set-Cookie: hadoop.auth="u=wrongHost&p=wrongHost&t=test&e=1481616537328&s=4weigW300RA7t0yrjiRd8CALMcI="; Path=/; Domain=127.0.0.1; Expires=ti, 13-des-2016 08:08:57 GMT; Secure; HttpOnly". Invalid 'expires' attribute: ti, 13-des-2016 08:08:57 GMT
   [junit4]   2> 91012 INFO  (TEST-TestSolrCloudWithSecureImpersonation.testProxyWrongHost-seed#[B275B86A96613E88]) [    ] o.a.s.SolrTestCaseJ4 ###Ending testProxyWrongHost
   [junit4]   2> 91022 INFO  (TEST-TestSolrCloudWithSecureImpersonation.testProxyNoConfigHosts-seed#[B275B86A96613E88]) [    ] o.a.s.SolrTestCaseJ4 ###Starting testProxyNoConfigHosts
   [junit4]   2> 91027 WARN  (TEST-TestSolrCloudWithSecureImpersonation.testProxyNoConfigHosts-seed#[B275B86A96613E88]) [    ] o.a.h.c.p.ResponseProcessCookies Invalid cookie header: "Set-Cookie: hadoop.auth="u=noHosts&p=noHosts&t=test&e=1481616537346&s=jF2SxG6zVA78Ecf3/fvo/UptVfM="; Path=/; Domain=127.0.0.1; Expires=ti, 13-des-2016 08:08:57 GMT; Secure; HttpOnly". Invalid 'expires' attribute: ti, 13-des-2016 08:08:57 GMT
   [junit4]   2> 91028 INFO  (TEST-TestSolrCloudWithSecureImpersonation.testProxyNoConfigHosts-seed#[B275B86A96613E88]) [    ] o.a.s.SolrTestCaseJ4 ###Ending testProxyNoConfigHosts
   [junit4]   2> 91037 INFO  (TEST-TestSolrCloudWithSecureImpersonation.testProxyInvalidGroup-seed#[B275B86A96613E88]) [    ] o.a.s.SolrTestCaseJ4 ###Starting testProxyInvalidGroup
   [junit4]   2> 91077 WARN  (qtp11194981-490) [n:127.0.0.1:35045_solr    ] o.a.h.s.ShellBasedUnixGroupsMapping got exception trying to get groups for user bar: id: bar: no such user
   [junit4]   2> 
   [junit4]   2> 91078 WARN  (qtp11194981-490) [n:127.0.0.1:35045_solr    ] o.a.h.s.UserGroupInformation No groups available for user bar
   [junit4]   2> 91082 WARN  (TEST-TestSolrCloudWithSecureImpersonation.testProxyInvalidGroup-seed#[B275B86A96613E88]) [    ] o.a.h.c.p.ResponseProcessCookies Invalid cookie header: "Set-Cookie: hadoop.auth="u=bogusGroup&p=bogusGroup&t=test&e=1481616537361&s=1fqNswWFfIEI70LJ04jZYkPSeCE="; Path=/; Domain=127.0.0.1; Expires=ti, 13-des-2016 08:08:57 GMT; Secure; HttpOnly". Invalid 'expires' attribute: ti, 13-des-2016 08:08:57 GMT
   [junit4]   2> 91082 INFO  (TEST-TestSolrCloudWithSecureImpersonation.testProxyInvalidGroup-seed#[B275B86A96613E88]) [    ] o.a.s.SolrTestCaseJ4 ###Ending testProxyInvalidGroup
   [junit4]   2> 91091 INFO  (TEST-TestSolrCloudWithSecureImpersonation.testProxyNullProxyUser-seed#[B275B86A96613E88]) [    ] o.a.s.SolrTestCaseJ4 ###Starting testProxyNullProxyUser
   [junit4]   2> 91092 INFO  (qtp11194981-492) [    ] o.a.s.s.SolrDispatchFilter Error authenticating
   [junit4]   2> java.lang.IllegalArgumentException: userName is NULL, empty or contains a '&'
   [junit4]   2> 	at org.apache.hadoop.security.authentication.util.AuthToken.checkForIllegalArgument(AuthToken.java:87)
   [junit4]   2> 	at org.apache.hadoop.security.authentication.util.AuthToken.<init>(AuthToken.java:70)
   [junit4]   2> 	at org.apache.hadoop.security.authentication.server.AuthenticationToken.<init>(AuthenticationToken.java:58)
   [junit4]   2> 	at org.apache.solr.security.HttpParamDelegationTokenPlugin$HttpParamDelegationTokenAuthenticationHandler$HttpParamAuthenticationHandler.authenticate(HttpParamDelegationTokenPlugin.java:213)
   [junit4]   2> 	at org.apache.hadoop.security.token.delegation.web.DelegationTokenAuthenticationHandler.authenticate(DelegationTokenAuthenticationHandler.java:348)
   [junit4]   2> 	at org.apache.solr.security.KerberosPlugin$RequestContinuesRecorderAuthenticationHandler.authenticate(KerberosPlugin.java:574)
   [junit4]   2> 	at org.apache.hadoop.security.authentication.server.AuthenticationFilter.doFilter(AuthenticationFilter.java:519)
   [junit4]   2> 	at org.apache.solr.security.DelegationTokenKerberosFilter.doFilter(DelegationTokenKerberosFilter.java:128)
   [junit4]   2> 	at org.apache.solr.security.HttpParamDelegationTokenPlugin$HttpParamToRequestFilter.doFilter(HttpParamDelegationTokenPlugin.java:245)
   [junit4]   2> 	at org.apache.solr.security.KerberosPlugin.doAuthenticate(KerberosPlugin.java:265)
   [junit4]   2> 	at org.apache.solr.servlet.SolrDispatchFilter.authenticateRequest(SolrDispatchFilter.java:362)
   [junit4]   2> 	at org.apache.solr.servlet.SolrDispatchFilter.doFilter(SolrDispatchFilter.java:268)
   [junit4]   2> 	at org.apache.solr.servlet.SolrDispatchFilter.doFilter(SolrDispatchFilter.java:254)
   [junit4]   2> 	at org.eclipse.jetty.servlet.ServletHandler$CachedChain.doFilter(ServletHandler.java:1699)
   [junit4]   2> 	at org.apache.solr.client.solrj.embedded.JettySolrRunner$DebugFilter.doFilter(JettySolrRunner.java:113)
   [junit4]   2> 	at org.eclipse.jetty.servlet.ServletHandler$CachedChain.doFilter(ServletHandler.java:1699)
   [junit4]   2> 	at org.eclipse.jetty.servlet.ServletHandler.doHandle(ServletHandler.java:582)
   [junit4]   2> 	at org.eclipse.jetty.server.session.SessionHandler.doHandle(SessionHandler.java:224)
   [junit4]   2> 	at org.eclipse.jetty.server.handler.ContextHandler.doHandle(ContextHandler.java:1180)
   [junit4]   2> 	at org.eclipse.jetty.servlet.ServletHandler.doScope(ServletHandler.java:512)
   [junit4]   2> 	at org.eclipse.jetty.server.session.SessionHandler.doScope(SessionHandler.java:185)
   [junit4]   2> 	at org.eclipse.jetty.server.handler.ContextHandler.doScope(ContextHandler.java:1112)
   [junit4]   2> 	at org.eclipse.jetty.server.handler.ScopedHandler.handle(ScopedHandler.java:141)
   [junit4]   2> 	at org.eclipse.jetty.server.handler.gzip.GzipHandler.handle(GzipHandler.java:462)
   [junit4]   2> 	at org.eclipse.jetty.server.handler.HandlerWrapper.handle(HandlerWrapper.java:134)
   [junit4]   2> 	at org.eclipse.jetty.server.Server.handle(Server.java:534)
   [junit4]   2> 	at org.eclipse.jetty.server.HttpChannel.handle(HttpChannel.java:320)
   [junit4]   2> 	at org.eclipse.jetty.server.HttpConnection.onFillable(HttpConnection.java:251)
   [junit4]   2> 	at org.eclipse.jetty.io.AbstractConnection$ReadCallback.succeeded(AbstractConnection.java:273)
   [junit4]   2> 	at org.eclipse.jetty.io.FillInterest.fillable(FillInterest.java:95)
   [junit4]   2> 	at org.eclipse.jetty.io.ssl.SslConnection.onFillable(SslConnection.java:202)
   [junit4]   2> 	at org.eclipse.jetty.io.AbstractConnection$ReadCallback.succeeded(AbstractConnection.java:273)
   [junit4]   2> 	at org.eclipse.jetty.io.FillInterest.fillable(FillInterest.java:95)
   [junit4]   2> 	at org.eclipse.jetty.io.SelectChannelEndPoint$2.run(SelectChannelEndPoint.java:93)
   [junit4]   2> 	at org.eclipse.jetty.util.thread.strategy.ExecuteProduceConsume.executeProduceConsume(ExecuteProduceConsume.java:303)
   [junit4]   2> 	at org.eclipse.jetty.util.thread.strategy.ExecuteProduceConsume.produceConsume(ExecuteProduceConsume.java:148)
   [junit4]   2> 	at org.eclipse.jetty.util.thread.strategy.ExecuteProduceConsume.run(ExecuteProduceConsume.java:136)
   [junit4]   2> 	at org.eclipse.jetty.util.thread.QueuedThreadPool.runJob(QueuedThreadPool.java:671)
   [junit4]   2> 	at org.eclipse.jetty.util.thread.QueuedThreadPool$2.run(QueuedThreadPool.java:589)
   [junit4]   2> 	at java.lang.Thread.run(Thread.java:745)
   [junit4]   2> 91093 WARN  (qtp11194981-492) [    ] o.e.j.s.ServletHandler /solr/admin/collections
   [junit4]   2> org.apache.solr.common.SolrException: Error during request authentication, 
   [junit4]   2> 	at org.apache.solr.servlet.SolrDispatchFilter.authenticateRequest(SolrDispatchFilter.java:368)
   [junit4]   2> 	at org.apache.solr.servlet.SolrDispatchFilter.doFilter(SolrDispatchFilter.java:268)
   [junit4]   2> 	at org.apache.solr.servlet.SolrDispatchFilter.doFilter(SolrDispatchFilter.java:254)
   [junit4]   2> 	at org.eclipse.jetty.servlet.ServletHandler$CachedChain.doFilter(ServletHandler.java:1699)
   [junit4]   2> 	at org.apache.solr.client.solrj.embedded.JettySolrRunner$DebugFilter.doFilter(JettySolrRunner.java:113)
   [junit4]   2> 	at org.eclipse.jetty.servlet.ServletHandler$CachedChain.doFilter(ServletHandler.java:1699)
   [junit4]   2> 	at org.eclipse.jetty.servlet.ServletHandler.doHandle(ServletHandler.java:582)
   [junit4]   2> 	at org.eclipse.jetty.server.session.SessionHandler.doHandle(SessionHandler.java:224)
   [junit4]   2> 	at org.eclipse.jetty.server.handler.ContextHandler.doHandle(ContextHandler.java:1180)
   [junit4]   2> 	at org.eclipse.jetty.servlet.ServletHandler.doScope(ServletHandler.java:512)
   [junit4]   2> 	at org.eclipse.jetty.server.session.SessionHandler.doScope(SessionHandler.java:185)
   [junit4]   2> 	at org.eclipse.jetty.server.handler.ContextHandler.doScope(ContextHandler.java:1112)
   [junit4]   2> 	at org.eclipse.jetty.server.handler.ScopedHandler.handle(ScopedHandler.java:141)
   [junit4]   2> 	at org.eclipse.jetty.server.handler.gzip.GzipHandler.handle(GzipHandler.java:462)
   [junit4]   2> 	at org.eclipse.jetty.server.handler.HandlerWrapper.handle(HandlerWrapper.java:134)
   [junit4]   2> 	at org.eclipse.jetty.server.Server.handle(Server.java:534)
   [junit4]   2> 	at org.eclipse.jetty.server.HttpChannel.handle(HttpChannel.java:320)
   [junit4]   2> 	at org.eclipse.jetty.server.HttpConnection.onFillable(HttpConnection.java:251)
   [junit4]   2> 	at org.eclipse.jetty.io.AbstractConnection$ReadCallback.succeeded(AbstractConnection.java:273)
   [junit4]   2> 	at org.eclipse.jetty.io.FillInterest.fillable(FillInterest.java:95)
   [junit4]   2> 	at org.eclipse.jetty.io.ssl.SslConnection.onFillable(SslConnection.java:202)
   [junit4]   2> 	at org.eclipse.jetty.io.AbstractConnection$ReadCallback.succeeded(AbstractConnection.java:273)
   [junit4]   2> 	at org.eclipse.jetty.io.FillInterest.fillable(FillInterest.java:95)
   [junit4]   2> 	at org.eclipse.jetty.io.SelectChannelEndPoint$2.run(SelectChannelEndPoint.java:93)
   [junit4]   2> 	at org.eclipse.jetty.util.thread.strategy.ExecuteProduceConsume.executeProduceConsume(ExecuteProduceConsume.java:303)
   [junit4]   2> 	at org.eclipse.jetty.util.thread.strategy.ExecuteProduceConsume.produceConsume(ExecuteProduceConsume.java:148)
   [junit4]   2> 	at org.eclipse.jetty.util.thread.strategy.ExecuteProduceConsume.run(ExecuteProduceConsume.java:136)
   [junit4]   2> 	at org.eclipse.jetty.util.thread.QueuedThreadPool.runJob(QueuedThreadPool.java:671)
   [junit4]   2> 	at org.eclipse.jetty.util.thread.QueuedThreadPool$2.run(QueuedThreadPool.java:589)
   [junit4]   2> 	at java.lang.Thread.run(Thread.java:745)
   [junit4]   2> Caused by: java.lang.IllegalArgumentException: userName is NULL, empty or contains a '&'
   [junit4]   2> 	at org.apache.hadoop.security.authentication.util.AuthToken.checkForIllegalArgument(AuthToken.java:87)
   [junit4]   2> 	at org.apache.hadoop.security.authentication.util.AuthToken.<init>(AuthToken.java:70)
   [junit4]   2> 	at org.apache.hadoop.security.authentication.server.AuthenticationToken.<init>(AuthenticationToken.java:58)
   [junit4]   2> 	at org.apache.solr.security.HttpParamDelegationTokenPlugin$HttpParamDelegationTokenAuthenticationHandler$HttpParamAuthenticationHandler.authenticate(HttpParamDelegationTokenPlugin.java:213)
   [junit4]   2> 	at org.apache.hadoop.security.token.delegation.web.DelegationTokenAuthenticationHandler.authenticate(DelegationTokenAuthenticationHandler.java:348)
   [junit4]   2> 	at org.apache.solr.security.KerberosPlugin$RequestContinuesRecorderAuthenticationHandler.authenticate(KerberosPlugin.java:574)
   [junit4]   2> 	at org.apache.hadoop.security.authentication.server.AuthenticationFilter.doFilter(AuthenticationFilter.java:519)
   [junit4]   2> 	at org.apache.solr.security.DelegationTokenKerberosFilter.doFilter(DelegationTokenKerberosFilter.java:128)
   [junit4]   2> 	at org.apache.solr.security.HttpParamDelegationTokenPlugin$HttpParamToRequestFilter.doFilter(HttpParamDelegationTokenPlugin.java:245)
   [junit4]   2> 	at org.apache.solr.security.KerberosPlugin.doAuthenticate(KerberosPlugin.java:265)
   [junit4]   2> 	at org.apache.solr.servlet.SolrDispatchFilter.authenticateRequest(SolrDispatchFilter.java:362)
   [junit4]   2> 	... 29 more
   [junit4]   2> 91099 INFO  (TEST-TestSolrCloudWithSecureImpersonation.testProxyNullProxyUser-seed#[B275B86A96613E88]) [    ] o.a.s.SolrTestCaseJ4 ###Ending testProxyNullProxyUser
   [junit4]   2> 91109 INFO  (TEST-TestSolrCloudWithSecureImpersonation.testProxyValidateAnyHostAnyUser-seed#[B275B86A96613E88]) [    ] o.a.s.SolrTestCaseJ4 ###Starting testProxyValidateAnyHostAnyUser
   [junit4]   2> 91117 INFO  (qtp11194981-492) [n:127.0.0.1:35045_solr    ] o.a.s.h.a.CollectionsHandler Invoked Collection Action :list with params doAs=bar&action=LIST&wt=javabin&version=2 and sendToOCPQueue=true
   [junit4]   2> 91117 INFO  (qtp11194981-492) [n:127.0.0.1:35045_solr    ] o.a.s.s.HttpSolrCall [admin] webapp=null path=/admin/collections params={doAs=bar&action=LIST&wt=javabin&version=2} status=0 QTime=0
   [junit4]   2> 91118 WARN  (TEST-TestSolrCloudWithSecureImpersonation.testProxyValidateAnyHostAnyUser-seed#[B275B86A96613E88]) [    ] o.a.h.c.p.ResponseProcessCookies Invalid cookie header: "Set-Cookie: hadoop.auth="u=anyHostAnyUser&p=anyHostAnyUser&t=test&e=1481616537438&s=aV93uYhcq+4arkRMFVVEhyGgE74="; Path=/; Domain=127.0.0.1; Expires=ti, 13-des-2016 08:08:57 GMT; Secure; HttpOnly". Invalid 'expires' attribute: ti, 13-des-2016 08:08:57 GMT
   [junit4]   2> 91118 INFO  (TEST-TestSolrCloudWithSecureImpersonation.testProxyValidateAnyHostAnyUser-seed#[B275B86A96613E88]) [    ] o.a.s.SolrTestCaseJ4 ###Ending testProxyValidateAnyHostAnyUser
   [junit4]   2> 91128 INFO  (TEST-TestSolrCloudWithSecureImpersonation.testProxyInvalidProxyUser-seed#[B275B86A96613E88]) [    ] o.a.s.SolrTestCaseJ4 ###Starting testProxyInvalidProxyUser
   [junit4]   2> 91132 WARN  (TEST-TestSolrCloudWithSecureImpersonation.testProxyInvalidProxyUser-seed#[B275B86A96613E88]) [    ] o.a.h.c.p.ResponseProcessCookies Invalid cookie header: "Set-Cookie: hadoop.auth="u=bar&p=bar&t=test&e=1481616537451&s=leKb+3+qQt+6DEsjuQMh4jVnuik="; Path=/; Domain=127.0.0.1; Expires=ti, 13-des-2016 08:08:57 GMT; Secure; HttpOnly". Invalid 'expires' attribute: ti, 13-des-2016 08:08:57 GMT
   [junit4]   2> 91132 INFO  (TEST-TestSolrCloudWithSecureImpersonation.testProxyInvalidProxyUser-seed#[B275B86A96613E88]) [    ] o.a.s.SolrTestCaseJ4 ###Ending testProxyInvalidProxyUser
   [junit4]   2> 91143 INFO  (TEST-TestSolrCloudWithSecureImpersonation.testProxyValidateGroup-seed#[B275B86A96613E88]) [    ] o.a.s.SolrTestCaseJ4 ###Starting testProxyValidateGroup
   [junit4]   2> 91149 INFO  (qtp11194981-482) [n:127.0.0.1:35045_solr    ] o.a.s.h.a.CollectionsHandler Invoked Collection Action :list with params doAs=jenkins&action=LIST&wt=javabin&version=2 and sendToOCPQueue=true
   [junit4]   2> 91149 INFO  (qtp11194981-482) [n:127.0.0.1:35045_solr    ] o.a.s.s.HttpSolrCall [admin] webapp=null path=/admin/collections params={doAs=jenkins&action=LIST&wt=javabin&version=2} status=0 QTime=0
   [junit4]   2> 91150 WARN  (TEST-TestSolrCloudWithSecureImpersonation.testProxyValidateGroup-seed#[B275B86A96613E88]) [    ] o.a.h.c.p.ResponseProcessCookies Invalid cookie header: "Set-Cookie: hadoop.auth="u=anyHostUsersGroup&p=anyHostUsersGroup&t=test&e=1481616537466&s=SvKXawAvYlegNgjCeic5G314KQ8="; Path=/; Domain=127.0.0.1; Expires=ti, 13-des-2016 08:08:57 GMT; Secure; HttpOnly". Invalid 'expires' attribute: ti, 13-des-2016 08:08:57 GMT
   [junit4]   2> 91150 INFO  (TEST-TestSolrCloudWithSecureImpersonation.testProxyValidateGroup-seed#[B275B86A96613E88]) [    ] o.a.s.SolrTestCaseJ4 ###Ending testProxyValidateGroup
   [junit4]   2> 91159 INFO  (TEST-TestSolrCloudWithSecureImpersonation.testForwarding-seed#[B275B86A96613E88]) [    ] o.a.s.SolrTestCaseJ4 ###Starting testForwarding
   [junit4]   2> 91468 WARN  (NIOServerCxn.Factory:0.0.0.0/0.0.0.0:0) [    ] o.a.z.s.NIOServerCnxn caught end of stream exception
   [junit4]   2> EndOfStreamException: Unable to read additional data from client sessionid 0x158f514e1ce000a, likely client has closed socket
   [junit4]   2> 	at org.apache.zookeeper.server.NIOServerCnxn.doIO(NIOServerCnxn.java:228)
   [junit4]   2> 	at org.apache.zookeeper.server.NIOServerCnxnFactory.run(NIOServerCnxnFactory.java:208)
   [junit4]   2> 	at java.lang.Thread.run(Thread.java:745)
   [junit4]   2> 91472 INFO  (TEST-TestSolrCloudWithSecureImpersonation.testForwarding-seed#[B275B86A96613E88]) [    ] o.a.s.c.c.ZkStateReader Updated live nodes from ZooKeeper... (0) -> (2)
   [junit4]   2> 91473 INFO  (TEST-TestSolrCloudWithSecureImpersonation.testForwarding-seed#[B275B86A96613E88]) [    ] o.a.s.c.s.i.ZkClientClusterStateProvider Cluster at 127.0.0.1:42465/solr ready
   [junit4]   2> 91606 INFO  (qtp28898925-483) [n:127.0.0.1:40928_solr    ] o.a.s.h.a.CollectionsHandler Invoked Collection Action :create with params replicationFactor=1&collection.configName=conf1&maxShardsPerNode=1&name=forwardingCollection&action=CREATE&numShards=1&wt=javabin&version=2 and sendToOCPQueue=true
   [junit4]   2> 91608 INFO  (OverseerThreadFactory-176-thread-1-processing-n:127.0.0.1:35045_solr) [n:127.0.0.1:35045_solr    ] o.a.s.c.CreateCollectionCmd Create collection forwardingCollection
   [junit4]   2> 91723 INFO  (qtp11194981-494) [n:127.0.0.1:35045_solr    ] o.a.s.h.a.CoreAdminOperation core create command qt=/admin/cores&collection.configName=conf1&newCollection=true&name=forwardingCollection_shard1_replica1&action=CREATE&numShards=1&collection=forwardingCollection&shard=shard1&wt=javabin&version=2
   [junit4]   2> 91827 INFO  (zkCallback-180-thread-1-processing-n:127.0.0.1:35045_solr) [n:127.0.0.1:35045_solr    ] o.a.s.c.c.ZkStateReader A cluster state change: [WatchedEvent state:SyncConnected type:NodeDataChanged path:/collections/forwardingCollection/state.json] for collection [forwardingCollection] has occurred - updating... (live nodes size: [2])
   [junit4]   2> 92785 WARN  (qtp11194981-494) [n:127.0.0.1:35045_solr c:forwardingCollection s:shard1  x:forwardingCollection_shard1_replica1] o.a.s.c.Config Beginning with Solr 5.5, <mergePolicy> is deprecated, use <mergePolicyFactory> instead.
   [junit4]   2> 92788 INFO  (qtp11194981-494) [n:127.0.0.1:35045_solr c:forwardingCollection s:shard1  x:forwardingCollection_shard1_replica1] o.a.s.c.SolrConfig Using Lucene MatchVersion: 7.0.0
   [junit4]   2> 92836 INFO  (qtp11194981-494) [n:127.0.0.1:35045_solr c:forwardingCollection s:shard1  x:forwardingCollection_shard1_replica1] o.a.s.s.IndexSchema [forwardingCollection_shard1_replica1] Schema name=test
   [junit4]   2> 92967 WARN  (qtp11194981-494) [n:127.0.0.1:35045_solr c:forwardingCollection s:shard1  x:forwardingCollection_shard1_replica1] o.a.s.s.IndexSchema [forwardingCollection_shard1_replica1] default search field in schema is text. WARNING: Deprecated, please use 'df' on request instead.
   [junit4]   2> 92971 INFO  (qtp11194981-494) [n:127.0.0.1:35045_solr c:forwardingCollection s:shard1  x:forwardingCollection_shard1_replica1] o.a.s.s.IndexSchema Loaded schema test/1.0 with uniqueid field id
   [junit4]   2> 92989 INFO  (qtp11194981-494) [n:127.0.0.1:35045_solr c:forwardingCollection s:shard1  x:forwardingCollection_shard1_replica1] o.a.s.c.CoreContainer Creating SolrCore 'forwardingCollection_shard1_replica1' using configuration from collection forwardingCollection
   [junit4]   2> 92990 INFO  (qtp11194981-494) [n:127.0.0.1:35045_solr c:forwardingCollection s:shard1 r:core_node1 x:forwardingCollection_shard1_replica1] o.a.s.c.SolrCore [[forwardingCollection_shard1_replica1] ] Opening new SolrCore at [/home/jenkins/workspace/Lucene-Solr-master-Linux/solr/build/solr-core/test/J2/temp/solr.cloud.TestSolrCloudWithSecureImpersonation_B275B86A96613E88-001/tempDir-001/node1/forwardingCollection_shard1_replica1], dataDir=[/home/jenkins/workspace/Lucene-Solr-master-Linux/solr/build/solr-core/test/J2/temp/solr.cloud.TestSolrCloudWithSecureImpersonation_B275B86A96613E88-001/tempDir-001/node1/./forwardingCollection_shard1_replica1/data/]
   [junit4]   2> 92991 INFO  (qtp11194981-494) [n:127.0.0.1:35045_solr c:forwardingCollection s:shard1 r:core_node1 x:forwardingCollection_shard1_replica1] o.a.s.c.JmxMonitoredMap JMX monitoring is enabled. Adding Solr mbeans to JMX Server: com.sun.jmx.mbeanserver.JmxMBeanServer@45a93e
   [junit4]   2> 92994 INFO  (qtp11194981-494) [n:127.0.0.1:35045_solr c:forwardingCollection s:shard1 r:core_node1 x:forwardingCollection_shard1_replica1] o.a.s.u.RandomMergePolicy RandomMergePolicy wrapping class org.apache.lucene.index.TieredMergePolicy: [TieredMergePolicy: maxMergeAtOnce=46, maxMergeAtOnceExplicit=15, maxMergedSegmentMB=66.5927734375, floorSegmentMB=1.177734375, forceMergeDeletesPctAllowed=10.068380795836273, segmentsPerTier=15.0, maxCFSSegmentSizeMB=8.796093022207999E12, noCFSRatio=0.5369634165983896
   [junit4]   2> 93023 INFO  (qtp11194981-494) [n:127.0.0.1:35045_solr c:forwardingCollection s:shard1 r:core_node1 x:forwardingCollection_shard1_replica1] o.a.s.u.UpdateHandler Using UpdateLog implementation: org.apache.solr.update.UpdateLog
   [junit4]   2> 93023 INFO  (qtp11194981-494) [n:127.0.0.1:35045_solr c:forwardingCollection s:shard1 r:core_node1 x:forwardingCollection_shard1_replica1] o.a.s.u.UpdateLog Initializing UpdateLog: dataDir= defaultSyncLevel=FLUSH numRecordsToKeep=100 maxNumLogsToKeep=10 numVersionBuckets=65536
   [junit4]   2> 93028 INFO  (qtp11194981-494) [n:127.0.0.1:35045_solr c:forwardingCollection s:shard1 r:core_node1 x:forwardingCollection_shard1_replica1] o.a.s.u.CommitTracker Hard AutoCommit: disabled
   [junit4]   2> 93028 INFO  (qtp11194981-494) [n:127.0.0.1:35045_solr c:forwardingCollection s:shard1 r:core_node1 x:forwardingCollection_shard1_replica1] o.a.s.u.CommitTracker Soft AutoCommit: disabled
   [junit4]   2> 93028 INFO  (qtp11194981-494) [n:127.0.0.1:35045_solr c:forwardingCollection s:shard1 r:core_node1 x:forwardingCollection_shard1_replica1] o.a.s.u.RandomMergePolicy RandomMergePolicy wrapping class org.apache.lucene.index.TieredMergePolicy: [TieredMergePolicy: maxMergeAtOnce=27, maxMergeAtOnceExplicit=36, maxMergedSegmentMB=21.2021484375, floorSegmentMB=1.23828125, forceMergeDeletesPctAllowed=2.372055101531003, segmentsPerTier=16.0, maxCFSSegmentSizeMB=8.796093022207999E12, noCFSRatio=1.0
   [junit4]   2> 93029 INFO  (qtp11194981-494) [n:127.0.0.1:35045_solr c:forwardingCollection s:shard1 r:core_node1 x:forwardingCollection_shard1_replica1] o.a.s.s.SolrIndexSearcher Opening [Searcher@1cb9d68[forwardingCollection_shard1_replica1] main]
   [junit4]   2> 93030 INFO  (qtp11194981-494) [n:127.0.0.1:35045_solr c:forwardingCollection s:shard1 r:core_node1 x:forwardingCollection_shard1_replica1] o.a.s.h.c.SpellCheckComponent Initializing spell checkers
   [junit4]   2> 93496 INFO  (qtp11194981-494) [n:127.0.0.1:35045_solr c:forwardingCollection s:shard1 r:core_node1 x:forwardingCollection_shard1_replica1] o.a.s.s.DirectSolrSpellChecker init: {name=direct,classname=DirectSolrSpellChecker,field=lowerfilt,minQueryLength=3}
   [junit4]   2> 93876 INFO  (qtp11194981-494) [n:127.0.0.1:35045_solr c:forwardingCollection s:shard1 r:core_node1 x:forwardingCollection_shard1_replica1] o.a.s.h.ReplicationHandler Commits will be reserved for  10000
   [junit4]   2> 93876 INFO  (searcherExecutor-181-thread-1-processing-n:127.0.0.1:35045_solr x:forwardingCollection_shard1_replica1 s:shard1 c:forwardingCollection r:core_node1) [n:127.0.0.1:35045_solr c:forwardingCollection s:shard1 r:core_node1 x:forwardingCollection_shard1_replica1] o.a.s.h.c.SpellCheckComponent Loading spell index for spellchecker: default
   [junit4]   2> 93876 INFO  (searcherExecutor-181-thread-1-processing-n:127.0.0.1:35045_solr x:forwardingCollection_shard1_replica1 s:shard1 c:forwardingCollection r:core_node1) [n:127.0.0.1:35045_solr c:forwardingCollection s:shard1 r:core_node1 x:forwardingCollection_shard1_replica1] o.a.s.h.c.SpellCheckComponent Loading spell index for spellchecker: direct
   [junit4]   2> 93877 INFO  (searcherExecutor-181-thread-1-processing-n:127.0.0.1:35045_solr x:forwardingCollection_shard1_replica1 s:shard1 c:forwardingCollection r:core_node1) [n:127.0.0.1:35045_solr c:forwardingCollection s:shard1 r:core_node1 x:forwardingCollection_shard1_replica1] o.a.s.h.c.SpellCheckComponent Loading spell index for spellchecker: wordbreak
   [junit4]   2> 93877 INFO  (searcherExecutor-181-thread-1-processing-n:127.0.0.1:35045_solr x:forwardingCollection_shard1_replica1 s:shard1 c:forwardingCollection r:core_node1) [n:127.0.0.1:35045_solr c:forwardingCollection s:shard1 r:core_node1 x:forwardingCollection_shard1_replica1] o.a.s.h.c.SpellCheckComponent Loading spell index for spellchecker: multipleFields
   [junit4]   2> 93877 INFO  (searcherExecutor-181-thread-1-processing-n:127.0.0.1:35045_solr x:forwardingCollection_shard1_replica1 s:shard1 c:forwardingCollection r:core_node1) [n:127.0.0.1:35045_solr c:forwardingCollection s:shard1 r:core_node1 x:forwardingCollection_shard1_replica1] o.a.s.h.c.SpellCheckComponent Loading spell index for spellchecker: jarowinkler
   [junit4]   2> 93877 INFO  (searcherExecutor-181-thread-1-processing-n:127.0.0.1:35045_solr x:forwardingCollection_shard1_replica1 s:shard1 c:forwardingCollection r:core_node1) [n:127.0.0.1:35045_solr c:forwardingCollection s:shard1 r:core_node1 x:forwardingCollection_shard1_replica1] o.a.s.h.c.SpellCheckComponent Loading spell index for spellchecker: external
   [junit4]   2> 93878 INFO  (searcherExecutor-181-thread-1-processing-n:127.0.0.1:35045_solr x:forwardingCollection_shard1_replica1 s:shard1 c:forwardingCollection r:core_node1) [n:127.0.0.1:35045_solr c:forwardingCollection s:shard1 r:core_node1 x:forwardingCollection_shard1_replica1] o.a.s.h.c.SpellCheckComponent Loading spell index for spellchecker: freq
   [junit4]   2> 93878 INFO  (searcherExecutor-181-thread-1-processing-n:127.0.0.1:35045_solr x:forwardingCollection_shard1_replica1 s:shard1 c:forwardingCollection r:core_node1) [n:127.0.0.1:35045_solr c:forwardingCollection s:shard1 r:core_node1 x:forwardingCollection_shard1_replica1] o.a.s.h.c.SpellCheckComponent Loading spell index for spellchecker: fqcn
   [junit4]   2> 93878 INFO  (searcherExecutor-181-thread-1-processing-n:127.0.0.1:35045_solr x:forwardingCollection_shard1_replica1 s:shard1 c:forwardingCollection r:core_node1) [n:127.0.0.1:35045_solr c:forwardingCollection s:shard1 r:core_node1 x:forwardingCollection_shard1_replica1] o.a.s.h.c.SpellCheckComponent Loading spell index for spellchecker: perDict
   [junit4]   2> 93878 INFO  (qtp11194981-494) [n:127.0.0.1:35045_solr c:forwardingCollection s:shard1 r:core_node1 x:forwardingCollection_shard1_replica1] o.a.s.u.UpdateLog Could not find max version in index or recent updates, using new clock 1553549796520755200
   [junit4]   2> 93880 INFO  (searcherExecutor-181-thread-1-processing-n:127.0.0.1:35045_solr x:forwardingCollection_shard1_replica1 s:shard1 c:forwardingCollection r:core_node1) [n:127.0.0.1:35045_solr c:forwardingCollection s:shard1 r:core_node1 x:forwardingCollection_shard1_replica1] o.a.s.c.SolrCore [forwardingCollection_shard1_replica1] Registered new searcher Searcher@1cb9d68[forwardingCollection_shard1_replica1] main{ExitableDirectoryReader(UninvertingDirectoryReader())}
   [junit4]   2> 93886 INFO  (qtp11194981-494) [n:127.0.0.1:35045_solr c:forwardingCollection s:shard1 r:core_node1 x:forwardingCollection_shard1_replica1] o.a.s.c.ShardLeaderElectionContext Enough replicas found to continue.
   [junit4]   2> 93886 INFO  (qtp11194981-494) [n:127.0.0.1:35045_solr c:forwardingCollection s:shard1 r:core_node1 x:forwardingCollection_shard1_replica1] o.a.s.c.ShardLeaderElectionContext I may be the new leader - try and sync
   [junit4]   2> 93886 INFO  (qtp11194981-494) [n:127.0.0.1:35045_solr c:forwardingCollection s:shard1 r:core_node1 x:forwardingCollection_shard1_replica1] o.a.s.c.SyncStrategy Sync replicas to https://127.0.0.1:35045/solr/forwardingCollection_shard1_replica1/
   [junit4]   2> 93886 INFO  (qtp11194981-494) [n:127.0.0.1:35045_solr c:forwardingCollection s:shard1 r:core_node1 x:forwardingCollection_shard1_replica1] o.a.s.c.SyncStrategy Sync Success - now sync replicas to me
   [junit4]   2> 93886 INFO  (qtp11194981-494) [n:127.0.0.1:35045_solr c:forwardingCollection s:shard1 r:core_node1 x:forwardingCollection_shard1_replica1] o.a.s.c.SyncStrategy https://127.0.0.1:35045/solr/forwardingCollection_shard1_replica1/ has no replicas
   [junit4]   2> 93888 INFO  (zkCallback-180-thread-1-processing-n:127.0.0.1:35045_solr) [n:127.0.0.1:35045_solr    ] o.a.s.c.c.ZkStateReader A cluster state change: [WatchedEvent state:SyncConnected type:NodeDataChanged path:/collections/forwardingCollection/state.json] for collection [forwardingCollection] has occurred - updating... (live nodes size: [2])
   [junit4]   2> 93892 INFO  (qtp11194981-494) [n:127.0.0.1:35045_solr c:forwardingCollection s:shard1 r:core_node1 x:forwardingCollection_shard1_replica1] o.a.s.c.ShardLeaderElectionContext I am the new leader: https://127.0.0.1:35045/solr/forwardingCollection_shard1_replica1/ shard1
   [junit4]   2> 93995 INFO  (zkCallback-180-thread-1-processing-n:127.0.0.1:35045_solr) [n:127.0.0.1:35045_solr    ] o.a.s.c.c.ZkStateReader A cluster state change: [WatchedEvent state:SyncConnected type:NodeDataChanged path:/collections/forwardingCollection/state.json] for collection [forwardingCollection] has occurred - updating... (live nodes size: [2])
   [junit4]   2> 94043 INFO  (qtp11194981-494) [n:127.0.0.1:35045_solr c:forwardingCollection s:shard1 r:core_node1 x:forwardingCollection_shard1_replica1] o.a.s.c.ZkController I am the leader, no recovery necessary
   [junit4]   2> 94047 INFO  (qtp11194981-494) [n:127.0.0.1:35045_solr c:forwardingCollection s:shard1 r:core_node1 x:forwardingCollection_shard1_replica1] o.a.s.s.HttpSolrCall [admin] webapp=null path=/admin/cores params={qt=/admin/cores&collection.configName=conf1&newCollection=true&name=forwardingCollection_shard1_replica1&action=CREATE&numShards=1&collection=forwardingCollection&shard=shard1&wt=javabin&version=2} status=0 QTime=2324
   [junit4]   2> 94048 WARN  (httpShardExecutor-173-thread-1-processing-n:127.0.0.1:35045_solr [https:////127.0.0.1:35045//solr] https:////127.0.0.1:35045//solr) [n:127.0.0.1:35045_solr    ] o.a.h.c.p.ResponseProcessCookies Invalid cookie header: "Set-Cookie: hadoop.auth="u=$&p=$&t=test&e=1481616538044&s=WKa2XMLsqkjT4ENPDPyRixij6w0="; Path=/; Domain=127.0.0.1; Expires=ti, 13-des-2016 08:08:58 GMT; Secure; HttpOnly". Invalid 'expires' attribute: ti, 13-des-2016 08:08:58 GMT
   [junit4]   2> 94060 INFO  (qtp28898925-483) [n:127.0.0.1:40928_solr    ] o.a.s.h.a.CollectionsHandler Wait for new collection to be active for at most 30 seconds. Check all shard replicas
   [junit4]   2> 94156 INFO  (zkCallback-180-thread-2-processing-n:127.0.0.1:35045_solr) [n:127.0.0.1:35045_solr    ] o.a.s.c.c.ZkStateReader A cluster state change: [WatchedEvent state:SyncConnected type:NodeDataChanged path:/collections/forwardingCollection/state.json] for collection [forwardingCollection] has occurred - updating... (live nodes size: [2])
   [junit4]   2> 95062 INFO  (qtp28898925-483) [n:127.0.0.1:40928_solr    ] o.a.s.s.HttpSolrCall [admin] webapp=null path=/admin/collections params={replicationFactor=1&collection.configName=conf1&maxShardsPerNode=1&name=forwardingCollection&action=CREATE&numShards=1&wt=javabin&version=2} status=0 QTime=3456
   [junit4]   2> 95063 WARN  (TEST-TestSolrCloudWithSecureImpersonation.testForwarding-seed#[B275B86A96613E88]) [    ] o.a.h.c.p.ResponseProcessCookies Invalid cookie header: "Set-Cookie: hadoop.auth="u=user&p=user&t=test&e=1481616537927&s=3qp+u3/3B0bOayzbsZsKaAZgAyw="; Path=/; Domain=127.0.0.1; Expires=ti, 13-des-2016 08:08:57 GMT; Secure; HttpOnly". Invalid 'expires' attribute: ti, 13-des-2016 08:08:57 GMT
   [junit4]   2> 95063 INFO  (TEST-TestSolrCloudWithSecureImpersonation.testForwarding-seed#[B275B86A96613E88]) [    ] o.a.s.c.AbstractDistribZkTestBase Wait for recoveries to finish - collection: forwardingCollection failOnTimeout:true timeout (sec):100
   [junit4]   2> 95064 INFO  (TEST-TestSolrCloudWithSecureImpersonation.testForwarding-seed#[B275B86A96613E88]) [    ] o.a.s.c.AbstractDistribZkTestBase Recoveries finished - collection: forwardingCollection
   [junit4]   2> 95077 INFO  (qtp11194981-492) [n:127.0.0.1:35045_solr c:forwardingCollection s:shard1 r:core_node1 x:forwardingCollection_shard1_replica1] o.a.s.c.S.Request [forwardingCollection_shard1_replica1]  webapp=/solr path=/select params={q=*:*&wt=javabin&version=2} hits=0 status=0 QTime=2
   [junit4]   2> 95079 WARN  (TEST-TestSolrCloudWithSecureImpersonation.testForwarding-seed#[B275B86A96613E88]) [    ] o.a.h.c.p.ResponseProcessCookies Invalid cookie header: "Set-Cookie: hadoop.auth="u=user&p=user&t=test&e=1481616541396&s=wCEnybAgVsLH3+qxnQxi5wgz3yk="; Path=/; Domain=127.0.0.1; Expires=ti, 13-des-2016 08:09:01 GMT; Secure; HttpOnly". Invalid 'expires' attribute: ti, 13-des-2016 08:09:01 GMT
   [junit4]   2> 95095 INFO  (qtp11194981-484) [n:127.0.0.1:35045_solr c:forwardingCollection s:shard1 r:core_node1 x:forwardingCollection_shard1_replica1] o.a.s.c.S.Request [forwardingCollection_shard1_replica1]  webapp=/solr path=/select params={q=*:*&wt=javabin&version=2} hits=0 status=0 QTime=0
   [junit4]   2> 95095 WARN  (qtp28898925-483) [n:127.0.0.1:40928_solr    ] o.a.h.c.p.ResponseProcessCookies Invalid cookie header: "Set-Cookie: hadoop.auth="u=$&p=$&t=test&e=1481616541416&s=L56rgYdaiBxEeb/Q+xN2WHQ+stE="; Path=/; Domain=127.0.0.1; Expires=ti, 13-des-2016 08:09:01 GMT; Secure; HttpOnly". Invalid 'expires' attribute: ti, 13-des-2016 08:09:01 GMT
   [junit4]   2> 95099 WARN  (TEST-TestSolrCloudWithSecureImpersonation.testForwarding-seed#[B275B86A96613E88]) [    ] o.a.h.c.p.ResponseProcessCookies Invalid cookie header: "Set-Cookie: hadoop.auth="u=user&p=user&t=test&e=1481616541409&s=dNjB9dQbVJ1PhP4zvbwB4Kc+VQc="; Path=/; Domain=127.0.0.1; Expires=ti, 13-des-2016 08:09:01 GMT; Secure; HttpOnly". Invalid 'expires' attribute: ti, 13-des-2016 08:09:01 GMT
   [junit4]   2> 95100 WARN  (TEST-TestSolrCloudWithSecureImpersonation.testForwarding-seed#[B275B86A96613E88]) [    ] o.a.h.c.p.ResponseProcessCookies Invalid cookie header: "Set-Cookie: hadoop.auth="u=$&p=$&t=test&e=1481616541416&s=L56rgYdaiBxEeb/Q+xN2WHQ+stE="; Path=/; Domain=127.0.0.1; Expires=ti, 13-des-2016 08:09:01 GMT; Secure; HttpOnly". Invalid 'expires' attribute: ti, 13-des-2016 08:09:01 GMT
   [junit4]   2> 95100 INFO  (TEST-TestSolrCloudWithSecureImpersonation.testForwarding-seed#[B275B86A96613E88]) [    ] o.a.s.SolrTestCaseJ4 ###Ending testForwarding
   [junit4]   2> 95116 INFO  (TEST-TestSolrCloudWithSecureImpersonation.testProxyUnknownRemote-seed#[B275B86A96613E88]) [    ] o.a.s.SolrTestCaseJ4 ###Starting testProxyUnknownRemote
   [junit4]   2> 105302 WARN  (NIOServerCxn.Factory:0.0.0.0/0.0.0.0:0) [    ] o.a.z.s.NIOServerCnxn caught end of stream exception
   [junit4]   2> EndOfStreamException: Unable to read additional data from client sessionid 0x158f514e1ce000b, likely client has closed socket
   [junit4]   2> 	at org.apache.zookeeper.server.NIOServerCnxn.doIO(NIOServerCnxn.java:228)
   [junit4]   2> 	at org.apache.zookeeper.server.NIOServerCnxnFactory.run(NIOServerCnxnFactory.java:208)
   [junit4]   2> 	at java.lang.Thread.run(Thread.java:745)
   [junit4]   2> 105302 WARN  (NIOServerCxn.Factory:0.0.0.0/0.0.0.0:0) [    ] o.a.z.s.NIOServerCnxn caught end of stream exception
   [junit4]   2> EndOfStreamException: Unable to read additional data from client sessionid 0x158f514e1ce0007, likely client has closed socket
   [junit4]   2> 	at org.apache.zookeeper.server.NIOServerCnxn.doIO(NIOServerCnxn.java:228)
   [junit4]   2> 	at org.apache.zookeeper.server.NIOServerCnxnFactory.run(NIOServerCnxnFactory.java:208)
   [junit4]   2> 	at java.lang.Thread.run(Thread.java:745)
   [junit4]   2> 105303 WARN  (NIOServerCxn.Factory:0.0.0.0/0.0.0.0:0) [    ] o.a.z.s.NIOServerCnxn caught end of stream exception
   [junit4]   2> EndOfStreamException: Unable to read additional data from client sessionid 0x158f514e1ce0008, likely client has closed socket
   [junit4]   2> 	at org.apache.zookeeper.server.NIOServerCnxn.doIO(NIOServerCnxn.java:228)
   [junit4]   2> 	at org.apache.zookeeper.server.NIOServerCnxnFactory.run(NIOServerCnxnFactory.java:208)
   [junit4]   2> 	at java.lang.Thread.run(Thread.java:745)
   [junit4]   2> 105303 INFO  (OverseerCollectionConfigSetProcessor-97096862024990725-127.0.0.1:35045_solr-n_0000000000) [n:127.0.0.1:35045_solr    ] o.a.s.c.OverseerTaskQueue Response ZK path: /overseer/collection-queue-work/qnr-0000000000 doesn't exist.  Requestor may have disconnected from ZooKeeper
   [junit4]   2> 105307 WARN  (TEST-TestSolrCloudWithSecureImpersonation.testProxyUnknownRemote-seed#[B275B86A96613E88]) [    ] o.a.h.c.p.ResponseProcessCookies Invalid cookie header: "Set-Cookie: hadoop.auth="u=localHostAnyGroup&p=localHostAnyGroup&t=test&e=1481616541441&s=iW8bOOBRTr/EFREOuHTp03zIUsY="; Path=/; Domain=127.0.0.1; Expires=ti, 13-des-2016 08:09:01 GMT; Secure; HttpOnly". Invalid 'expires' attribute: ti, 13-des-2016 08:09:01 GMT
   [junit4]   2> 105307 INFO  (TEST-TestSolrCloudWithSecureImpersonation.testProxyUnknownRemote-seed#[B275B86A96613E88]) [    ] o.a.s.SolrTestCaseJ4 ###Ending testProxyUnknownRemote
   [junit4]   2> 105402 INFO  (jetty-launcher-170-thread-2-EventThread) [n:127.0.0.1:40928_solr    ] o.a.c.f.s.ConnectionStateManager State change: SUSPENDED
   [junit4]   2> 105404 INFO  (jetty-launcher-170-thread-2) [    ] o.e.j.s.AbstractConnector Stopped ServerConnector@11186d5{SSL,[ssl, http/1.1]}{127.0.0.1:0}
   [junit4]   2> 105404 INFO  (jetty-launcher-170-thread-2) [    ] o.a.s.c.CoreContainer Shutting down CoreContainer instance=33002625
   [junit4]   2> 105405 INFO  (jetty-launcher-170-thread-1) [    ] o.e.j.s.AbstractConnector Stopped ServerConnector@1299633{SSL,[ssl, http/1.1]}{127.0.0.1:0}
   [junit4]   2> 105405 INFO  (jetty-launcher-170-thread-1) [    ] o.a.s.c.CoreContainer Shutting down CoreContainer instance=28418329
   [junit4]   2> 105407 INFO  (coreCloseExecutor-187-thread-1) [n:127.0.0.1:35045_solr c:forwardingCollection s:shard1 r:core_node1 x:forwardingCollection_shard1_replica1] o.a.s.c.SolrCore [forwardingCollection_shard1_replica1]  CLOSING SolrCore org.apache.solr.core.SolrCore@1fac75f
   [junit4]   2> 105408 WARN  (zkCallback-181-thread-1-processing-n:127.0.0.1:40928_solr) [n:127.0.0.1:40928_solr    ] o.a.s.c.c.ZkStateReader ZooKeeper watch triggered, but Solr cannot talk to ZK: [KeeperErrorCode = Session expired for /live_nodes]
   [junit4]   2> 105410 ERROR (Thread[Thread-132,5,TGRP-TestSolrCloudWithSecureImpersonation]) [n:127.0.0.1:40928_solr    ] o.a.h.s.t.d.AbstractDelegationTokenSecretManager ExpiredTokenRemover received java.lang.InterruptedException: sleep interrupted
   [junit4]   2> 105411 INFO  (zkCallback-180-thread-2-processing-n:127.0.0.1:35045_solr) [n:127.0.0.1:35045_solr    ] o.a.s.c.c.ZkStateReader Updated live nodes from ZooKeeper... (2) -> (1)
   [junit4]   2> 105411 INFO  (zkCallback-180-thread-2-processing-n:127.0.0.1:35045_solr) [n:127.0.0.1:35045_solr    ] o.a.s.c.c.ZkStateReader A cluster state change: [WatchedEvent state:SyncConnected type:NodeDataChanged path:/collections/forwardingCollection/state.json] for collection [forwardingCollection] has occurred - updating... (live nodes size: [1])
   [junit4]   2> 105450 INFO  (jetty-launcher-170-thread-1) [    ] o.a.s.c.Overseer Overseer (id=97096862024990725-127.0.0.1:35045_solr-n_0000000000) closing
   [junit4]   2> 105451 INFO  (OverseerStateUpdate-97096862024990725-127.0.0.1:35045_solr-n_0000000000) [n:127.0.0.1:35045_solr    ] o.a.s.c.Overseer Overseer Loop exiting : 127.0.0.1:35045_solr
   [junit4]   2> 105451 WARN  (zkCallback-180-thread-2-processing-n:127.0.0.1:35045_solr) [n:127.0.0.1:35045_solr    ] o.a.s.c.c.ZkStateReader ZooKeeper watch triggered, but Solr cannot talk to ZK: [KeeperErrorCode = Session expired for /live_nodes]
   [junit4]   2> 105451 ERROR (Thread[Thread-131,5,TGRP-TestSolrCloudWithSecureImpersonation]) [n:127.0.0.1:35045_solr    ] o.a.h.s.t.d.AbstractDelegationTokenSecretManager ExpiredTokenRemover received java.lang.InterruptedException: sleep interrupted
   [junit4]   2> 105666 INFO  (jetty-launcher-170-thread-1) [    ] o.e.j.s.h.ContextHandler Stopped o.e.j.s.ServletContextHandler@311b17{/solr,null,UNAVAILABLE}
   [junit4]   2> 105935 INFO  (jetty-launcher-170-thread-2) [    ] o.e.j.s.h.ContextHandler Stopped o.e.j.s.ServletContextHandler@1be2239{/solr,null,UNAVAILABLE}
   [junit4]   2> 105936 INFO  (SUITE-TestSolrCloudWithSecureImpersonation-seed#[B275B86A96613E88]-worker) [    ] o.a.s.c.ZkTestServer connecting to 127.0.0.1:42465 42465
   [junit4]   2> 105958 INFO  (Thread-114) [    ] o.a.s.c.ZkTestServer connecting to 127.0.0.1:42465 42465
   [junit4]   2> 105958 WARN  (Thread-114) [    ] o.a.s.c.ZkTestServer Watch limit violations: 
   [junit4]   2> Maximum concurrent create/delete watches above limit:
   [junit4]   2> 
   [junit4]   2> 	3	/solr/aliases.json
   [junit4]   2> 	2	/solr/security.json
   [junit4]   2> 
   [junit4]   2> Maximum concurrent data watches above limit:
   [junit4]   2> 
   [junit4]   2> 	4	/solr/security/zkdtsm/ZKDTSMRoot/ZKDTSMKeyIdRoot
   [junit4]   2> 	3	/solr/clusterstate.json
   [junit4]   2> 	3	/solr/clusterprops.json
   [junit4]   2> 	2	/solr/security/zkdtsm/ZKDTSMRoot/ZKDTSMMasterKeyRoot/DK_1
   [junit4]   2> 	2	/solr/security/zkdtsm/ZKDTSMRoot/ZKDTSMMasterKeyRoot/DK_3
   [junit4]   2> 	2	/solr/security/zkdtsm/ZKDTSMRoot/ZKDTSMMasterKeyRoot/DK_2
   [junit4]   2> 	2	/solr/security/zkdtsm/ZKDTSMRoot/ZKDTSMMasterKeyRoot/DK_4
   [junit4]   2> 	2	/solr/security/zkdtsm/ZKDTSMRoot/ZKDTSMSeqNumRoot
   [junit4]   2> 
   [junit4]   2> Maximum concurrent children watches above limit:
   [junit4]   2> 
   [junit4]   2> 	8	/solr/overseer/queue
   [junit4]   2> 	3	/solr/live_nodes
   [junit4]   2> 	3	/solr/collections
   [junit4]   2> 	3	/solr/overseer/collection-queue-work
   [junit4]   2> 	3	/solr/overseer/queue-work
   [junit4]   2> 	2	/solr/security/zkdtsm/ZKDTSMRoot/ZKDTSMMasterKeyRoot
   [junit4]   2> 	2	/solr/security/zkdtsm/ZKDTSMRoot/ZKDTSMTokensRoot
   [junit4]   2> 
   [junit4]   2> 105972 INFO  (SUITE-TestSolrCloudWithSecureImpersonation-seed#[B275B86A96613E88]-worker) [    ] o.a.s.SolrTestCaseJ4 ###deleteCore
   [junit4]   2> Dec 12, 2016 10:09:12 PM com.carrotsearch.randomizedtesting.ThreadLeakControl checkThreadLeaks
   [junit4]   2> WARNING: Will linger awaiting termination of 3 leaked thread(s).
   [junit4]   2> Dec 12, 2016 10:09:32 PM com.carrotsearch.randomizedtesting.ThreadLeakControl checkThreadLeaks
   [junit4]   2> SEVERE: 2 threads leaked from SUITE scope at org.apache.solr.cloud.TestSolrCloudWithSecureImpersonation: 
   [junit4]   2>    1) Thread[id=529, name=jetty-launcher-170-thread-1-EventThread, state=TIMED_WAITING, group=TGRP-TestSolrCloudWithSecureImpersonation]
   [junit4]   2>         at sun.misc.Unsafe.park(Native Method)
   [junit4]   2>         at java.util.concurrent.locks.LockSupport.parkNanos(LockSupport.java:215)
   [junit4]   2>         at java.util.concurrent.locks.AbstractQueuedSynchronizer.doAcquireSharedNanos(AbstractQueuedSynchronizer.java:1037)
   [junit4]   2>         at java.util.concurrent.locks.AbstractQueuedSynchronizer.tryAcquireSharedNanos(AbstractQueuedSynchronizer.java:1328)
   [junit4]   2>         at java.util.concurrent.CountDownLatch.await(CountDownLatch.java:277)
   [junit4]   2>         at org.apache.curator.CuratorZookeeperClient.internalBlockUntilConnectedOrTimedOut(CuratorZookeeperClient.java:323)
   [junit4]   2>         at org.apache.curator.RetryLoop.callWithRetry(RetryLoop.java:105)
   [junit4]   2>         at org.apache.curator.framework.imps.GetDataBuilderImpl.pathInForeground(GetDataBuilderImpl.java:288)
   [junit4]   2>         at org.apache.curator.framework.imps.GetDataBuilderImpl.forPath(GetDataBuilderImpl.java:279)
   [junit4]   2>         at org.apache.curator.framework.imps.GetDataBuilderImpl.forPath(GetDataBuilderImpl.java:41)
   [junit4]   2>         at org.apache.curator.framework.recipes.shared.SharedValue.readValue(SharedValue.java:244)
   [junit4]   2>         at org.apache.curator.framework.recipes.shared.SharedValue.access$100(SharedValue.java:44)
   [junit4]   2>         at org.apache.curator.framework.recipes.shared.SharedValue$1.process(SharedValue.java:61)
   [junit4]   2>         at org.apache.curator.framework.imps.NamespaceWatcher.process(NamespaceWatcher.java:67)
   [junit4]   2>         at org.apache.zookeeper.ClientCnxn$EventThread.processEvent(ClientCnxn.java:522)
   [junit4]   2>         at org.apache.zookeeper.ClientCnxn$EventThread.run(ClientCnxn.java:498)
   [junit4]   2>    2) Thread[id=530, name=jetty-launcher-170-thread-2-EventThread, state=TIMED_WAITING, group=TGRP-TestSolrCloudWithSecureImpersonation]
   [junit4]   2>         at sun.misc.Unsafe.park(Native Method)
   [junit4]   2>         at java.util.concurrent.locks.LockSupport.parkNanos(LockSupport.java:215)
   [junit4]   2>         at java.util.concurrent.locks.AbstractQueuedSynchronizer.doAcquireSharedNanos(AbstractQueuedSynchronizer.java:1037)
   [junit4]   2>         at java.util.concurrent.locks.AbstractQueuedSynchronizer.tryAcquireSharedNanos(AbstractQueuedSynchronizer.java:1328)
   [junit4]   2>         at java.util.concurrent.CountDownLatch.await(CountDownLatch.java:277)
   [junit4]   2>         at org.apache.curator.CuratorZookeeperClient.internalBlockUntilConnectedOrTimedOut(CuratorZookeeperClient.java:323)
   [junit4]   2>         at org.apache.curator.RetryLoop.callWithRetry(RetryLoop.java:105)
   [junit4]   2>         at org.apache.curator.framework.imps.GetDataBuilderImpl.pathInForeground(GetDataBuilderImpl.java:288)
   [junit4]   2>         at org.apache.curator.framework.imps.GetDataBuilderImpl.forPath(GetDataBuilderImpl.java:279)
   [junit4]   2>         at org.apache.curator.framework.imps.GetDataBuilderImpl.forPath(GetDataBuilderImpl.java:41)
   [junit4]   2>         at org.apache.curator.framework.recipes.shared.SharedValue.readValue(SharedValue.java:244)
   [junit4]   2>         at org.apache.curator.framework.recipes.shared.SharedValue.access$100(SharedValue.java:44)
   [junit4]   2>         at org.apache.curator.framework.recipes.shared.SharedValue$1.process(SharedValue.java:61)
   [junit4]   2>         at org.apache.curator.framework.imps.NamespaceWatcher.process(NamespaceWatcher.java:67)
   [junit4]   2>         at org.apache.zookeeper.ClientCnxn$EventThread.processEvent(ClientCnxn.java:522)
   [junit4]   2>         at org.apache.zookeeper.ClientCnxn$EventThread.run(ClientCnxn.java:498)
   [junit4]   2> Dec 12, 2016 10:09:32 PM com.carrotsearch.randomizedtesting.ThreadLeakControl tryToInterruptAll
   [junit4]   2> INFO: Starting to interrupt leaked threads:
   [junit4]   2>    1) Thread[id=529, name=jetty-launcher-170-thread-1-EventThread, state=TIMED_WAITING, group=TGRP-TestSolrCloudWithSecureImpersonation]
   [junit4]   2>    2) Thread[id=530, name=jetty-launcher-170-thread-2-EventThread, state=TIMED_WAITING, group=TGRP-TestSolrCloudWithSecureImpersonation]
   [junit4]   2> 126045 ERROR (jetty-launcher-170-thread-1-EventThread) [n:127.0.0.1:35045_solr    ] o.a.c.f.i.CuratorFrameworkImpl Watcher exception
   [junit4]   2> java.lang.InterruptedException
   [junit4]   2> 	at java.util.concurrent.locks.AbstractQueuedSynchronizer.doAcquireSharedNanos(AbstractQueuedSynchronizer.java:1039)
   [junit4]   2> 	at java.util.concurrent.locks.AbstractQueuedSynchronizer.tryAcquireSharedNanos(AbstractQueuedSynchronizer.java:1328)
   [junit4]   2> 	at java.util.concurrent.CountDownLatch.await(CountDownLatch.java:277)
   [junit4]   2> 	at org.apache.curator.CuratorZookeeperClient.internalBlockUntilConnectedOrTimedOut(CuratorZookeeperClient.java:323)
   [junit4]   2> 	at org.apache.curator.RetryLoop.callWithRetry(RetryLoop.java:105)
   [junit4]   2> 	at org.apache.curator.framework.imps.GetDataBuilderImpl.pathInForeground(GetDataBuilderImpl.java:288)
   [junit4]   2> 	at org.apache.curator.framework.imps.GetDataBuilderImpl.forPath(GetDataBuilderImpl.java:279)
   [junit4]   2> 	at org.apache.curator.framework.imps.GetDataBuilderImpl.forPath(GetDataBuilderImpl.java:41)
   [junit4]   2> 	at org.apache.curator.framework.recipes.shared.SharedValue.readValue(SharedValue.java:244)
   [junit4]   2> 	at org.apache.curator.framework.recipes.shared.SharedValue.access$100(SharedValue.java:44)
   [junit4]   2> 	at org.apache.curator.framework.recipes.shared.SharedValue$1.process(SharedValue.java:61)
   [junit4]   2> 	at org.apache.curator.framework.imps.NamespaceWatcher.process(NamespaceWatcher.java:67)
   [junit4]   2> 	at org.apache.zookeeper.ClientCnxn$EventThread.processEvent(ClientCnxn.java:522)
   [junit4]   2> 	at org.apache.zookeeper.ClientCnxn$EventThread.run(ClientCnxn.java:498)
   [junit4]   2> 126045 ERROR (jetty-launcher-170-thread-2-EventThread) [n:127.0.0.1:40928_solr    ] o.a.c.f.i.CuratorFrameworkImpl Watcher exception
   [junit4]   2> java.lang.InterruptedException
   [junit4]   2> 	at java.util.concurrent.locks.AbstractQueuedSynchronizer.doAcquireSharedNanos(AbstractQueuedSynchronizer.java:1039)
   [junit4]   2> 	at java.util.concurrent.locks.AbstractQueuedSynchronizer.tryAcquireSharedNanos(AbstractQueuedSynchronizer.java:1328)
   [junit4]   2> 	at java.util.concurrent.CountDownLatch.await(CountDownLatch.java:277)
   [junit4]   2> 	at org.apache.curator.CuratorZookeeperClient.internalBlockUntilConnectedOrTimedOut(CuratorZookeeperClient.java:323)
   [junit4]   2> 	at org.apache.curator.RetryLoop.callWithRetry(RetryLoop.java:105)
   [junit4]   2> 	at org.apache.curator.framework.imps.GetDataBuilderImpl.pathInForeground(GetDataBuilderImpl.java:288)
   [junit4]   2> 	at org.apache.curator.framework.imps.GetDataBuilderImpl.forPath(GetDataBuilderImpl.java:279)
   [junit4]   2> 	at org.apache.curator.framework.imps.GetDataBuilderImpl.forPath(GetDataBuilderImpl.java:41)
   [junit4]   2> 	at org.apache.curator.framework.recipes.shared.SharedValue.readValue(SharedValue.java:244)
   [junit4]   2> 	at org.apache.curator.framework.recipes.shared.SharedValue.access$100(SharedValue.java:44)
   [junit4]   2> 	at org.apache.curator.framework.recipes.shared.SharedValue$1.process(SharedValue.java:61)
   [junit4]   2> 	at org.apache.curator.framework.imps.NamespaceWatcher.process(NamespaceWatcher.java:67)
   [junit4]   2> 	at org.apache.zookeeper.ClientCnxn$EventThread.processEvent(ClientCnxn.java:522)
   [junit4]   2> 	at org.apache.zookeeper.ClientCnxn$EventThread.run(ClientCnxn.java:498)
   [junit4]   2> Dec 12, 2016 10:09:32 PM com.carrotsearch.randomizedtesting.ThreadLeakControl tryToInterruptAll
   [junit4]   2> INFO: All leaked threads terminated.
   [junit4]   2> NOTE: test params are: codec=Asserting(Lucene70): {}, docValues:{}, maxPointsInLeafNode=544, maxMBSortInHeap=6.542461847403201, sim=RandomSimilarity(queryNorm=true): {}, locale=no-NO, timezone=Atlantic/Bermuda
   [junit4]   2> NOTE: Linux 4.4.0-53-generic i386/Oracle Corporation 1.8.0_112 (32-bit)/cpus=12,threads=1,free=26577064,total=192913408
   [junit4]   2> NOTE: All tests run in this JVM: [RemoteQueryErrorTest, CdcrRequestHandlerTest, ZkStateReaderTest, BlockDirectoryTest, SuggesterTest, ClassificationUpdateProcessorFactoryTest, HdfsWriteToMultipleCollectionsTest, TestPKIAuthenticationPlugin, TestIndexSearcher, TestReplicationHandlerBackup, TestFilteredDocIdSet, SharedFSAutoReplicaFailoverUtilsTest, TestSolrCloudWithSecureImpersonation]
   [junit4]   2> NOTE: reproduce with: ant test  -Dtestcase=TestSolrCloudWithSecureImpersonation -Dtests.seed=B275B86A96613E88 -Dtests.multiplier=3 -Dtests.slow=true -Dtests.locale=no-NO -Dtests.timezone=Atlantic/Bermuda -Dtests.asserts=true -Dtests.file.encoding=ISO-8859-1
   [junit4] ERROR   0.00s J2 | TestSolrCloudWithSecureImpersonation (suite) <<<
   [junit4]    > Throwable #1: com.carrotsearch.randomizedtesting.ThreadLeakError: 2 threads leaked from SUITE scope at org.apache.solr.cloud.TestSolrCloudWithSecureImpersonation: 
   [junit4]    >    1) Thread[id=529, name=jetty-launcher-170-thread-1-EventThread, state=TIMED_WAITING, group=TGRP-TestSolrCloudWithSecureImpersonation]
   [junit4]    >         at sun.misc.Unsafe.park(Native Method)
   [junit4]    >         at java.util.concurrent.locks.LockSupport.parkNanos(LockSupport.java:215)
   [junit4]    >         at java.util.concurrent.locks.AbstractQueuedSynchronizer.doAcquireSharedNanos(AbstractQueuedSynchronizer.java:1037)
   [junit4]    >         at java.util.concurrent.locks.AbstractQueuedSynchronizer.tryAcquireSharedNanos(AbstractQueuedSynchronizer.java:1328)
   [junit4]    >         at java.util.concurrent.CountDownLatch.await(CountDownLatch.java:277)
   [junit4]    >         at org.apache.curator.CuratorZookeeperClient.internalBlockUntilConnectedOrTimedOut(CuratorZookeeperClient.java:323)
   [junit4]    >         at org.apache.curator.RetryLoop.callWithRetry(RetryLoop.java:105)
   [junit4]    >         at org.apache.curator.framework.imps.GetDataBuilderImpl.pathInForeground(GetDataBuilderImpl.java:288)
   [junit4]    >         at org.apache.curator.framework.imps.GetDataBuilderImpl.forPath(GetDataBuilderImpl.java:279)
   [junit4]    >         at org.apache.curator.framework.imps.GetDataBuilderImpl.forPath(GetDataBuilderImpl.java:41)
   [junit4]    >         at org.apache.curator.framework.recipes.shared.SharedValue.readValue(SharedValue.java:244)
   [junit4]    >         at org.apache.curator.framework.recipes.shared.SharedValue.access$100(SharedValue.java:44)
   [junit4]    >         at org.apache.curator.framework.recipes.shared.SharedValue$1.process(SharedValue.java:61)
   [junit4]    >         at org.apache.curator.framework.imps.NamespaceWatcher.process(NamespaceWatcher.java:67)
   [junit4]    >         at org.apache.zookeeper.ClientCnxn$EventThread.processEvent(ClientCnxn.java:522)
   [junit4]    >         at org.apache.zookeeper.ClientCnxn$EventThread.run(ClientCnxn.java:498)
   [junit4]    >    2) Thread[id=530, name=jetty-launcher-170-thread-2-EventThread, state=TIMED_WAITING, group=TGRP-TestSolrCloudWithSecureImpersonation]
   [junit4]    >         at sun.misc.Unsafe.park(Native Method)
   [junit4]    >         at java.util.concurrent.locks.LockSupport.parkNanos(LockSupport.java:215)
   [junit4]    >         at java.util.concurrent.locks.AbstractQueuedSynchronizer.doAcquireSharedNanos(AbstractQueuedSynchronizer.java:1037)
   [junit4]    >         at java.util.concurrent.locks.AbstractQueuedSynchronizer.tryAcquireSharedNanos(AbstractQueuedSynchronizer.java:1328)
   [junit4]    >         at java.util.concurrent.CountDownLatch.await(CountDownLatch.java:277)
   [junit4]    >         at org.apache.curator.CuratorZookeeperClient.internalBlockUntilConnectedOrTimedOut(CuratorZookeeperClient.java:323)
   [junit4]    >         at org.apache.curator.RetryLoop.callWithRetry(RetryLoop.java:105)
   [junit4]    >         at org.apache.curator.framework.imps.GetDataBuilderImpl.pathInForeground(GetDataBuilderImpl.java:288)
   [junit4]    >         at org.apache.curator.framework.imps.GetDataBuilderImpl.forPath(GetDataBuilderImpl.java:279)
   [junit4]    >         at org.apache.curator.framework.imps.GetDataBuilderImpl.forPath(GetDataBuilderImpl.java:41)
   [junit4]    >         at org.apache.curator.framework.recipes.shared.SharedValue.readValue(SharedValue.java:244)
   [junit4]    >         at org.apache.curator.framework.recipes.shared.SharedValue.access$100(SharedValue.java:44)
   [junit4]    >         at org.apache.curator.framework.recipes.shared.SharedValue$1.process(SharedValue.java:61)
   [junit4]    >         at org.apache.curator.framework.imps.NamespaceWatcher.process(NamespaceWatcher.java:67)
   [junit4]    >         at org.apache.zookeeper.ClientCnxn$EventThread.processEvent(ClientCnxn.java:522)
   [junit4]    >         at org.apache.zookeeper.ClientCnxn$EventThread.run(ClientCnxn.java:498)
   [junit4]    > 	at __randomizedtesting.SeedInfo.seed([B275B86A96613E88]:0)
   [junit4] Completed [36/659 (1!)] on J2 in 36.30s, 12 tests, 1 error <<< FAILURES!

[...truncated 56526 lines...]


Mime
View raw message