lucene-dev mailing list archives

Site index · List index
Message view « Date » · « Thread »
Top « Date » · « Thread »
From Policeman Jenkins Server <jenk...@thetaphi.de>
Subject [JENKINS-EA] Lucene-Solr-6.x-Linux (64bit/jdk-9-ea+140) - Build # 2318 - Unstable!
Date Fri, 02 Dec 2016 02:51:59 GMT
Build: https://jenkins.thetaphi.de/job/Lucene-Solr-6.x-Linux/2318/
Java: 64bit/jdk-9-ea+140 -XX:-UseCompressedOops -XX:+UseSerialGC

1 tests failed.
FAILED:  org.apache.solr.handler.component.SpellCheckComponentTest.testNumericQuery

Error Message:
List size mismatch @ spellcheck/suggestions

Stack Trace:
java.lang.RuntimeException: List size mismatch @ spellcheck/suggestions
	at __randomizedtesting.SeedInfo.seed([514FD50BC701AA0E:5A6382CB58C816A1]:0)
	at org.apache.solr.SolrTestCaseJ4.assertJQ(SolrTestCaseJ4.java:900)
	at org.apache.solr.SolrTestCaseJ4.assertJQ(SolrTestCaseJ4.java:847)
	at org.apache.solr.handler.component.SpellCheckComponentTest.testNumericQuery(SpellCheckComponentTest.java:154)
	at jdk.internal.reflect.NativeMethodAccessorImpl.invoke0(java.base@9-ea/Native Method)
	at jdk.internal.reflect.NativeMethodAccessorImpl.invoke(java.base@9-ea/NativeMethodAccessorImpl.java:62)
	at jdk.internal.reflect.DelegatingMethodAccessorImpl.invoke(java.base@9-ea/DelegatingMethodAccessorImpl.java:43)
	at java.lang.reflect.Method.invoke(java.base@9-ea/Method.java:535)
	at com.carrotsearch.randomizedtesting.RandomizedRunner.invoke(RandomizedRunner.java:1713)
	at com.carrotsearch.randomizedtesting.RandomizedRunner$8.evaluate(RandomizedRunner.java:907)
	at com.carrotsearch.randomizedtesting.RandomizedRunner$9.evaluate(RandomizedRunner.java:943)
	at com.carrotsearch.randomizedtesting.RandomizedRunner$10.evaluate(RandomizedRunner.java:957)
	at com.carrotsearch.randomizedtesting.rules.SystemPropertiesRestoreRule$1.evaluate(SystemPropertiesRestoreRule.java:57)
	at org.apache.lucene.util.TestRuleSetupTeardownChained$1.evaluate(TestRuleSetupTeardownChained.java:49)
	at org.apache.lucene.util.AbstractBeforeAfterRule$1.evaluate(AbstractBeforeAfterRule.java:45)
	at org.apache.lucene.util.TestRuleThreadAndTestName$1.evaluate(TestRuleThreadAndTestName.java:48)
	at org.apache.lucene.util.TestRuleIgnoreAfterMaxFailures$1.evaluate(TestRuleIgnoreAfterMaxFailures.java:64)
	at org.apache.lucene.util.TestRuleMarkFailure$1.evaluate(TestRuleMarkFailure.java:47)
	at com.carrotsearch.randomizedtesting.rules.StatementAdapter.evaluate(StatementAdapter.java:36)
	at com.carrotsearch.randomizedtesting.ThreadLeakControl$StatementRunner.run(ThreadLeakControl.java:367)
	at com.carrotsearch.randomizedtesting.ThreadLeakControl.forkTimeoutingTask(ThreadLeakControl.java:811)
	at com.carrotsearch.randomizedtesting.ThreadLeakControl$3.evaluate(ThreadLeakControl.java:462)
	at com.carrotsearch.randomizedtesting.RandomizedRunner.runSingleTest(RandomizedRunner.java:916)
	at com.carrotsearch.randomizedtesting.RandomizedRunner$5.evaluate(RandomizedRunner.java:802)
	at com.carrotsearch.randomizedtesting.RandomizedRunner$6.evaluate(RandomizedRunner.java:852)
	at com.carrotsearch.randomizedtesting.RandomizedRunner$7.evaluate(RandomizedRunner.java:863)
	at com.carrotsearch.randomizedtesting.rules.StatementAdapter.evaluate(StatementAdapter.java:36)
	at com.carrotsearch.randomizedtesting.rules.SystemPropertiesRestoreRule$1.evaluate(SystemPropertiesRestoreRule.java:57)
	at org.apache.lucene.util.AbstractBeforeAfterRule$1.evaluate(AbstractBeforeAfterRule.java:45)
	at com.carrotsearch.randomizedtesting.rules.StatementAdapter.evaluate(StatementAdapter.java:36)
	at org.apache.lucene.util.TestRuleStoreClassName$1.evaluate(TestRuleStoreClassName.java:41)
	at com.carrotsearch.randomizedtesting.rules.NoShadowingOrOverridesOnMethodsRule$1.evaluate(NoShadowingOrOverridesOnMethodsRule.java:40)
	at com.carrotsearch.randomizedtesting.rules.NoShadowingOrOverridesOnMethodsRule$1.evaluate(NoShadowingOrOverridesOnMethodsRule.java:40)
	at com.carrotsearch.randomizedtesting.rules.StatementAdapter.evaluate(StatementAdapter.java:36)
	at com.carrotsearch.randomizedtesting.rules.StatementAdapter.evaluate(StatementAdapter.java:36)
	at com.carrotsearch.randomizedtesting.rules.StatementAdapter.evaluate(StatementAdapter.java:36)
	at org.apache.lucene.util.TestRuleAssertionsRequired$1.evaluate(TestRuleAssertionsRequired.java:53)
	at org.apache.lucene.util.TestRuleMarkFailure$1.evaluate(TestRuleMarkFailure.java:47)
	at org.apache.lucene.util.TestRuleIgnoreAfterMaxFailures$1.evaluate(TestRuleIgnoreAfterMaxFailures.java:64)
	at org.apache.lucene.util.TestRuleIgnoreTestSuites$1.evaluate(TestRuleIgnoreTestSuites.java:54)
	at com.carrotsearch.randomizedtesting.rules.StatementAdapter.evaluate(StatementAdapter.java:36)
	at com.carrotsearch.randomizedtesting.ThreadLeakControl$StatementRunner.run(ThreadLeakControl.java:367)
	at java.lang.Thread.run(java.base@9-ea/Thread.java:843)




Build Log:
[...truncated 11808 lines...]
   [junit4] Suite: org.apache.solr.handler.component.SpellCheckComponentTest
   [junit4]   2> Creating dataDir: /home/jenkins/workspace/Lucene-Solr-6.x-Linux/solr/build/solr-core/test/J1/temp/solr.handler.component.SpellCheckComponentTest_514FD50BC701AA0E-001/init-core-data-001
   [junit4]   2> 1234952 INFO  (SUITE-SpellCheckComponentTest-seed#[514FD50BC701AA0E]-worker) [    ] o.a.s.SolrTestCaseJ4 Randomized ssl (false) and clientAuth (true) via: @org.apache.solr.util.RandomizeSSL(reason="", ssl=0.0/0.0, value=0.0/0.0, clientAuth=0.0/0.0)
   [junit4]   2> 1234953 INFO  (SUITE-SpellCheckComponentTest-seed#[514FD50BC701AA0E]-worker) [    ] o.a.s.SolrTestCaseJ4 ####initCore
   [junit4]   2> 1234954 INFO  (SUITE-SpellCheckComponentTest-seed#[514FD50BC701AA0E]-worker) [    ] o.a.s.c.SolrResourceLoader [null] Added 2 libs to classloader, from paths: [/home/jenkins/workspace/Lucene-Solr-6.x-Linux/solr/core/src/test-files/solr/collection1/lib, /home/jenkins/workspace/Lucene-Solr-6.x-Linux/solr/core/src/test-files/solr/collection1/lib/classes]
   [junit4]   2> 1235011 INFO  (SUITE-SpellCheckComponentTest-seed#[514FD50BC701AA0E]-worker) [    ] o.a.s.c.SolrConfig Using Lucene MatchVersion: 6.4.0
   [junit4]   2> 1235022 INFO  (SUITE-SpellCheckComponentTest-seed#[514FD50BC701AA0E]-worker) [    ] o.a.s.s.IndexSchema [null] Schema name=test
   [junit4]   2> 1235116 WARN  (SUITE-SpellCheckComponentTest-seed#[514FD50BC701AA0E]-worker) [    ] o.a.s.s.IndexSchema [null] default search field in schema is text. WARNING: Deprecated, please use 'df' on request instead.
   [junit4]   2> 1235118 INFO  (SUITE-SpellCheckComponentTest-seed#[514FD50BC701AA0E]-worker) [    ] o.a.s.s.IndexSchema Loaded schema test/1.0 with uniqueid field id
   [junit4]   2> 1235140 INFO  (SUITE-SpellCheckComponentTest-seed#[514FD50BC701AA0E]-worker) [    ] o.a.s.u.UpdateShardHandler Creating UpdateShardHandler HTTP client with params: socketTimeout=30000&connTimeout=30000&retry=true
   [junit4]   2> 1235143 INFO  (coreLoadExecutor-5898-thread-1) [    ] o.a.s.c.SolrResourceLoader [null] Added 2 libs to classloader, from paths: [/home/jenkins/workspace/Lucene-Solr-6.x-Linux/solr/core/src/test-files/solr/collection1/lib, /home/jenkins/workspace/Lucene-Solr-6.x-Linux/solr/core/src/test-files/solr/collection1/lib/classes]
   [junit4]   2> 1235199 INFO  (coreLoadExecutor-5898-thread-1) [    ] o.a.s.c.SolrConfig Using Lucene MatchVersion: 6.4.0
   [junit4]   2> 1235217 INFO  (coreLoadExecutor-5898-thread-1) [    ] o.a.s.s.IndexSchema [collection1] Schema name=test
   [junit4]   2> 1235294 WARN  (coreLoadExecutor-5898-thread-1) [    ] o.a.s.s.IndexSchema [collection1] default search field in schema is text. WARNING: Deprecated, please use 'df' on request instead.
   [junit4]   2> 1235296 INFO  (coreLoadExecutor-5898-thread-1) [    ] o.a.s.s.IndexSchema Loaded schema test/1.0 with uniqueid field id
   [junit4]   2> 1235311 INFO  (coreLoadExecutor-5898-thread-1) [    ] o.a.s.c.CoreContainer Creating SolrCore 'collection1' using configuration from instancedir /home/jenkins/workspace/Lucene-Solr-6.x-Linux/solr/core/src/test-files/solr/collection1
   [junit4]   2> 1235312 INFO  (coreLoadExecutor-5898-thread-1) [    ] o.a.s.c.SolrCore [[collection1] ] Opening new SolrCore at [/home/jenkins/workspace/Lucene-Solr-6.x-Linux/solr/core/src/test-files/solr/collection1], dataDir=[/home/jenkins/workspace/Lucene-Solr-6.x-Linux/solr/build/solr-core/test/J1/temp/solr.handler.component.SpellCheckComponentTest_514FD50BC701AA0E-001/init-core-data-001/]
   [junit4]   2> 1235312 INFO  (coreLoadExecutor-5898-thread-1) [    ] o.a.s.u.RandomMergePolicy RandomMergePolicy wrapping class org.apache.lucene.index.TieredMergePolicy: [TieredMergePolicy: maxMergeAtOnce=19, maxMergeAtOnceExplicit=25, maxMergedSegmentMB=12.5322265625, floorSegmentMB=0.736328125, forceMergeDeletesPctAllowed=1.857335363942355, segmentsPerTier=10.0, maxCFSSegmentSizeMB=8.796093022207999E12, noCFSRatio=1.0
   [junit4]   2> 1235317 INFO  (coreLoadExecutor-5898-thread-1) [    ] o.a.s.u.CommitTracker Hard AutoCommit: disabled
   [junit4]   2> 1235317 INFO  (coreLoadExecutor-5898-thread-1) [    ] o.a.s.u.CommitTracker Soft AutoCommit: disabled
   [junit4]   2> 1235317 INFO  (coreLoadExecutor-5898-thread-1) [    ] o.a.s.u.RandomMergePolicy RandomMergePolicy wrapping class org.apache.lucene.index.TieredMergePolicy: [TieredMergePolicy: maxMergeAtOnce=10, maxMergeAtOnceExplicit=25, maxMergedSegmentMB=72.970703125, floorSegmentMB=1.103515625, forceMergeDeletesPctAllowed=9.98294187501659, segmentsPerTier=25.0, maxCFSSegmentSizeMB=8.796093022207999E12, noCFSRatio=1.0
   [junit4]   2> 1235317 INFO  (coreLoadExecutor-5898-thread-1) [    ] o.a.s.s.SolrIndexSearcher Opening [Searcher@6e7d3efe[collection1] main]
   [junit4]   2> 1235317 WARN  (coreLoadExecutor-5898-thread-1) [    ] o.a.s.r.ManagedResourceStorage Cannot write to config directory /home/jenkins/workspace/Lucene-Solr-6.x-Linux/solr/core/src/test-files/solr/collection1/conf; switching to use InMemory storage instead.
   [junit4]   2> 1235317 INFO  (coreLoadExecutor-5898-thread-1) [    ] o.a.s.h.c.SpellCheckComponent Initializing spell checkers
   [junit4]   2> 1235362 INFO  (coreLoadExecutor-5898-thread-1) [    ] o.a.s.h.c.SpellCheckComponent Registering newSearcher listener for spellchecker: default
   [junit4]   2> 1235403 INFO  (coreLoadExecutor-5898-thread-1) [    ] o.a.s.h.c.SpellCheckComponent Registering newSearcher listener for spellchecker: default_teststop
   [junit4]   2> 1235403 INFO  (coreLoadExecutor-5898-thread-1) [    ] o.a.s.s.DirectSolrSpellChecker init: {name=direct,classname=solr.DirectSolrSpellChecker,minQueryLength=3,maxQueryFrequency=100.0,field=teststop}
   [junit4]   2> 1235403 INFO  (coreLoadExecutor-5898-thread-1) [    ] o.a.s.s.DirectSolrSpellChecker init: {name=direct_lowerfilt,classname=solr.DirectSolrSpellChecker,minQueryLength=3,maxQueryFrequency=100.0,field=lowerfilt}
   [junit4]   2> 1235433 INFO  (coreLoadExecutor-5898-thread-1) [    ] o.a.s.h.c.SpellCheckComponent Registering newSearcher listener for spellchecker: threshold
   [junit4]   2> 1235433 INFO  (coreLoadExecutor-5898-thread-1) [    ] o.a.s.s.DirectSolrSpellChecker init: {name=threshold_direct,classname=solr.DirectSolrSpellChecker,field=lowerfilt,spellcheckIndexDir=spellcheckerThreshold,buildOnCommit=true,thresholdTokenFrequency=0.29}
   [junit4]   2> 1235433 INFO  (coreLoadExecutor-5898-thread-1) [    ] o.a.s.h.c.SpellCheckComponent Registering newSearcher listener for spellchecker: threshold_direct
   [junit4]   2> 1235491 INFO  (coreLoadExecutor-5898-thread-1) [    ] o.a.s.h.c.SpellCheckComponent Registering newSearcher listener for spellchecker: multipleFields
   [junit4]   2> 1235602 INFO  (coreLoadExecutor-5898-thread-1) [    ] o.a.s.h.c.SpellCheckComponent Registering newSearcher listener for spellchecker: freq
   [junit4]   2> 1235656 INFO  (coreLoadExecutor-5898-thread-1) [    ] o.a.s.h.c.SpellCheckComponent Registering newSearcher listener for spellchecker: fqcn
   [junit4]   2> 1235656 INFO  (coreLoadExecutor-5898-thread-1) [    ] o.a.s.h.ReplicationHandler Commits will be reserved for  10000
   [junit4]   2> 1235656 INFO  (searcherExecutor-5899-thread-1) [    ] o.a.s.h.c.SpellCheckComponent Loading spell index for spellchecker: default
   [junit4]   2> 1235657 INFO  (SUITE-SpellCheckComponentTest-seed#[514FD50BC701AA0E]-worker) [    ] o.a.s.SolrTestCaseJ4 ####initCore end
   [junit4]   2> 1235657 INFO  (searcherExecutor-5899-thread-1) [    ] o.a.s.h.c.SpellCheckComponent Loading spell index for spellchecker: default_teststop
   [junit4]   2> 1235658 INFO  (TEST-SpellCheckComponentTest.testNumericQuery-seed#[514FD50BC701AA0E]) [    ] o.a.s.SolrTestCaseJ4 ###Starting testNumericQuery
   [junit4]   2> 1235659 INFO  (TEST-SpellCheckComponentTest.testNumericQuery-seed#[514FD50BC701AA0E]) [    ] o.a.s.u.p.LogUpdateProcessorFactory [collection1]  webapp=null path=null params={}{add=[0]} 0 0
   [junit4]   2> 1235659 INFO  (searcherExecutor-5899-thread-1) [    ] o.a.s.h.c.SpellCheckComponent Loading spell index for spellchecker: direct
   [junit4]   2> 1235659 INFO  (searcherExecutor-5899-thread-1) [    ] o.a.s.h.c.SpellCheckComponent Loading spell index for spellchecker: direct_lowerfilt
   [junit4]   2> 1235659 INFO  (searcherExecutor-5899-thread-1) [    ] o.a.s.h.c.SpellCheckComponent Loading spell index for spellchecker: wordbreak
   [junit4]   2> 1235659 INFO  (searcherExecutor-5899-thread-1) [    ] o.a.s.h.c.SpellCheckComponent Loading spell index for spellchecker: threshold
   [junit4]   2> 1235659 INFO  (TEST-SpellCheckComponentTest.testNumericQuery-seed#[514FD50BC701AA0E]) [    ] o.a.s.u.p.LogUpdateProcessorFactory [collection1]  webapp=null path=null params={}{add=[1]} 0 0
   [junit4]   2> 1235660 INFO  (TEST-SpellCheckComponentTest.testNumericQuery-seed#[514FD50BC701AA0E]) [    ] o.a.s.u.p.LogUpdateProcessorFactory [collection1]  webapp=null path=null params={}{add=[2]} 0 0
   [junit4]   2> 1235660 INFO  (TEST-SpellCheckComponentTest.testNumericQuery-seed#[514FD50BC701AA0E]) [    ] o.a.s.u.p.LogUpdateProcessorFactory [collection1]  webapp=null path=null params={}{add=[3]} 0 0
   [junit4]   2> 1235660 INFO  (TEST-SpellCheckComponentTest.testNumericQuery-seed#[514FD50BC701AA0E]) [    ] o.a.s.u.p.LogUpdateProcessorFactory [collection1]  webapp=null path=null params={}{add=[4]} 0 0
   [junit4]   2> 1235660 INFO  (TEST-SpellCheckComponentTest.testNumericQuery-seed#[514FD50BC701AA0E]) [    ] o.a.s.u.p.LogUpdateProcessorFactory [collection1]  webapp=null path=null params={}{add=[5]} 0 0
   [junit4]   2> 1235660 INFO  (searcherExecutor-5899-thread-1) [    ] o.a.s.h.c.SpellCheckComponent Loading spell index for spellchecker: threshold_direct
   [junit4]   2> 1235660 INFO  (searcherExecutor-5899-thread-1) [    ] o.a.s.h.c.SpellCheckComponent Loading spell index for spellchecker: multipleFields
   [junit4]   2> 1235660 INFO  (TEST-SpellCheckComponentTest.testNumericQuery-seed#[514FD50BC701AA0E]) [    ] o.a.s.u.p.LogUpdateProcessorFactory [collection1]  webapp=null path=null params={}{add=[6]} 0 0
   [junit4]   2> 1235660 INFO  (TEST-SpellCheckComponentTest.testNumericQuery-seed#[514FD50BC701AA0E]) [    ] o.a.s.u.p.LogUpdateProcessorFactory [collection1]  webapp=null path=null params={}{add=[7]} 0 0
   [junit4]   2> 1235661 INFO  (TEST-SpellCheckComponentTest.testNumericQuery-seed#[514FD50BC701AA0E]) [    ] o.a.s.u.p.LogUpdateProcessorFactory [collection1]  webapp=null path=null params={}{add=[8]} 0 0
   [junit4]   2> 1235661 INFO  (TEST-SpellCheckComponentTest.testNumericQuery-seed#[514FD50BC701AA0E]) [    ] o.a.s.u.p.LogUpdateProcessorFactory [collection1]  webapp=null path=null params={}{add=[9]} 0 0
   [junit4]   2> 1235661 INFO  (TEST-SpellCheckComponentTest.testNumericQuery-seed#[514FD50BC701AA0E]) [    ] o.a.s.u.DirectUpdateHandler2 start commit{,optimize=false,openSearcher=true,waitSearcher=true,expungeDeletes=false,softCommit=false,prepareCommit=false}
   [junit4]   2> 1235661 INFO  (TEST-SpellCheckComponentTest.testNumericQuery-seed#[514FD50BC701AA0E]) [    ] o.a.s.u.SolrIndexWriter Calling setCommitData with IW:org.apache.solr.update.SolrIndexWriter@3691a349
   [junit4]   2> 1235662 INFO  (searcherExecutor-5899-thread-1) [    ] o.a.s.h.c.SpellCheckComponent Loading spell index for spellchecker: jarowinkler
   [junit4]   2> 1235663 WARN  (TEST-SpellCheckComponentTest.testNumericQuery-seed#[514FD50BC701AA0E]) [    ] o.a.s.c.SolrCore [collection1] PERFORMANCE WARNING: Overlapping onDeckSearchers=2
   [junit4]   2> 1235664 INFO  (searcherExecutor-5899-thread-1) [    ] o.a.s.h.c.SpellCheckComponent Loading spell index for spellchecker: external
   [junit4]   2> 1235664 INFO  (TEST-SpellCheckComponentTest.testNumericQuery-seed#[514FD50BC701AA0E]) [    ] o.a.s.s.SolrIndexSearcher Opening [Searcher@6018299[collection1] main]
   [junit4]   2> 1235664 INFO  (TEST-SpellCheckComponentTest.testNumericQuery-seed#[514FD50BC701AA0E]) [    ] o.a.s.u.DirectUpdateHandler2 end_commit_flush
   [junit4]   2> 1235665 INFO  (searcherExecutor-5899-thread-1) [    ] o.a.s.h.c.SpellCheckComponent Loading spell index for spellchecker: freq
   [junit4]   2> 1235666 INFO  (searcherExecutor-5899-thread-1) [    ] o.a.s.h.c.SpellCheckComponent Loading spell index for spellchecker: fqcn
   [junit4]   2> 1235667 INFO  (searcherExecutor-5899-thread-1) [    ] o.a.s.h.c.SpellCheckComponent Loading spell index for spellchecker: perDict
   [junit4]   2> 1235667 INFO  (searcherExecutor-5899-thread-1) [    ] o.a.s.c.SolrCore [collection1] Registered new searcher Searcher@6e7d3efe[collection1] main{ExitableDirectoryReader(UninvertingDirectoryReader())}
   [junit4]   2> 1235667 INFO  (searcherExecutor-5899-thread-1) [    ] o.a.s.h.c.SpellCheckComponent Loading spell index for spellchecker: default
   [junit4]   2> 1235669 INFO  (searcherExecutor-5899-thread-1) [    ] o.a.s.h.c.SpellCheckComponent Loading spell index for spellchecker: default_teststop
   [junit4]   2> 1235670 INFO  (searcherExecutor-5899-thread-1) [    ] o.a.s.h.c.SpellCheckComponent Loading spell index for spellchecker: direct
   [junit4]   2> 1235670 INFO  (searcherExecutor-5899-thread-1) [    ] o.a.s.h.c.SpellCheckComponent Loading spell index for spellchecker: direct_lowerfilt
   [junit4]   2> 1235670 INFO  (searcherExecutor-5899-thread-1) [    ] o.a.s.h.c.SpellCheckComponent Loading spell index for spellchecker: wordbreak
   [junit4]   2> 1235670 INFO  (searcherExecutor-5899-thread-1) [    ] o.a.s.h.c.SpellCheckComponent Loading spell index for spellchecker: threshold
   [junit4]   2> 1235671 INFO  (searcherExecutor-5899-thread-1) [    ] o.a.s.h.c.SpellCheckComponent Loading spell index for spellchecker: threshold_direct
   [junit4]   2> 1235671 INFO  (searcherExecutor-5899-thread-1) [    ] o.a.s.h.c.SpellCheckComponent Loading spell index for spellchecker: multipleFields
   [junit4]   2> 1235672 INFO  (searcherExecutor-5899-thread-1) [    ] o.a.s.h.c.SpellCheckComponent Loading spell index for spellchecker: jarowinkler
   [junit4]   2> 1235674 INFO  (searcherExecutor-5899-thread-1) [    ] o.a.s.h.c.SpellCheckComponent Loading spell index for spellchecker: external
   [junit4]   2> 1235676 INFO  (searcherExecutor-5899-thread-1) [    ] o.a.s.h.c.SpellCheckComponent Loading spell index for spellchecker: freq
   [junit4]   2> 1235678 INFO  (searcherExecutor-5899-thread-1) [    ] o.a.s.h.c.SpellCheckComponent Loading spell index for spellchecker: fqcn
   [junit4]   2> 1235680 INFO  (searcherExecutor-5899-thread-1) [    ] o.a.s.h.c.SpellCheckComponent Loading spell index for spellchecker: perDict
   [junit4]   2> 1235680 INFO  (searcherExecutor-5899-thread-1) [    ] o.a.s.c.SolrCore [collection1] Registered new searcher Searcher@6018299[collection1] main{ExitableDirectoryReader(UninvertingDirectoryReader(Uninverting(_0(6.4.0):C10)))}
   [junit4]   2> 1235680 INFO  (TEST-SpellCheckComponentTest.testNumericQuery-seed#[514FD50BC701AA0E]) [    ] o.a.s.u.p.LogUpdateProcessorFactory [collection1]  webapp=null path=null params={}{commit=} 0 19
   [junit4]   2> 1235682 INFO  (TEST-SpellCheckComponentTest.testNumericQuery-seed#[514FD50BC701AA0E]) [    ] o.a.s.c.S.Request [collection1]  webapp=null path=null params={q=12346&qt=spellCheckCompRH&spellcheck=true&wt=xml} hits=0 status=0 QTime=1
   [junit4]   2> 1235682 ERROR (TEST-SpellCheckComponentTest.testNumericQuery-seed#[514FD50BC701AA0E]) [    ] o.a.s.SolrTestCaseJ4 query failed JSON validation. error=List size mismatch @ spellcheck/suggestions
   [junit4]   2>  expected =/spellcheck=={'suggestions':['12346',{'numFound':1,'startOffset':0,'endOffset':5,'suggestion':['12345']}]}
   [junit4]   2>  response = {
   [junit4]   2>   "responseHeader":{
   [junit4]   2>     "status":0,
   [junit4]   2>     "QTime":1},
   [junit4]   2>   "response":{"numFound":0,"start":0,"docs":[]
   [junit4]   2>   },
   [junit4]   2>   "spellcheck":{
   [junit4]   2>     "suggestions":[]}}
   [junit4]   2> 
   [junit4]   2>  request = q=12346&qt=spellCheckCompRH&spellcheck=true&wt=xml
   [junit4]   2> 1235682 INFO  (TEST-SpellCheckComponentTest.testNumericQuery-seed#[514FD50BC701AA0E]) [    ] o.a.s.SolrTestCaseJ4 ###Ending testNumericQuery
   [junit4]   2> 1235682 INFO  (TEST-SpellCheckComponentTest.testNumericQuery-seed#[514FD50BC701AA0E]) [    ] o.a.s.u.DirectUpdateHandler2 [collection1] REMOVING ALL DOCUMENTS FROM INDEX
   [junit4]   2> 1235682 INFO  (TEST-SpellCheckComponentTest.testNumericQuery-seed#[514FD50BC701AA0E]) [    ] o.a.s.u.p.LogUpdateProcessorFactory [collection1]  webapp=null path=null params={}{deleteByQuery=*:*} 0 0
   [junit4]   2> 1235682 INFO  (TEST-SpellCheckComponentTest.testNumericQuery-seed#[514FD50BC701AA0E]) [    ] o.a.s.u.DirectUpdateHandler2 start commit{,optimize=false,openSearcher=true,waitSearcher=true,expungeDeletes=false,softCommit=false,prepareCommit=false}
   [junit4]   2> 1235682 INFO  (TEST-SpellCheckComponentTest.testNumericQuery-seed#[514FD50BC701AA0E]) [    ] o.a.s.u.SolrIndexWriter Calling setCommitData with IW:org.apache.solr.update.SolrIndexWriter@3691a349
   [junit4]   2> 1235683 INFO  (TEST-SpellCheckComponentTest.testNumericQuery-seed#[514FD50BC701AA0E]) [    ] o.a.s.s.SolrIndexSearcher Opening [Searcher@29eff998[collection1] main]
   [junit4]   2> 1235683 INFO  (TEST-SpellCheckComponentTest.testNumericQuery-seed#[514FD50BC701AA0E]) [    ] o.a.s.u.DirectUpdateHandler2 end_commit_flush
   [junit4]   2> 1235683 INFO  (searcherExecutor-5899-thread-1) [    ] o.a.s.h.c.SpellCheckComponent Building spell index for spell checker: default
   [junit4]   2> 1235719 INFO  (searcherExecutor-5899-thread-1) [    ] o.a.s.h.c.SpellCheckComponent Building spell index for spell checker: default_teststop
   [junit4]   2> 1235766 INFO  (searcherExecutor-5899-thread-1) [    ] o.a.s.h.c.SpellCheckComponent Building spell index for spell checker: threshold
   [junit4]   2> 1235835 INFO  (searcherExecutor-5899-thread-1) [    ] o.a.s.h.c.SpellCheckComponent Building spell index for spell checker: threshold_direct
   [junit4]   2> 1235835 INFO  (searcherExecutor-5899-thread-1) [    ] o.a.s.h.c.SpellCheckComponent Building spell index for spell checker: multipleFields
   [junit4]   2> 1235890 INFO  (searcherExecutor-5899-thread-1) [    ] o.a.s.h.c.SpellCheckComponent Building spell index for spell checker: freq
   [junit4]   2> 1235932 INFO  (searcherExecutor-5899-thread-1) [    ] o.a.s.h.c.SpellCheckComponent Building spell index for spell checker: fqcn
   [junit4]   2> 1235978 INFO  (searcherExecutor-5899-thread-1) [    ] o.a.s.c.SolrCore [collection1] Registered new searcher Searcher@29eff998[collection1] main{ExitableDirectoryReader(UninvertingDirectoryReader())}
   [junit4]   2> 1235978 INFO  (TEST-SpellCheckComponentTest.testNumericQuery-seed#[514FD50BC701AA0E]) [    ] o.a.s.u.p.LogUpdateProcessorFactory [collection1]  webapp=null path=null params={}{commit=} 0 295
   [junit4]   2> NOTE: reproduce with: ant test  -Dtestcase=SpellCheckComponentTest -Dtests.method=testNumericQuery -Dtests.seed=514FD50BC701AA0E -Dtests.multiplier=3 -Dtests.slow=true -Dtests.locale=vun -Dtests.timezone=CET -Dtests.asserts=true -Dtests.file.encoding=ISO-8859-1
   [junit4] ERROR   0.32s J1 | SpellCheckComponentTest.testNumericQuery <<<
   [junit4]    > Throwable #1: java.lang.RuntimeException: List size mismatch @ spellcheck/suggestions
   [junit4]    > 	at __randomizedtesting.SeedInfo.seed([514FD50BC701AA0E:5A6382CB58C816A1]:0)
   [junit4]    > 	at org.apache.solr.SolrTestCaseJ4.assertJQ(SolrTestCaseJ4.java:900)
   [junit4]    > 	at org.apache.solr.SolrTestCaseJ4.assertJQ(SolrTestCaseJ4.java:847)
   [junit4]    > 	at org.apache.solr.handler.component.SpellCheckComponentTest.testNumericQuery(SpellCheckComponentTest.java:154)
   [junit4]    > 	at jdk.internal.reflect.NativeMethodAccessorImpl.invoke0(java.base@9-ea/Native Method)
   [junit4]    > 	at jdk.internal.reflect.NativeMethodAccessorImpl.invoke(java.base@9-ea/NativeMethodAccessorImpl.java:62)
   [junit4]    > 	at jdk.internal.reflect.DelegatingMethodAccessorImpl.invoke(java.base@9-ea/DelegatingMethodAccessorImpl.java:43)
   [junit4]    > 	at java.lang.Thread.run(java.base@9-ea/Thread.java:843)
   [junit4]   2> 1235981 INFO  (TEST-SpellCheckComponentTest.test-seed#[514FD50BC701AA0E]) [    ] o.a.s.SolrTestCaseJ4 ###Starting test
   [junit4]   2> 1235981 INFO  (TEST-SpellCheckComponentTest.test-seed#[514FD50BC701AA0E]) [    ] o.a.s.u.p.LogUpdateProcessorFactory [collection1]  webapp=null path=null params={}{add=[0]} 0 0
   [junit4]   2> 1235981 INFO  (TEST-SpellCheckComponentTest.test-seed#[514FD50BC701AA0E]) [    ] o.a.s.u.p.LogUpdateProcessorFactory [collection1]  webapp=null path=null params={}{add=[1]} 0 0
   [junit4]   2> 1235982 INFO  (TEST-SpellCheckComponentTest.test-seed#[514FD50BC701AA0E]) [    ] o.a.s.u.p.LogUpdateProcessorFactory [collection1]  webapp=null path=null params={}{add=[2]} 0 0
   [junit4]   2> 1235982 INFO  (TEST-SpellCheckComponentTest.test-seed#[514FD50BC701AA0E]) [    ] o.a.s.u.p.LogUpdateProcessorFactory [collection1]  webapp=null path=null params={}{add=[3]} 0 0
   [junit4]   2> 1235982 INFO  (TEST-SpellCheckComponentTest.test-seed#[514FD50BC701AA0E]) [    ] o.a.s.u.p.LogUpdateProcessorFactory [collection1]  webapp=null path=null params={}{add=[4]} 0 0
   [junit4]   2> 1235982 INFO  (TEST-SpellCheckComponentTest.test-seed#[514FD50BC701AA0E]) [    ] o.a.s.u.p.LogUpdateProcessorFactory [collection1]  webapp=null path=null params={}{add=[5]} 0 0
   [junit4]   2> 1235982 INFO  (TEST-SpellCheckComponentTest.test-seed#[514FD50BC701AA0E]) [    ] o.a.s.u.p.LogUpdateProcessorFactory [collection1]  webapp=null path=null params={}{add=[6]} 0 0
   [junit4]   2> 1235982 INFO  (TEST-SpellCheckComponentTest.test-seed#[514FD50BC701AA0E]) [    ] o.a.s.u.p.LogUpdateProcessorFactory [collection1]  webapp=null path=null params={}{add=[7]} 0 0
   [junit4]   2> 1235983 INFO  (TEST-SpellCheckComponentTest.test-seed#[514FD50BC701AA0E]) [    ] o.a.s.u.p.LogUpdateProcessorFactory [collection1]  webapp=null path=null params={}{add=[8]} 0 0
   [junit4]   2> 1235983 INFO  (TEST-SpellCheckComponentTest.test-seed#[514FD50BC701AA0E]) [    ] o.a.s.u.p.LogUpdateProcessorFactory [collection1]  webapp=null path=null params={}{add=[9]} 0 0
   [junit4]   2> 1235983 INFO  (TEST-SpellCheckComponentTest.test-seed#[514FD50BC701AA0E]) [    ] o.a.s.u.DirectUpdateHandler2 start commit{,optimize=false,openSearcher=true,waitSearcher=true,expungeDeletes=false,softCommit=false,prepareCommit=false}
   [junit4]   2> 1235983 INFO  (TEST-SpellCheckComponentTest.test-seed#[514FD50BC701AA0E]) [    ] o.a.s.u.SolrIndexWriter Calling setCommitData with IW:org.apache.solr.update.SolrIndexWriter@3691a349
   [junit4]   2> 1235985 INFO  (TEST-SpellCheckComponentTest.test-seed#[514FD50BC701AA0E]) [    ] o.a.s.s.SolrIndexSearcher Opening [Searcher@66e6a162[collection1] main]
   [junit4]   2> 1235985 INFO  (TEST-SpellCheckComponentTest.test-seed#[514FD50BC701AA0E]) [    ] o.a.s.u.DirectUpdateHandler2 end_commit_flush
   [junit4]   2> 1235985 INFO  (searcherExecutor-5899-thread-1) [    ] o.a.s.h.c.SpellCheckComponent Building spell index for spell checker: default
   [junit4]   2> 1236155 INFO  (searcherExecutor-5899-thread-1) [    ] o.a.s.h.c.SpellCheckComponent Building spell index for spell checker: default_teststop
   [junit4]   2> 1236208 INFO  (searcherExecutor-5899-thread-1) [    ] o.a.s.h.c.SpellCheckComponent Building spell index for spell checker: threshold
   [junit4]   2> 1236384 INFO  (searcherExecutor-5899-thread-1) [    ] o.a.s.h.c.SpellCheckComponent Building spell index for spell checker: threshold_direct
   [junit4]   2> 1236384 INFO  (searcherExecutor-5899-thread-1) [    ] o.a.s.h.c.SpellCheckComponent Building spell index for spell checker: multipleFields
   [junit4]   2> 1236580 INFO  (searcherExecutor-5899-thread-1) [    ] o.a.s.h.c.SpellCheckComponent Building spell index for spell checker: freq
   [junit4]   2> 1236736 INFO  (searcherExecutor-5899-thread-1) [    ] o.a.s.h.c.SpellCheckComponent Building spell index for spell checker: fqcn
   [junit4]   2> 1236873 INFO  (searcherExecutor-5899-thread-1) [    ] o.a.s.c.SolrCore [collection1] Registered new searcher Searcher@66e6a162[collection1] main{ExitableDirectoryReader(UninvertingDirectoryReader(Uninverting(_1(6.4.0):C10)))}
   [junit4]   2> 1236873 INFO  (TEST-SpellCheckComponentTest.test-seed#[514FD50BC701AA0E]) [    ] o.a.s.u.p.LogUpdateProcessorFactory [collection1]  webapp=null path=null params={}{commit=} 0 890
   [junit4]   2> 1236875 INFO  (TEST-SpellCheckComponentTest.test-seed#[514FD50BC701AA0E]) [    ] o.a.s.c.S.Request [collection1]  webapp=null path=null params={q=documemt&qt=spellCheckCompRH&spellcheck=true&wt=xml} hits=0 status=0 QTime=0
   [junit4]   2> 1236875 INFO  (TEST-SpellCheckComponentTest.test-seed#[514FD50BC701AA0E]) [    ] o.a.s.SolrTestCaseJ4 ###Ending test
   [junit4]   2> 1236875 INFO  (TEST-SpellCheckComponentTest.test-seed#[514FD50BC701AA0E]) [    ] o.a.s.u.DirectUpdateHandler2 [collection1] REMOVING ALL DOCUMENTS FROM INDEX
   [junit4]   2> 1236875 INFO  (TEST-SpellCheckComponentTest.test-seed#[514FD50BC701AA0E]) [    ] o.a.s.u.p.LogUpdateProcessorFactory [collection1]  webapp=null path=null params={}{deleteByQuery=*:*} 0 0
   [junit4]   2> 1236875 INFO  (TEST-SpellCheckComponentTest.test-seed#[514FD50BC701AA0E]) [    ] o.a.s.u.DirectUpdateHandler2 start commit{,optimize=false,openSearcher=true,waitSearcher=true,expungeDeletes=false,softCommit=false,prepareCommit=false}
   [junit4]   2> 1236875 INFO  (TEST-SpellCheckComponentTest.test-seed#[514FD50BC701AA0E]) [    ] o.a.s.u.SolrIndexWriter Calling setCommitData with IW:org.apache.solr.update.SolrIndexWriter@3691a349
   [junit4]   2> 1236876 INFO  (TEST-SpellCheckComponentTest.test-seed#[514FD50BC701AA0E]) [    ] o.a.s.s.SolrIndexSearcher Opening [Searcher@3afaf580[collection1] main]
   [junit4]   2> 1236876 INFO  (TEST-SpellCheckComponentTest.test-seed#[514FD50BC701AA0E]) [    ] o.a.s.u.DirectUpdateHandler2 end_commit_flush
   [junit4]   2> 1236876 INFO  (searcherExecutor-5899-thread-1) [    ] o.a.s.h.c.SpellCheckComponent Building spell index for spell checker: default
   [junit4]   2> 1236947 INFO  (searcherExecutor-5899-thread-1) [    ] o.a.s.h.c.SpellCheckComponent Building spell index for spell checker: default_teststop
   [junit4]   2> 1236990 INFO  (searcherExecutor-5899-thread-1) [    ] o.a.s.h.c.SpellCheckComponent Building spell index for spell checker: threshold
   [junit4]   2> 1237037 INFO  (searcherExecutor-5899-thread-1) [    ] o.a.s.h.c.SpellCheckComponent Building spell index for spell checker: threshold_direct
   [junit4]   2> 1237038 INFO  (searcherExecutor-5899-thread-1) [    ] o.a.s.h.c.SpellCheckComponent Building spell index for spell checker: multipleFields
   [junit4]   2> 1237085 INFO  (searcherExecutor-5899-thread-1) [    ] o.a.s.h.c.SpellCheckComponent Building spell index for spell checker: freq
   [junit4]   2> 1237136 INFO  (searcherExecutor-5899-thread-1) [    ] o.a.s.h.c.SpellCheckComponent Building spell index for spell checker: fqcn
   [junit4]   2> 1237198 INFO  (searcherExecutor-5899-thread-1) [    ] o.a.s.c.SolrCore [collection1] Registered new searcher Searcher@3afaf580[collection1] main{ExitableDirectoryReader(UninvertingDirectoryReader())}
   [junit4]   2> 1237198 INFO  (TEST-SpellCheckComponentTest.test-seed#[514FD50BC701AA0E]) [    ] o.a.s.u.p.LogUpdateProcessorFactory [collection1]  webapp=null path=null params={}{commit=} 0 322
   [junit4]   2> 1237200 INFO  (TEST-SpellCheckComponentTest.testReloadOnStart-seed#[514FD50BC701AA0E]) [    ] o.a.s.SolrTestCaseJ4 ###Starting testReloadOnStart
   [junit4]   2> 1237200 INFO  (TEST-SpellCheckComponentTest.testReloadOnStart-seed#[514FD50BC701AA0E]) [    ] o.a.s.u.p.LogUpdateProcessorFactory [collection1]  webapp=null path=null params={}{add=[0]} 0 0
   [junit4]   2> 1237200 INFO  (TEST-SpellCheckComponentTest.testReloadOnStart-seed#[514FD50BC701AA0E]) [    ] o.a.s.u.p.LogUpdateProcessorFactory [collection1]  webapp=null path=null params={}{add=[1]} 0 0
   [junit4]   2> 1237201 INFO  (TEST-SpellCheckComponentTest.testReloadOnStart-seed#[514FD50BC701AA0E]) [    ] o.a.s.u.p.LogUpdateProcessorFactory [collection1]  webapp=null path=null params={}{add=[2]} 0 0
   [junit4]   2> 1237201 INFO  (TEST-SpellCheckComponentTest.testReloadOnStart-seed#[514FD50BC701AA0E]) [    ] o.a.s.u.p.LogUpdateProcessorFactory [collection1]  webapp=null path=null params={}{add=[3]} 0 0
   [junit4]   2> 1237201 INFO  (TEST-SpellCheckComponentTest.testReloadOnStart-seed#[514FD50BC701AA0E]) [    ] o.a.s.u.p.LogUpdateProcessorFactory [collection1]  webapp=null path=null params={}{add=[4]} 0 0
   [junit4]   2> 1237201 INFO  (TEST-SpellCheckComponentTest.testReloadOnStart-seed#[514FD50BC701AA0E]) [    ] o.a.s.u.p.LogUpdateProcessorFactory [collection1]  webapp=null path=null params={}{add=[5]} 0 0
   [junit4]   2> 1237202 INFO  (TEST-SpellCheckComponentTest.testReloadOnStart-seed#[514FD50BC701AA0E]) [    ] o.a.s.u.p.LogUpdateProcessorFactory [collection1]  webapp=null path=null params={}{add=[6]} 0 0
   [junit4]   2> 1237202 INFO  (TEST-SpellCheckComponentTest.testReloadOnStart-seed#[514FD50BC701AA0E]) [    ] o.a.s.u.p.LogUpdateProcessorFactory [collection1]  webapp=null path=null params={}{add=[7]} 0 0
   [junit4]   2> 1237202 INFO  (TEST-SpellCheckComponentTest.testReloadOnStart-seed#[514FD50BC701AA0E]) [    ] o.a.s.u.p.LogUpdateProcessorFactory [collection1]  webapp=null path=null params={}{add=[8]} 0 0
   [junit4]   2> 1237202 INFO  (TEST-SpellCheckComponentTest.testReloadOnStart-seed#[514FD50BC701AA0E]) [    ] o.a.s.u.p.LogUpdateProcessorFactory [collection1]  webapp=null path=null params={}{add=[9]} 0 0
   [junit4]   2> 1237203 INFO  (TEST-SpellCheckComponentTest.testReloadOnStart-seed#[514FD50BC701AA0E]) [    ] o.a.s.u.DirectUpdateHandler2 start commit{,optimize=false,openSearcher=true,waitSearcher=true,expungeDeletes=false,softCommit=false,prepareCommit=false}
   [junit4]   2> 1237203 INFO  (TEST-SpellCheckComponentTest.testReloadOnStart-seed#[514FD50BC701AA0E]) [    ] o.a.s.u.SolrIndexWriter Calling setCommitData with IW:org.apache.solr.update.SolrIndexWriter@3691a349
   [junit4]   2> 1237206 INFO  (TEST-SpellCheckComponentTest.testReloadOnStart-seed#[514FD50BC701AA0E]) [    ] o.a.s.s.SolrIndexSearcher Opening [Searcher@7962c920[collection1] main]
   [junit4]   2> 1237206 INFO  (TEST-SpellCheckComponentTest.testReloadOnStart-seed#[514FD50BC701AA0E]) [    ] o.a.s.u.DirectUpdateHandler2 end_commit_flush
   [junit4]   2> 1237206 INFO  (searcherExecutor-5899-thread-1) [    ] o.a.s.h.c.SpellCheckComponent Building spell index for spell checker: default
   [junit4]   2> 1237369 INFO  (searcherExecutor-5899-thread-1) [    ] o.a.s.h.c.SpellCheckComponent Building spell index for spell checker: default_teststop
   [junit4]   2> 1237413 INFO  (searcherExecutor-5899-thread-1) [    ] o.a.s.h.c.SpellCheckComponent Building spell index for spell checker: threshold
   [junit4]   2> 1237560 INFO  (searcherExecutor-5899-thread-1) [    ] o.a.s.h.c.SpellCheckComponent Building spell index for spell checker: threshold_direct
   [junit4]   2> 1237560 INFO  (searcherExecutor-5899-thread-1) [    ] o.a.s.h.c.SpellCheckComponent Building spell index for spell checker: multipleFields
   [junit4]   2> 1237710 INFO  (searcherExecutor-5899-thread-1) [    ] o.a.s.h.c.SpellCheckComponent Building spell index for spell checker: freq
   [junit4]   2> 1237855 INFO  (searcherExecutor-5899-thread-1) [    ] o.a.s.h.c.SpellCheckComponent Building spell index for spell checker: fqcn
   [junit4]   2> 1237982 INFO  (searcherExecutor-5899-thread-1) [    ] o.a.s.c.SolrCore [collection1] Registered new searcher Searcher@7962c920[collection1] main{ExitableDirectoryReader(UninvertingDirectoryReader(Uninverting(_2(6.4.0):C10)))}
   [junit4]   2> 1237982 INFO  (TEST-SpellCheckComponentTest.testReloadOnStart-seed#[514FD50BC701AA0E]) [    ] o.a.s.u.p.LogUpdateProcessorFactory [collection1]  webapp=null path=null params={}{commit=} 0 779
   [junit4]   2> 1237983 INFO  (TEST-SpellCheckComponentTest.testReloadOnStart-seed#[514FD50BC701AA0E]) [    ] o.a.s.u.p.LogUpdateProcessorFactory [collection1]  webapp=null path=null params={}{add=[0]} 0 0
   [junit4]   2> 1237983 INFO  (TEST-SpellCheckComponentTest.testReloadOnStart-seed#[514FD50BC701AA0E]) [    ] o.a.s.u.DirectUpdateHandler2 start commit{,optimize=false,openSearcher=true,waitSearcher=true,expungeDeletes=false,softCommit=false,prepareCommit=false}
   [junit4]   2> 1237983 INFO  (TEST-SpellCheckComponentTest.testReloadOnStart-seed#[514FD50BC701AA0E]) [    ] o.a.s.u.SolrIndexWriter Calling setCommitData with IW:org.apache.solr.update.SolrIndexWriter@3691a349
   [junit4]   2> 1237985 INFO  (TEST-SpellCheckComponentTest.testReloadOnStart-seed#[514FD50BC701AA0E]) [    ] o.a.s.s.SolrIndexSearcher Opening [Searcher@13e85ac[collection1] main]
   [junit4]   2> 1237985 INFO  (TEST-SpellCheckComponentTest.testReloadOnStart-seed#[514FD50BC701AA0E]) [    ] o.a.s.u.DirectUpdateHandler2 end_commit_flush
   [junit4]   2> 1237985 INFO  (searcherExecutor-5899-thread-1) [    ] o.a.s.h.c.SpellCheckComponent Building spell index for spell checker: default
   [junit4]   2> 1238147 INFO  (searcherExecutor-5899-thread-1) [    ] o.a.s.h.c.SpellCheckComponent Building spell index for spell checker: default_teststop
   [junit4]   2> 1238204 INFO  (searcherExecutor-5899-thread-1) [    ] o.a.s.h.c.SpellCheckComponent Building spell index for spell checker: threshold
   [junit4]   2> 1238440 INFO  (searcherExecutor-5899-thread-1) [    ] o.a.s.h.c.SpellCheckComponent Building spell index for spell checker: threshold_direct
   [junit4]   2> 1238440 INFO  (searcherExecutor-5899-thread-1) [    ] o.a.s.h.c.SpellCheckComponent Building spell index for spell checker: multipleFields
   [junit4]   2> 1238660 INFO  (searcherExecutor-5899-thread-1) [    ] o.a.s.h.c.SpellCheckComponent Building spell index for spell checker: freq
   [junit4]   2> 1238893 INFO  (searcherExecutor-5899-thread-1) [    ] o.a.s.h.c.SpellCheckComponent Building spell index for spell checker: fqcn
   [junit4]   2> 1239108 INFO  (searcherExecutor-5899-thread-1) [    ] o.a.s.c.SolrCore [collection1] Registered new searcher Searcher@13e85ac[collection1] main{ExitableDirectoryReader(UninvertingDirectoryReader(Uninverting(_2(6.4.0):C10/1:delGen=1) Uninverting(_3(6.4.0):C1)))}
   [junit4]   2> 1239109 INFO  (TEST-SpellCheckComponentTest.testReloadOnStart-seed#[514FD50BC701AA0E]) [    ] o.a.s.u.p.LogUpdateProcessorFactory [collection1]  webapp=null path=null params={}{commit=} 0 1125
   [junit4]   2> 1239319 INFO  (TEST-SpellCheckComponentTest.testReloadOnStart-seed#[514FD50BC701AA0E]) [    ] o.a.s.c.S.Request [collection1]  webapp=null path=null params={q=*:*&spellcheck.q=ttle&qt=spellCheckCompRH&spellcheck.dictionary=default&spellcheck=true&wt=xml&spellcheck.build=true} hits=10 status=0 QTime=210
   [junit4]   2> 1239320 INFO  (TEST-SpellCheckComponentTest.testReloadOnStart-seed#[514FD50BC701AA0E]) [    ] o.a.s.h.c.SpellCheckComponent Initializing spell checkers
   [junit4]   2> 1239332 INFO  (TEST-SpellCheckComponentTest.testReloadOnStart-seed#[514FD50BC701AA0E]) [    ] o.a.s.SolrTestCaseJ4 ###Ending testReloadOnStart
   [junit4]   2> 1239333 INFO  (TEST-SpellCheckComponentTest.testReloadOnStart-seed#[514FD50BC701AA0E]) [    ] o.a.s.u.DirectUpdateHandler2 [collection1] REMOVING ALL DOCUMENTS FROM INDEX
   [junit4]   2> 1239333 INFO  (TEST-SpellCheckComponentTest.testReloadOnStart-seed#[514FD50BC701AA0E]) [    ] o.a.s.u.p.LogUpdateProcessorFactory [collection1]  webapp=null path=null params={}{deleteByQuery=*:*} 0 0
   [junit4]   2> 1239333 INFO  (TEST-SpellCheckComponentTest.testReloadOnStart-seed#[514FD50BC701AA0E]) [    ] o.a.s.u.DirectUpdateHandler2 start commit{,optimize=false,openSearcher=true,waitSearcher=true,expungeDeletes=false,softCommit=false,prepareCommit=false}
   [junit4]   2> 1239333 INFO  (TEST-SpellCheckComponentTest.testReloadOnStart-seed#[514FD50BC701AA0E]) [    ] o.a.s.u.SolrIndexWriter Calling setCommitData with IW:org.apache.solr.update.SolrIndexWriter@3691a349
   [junit4]   2> 1239334 INFO  (TEST-SpellCheckComponentTest.testReloadOnStart-seed#[514FD50BC701AA0E]) [    ] o.a.s.s.SolrIndexSearcher Opening [Searcher@59cf3a61[collection1] main]
   [junit4]   2> 1239334 INFO  (TEST-SpellCheckComponentTest.testReloadOnStart-seed#[514FD50BC701AA0E]) [    ] o.a.s.u.DirectUpdateHandler2 end_commit_flush
   [junit4]   2> 1239334 INFO  (searcherExecutor-5899-thread-1) [    ] o.a.s.h.c.SpellCheckComponent Building spell index for spell checker: default
   [junit4]   2> 1239392 INFO  (searcherExecutor-5899-thread-1) [    ] o.a.s.h.c.SpellCheckComponent Building spell index for spell checker: default_teststop
   [junit4]   2> 1239452 INFO  (searcherExecutor-5899-thread-1) [    ] o.a.s.h.c.SpellCheckComponent Building spell index for spell checker: threshold
   [junit4]   2> 1239500 INFO  (searcherExecutor-5899-thread-1) [    ] o.a.s.h.c.SpellCheckComponent Building spell index for spell checker: threshold_direct
   [junit4]   2> 1239500 INFO  (searcherExecutor-5899-thread-1) [    ] o.a.s.h.c.SpellCheckComponent Building spell index for spell checker: multipleFields
   [junit4]   2> 1239541 INFO  (searcherExecutor-5899-thread-1) [    ] o.a.s.h.c.SpellCheckComponent Building spell index for spell checker: freq
   [junit4]   2> 1239601 INFO  (searcherExecutor-5899-thread-1) [    ] o.a.s.h.c.SpellCheckComponent Building spell index for spell checker: fqcn
   [junit4]   2> 1239648 INFO  (searcherExecutor-5899-thread-1) [    ] o.a.s.c.SolrCore [collection1] Registered new searcher Searcher@59cf3a61[collection1] main{ExitableDirectoryReader(UninvertingDirectoryReader())}
   [junit4]   2> 1239648 INFO  (TEST-SpellCheckComponentTest.testReloadOnStart-seed#[514FD50BC701AA0E]) [    ] o.a.s.u.p.LogUpdateProcessorFactory [collection1]  webapp=null path=null params={}{commit=} 0 314
   [junit4]   2> 1239649 INFO  (TEST-SpellCheckComponentTest.testMaximumResultsForSuggest-seed#[514FD50BC701AA0E]) [    ] o.a.s.SolrTestCaseJ4 ###Starting testMaximumResultsForSuggest
   [junit4]   2> 1239650 INFO  (TEST-SpellCheckComponentTest.testMaximumResultsForSuggest-seed#[514FD50BC701AA0E]) [    ] o.a.s.u.p.LogUpdateProcessorFactory [collection1]  webapp=null path=null params={}{add=[0]} 0 0
   [junit4]   2> 1239650 INFO  (TEST-SpellCheckComponentTest.testMaximumResultsForSuggest-seed#[514FD50BC701AA0E]) [    ] o.a.s.u.p.LogUpdateProcessorFactory [collection1]  webapp=null path=null params={}{add=[1]} 0 0
   [junit4]   2> 1239650 INFO  (TEST-SpellCheckComponentTest.testMaximumResultsForSuggest-seed#[514FD50BC701AA0E]) [    ] o.a.s.u.p.LogUpdateProcessorFactory [collection1]  webapp=null path=null params={}{add=[2]} 0 0
   [junit4]   2> 1239651 INFO  (TEST-SpellCheckComponentTest.testMaximumResultsForSuggest-seed#[514FD50BC701AA0E]) [    ] o.a.s.u.p.LogUpdateProcessorFactory [collection1]  webapp=null path=null params={}{add=[3]} 0 0
   [junit4]   2> 1239651 INFO  (TEST-SpellCheckComponentTest.testMaximumResultsForSuggest-seed#[514FD50BC701AA0E]) [    ] o.a.s.u.p.LogUpdateProcessorFactory [collection1]  webapp=null path=null params={}{add=[4]} 0 0
   [junit4]   2> 1239651 INFO  (TEST-SpellCheckComponentTest.testMaximumResultsForSuggest-seed#[514FD50BC701AA0E]) [    ] o.a.s.u.p.LogUpdateProcessorFactory [collection1]  webapp=null path=null params={}{add=[5]} 0 0
   [junit4]   2> 1239651 INFO  (TEST-SpellCheckComponentTest.testMaximumResultsForSuggest-seed#[514FD50BC701AA0E]) [    ] o.a.s.u.p.LogUpdateProcessorFactory [collection1]  webapp=null path=null params={}{add=[6]} 0 0
   [junit4]   2> 1239652 INFO  (TEST-SpellCheckComponentTest.testMaximumResultsForSuggest-seed#[514FD50BC701AA0E]) [    ] o.a.s.u.p.LogUpdateProcessorFactory [collection1]  webapp=null path=null params={}{add=[7]} 0 0
   [junit4]   2> 1239652 INFO  (TEST-SpellCheckComponentTest.testMaximumResultsForSuggest-seed#[514FD50BC701AA0E]) [    ] o.a.s.u.p.LogUpdateProcessorFactory [collection1]  webapp=null path=null params={}{add=[8]} 0 0
   [junit4]   2> 1239652 INFO  (TEST-SpellCheckComponentTest.testMaximumResultsForSuggest-seed#[514FD50BC701AA0E]) [    ] o.a.s.u.p.LogUpdateProcessorFactory [collection1]  webapp=null path=null params={}{add=[9]} 0 0
   [junit4]   2> 1239652 INFO  (TEST-SpellCheckComponentTest.testMaximumResultsForSuggest-seed#[514FD50BC701AA0E]) [    ] o.a.s.u.DirectUpdateHandler2 start commit{,optimize=false,openSearcher=true,waitSearcher=true,expungeDeletes=false,softCommit=false,prepareCommit=false}
   [junit4]   2> 1239652 INFO  (TEST-SpellCheckComponentTest.testMaximumResultsForSuggest-seed#[514FD50BC701AA0E]) [    ] o.a.s.u.SolrIndexWriter Calling setCommitData with IW:org.apache.solr.update.SolrIndexWriter@3691a349
   [junit4]   2> 1239655 INFO  (TEST-SpellCheckComponentTest.testMaximumResultsForSuggest-seed#[514FD50BC701AA0E]) [    ] o.a.s.s.SolrIndexSearcher Opening [Searcher@25de3481[collection1] main]
   [junit4]   2> 1239655 INFO  (TEST-SpellCheckComponentTest.testMaximumResultsForSuggest-seed#[514FD50BC701AA0E]) [    ] o.a.s.u.DirectUpdateHandler2 end_commit_flush
   [junit4]   2> 1239655 INFO  (searcherExecutor-5899-thread-1) [    ] o.a.s.h.c.SpellCheckComponent Building spell index for spell checker: default
   [junit4]   2> 1239787 INFO  (searcherExecutor-5899-thread-1) [    ] o.a.s.h.c.SpellCheckComponent Building spell index for spell checker: default_teststop
   [junit4]   2> 1239852 INFO  (searcherExecutor-5899-thread-1) [    ] o.a.s.h.c.SpellCheckComponent Building spell index for spell checker: threshold
   [junit4]   2> 1239992 INFO  (searcherExecutor-5899-thread-1) [    ] o.a.s.h.c.SpellCheckComponent Building spell index for spell checker: threshold_direct
   [junit4]   2> 1239992 INFO  (searcherExecutor-5899-thread-1) [    ] o.a.s.h.c.SpellCheckComponent Building spell index for spell checker: multipleFields
   [junit4]   2> 1240154 INFO  (searcherExecutor-5899-thread-1) [    ] o.a.s.h.c.SpellCheckComponent Building spell index for spell checker: freq
   [junit4]   2> 1240355 INFO  (searcherExecutor-5899-thread-1) [    ] o.a.s.h.c.SpellCheckComponent Building spell index for spell checker: fqcn
   [junit4]   2> 1240483 INFO  (searcherExecutor-5899-thread-1) [    ] o.a.s.c.SolrCore [collection1] Registered new searcher Searcher@25de3481[collection1] main{ExitableDirectoryReader(UninvertingDirectoryReader(Uninverting(_4(6.4.0):C10)))}
   [junit4]   2> 1240483 INFO  (TEST-SpellCheckComponentTest.testMaximumResultsForSuggest-seed#[514FD50BC701AA0E]) [    ] o.a.s.u.p.LogUpdateProcessorFactory [collection1]  webapp=null path=null params={}{commit=} 0 830
   [junit4]   2> 1240706 INFO  (TEST-SpellCheckComponentTest.testMaximumResultsForSuggest-seed#[514FD50BC701AA0E]) [    ] o.a.s.c.S.Request [collection1]  webapp=null path=null params={q=lowerfilt:(this+OR+brwn)&spellcheck.maxResultsForSuggest=7&qt=spellCheckCompRH&spellcheck=true&spellcheck.count=5&wt=xml&spellcheck.build=true&spellcheck.extendedResults=false} hits=7 status=0 QTime=222
   [junit4]   2> 1240892 INFO  (TEST-SpellCheckComponentTest.testMaximumResultsForSuggest-seed#[514FD50BC701AA0E]) [    ] o.a.s.c.S.Request [collection1]  webapp=null path=null params={q=lowerfilt:(this+OR+brwn)&spellcheck.maxResultsForSuggest=6&qt=spellCheckCompRH&spellcheck=true&spellcheck.count=5&wt=xml&spellcheck.build=true&spellcheck.extendedResults=false} hits=7 status=0 QTime=185
   [junit4]   2> 1240893 ERROR (TEST-SpellCheckComponentTest.testMaximumResultsForSuggest-seed#[514FD50BC701AA0E]) [    ] o.a.s.SolrTestCaseJ4 query failed JSON validation. error=Path not found: /spellcheck/suggestions/[1]/numFound
   [junit4]   2>  expected =/spellcheck/suggestions/[1]/numFound==1
   [junit4]   2>  response = {
   [junit4]   2>   "responseHeader":{
   [junit4]   2>     "status":0,
   [junit4]   2>     "QTime":185},
   [junit4]   2>   "command":"build",
   [junit4]   2>   "response":{"numFound":7,"start":0,"docs":[
   [junit4]   2>       {
   [junit4]   2>         "id":4,
   [junit4]   2>         "range_facet_l":[4],
   [junit4]   2>         "range_facet_l_dv":[4],
   [junit4]   2>         "range_facet_i_dv":[4],
   [junit4]   2>         "lowerfilt":["this blue"],
   [junit4]   2>         "lowerfilt1and2":["this blue"],
   [junit4]   2>         "multiDefault":["muLti-Default"],
   [junit4]   2>         "intDefault":42,
   [junit4]   2>         "timestamp":"2016-12-02T02:28:40.786Z"},
   [junit4]   2>       {
   [junit4]   2>         "id":5,
   [junit4]   2>         "range_facet_l":[5],
   [junit4]   2>         "range_facet_l_dv":[5],
   [junit4]   2>         "range_facet_i_dv":[5],
   [junit4]   2>         "lowerfilt":["this blud"],
   [junit4]   2>         "lowerfilt1and2":["this blud"],
   [junit4]   2>         "multiDefault":["muLti-Default"],
   [junit4]   2>         "intDefault":42,
   [junit4]   2>         "timestamp":"2016-12-02T02:28:40.786Z"},
   [junit4]   2>       {
   [junit4]   2>         "id":6,
   [junit4]   2>         "range_facet_l":[6],
   [junit4]   2>         "range_facet_l_dv":[6],
   [junit4]   2>         "range_facet_i_dv":[6],
   [junit4]   2>         "lowerfilt":["this boue"],
   [junit4]   2>         "lowerfilt1and2":["this boue"],
   [junit4]   2>         "multiDefault":["muLti-Default"],
   [junit4]   2>         "intDefault":42,
   [junit4]   2>         "timestamp":"2016-12-02T02:28:40.786Z"},
   [junit4]   2>       {
   [junit4]   2>         "id":7,
   [junit4]   2>         "range_facet_l":[7],
   [junit4]   2>         "range_facet_l_dv":[7],
   [junit4]   2>         "range_facet_i_dv":[7],
   [junit4]   2>         "lowerfilt":["this glue"],
   [junit4]   2>         "lowerfilt1and2":["this glue"],
   [junit4]   2>         "multiDefault":["muLti-Default"],
   [junit4]   2>         "intDefault":42,
   [junit4]   2>         "timestamp":"2016-12-02T02:28:40.787Z"},
   [junit4]   2>       {
   [junit4]   2>         "id":8,
   [junit4]   2>         "range_facet_l":[8],
   [junit4]   2>         "range_facet_l_dv":[8],
   [junit4]   2>         "range_facet_i_dv":[8],
   [junit4]   2>         "lowerfilt":["this blee"],
   [junit4]   2>         "lowerfilt1and2":["this blee"],
   [junit4]   2>         "multiDefault":["muLti-Default"],
   [junit4]   2>         "intDefault":42,
   [junit4]   2>         "timestamp":"2016-12-02T02:28:40.787Z"},
   [junit4]   2>       {
   [junit4]   2>         "id":0,
   [junit4]   2>         "range_facet_l":[0],
   [junit4]   2>         "range_facet_l_dv":[0],
   [junit4]   2>         "range_facet_i_dv":[0],
   [junit4]   2>         "lowerfilt":["This is a title"],
   [junit4]   2>         "lowerfilt1and2":["This is a title"],
   [junit4]   2>         "multiDefault":["muLti-Default"],
   [junit4]   2>         "intDefault":42,
   [junit4]   2>         "timestamp":"2016-12-02T02:28:40.784Z"},
   [junit4]   2>       {
   [junit4]   2>         "id":2,
   [junit4]   2>         "range_facet_l":[2],
   [junit4]   2>         "range_facet_l_dv":[2],
   [junit4]   2>         "range_facet_i_dv":[2],
   [junit4]   2>         "lowerfilt":["This is a document"],
   [junit4]   2>         "lowerfilt1and2":["This is a document"],
   [junit4]   2>         "multiDefault":["muLti-Default"],
   [junit4]   2>         "intDefault":42,
   [junit4]   2>         "timestamp":"2016-12-02T02:28:40.785Z"}]
   [junit4]   2>   },
   [junit4]   2>   "spellcheck":{
   [junit4]   2>     "suggestions":[]}}
   [junit4]   2> 
   [junit4]   2>  request = q=lowerfilt:(this+OR+brwn)&spellcheck.maxResultsForSuggest=6&qt=spellCheckCompRH&spellcheck=true&spellcheck.count=5&wt=xml&spellcheck.build=true&spellcheck.extendedResults=false
   [junit4]   2> 1241119 INFO  (TEST-SpellCheckComponentTest.testMaximumResultsForSuggest-seed#[514FD50BC701AA0E]) [    ] o.a.s.c.S.Request [collection1]  webapp=null path=null params={q=lowerfilt:(this+OR+brwn)&spellcheck.maxResultsForSuggest=.90&qt=spellCheckCompRH&spellcheck=true&fq=id:[0+TO+9]&fq=lowerfilt:th*&spellcheck.count=5&wt=xml&spellcheck.build=true&spellcheck.extendedResults=false} hits=7 status=0 QTime=225
   [junit4]   2> 1242488 INFO  (TEST-SpellCheckComponentTest.testMaximumResultsForSuggest-seed#[514FD50BC701AA0E]) [    ] o.a.s.c.S.Request [collection1]  webapp=null path=null params={q=lowerfilt:(this+OR+brwn)&spellcheck.maxResultsForSuggest=.80&qt=spellCheckCompRH&spellcheck=true&fq=id:[0+TO+9]&fq=lowerfilt:th*&spellcheck.count=5&wt=xml&spellcheck.build=true&spellcheck.extendedResults=false} hits=7 status=0 QTime=1368
   [junit4]   2> 1242488 ERROR (TEST-SpellCheckComponentTest.testMaximumResultsForSuggest-seed#[514FD50BC701AA0E]) [    ] o.a.s.SolrTestCaseJ4 query failed JSON validation. error=Path not found: /spellcheck/suggestions/[1]/numFound
   [junit4]   2>  expected =/spellcheck/suggestions/[1]/numFound==1
   [junit4]   2>  response = {
   [junit4]   2>   "responseHeader":{
   [junit4]   2>     "status":0,
   [junit4]   2>     "QTime":1368},
   [junit4]   2>   "command":"build",
   [junit4]   2>   "response":{"numFound":7,"start":0,"docs":[
   [junit4]   2>       {
   [junit4]   2>         "id":4,
   [junit4]   2>         "range_facet_l":[4],
   [junit4]   2>         "range_facet_l_dv":[4],
   [junit4]   2>         "range_facet_i_dv":[4],
   [junit4]   2>         "lowerfilt":["this blue"],
   [junit4]   2>         "lowerfilt1and2":["this blue"],
   [junit4]   2>         "multiDefault":["muLti-Default"],
   [junit4]   2>         "intDefault":42,
   [junit4]   2>         "timestamp":"2016-12-02T02:28:40.786Z"},
   [junit4]   2>       {
   [junit4]   2>         "id":5,
   [junit4]   2>         "range_facet_l":[5],
   [junit4]   2>         "range_facet_l_dv":[5],
   [junit4]   2>         "range_facet_i_dv":[5],
   [junit4]   2>         "lowerfilt":["this blud"],
   [junit4]   2>         "lowerfilt1and2":["this blud"],
   [junit4]   2>         "multiDefault":["muLti-Default"],
   [junit4]   2>         "intDefault":42,
   [junit4]   2>         "timestamp":"2016-12-02T02:28:40.786Z"},
   [junit4]   2>       {
   [junit4]   2>         "id":6,
   [junit4]   2>         "range_facet_l":[6],
   [junit4]   2>         "range_facet_l_dv":[6],
   [junit4]   2>         "range_facet_i_dv":[6],
   [junit4]   2>         "lowerfilt":["this boue"],
   [junit4]   2>         "lowerfilt1and2":["this boue"],
   [junit4]   2>         "multiDefault":["muLti-Default"],
   [junit4]   2>         "intDefault":42,
   [junit4]   2>         "timestamp":"2016-12-02T02:28:40.786Z"},
   [junit4]   2>       {
   [junit4]   2>         "id":7,
   [junit4]   2>         "range_facet_l":[7],
   [junit4]   2>         "range_facet_l_dv":[7],
   [junit4]   2>         "range_facet_i_dv":[7],
   [junit4]   2>         "lowerfilt":["this glue"],
   [junit4]   2>         "lowerfilt1and2":["this glue"],
   [junit4]   2>         "multiDefault":["muLti-Default"],
   [junit4]   2>         "intDefault":42,
   [junit4]   2>         "timestamp":"2016-12-02T02:28:40.787Z"},
   [junit4]   2>       {
   [junit4]   2>         "id":8,
   [junit4]   2>         "range_facet_l":[8],
   [junit4]   2>         "range_facet_l_dv":[8],
   [junit4]   2>         "range_facet_i_dv":[8],
   [junit4]   2>         "lowerfilt":["this blee"],
   [junit4]   2>         "lowerfilt1and2":["this blee"],
   [junit4]   2>         "multiDefault":["muLti-Default"],
   [junit4]   2>         "intDefault":42,
   [junit4]   2>         "timestamp":"2016-12-02T02:28:40.787Z"},
   [junit4]   2>       {
   [junit4]   2>         "id":0,
   [junit4]   2>         "range_facet_l":[0],
   [junit4]   2>         "range_facet_l_dv":[0],
   [junit4]   2>         "range_facet_i_dv":[0],
   [junit4]   2>         "lowerfilt":["This is a title"],
   [junit4]   2>         "lowerfilt1and2":["This is a title"],
   [junit4]   2>         "multiDefault":["muLti-Default"],
   [junit4]   2>         "intDefault":42,
   [junit4]   2>         "timestamp":"2016-12-02T02:28:40.784Z"},
   [junit4]   2>       {
   [junit4]   2>         "id":2,
   [junit4]   2>         "range_facet_l":[2],
   [junit4]   2>         "range_facet_l_dv":[2],
   [junit4]   2>         "range_facet_i_dv":[2],
   [junit4]   2>         "lowerfilt":["This is a document"],
   [junit4]   2>         "lowerfilt1and2":["This is a document"],
   [junit4]   2>         "multiDefault":["muLti-Default"],
   [junit4]   2>         "intDefault":42,
   [junit4]   2>         "timestamp":"2016-12-02T02:28:40.785Z"}]
   [junit4]   2>   },
   [junit4]   2>   "spellcheck":{
   [junit4]   2>     "suggestions":[]}}
   [junit4]   2> 
   [junit4]   2>  request = q=lowerfilt:(this+OR+brwn)&spellcheck.maxResultsForSuggest=.80&qt=spellCheckCompRH&spellcheck=true&fq=id:[0+TO+9]&fq=lowerfilt:th*&spellcheck.count=5&wt=xml&spellcheck.build=true&spellcheck.extendedResults=false
   [junit4]   2> 1242850 INFO  (TEST-SpellCheckComponentTest.testMaximumResultsForSuggest-seed#[514FD50BC701AA0E]) [    ] o.a.s.c.S.Request [collection1]  webapp=null path=null params={q=lowerfilt:(this+OR+brwn)&spellcheck.maxResultsForSuggest=.70&qt=spellCheckCompRH&spellcheck=true&fq=id:[0+TO+9]&spellcheck.count=5&wt=xml&spellcheck.build=true&spellcheck.maxResultsForSuggest.fq=id:[0+TO+9]&spellcheck.extendedResults=false} hits=7 status=0 QTime=361
   [junit4]   2> 1243160 INFO  (TEST-SpellCheckComponentTest.testMaximumResultsForSuggest-seed#[514FD50BC701AA0E]) [    ] o.a.s.c.S.Request [collection1]  webapp=null path=null params={q=lowerfilt:(this+OR+brwn)&spellcheck.maxResultsForSuggest=.64&qt=spellCheckCompRH&spellcheck=true&fq=id:[0+TO+9]&spellcheck.count=5&wt=xml&spellcheck.build=true&spellcheck.maxResultsForSuggest.fq=lowerfilt:th*&spellcheck.extendedResults=false} hits=7 status=0 QTime=309
   [junit4]   2> 1243160 ERROR (TEST-SpellCheckComponentTest.testMaximumResultsForSuggest-seed#[514FD50BC701AA0E]) [    ] o.a.s.SolrTestCaseJ4 query failed JSON validation. error=Path not found: /spellcheck/suggestions/[1]/numFound
   [junit4]   2>  expected =/spellcheck/suggestions/[1]/numFound==1
   [junit4]   2>  response = {
   [junit4]   2>   "responseHeader":{
   [junit4]   2>     "status":0,
   [junit4]   2>     "QTime":309},
   [junit4]   2>   "command":"build",
   [junit4]   2>   "response":{"numFound":7,"start":0,"docs":[
   [junit4]   2>       {
   [junit4]   2>         "id":4,
   [junit4]   2>         "range_facet_l":[4],
   [junit4]   2>         "range_facet_l_dv":[4],
   [junit4]   2>         "range_facet_i_dv":[4],
   [junit4]   2>         "lowerfilt":["this blue"],
   [junit4]   2>         "lowerfilt1and2":["this blue"],
   [junit4]   2>         "multiDefault":["muLti-Default"],
   [junit4]   2>         "intDefault":42,
   [junit4]   2>         "timestamp":"2016-12-02T02:28:40.786Z"},
   [junit4]   2>       {
   [junit4]   2>         "id":5,
   [junit4]   2>         "range_facet_l":[5],
   [junit4]   2>         "range_facet_l_dv":[5],
   [junit4]   2>         "range_facet_i_dv":[5],
   [junit4]   2>         "lowerfilt":["this blud"],
   [junit4]   2>         "lowerfilt1and2":["this blud"],
   [junit4]   2>         "multiDefault":["muLti-Default"],
   [junit4]   2>         "intDefault":42,
   [junit4]   2>         "timestamp":"2016-12-02T02:28:40.786Z"},
   [junit4]   2>       {
   [junit4]   2>         "id":6,
   [junit4]   2>         "range_facet_l":[6],
   [junit4]   2>         "range_facet_l_dv":[6],
   [junit4]   2>         "range_facet_i_dv":[6],
   [junit4]   2>         "lowerfilt":["this boue"],
   [junit4]   2>         "lowerfilt1and2":["this boue"],
   [junit4]   2>         "multiDefault":["muLti-Default"],
   [junit4]   2>         "intDefault":42,
   [junit4]   2>         "timestamp":"2016-12-02T02:28:40.786Z"},
   [junit4]   2>       {
   [junit4]   2>         "id":7,
   [junit4]   2>         "range_facet_l":[7],
   [junit4]   2>         "range_facet_l_dv":[7],
   [junit4]   2>         "range_facet_i_dv":[7],
   [junit4]   2>         "lowerfilt":["this glue"],
   [junit4]   2>         "lowerfilt1and2":["this glue"],
   [junit4]   2>         "multiDefault":["muLti-Default"],
   [junit4]   2>         "intDefault":42,
   [junit4]   2>         "timestamp":"2016-12-02T02:28:40.787Z"},
   [junit4]   2>       {
   [junit4]   2>         "id":8,
   [junit4]   2>         "range_facet_l":[8],
   [junit4]   2>         "range_facet_l_dv":[8],
   [junit4]   2>         "range_facet_i_dv":[8],
   [junit4]   2>         "lowerfilt":["this blee"],
   [junit4]   2>         "lowerfilt1and2":["this blee"],
   [junit4]   2>         "multiDefault":["muLti-Default"],
   [junit4]   2>         "intDefault":42,
   [junit4]   2>         "timestamp":"2016-12-02T02:28:40.787Z"},
   [junit4]   2>       {
   [junit4]   2>         "id":0,
   [junit4]   2>         "range_facet_l":[0],
   [junit4]   2>         "range_facet_l_dv":[0],
   [junit4]   2>         "range_facet_i_dv":[0],
   [junit4]   2>         "lowerfilt":["This is a title"],
   [junit4]   2>         "lowerfilt1and2":["This is a title"],
   [junit4]   2>         "multiDefault":["muLti-Default"],
   [junit4]   2>         "intDefault":42,
   [junit4]   2>         "timestamp":"2016-12-02T02:28:40.784Z"},
   [junit4]   2>       {
   [junit4]   2>         "id":2,
   [junit4]   2>         "range_facet_l":[2],
   [junit4]   2>         "range_facet_l_dv":[2],
   [junit4]   2>         "range_facet_i_dv":[2],
   [junit4]   2>         "lowerfilt":["This is a document"],
   [junit4]   2>         "lowerfilt1and2":["This is a document"],
   [junit4]   2>         "multiDefault":["muLti-Default"],
   [junit4]   2>         "intDefault":42,
   [junit4]   2>         "timestamp":"2016-12-02T02:28:40.785Z"}]
   [junit4]   2>   },
   [junit4]   2>   "spellcheck":{
   [junit4]   2>     "suggestions":[]}}
   [junit4]   2> 
   [junit4]   2>  request = q=lowerfilt:(this+OR+brwn)&spellcheck.maxResultsForSuggest=.64&qt=spellCheckCompRH&spellcheck=true&fq=id:[0+TO+9]&spellcheck.count=5&wt=xml&spellcheck.build=true&spellcheck.maxResultsForSuggest.fq=lowerfilt:th*&spellcheck.extendedResults=false
   [junit4]   2> 1243161 INFO  (TEST-SpellCheckComponentTest.testMaximumResultsForSuggest-seed#[514FD50BC701AA0E]) [    ] o.a.s.SolrTestCaseJ4 ###Ending testMaximumResultsForSuggest
   [junit4]   2> 1243161 INFO  (TEST-SpellCheckComponentTest.testMaximumResultsForSuggest-seed#[514FD50BC701AA0E]) [    ] o.a.s.u.DirectUpdateHandler2 [collection1] REMOVING ALL DOCUMENTS FROM INDEX
   [junit4]   2> 1243161 INFO  (TEST-SpellCheckComponentTest.testMaximumResultsForSuggest-seed#[514FD50BC701AA0E]) [    ] o.a.s.u.p.LogUpdateProcessorFactory [collection1]  webapp=null path=null params={}{deleteByQuery=*:*} 0 0
   [junit4]   2> 1243161 INFO  (TEST-SpellCheckComponentTest.testMaximumResultsForSuggest-seed#[514FD50BC701AA0E]) [    ] o.a.s.u.DirectUpdateHandler2 start commit{,optimize=false,openSearcher=true,waitSearcher=true,expungeDeletes=false,softCommit=false,prepareCommit=false}
   [junit4]   2> 1243161 INFO  (TEST-SpellCheckComponentTest.testMaximumResultsForSuggest-seed#[514FD50BC701AA0E]) [    ] o.a.s.u.SolrIndexWriter Calling setCommitData with IW:org.apache.solr.update.SolrIndexWriter@3691a349
   [junit4]   2> 1243162 INFO  (TEST-SpellCheckComponentTest.testMaximumResultsForSuggest-seed#[514FD50BC701AA0E]) [    ] o.a.s.s.SolrIndexSearcher Opening [Searcher@3a048218[collection1] main]
   [junit4]   2> 1243162 INFO  (TEST-SpellCheckComponentTest.testMaximumResultsForSuggest-seed#[514FD50BC701AA0E]) [    ] o.a.s.u.DirectUpdateHandler2 end_commit_flush
   [junit4]   2> 1243162 INFO  (searcherExecutor-5899-thread-1) [    ] o.a.s.h.c.SpellCheckComponent Building spell index for spell checker: default
   [junit4]   2> 1243212 INFO  (searcherExecutor-5899-thread-1) [    ] o.a.s.h.c.SpellCheckComponent Building spell index for spell checker: default_teststop
   [junit4]   2> 1243264 INFO  (searcherExecutor-5899-thread-1) [    ] o.a.s.h.c.SpellCheckComponent Building spell index for spell checker: threshold
   [junit4]   2> 1243298 INFO  (searcherExecutor-5899-thread-1) [    ] o.a.s.h.c.SpellCheckComponent Building spell index for spell checker: threshold_direct
   [junit4]   2> 1243298 INFO  (searcherExecutor-5899-thread-1) [    ] o.a.s.h.c.SpellCheckComponent Building spell index for spell checker: multipleFields
   [junit4]   2> 1243348 INFO  (searcherExecutor-5899-thread-1) [    ] o.a.s.h.c.SpellCheckComponent Building spell index for spell checker: freq
   [junit4]   2> 1243396 INFO  (searcherExecutor-5899-thread-1) [    ] o.a.s.h.c.SpellCheckComponent Building spell index for spell checker: fqcn
   [junit4]   2> 1243448 INFO  (searcherExecutor-5899-thread-1) [    ] o.a.s.c.SolrCore [collection1] Registered new searcher Searcher@3a048218[collection1] main{ExitableDirectoryReader(UninvertingDirectoryReader())}
   [junit4]   2> 1243448 INFO  (TEST-SpellCheckComponentTest.testMaximumResultsForSuggest-seed#[514FD50BC701AA0E]) [    ] o.a.s.u.p.LogUpdateProcessorFactory [collection1]  webapp=null path=null params={}{commit=} 0 287
   [junit4]   2> 1243450 INFO  (TEST-SpellCheckComponentTest.testCorrectSpelling-seed#[514FD50BC701AA0E]) [    ] o.a.s.SolrTestCaseJ4 ###Starting testCorrectSpelling
   [junit4]   2> 1243451 INFO  (TEST-SpellCheckComponentTest.testCorrectSpelling-seed#[514FD50BC701AA0E]) [    ] o.a.s.u.p.LogUpdateProcessorFactory [collection1]  webapp=null path=null params={}{add=[0]} 0 0
   [junit4]   2> 1243451 INFO  (TEST-SpellCheckComponentTest.testCorrectSpelling-seed#[514FD50BC701AA0E]) [    ] o.a.s.u.p.LogUpdateProcessorFactory [collection1]  webapp=null path=null params={}{add=[1]} 0 0
   [junit4]   2> 1243451 INFO  (TEST-SpellCheckComponentTest.testCorrectSpelling-seed#[514FD50BC701AA0E]) [    ] o.a.s.u.p.LogUpdateProcessorFactory [collection1]  webapp=null path=null params={}{add=[2]} 0 0
   [junit4]   2> 1243452 INFO  (TEST-SpellCheckComponentTest.testCorrectSpelling-seed#[514FD50BC701AA0E]) [    ] o.a.s.u.p.LogUpdateProcessorFactory [collection1]  webapp=null path=null params={}{add=[3]} 0 0
   [junit4]   2> 1243452 INFO  (TEST-SpellCheckComponentTest.testCorrectSpelling-seed#[514FD50BC701AA0E]) [    ] o.a.s.u.p.LogUpdateProcessorFactory [collection1]  webapp=null path=null params={}{add=[4]} 0 0
   [junit4]   2> 1243452 INFO  (TEST-SpellCheckComponentTest.testCorrectSpelling-seed#[514FD50BC701AA0E]) [    ] o.a.s.u.p.LogUpdateProcessorFactory [collection1]  webapp=null path=null params={}{add=[5]} 0 0
   [junit4]   2> 1243452 INFO  (TEST-SpellCheckComponentTest.testCorrectSpelling-seed#[514FD50BC701AA0E]) [    ] o.a.s.u.p.LogUpdateProcessorFactory [collection1]  webapp=null path=null params={}{add=[6]} 0 0
   [junit4]   2> 1243453 INFO  (TEST-SpellCheckComponentTest.testCorrectSpelling-seed#[514FD50BC701AA0E]) [    ] o.a.s.u.p.LogUpdateProcessorFactory [collection1]  webapp=null path=null params={}{add=[7]} 0 0
   [junit4]   2> 1243453 INFO  (TEST-SpellCheckComponentTest.testCorrectSpelling-seed#[514FD50BC701AA0E]) [    ] o.a.s.u.p.LogUpdateProcessorFactory [collection1]  webapp=null path=null params={}{add=[8]} 0 0
   [junit4]   2> 1243453 INFO  (TEST-SpellCheckComponentTest.testCorrectSpelling-seed#[514FD50BC701AA0E]) [    ] o.a.s.u.p.LogUpdateProcessorFactory [collection1]  webapp=null path=null params={}{add=[9]} 0 0
   [junit4]   2> 1243454 INFO  (TEST-SpellCheckComponentTest.testCorrectSpelling-seed#[514FD50BC701AA0E]) [    ] o.a.s.u.DirectUpdateHandler2 start commit{,optimize=false,openSearcher=true,waitSearcher=true,expungeDeletes=false,softCommit=false,prepareCommit=false}
   [junit4]   2> 1243454 INFO  (TEST-SpellCheckComponentTest.testCorrectSpelling-seed#[514FD50BC701AA0E]) [    ] o.a.s.u.SolrIndexWriter Calling setCommitData with IW:org.apache.solr.update.SolrIndexWriter@3691a349
   [junit4]   2> 1243456 INFO  (TEST-SpellCheckComponentTest.testCorrectSpelling-seed#[514FD50BC701AA0E]) [    ] o.a.s.s.SolrIndexSearcher Opening [Searcher@327490a[collection1] main]
   [junit4]   2> 1243457 INFO  (TEST-SpellCheckComponentTest.testCorrectSpelling-seed#[514FD50BC701AA0E]) [    ] o.a.s.u.DirectUpdateHandler2 end_commit_flush
   [junit4]   2> 1243457 INFO  (searcherExecutor-5899-thread-1) [    ] o.a.s.h.c.SpellCheckComponent Building spell index for spell checker: default
   [junit4]   2> 1243577 INFO  (searcherExecutor-5899-thread-1) [    ] o.a.s.h.c.SpellCheckComponent Building spell index for spell checker: default_teststop
   [junit4]   2> 1243609 INFO  (searcherExecutor-5899-thread-1) [    ] o.a.s.h.c.SpellCheckComponent Building spell index for spell checker: threshold
   [junit4]   2> 1243748 INFO  (searcherExecutor-5899-thread-1) [    ] o.a.s.h.c.SpellCheckComponent Building spell index for spell checker: threshold_direct
   [junit4]   2> 1243748 INFO  (searcherExecutor-5899-thread-1) [    ] o.a.s.h.c.SpellCheckComponent Building spell index for spell checker: multipleFields
   [junit4]   2> 1243863 INFO  (searcherExecutor-5899-thread-1) [    ] o.a.s.h.c.SpellCheckComponent Building spell index for spell checker: freq
   [junit4]   2> 1244016 INFO  (searcherExecutor-5899-thread-1) [    ] o.a.s.h.c.SpellCheckComponent Building spell index for spell checker: fqcn
   [junit4]   2> 1244190 INFO  (searcherExecutor-5899-thread-1) [    ] o.a.s.c.SolrCore [collection1] Registered new searcher Searcher@327490a[collection1] main{ExitableDirectoryReader(UninvertingDirectoryReader(Uninverting(_5(6.4.0):C10)))}
   [junit4]   2> 1244190 INFO  (TEST-SpellCheckComponentTest.testCorrectSpelling-seed#[514FD50BC701AA0E]) [    ] o.a.s.u.p.LogUpdateProcessorFactory [collection1]  webapp=null path=null params={}{commit=} 0 736
   [junit4]   2> 1244191 INFO  (TEST-SpellCheckComponentTest.testCorrectSpelling-seed#[514FD50BC701AA0E]) [    ] o.a.s.c.S.Request [collection1]  webapp=null path=null params={q=lowerfilt:lazy+lowerfilt:brown&qt=spellCheckCompRH&json.nl=map&spellcheck=true&wt=xml&spellcheck.extendedResults=true} hits=1 status=0 QTime=0
   [junit4]   2> 1244192 INFO  (TEST-SpellCheckComponentTest.testCorrectSpelling-seed#[514FD50BC701AA0E]) [    ] o.a.s.c.S.Request [collection1]  webapp=null path=null params={q=lowerfilt:lazy+lowerfilt:brown&qt=spellCheckCompRH&spellcheck.dictionary=direct_lowerfilt&json.nl=map&spellcheck=true&wt=xml&spellcheck.extendedResults=true} hits=1 status=0 QTime=0
   [junit4]   2> 1244193 INFO  (TEST-SpellCheckComponentTest.testCorrectSpelling-seed#[514FD50BC701AA0E]) [    ] o.a.s.c.S.Request [collection1]  webapp=null path=null params={q=lakkle&qt=spellCheckCompRH&spellcheck.dictionary=direct_lowerfilt&json.nl=map&spellcheck=true&wt=xml&spellcheck.extendedResults=true} hits=0 status=0 QTime=1
   [junit4]   2> 1244193 INFO  (TEST-SpellCheckComponentTest.testCorrectSpelling-seed#[514FD50BC701AA0E]) [    ] o.a.s.SolrTestCaseJ4 ###Ending testCorrectSpelling
   [junit4]   2> 1244193 INFO  (TEST-SpellCheckComponentTest.testCorrectSpelling-seed#[514FD50BC701AA0E]) [    ] o.a.s.u.DirectUpdateHandler2 [collection1] REMOVING ALL DOCUMENTS FROM INDEX
   [junit4]   2> 1244193 INFO  (TEST-SpellCheckComponentTest.testCorrectSpelling-seed#[514FD50BC701AA0E]) [    ] o.a.s.u.p.LogUpdateProcessorFactory [collection1]  webapp=null path=null params={}{deleteByQuery=*:*} 0 0
   [junit4]   2> 1244194 INFO  (TEST-SpellCheckComponentTest.testCorrectSpelling-seed#[514FD50BC701AA0E]) [    ] o.a.s.u.DirectUpdateHandler2 start commit{,optimize=false,openSearcher=true,waitSearcher=true,expungeDeletes=false,softCommit=false,prepareCommit=false}
   [junit4]   2> 1244194 INFO  (TEST-SpellCheckComponentTest.testCorrectSpelling-seed#[514FD50BC701AA0E]) [    ] o.a.s.u.SolrIndexWriter Calling setCommitData with IW:org.apache.solr.update.SolrIndexWriter@3691a349
   [junit4]   2> 1244194 INFO  (TEST-SpellCheckComponentTest.testCorrectSpelling-seed#[514FD50BC701AA0E]) [    ] o.a.s.s.SolrIndexSearcher Opening [Searcher@79e355c3[collection1] main]
   [junit4]   2> 1244195 INFO  (TEST-SpellCheckComponentTest.testCorrectSpelling-seed#[514FD50BC701AA0E]) [    ] o.a.s.u.DirectUpdateHandler2 end_commit_flush
   [junit4]   2> 1244195 INFO  (searcherExecutor-5899-thread-1) [    ] o.a.s.h.c.SpellCheckComponent Building spell index for spell checker: default
   [junit4]   2> 1244256 INFO  (searcherExecutor-5899-thread-1) [    ] o.a.s.h.c.SpellCheckComponent Building spell index for spell checker: default_teststop
   [junit4]   2> 1244316 INFO  (searcherExecutor-5899-thread-1) [    ] o.a.s.h.c.SpellCheckComponent Building spell index for spell checker: threshold
   [junit4]   2> 1244381 INFO  (searcherExecutor-5899-thread-1) [    ] o.a.s.h.c.SpellCheckComponent Building spell index for spell checker: threshold_direct
   [junit4]   2> 1244381 INFO  (searcherExecutor-5899-thread-1) [    ] o.a.s.h.c.SpellCheckComponent Building spell index for spell checker: multipleFields
   [junit4]   2> 1244457 INFO  (searcherExecutor-5899-thread-1) [    ] o.a.s.h.c.SpellCheckComponent Building spell index for spell checker: freq
   [junit4]   2> 1244531 INFO  (searcherExecutor-5899-thread-1) [    ] o.a.s.h.c.SpellCheckComponent Building spell index for spell checker: fqcn
   [junit4]   2> 1244601 INFO  (searcherExecutor-5899-thread-1) [    ] o.a.s.c.SolrCore [collection1] Registered new searcher Searcher@79e355c3[collection1] main{ExitableDirectoryReader(UninvertingDirectoryReader())}
   [junit4]   2> 1244601 INFO  (TEST-SpellCheckComponentTest.testCorrectSpelling-seed#[514FD50BC701AA0E]) [    ] o.a.s.u.p.LogUpdateProcessorFactory [collection1]  webapp=null path=null params={}{commit=} 0 407
   [junit4]   2> 1244603 INFO  (TEST-SpellCheckComponentTest.testRebuildOnCommit-seed#[514FD50BC701AA0E]) [    ] o.a.s.SolrTestCaseJ4 ###Starting testRebuildOnCommit
   [junit4]   2> 1244603 INFO  (TEST-SpellCheckComponentTest.testRebuildOnCommit-seed#[514FD50BC701AA0E]) [    ] o.a.s.u.p.LogUpdateProcessorFactory [collection1]  webapp=null path=null params={}{add=[0]} 0 0
   [junit4]   2> 1244604 INFO  (TEST-SpellCheckComponentTest.testRebuildOnCommit-seed#[514FD50BC701AA0E]) [    ] o.a.s.u.p.LogUpdateProcessorFactory [collection1]  webapp=null path=null params={}{add=[1]} 0 0
   [junit4]   2> 1244604 INFO  (TEST-SpellCheckComponentTest.testRebuildOnCommit-seed#[514FD50BC701AA0E]) [    ] o.a.s.u.p.LogUpdateProcessorFactory [collection1]  webapp=null path=null params={}{add=[2]} 0 0
   [junit4]   2> 1244604 INFO  (TEST-SpellCheckComponentTest.testRebuildOnCommit-seed#[514FD50BC701AA0E]) [    ] o.a.s.u.p.LogUpdateProcessorFactory [collection1]  webapp=null path=null params={}{add=[3]} 0 0
   [junit4]   2> 1244604 INFO  (TEST-SpellCheckComponentTest.testRebuildOnCommit-seed#[514FD50BC701AA0E]) [    ] o.a.s.u.p.LogUpdateProcessorFactory [collection1]  webapp=null path=null params={}{add=[4]} 0 0
   [junit4]   2> 1244604 INFO  (TEST-SpellCheckComponentTest.testRebuildOnCommit-seed#[514FD50BC701AA0E]) [    ] o.a.s.u.p.LogUpdateProcessorFactory [collection1]  webapp=null path=null params={}{add=[5]} 0 0
   [junit4]   2> 1244604 INFO  (TEST-SpellCheckComponentTest.testRebuildOnCommit-seed#[514FD50BC701AA0E]) [    ] o.a.s.u.p.LogUpdateProcessorFactory [collection1]  webapp=null path=null params={}{add=[6]} 0 0
   [junit4]   2> 1244605 INFO  (TEST-SpellCheckComponentTest.testRebuildOnCommit-seed#[514FD50BC701AA0E]) [    ] o.a.s.u.p.LogUpdateProcessorFactory [collection1]  webapp=null path=null params={}{add=[7]} 0 0
   [junit4]   2> 1244605 INFO  (TEST-SpellCheckComponentTest.testRebuildOnCommit-seed#[514FD50BC701AA0E]) [    ] o.a.s.u.p.LogUpdateProcessorFactory [collection1]  webapp=null path=null params={}{add=[8]} 0 0
   [junit4]   2> 1244605 INFO  (TEST-SpellCheckComponentTest.testRebuildOnCommit-seed#[514FD50BC701AA0E]) [    ] o.a.s.u.p.LogUpdateProcessorFactory [collection1]  webapp=null path=null params={}{add=[9]} 0 0
   [junit4]   2> 1244605 INFO  (TEST-SpellCheckComponentTest.testRebuildOnCommit-seed#[514FD50BC701AA0E]) [    ] o.a.s.u.DirectUpdateHandler2 start commit{,optimize=false,openSearcher=true,waitSearcher=true,expungeDeletes=false,softCommit=false,prepareCommit=false}
   [junit4]   2> 1244605 INFO  (TEST-SpellCheckComponentTest.testRebuildOnCommit-seed#[514FD50BC701AA0E]) [    ] o.a.s.u.SolrIndexWriter Calling setCommitData with IW:org.apache.solr.update.SolrIndexWriter@3691a349
   [junit4]   2> 1244607 INFO  (TEST-SpellCheckComponentTest.testRebuildOnCommit-seed#[514FD50BC701AA0E]) [    ] o.a.s.s.SolrIndexSearcher Opening [Searcher@775c82c3[collection1] main]
   [junit4]   2> 1244607 INFO  (TEST-SpellCheckComponentTest.testRebuildOnCommit-seed#[514FD50BC701AA0E]) [    ] o.a.s.u.DirectUpdateHandler2 end_commit_flush
   [junit4]   2> 1244607 INFO  (searcherExecutor-5899-thread-1) [    ] o.a.s.h.c.SpellCheckComponent Building spell index for spell checker: default
   [junit4]   2> 1244780 INFO  (searcherExecutor-5899-thread-1) [    ] o.a.s.h.c.SpellCheckComponent Building spell index for spell checker: default_teststop
   [junit4]   2> 1244826 INFO  (searcherExecutor-5899-thread-1) [    ] o.a.s.h.c.SpellCheckComponent Building spell index for spell checker: threshold
   [junit4]   2> 1245021 INFO  (searcherExecutor-5899-thread-1) [    ] o.a.s.h.c.SpellCheckComponent Building spell index for spell checker: threshold_direct
   [junit4]   2> 1245021 INFO  (searcherExecutor-5899-thread-1) [    ] o.a.s.h.c.SpellCheckComponent Building spell index for spell checker: multipleFields
   [junit4]   2> 1245155 INFO  (searcherExecutor-5899-thread-1) [    ] o.a.s.h.c.SpellCheckComponent Building spell index for spell checker: freq
   [junit4]   2> 1245288 INFO  (searcherExecutor-5899-thread-1) [    ] o.a.s.h.c.SpellCheckComponent Building spell index for spell checker: fqcn
   [junit4]   2> 1245399 INFO  (searcherExecutor-5899-thread-1) [    ] o.a.s.c.SolrCore [collection1] Registered new searcher Searcher@775c82c3[collection1] main{ExitableDirectoryReader(UninvertingDirectoryReader(Uninverting(_6(6.4.0):C10)))}
   [junit4]   2> 1245399 INFO  (TEST-SpellCheckComponentTest.testRebuildOnCommit-seed#[514FD50BC701AA0E]) [    ] o.a.s.u.p.LogUpdateProcessorFactory [collection1]  webapp=null path=null params={}{commit=} 0 793
   [junit4]   2> 1245400 INFO  (TEST-SpellCheckComponentTest.testRebuildOnCommit-seed#[514FD50BC701AA0E]) [    ] o.a.s.c.S.Request [collection1]  webapp=null path=null params={q=lowerfilt:lucenejavt&qt=spellCheckCompRH&spellcheck=true&wt=xml} hits=0 status=0 QTime=0
   [junit4]   2> 1245400 INFO  (TEST-SpellCheckComponentTest.testRebuildOnCommit-seed#[514FD50BC701AA0E]) [    ] o.a.s.u.p.LogUpdateProcessorFactory [collection1]  webapp=null path=null params={}{add=[11231]} 0 0
   [junit4]   2> 1245400 INFO  (TEST-SpellCheckComponentTest.testRebuildOnCommit-seed#[514FD50BC701AA0E]) [    ] o.a.s.u.DirectUpdateHandler2 start commit{,optimize=false,openSearcher=true,waitSearcher=true,expungeDeletes=false,softCommit=false,prepareCommit=false}
   [junit4]   2> 1245400 INFO  (TEST-SpellCheckComponentTest.testRebuildOnCommit-seed#[514FD50BC701AA0E]) [    ] o.a.s.u.SolrIndexWriter Calling setCommitData with IW:org.apache.solr.update.SolrIndexWriter@3691a349
   [junit4]   2> 1245402 INFO  (TEST-SpellCheckComponentTest.testRebuildOnCommit-seed#[514FD50BC701AA0E]) [    ] o.a.s.s.SolrIndexSearcher Opening [Searcher@7e51d6ab[collection1] main]
   [junit4]   2> 1245402 INFO  (TEST-SpellCheckComponentTest.testRebuildOnCommit-seed#[514FD50BC701AA0E]) [    ] o.a.s.u.DirectUpdateHandler2 end_commit_flush
   [junit4]   2> 1245402 INFO  (searcherExecutor-5899-thread-1) [    ] o.a.s.h.c.SpellCheckComponent Building spell index for spell checker: default
   [junit4]   2> 1245539 INFO  (searcherExecutor-5899-thread-1) [    ] o.a.s.h.c.SpellCheckComponent Building spell index for spell checker: default_teststop
   [junit4]   2> 1245595 INFO  (searcherExecutor-5899-thread-1) [    ] o.a.s.h.c.SpellCheckComponent Building spell index for spell checker: threshold
   [junit4]   2> 1245728 INFO  (searcherExecutor-5899-thread-1) [    ] o.a.s.h.c.SpellCheckComponent Building spell index for spell checker: threshold_direct
   [junit4]   2> 1245728 INFO  (searcherExecutor-5899-thread-1) [    ] o.a.s.h.c.SpellCheckComponent Building spell index for spell checker: multipleFields
   [junit4]   2> 1245839 INFO  (searcherExecutor-5899-thread-1) [    ] o.a.s.h.c.SpellCheckComponent Building spell index for spell checker: freq
   [junit4]   2> 1245991 INFO  (searcherExecutor-5899-thread-1) [    ] o.a.s.h.c.SpellCheckComponent Building spell index for spell checker: fqcn
   [junit4]   2> 1246128 INFO  (searcherExecutor-5899-thread-1) [    ] o.a.s.c.SolrCore [collection1] Registered new searcher Searcher@7e51d6ab[collection1] main{ExitableDirectoryReader(UninvertingDirectoryReader(Uninverting(_6(6.4.0):C10) Uninverting(_7(6.4.0):C1)))}
   [junit4]   2> 1246128 INFO  (TEST-SpellCheckComponentTest.testRebuildOnCommit-seed#[514FD50BC701AA0E]) [    ] o.a.s.u.p.LogUpdateProcessorFactory [collection1]  webapp=null path=null params={}{commit=} 0 728
   [junit4]   2> 1246130 INFO  (TEST-SpellCheckComponentTest.testRebuildOnCommit-seed#[514FD50BC701AA0E]) [    ] o.a.s.c.S.Request [collection1]  webapp=null path=null params={q=lowerfilt:lucenejavt&qt=spellCheckCompRH&spellcheck=true&wt=xml} hits=0 status=0 QTime=730
   [junit4]   2> 1246130 INFO  (TEST-SpellCheckComponentTest.testRebuildOnCommit-seed#[514FD50BC701AA0E]) [    ] o.a.s.SolrTestCaseJ4 ###Ending testRebuildOnCommit
   [junit4]   2> 1246130 INFO  (TEST-SpellCheckComponentTest.testRebuildOnCommit-seed#[514FD50BC701AA0E]) [    ] o.a.s.u.DirectUpdateHandler2 [collection1] REMOVING ALL DOCUMENTS FROM INDEX
   [junit4]   2> 1246131 INFO  (TEST-SpellCheckComponentTest.testRebuildOnCommit-seed#[514FD50BC701AA0E]) [    ] o.a.s.u.p.LogUpdateProcessorFactory [collection1]  webapp=null path=null params={}{deleteByQuery=*:*} 0 0
   [junit4]   2> 1246131 INFO  (TEST-SpellCheckComponentTest.testRebuildOnCommit-seed#[514FD50BC701AA0E]) [    ] o.a.s.u.DirectUpdateHandler2 start commit{,optimize=false,openSearcher=true,waitSearcher=true,expungeDeletes=false,softCommit=false,prepareCommit=false}
   [junit4]   2> 1246131 INFO  (TEST-SpellCheckComponentTest.testRebuildOnCommit-seed#[514FD50BC701AA0E]) [    ] o.a.s.u.SolrIndexWriter Calling setCommitData with IW:org.apache.solr.update.SolrIndexWriter@3691a349
   [junit4]   2> 1246131 INFO  (TEST-SpellCheckComponentTest.testRebuildOnCommit-seed#[514FD50BC701AA0E]) [    ] o.a.s.s.SolrIndexSearcher Opening [Searcher@4ac896ce[collection1] main]
   [junit4]   2> 1246131 INFO  (searcherExecutor-5899-thread-1) [    ] o.a.s.h.c.SpellCheckComponent Building spell index for spell checker: default
   [junit4]   2> 1246131 INFO  (TEST-SpellCheckComponentTest.testRebuildOnCommit-seed#[514FD50BC701AA0E]) [    ] o.a.s.u.DirectUpdateHandler2 end_commit_flush
   [junit4]   2> 1246172 INFO  (searcherExecutor-5899-thread-1) [    ] o.a.s.h.c.SpellCheckComponent Building spell index for spell checker: default_teststop
   [junit4]   2> 1246215 INFO  (searcherExecutor-5899-thread-1) [    ] o.a.s.h.c.SpellCheckComponent Building spell index for spell checker: threshold
   [junit4]   2> 1246278 INFO  (searcherExecutor-5899-thread-1) [    ] o.a.s.h.c.SpellCheckComponent Building spell index for spell checker: threshold_direct
   [junit4]   2> 1246278 INFO  (searcherExecutor-5899-thread-1) [    ] o.a.s.h.c.SpellCheckComponent Building spell index for spell checker: multipleFields
   [junit4]   2> 1246331 INFO  (searcherExecutor-5899-thread-1) [    ] o.a.s.h.c.SpellCheckComponent Building spell index for spell checker: freq
   [junit4]   2> 1246389 INFO  (searcherExecutor-5899-thread-1) [    ] o.a.s.h.c.SpellCheckComponent Building spell index for spell checker: fqcn
   [junit4]   2> 1246444 INFO  (searcherExecutor-5899-thread-1) [    ] o.a.s.c.SolrCore [collection1] Registered new searcher Searcher@4ac896ce[collection1] main{ExitableDirectoryReader(UninvertingDirectoryReader())}
   [junit4]   2> 1246444 INFO  (TEST-SpellCheckComponentTest.testRebuildOnCommit-seed#[514FD50BC701AA0E]) [    ] o.a.s.u.p.LogUpdateProcessorFactory [collection1]  webapp=null path=null params={}{commit=} 0 313
   [junit4]   2> 1246446 INFO  (TEST-SpellCheckComponentTest.testExtendedResultsCount-seed#[514FD50BC701AA0E]) [    ] o.a.s.SolrTestCaseJ4 ###Starting testExtendedResultsCount
   [junit4]   2> 1246446 INFO  (TEST-SpellCheckComponentTest.testExtendedResultsCount-seed#[514FD50BC701AA0E]) [    ] o.a.s.u.p.LogUpdateProcessorFactory [collection1]  webapp=null path=null params={}{add=[0]} 0 0
   [junit4]   2> 1246446 INFO  (TEST-SpellCheckComponentTest.testExtendedResultsCount-seed#[514FD50BC701AA0E]) [    ] o.a.s.u.p.LogUpdateProcessorFactory [collection1]  webapp=null path=null params={}{add=[1]} 0 0
   [junit4]   2> 1246447 INFO  (TEST-SpellCheckComponentTest.testExtendedResultsCount-seed#[514FD50BC701AA0E]) [    ] o.a.s.u.p.LogUpdateProcessorFactory [collection1]  webapp=null path=null params={}{add=[2]} 0 0
   [junit4]   2> 1246447 INFO  (TEST-SpellCheckComponentTest.testExtendedResultsCount-seed#[514FD50BC701AA0E]) [    ] o.a.s.u.p.LogUpdateProcessorFactory [collection1]  webapp=null path=null params={}{add=[3]} 0 0
   [junit4]   2> 1246447 INFO  (TEST-SpellCheckComponentTest.testExtendedResultsCount-seed#[514FD50BC701AA0E]) [    ] o.a.s.u.p.LogUpdateProcessorFactory [collection1]  webapp=null path=null params={}{add=[4]} 0 0
   [junit4]   2> 1246447 INFO  (TEST-SpellCheckComponentTest.testExtendedResultsCount-seed#[514FD50BC701AA0E]) [    ] o.a.s.u.p.LogUpdateProcessorFactory [collection1]  webapp=null path=null params={}{add=[5]} 0 0
   [junit4]   2> 1246447 INFO  (TEST-SpellCheckComponentTest.testExtendedResultsCount-seed#[514FD50BC701AA0E]) [    ] o.a.s.u.p.LogUpdateProcessorFactory [collection1]  webapp=null path=null params={}{add=[6]} 0 0
   [junit4]   2> 1246447 INFO  (TEST-SpellCheckComponentTest.testExtendedResultsCount-seed#[514FD50BC701AA0E]) [    ] o.a.s.u.p.LogUpdateProcessorFactory [collection1]  webapp=null path=null params={}{add=[7]} 0 0
   [junit4]   2> 1246448 INFO  (TEST-SpellCheckComponentTest.testExtendedResultsCount-seed#[514FD50BC701AA0E]) [    ] o.a.s.u.p.LogUpdateProcessorFactory [collection1]  webapp=null path=null params={}{add=[8]} 0 0
   [junit4]   2> 1246448 INFO  (TEST-SpellCheckComponentTest.testExtendedResultsCount-seed#[514FD50BC701AA0E]) [    ] o.a.s.u.p.LogUpdateProcessorFactory [collection1]  webapp=null path=null params={}{add=[9]} 0 0
   [junit4]   2> 1246448 INFO  (TEST-SpellCheckComponentTest.testExtendedResultsCount-seed#[514FD50BC701AA0E]) [    ] o.a.s.u.DirectUpdateHandler2 start commit{,optimize=false,openSearcher=true,waitSearcher=true,expungeDeletes=false,softCommit=false,prepareCommit=false}
   [junit4]   2> 1246448 INFO  (TEST-SpellCheckComponentTest.testExtendedResultsCount-seed#[514FD50BC701AA0E]) [    ] o.a.s.u.SolrIndexWriter Calling setCommitData with IW:org.apache.solr.update.SolrIndexWriter@3691a349
   [junit4]   2> 1246450 INFO  (TEST-SpellCheckComponentTest.testExtendedResultsCount-seed#[514FD50BC701AA0E]) [    ] o.a.s.s.SolrIndexSearcher Opening [Searcher@24eb5ca5[collection1] main]
   [junit4]   2> 1246451 INFO  (TEST-SpellCheckComponentTest.testExtendedResultsCount-seed#[514FD50BC701AA0E]) [    ] o.a.s.u.DirectUpdateHandler2 end_commit_flush
   [junit4]   2> 1246451 INFO  (searcherExecutor-5899-thread-1) [    ] o.a.s.h.c.SpellCheckComponent Building spell index for spell checker: default
   [junit4]   2> 1246592 INFO  (searcherExecutor-5899-thread-1) [    ] o.a.s.h.c.SpellCheckComponent Building spell index for spell checker: default_teststop
   [junit4]   2> 1246664 INFO  (searcherExecutor-5899-thread-1) [    ] o.a.s.h.c.SpellCheckComponent Building spell index for spell checker: threshold
   [junit4]   2> 1246829 INFO  (searcherExecutor-5899-thread-1) [    ] o.a.s.h.c.SpellCheckComponent Building spell index for spell checker: threshold_direct
   [junit4]   2> 1246830 INFO  (searcherExecutor-5899-thread-1) [    ] o.a.s.h.c.SpellCheckComponent Building spell index for spell checker: multipleFields
   [junit4]   2> 1247012 INFO  (searcherExecutor-5899-thread-1) [    ] o.a.s.h.c.SpellCheckComponent Building spell index for spell checker: freq
   [junit4]   2> 1247166 INFO  (searcherExecutor-5899-thread-1) [    ] o.a.s.h.c.SpellCheckComponent Building spell index for spell checker: fqcn
   [junit4]   2> 1247302 INFO  (searcherExecutor-5899-thread-1) [    ] o.a.s.c.SolrCore [collection1] Registered new searcher Searcher@24eb5ca5[collection1] main{ExitableDirectoryReader(UninvertingDirectoryReader(Uninverting(_8(6.4.0):C10)))}
   [junit4]   2> 1247302 INFO  (TEST-SpellCheckComponentTest.testExtendedResultsCount-seed#[514FD50BC701AA0E]) [    ] o.a.s.u.p.LogUpdateProcessorFactory [collection1]  webapp=null path=null params={}{commit=} 0 854
   [junit4]   2> 1247469 INFO  (TEST-SpellCheckComponentTest.testExtendedResultsCount-seed#[514FD50BC701AA0E]) [    ] o.a.s.c.S.Request [collection1]  webapp=null path=null params={q=bluo&qt=spellCheckCompRH&spellcheck=true&spellcheck.count=5&wt=xml&spellcheck.build=true&spellcheck.extendedResults=false} hits=0 status=0 QTime=166
   [junit4]   2> 1247470 INFO  (TEST-SpellCheckComponentTest.testExtendedResultsCount-seed#[514FD50BC701AA0E]

[...truncated too long message...]

 2> 1252293 INFO  (TEST-SpellCheckComponentTest.testPerDictionary-seed#[514FD50BC701AA0E]) [    ] o.a.s.u.DirectUpdateHandler2 end_commit_flush
   [junit4]   2> 1252507 INFO  (searcherExecutor-5899-thread-1) [    ] o.a.s.h.c.SpellCheckComponent Building spell index for spell checker: default_teststop
   [junit4]   2> 1252577 INFO  (searcherExecutor-5899-thread-1) [    ] o.a.s.h.c.SpellCheckComponent Building spell index for spell checker: threshold
   [junit4]   2> 1252743 INFO  (searcherExecutor-5899-thread-1) [    ] o.a.s.h.c.SpellCheckComponent Building spell index for spell checker: threshold_direct
   [junit4]   2> 1252744 INFO  (searcherExecutor-5899-thread-1) [    ] o.a.s.h.c.SpellCheckComponent Building spell index for spell checker: multipleFields
   [junit4]   2> 1252957 INFO  (searcherExecutor-5899-thread-1) [    ] o.a.s.h.c.SpellCheckComponent Building spell index for spell checker: freq
   [junit4]   2> 1253195 INFO  (searcherExecutor-5899-thread-1) [    ] o.a.s.h.c.SpellCheckComponent Building spell index for spell checker: fqcn
   [junit4]   2> 1253482 INFO  (searcherExecutor-5899-thread-1) [    ] o.a.s.c.SolrCore [collection1] Registered new searcher Searcher@12c5da90[collection1] main{ExitableDirectoryReader(UninvertingDirectoryReader(Uninverting(_c(6.4.0):C10)))}
   [junit4]   2> 1253482 INFO  (TEST-SpellCheckComponentTest.testPerDictionary-seed#[514FD50BC701AA0E]) [    ] o.a.s.u.p.LogUpdateProcessorFactory [collection1]  webapp=null path=null params={}{commit=} 0 1196
   [junit4]   2> 1253483 INFO  (TEST-SpellCheckComponentTest.testPerDictionary-seed#[514FD50BC701AA0E]) [    ] o.a.s.c.S.Request [collection1]  webapp=null path=null params={q=documemt&qt=spellCheckCompRH&spellcheck.dictionary=perDict&json.nl=map&spellcheck..perDict.foo=bar&spellcheck=true&spellcheck..perDict.bar=foo&wt=xml&spellcheck.build=true} hits=0 status=0 QTime=0
   [junit4]   2> 1253484 INFO  (TEST-SpellCheckComponentTest.testPerDictionary-seed#[514FD50BC701AA0E]) [    ] o.a.s.SolrTestCaseJ4 ###Ending testPerDictionary
   [junit4]   2> 1253484 INFO  (TEST-SpellCheckComponentTest.testPerDictionary-seed#[514FD50BC701AA0E]) [    ] o.a.s.u.DirectUpdateHandler2 [collection1] REMOVING ALL DOCUMENTS FROM INDEX
   [junit4]   2> 1253484 INFO  (TEST-SpellCheckComponentTest.testPerDictionary-seed#[514FD50BC701AA0E]) [    ] o.a.s.u.p.LogUpdateProcessorFactory [collection1]  webapp=null path=null params={}{deleteByQuery=*:*} 0 0
   [junit4]   2> 1253484 INFO  (TEST-SpellCheckComponentTest.testPerDictionary-seed#[514FD50BC701AA0E]) [    ] o.a.s.u.DirectUpdateHandler2 start commit{,optimize=false,openSearcher=true,waitSearcher=true,expungeDeletes=false,softCommit=false,prepareCommit=false}
   [junit4]   2> 1253484 INFO  (TEST-SpellCheckComponentTest.testPerDictionary-seed#[514FD50BC701AA0E]) [    ] o.a.s.u.SolrIndexWriter Calling setCommitData with IW:org.apache.solr.update.SolrIndexWriter@3691a349
   [junit4]   2> 1253484 INFO  (TEST-SpellCheckComponentTest.testPerDictionary-seed#[514FD50BC701AA0E]) [    ] o.a.s.s.SolrIndexSearcher Opening [Searcher@dcf0a97[collection1] main]
   [junit4]   2> 1253484 INFO  (TEST-SpellCheckComponentTest.testPerDictionary-seed#[514FD50BC701AA0E]) [    ] o.a.s.u.DirectUpdateHandler2 end_commit_flush
   [junit4]   2> 1253484 INFO  (searcherExecutor-5899-thread-1) [    ] o.a.s.h.c.SpellCheckComponent Building spell index for spell checker: default
   [junit4]   2> 1253585 INFO  (searcherExecutor-5899-thread-1) [    ] o.a.s.h.c.SpellCheckComponent Building spell index for spell checker: default_teststop
   [junit4]   2> 1253655 INFO  (searcherExecutor-5899-thread-1) [    ] o.a.s.h.c.SpellCheckComponent Building spell index for spell checker: threshold
   [junit4]   2> 1253736 INFO  (searcherExecutor-5899-thread-1) [    ] o.a.s.h.c.SpellCheckComponent Building spell index for spell checker: threshold_direct
   [junit4]   2> 1253736 INFO  (searcherExecutor-5899-thread-1) [    ] o.a.s.h.c.SpellCheckComponent Building spell index for spell checker: multipleFields
   [junit4]   2> 1253849 INFO  (searcherExecutor-5899-thread-1) [    ] o.a.s.h.c.SpellCheckComponent Building spell index for spell checker: freq
   [junit4]   2> 1253939 INFO  (searcherExecutor-5899-thread-1) [    ] o.a.s.h.c.SpellCheckComponent Building spell index for spell checker: fqcn
   [junit4]   2> 1254037 INFO  (searcherExecutor-5899-thread-1) [    ] o.a.s.c.SolrCore [collection1] Registered new searcher Searcher@dcf0a97[collection1] main{ExitableDirectoryReader(UninvertingDirectoryReader())}
   [junit4]   2> 1254037 INFO  (TEST-SpellCheckComponentTest.testPerDictionary-seed#[514FD50BC701AA0E]) [    ] o.a.s.u.p.LogUpdateProcessorFactory [collection1]  webapp=null path=null params={}{commit=} 0 553
   [junit4]   2> 1254038 INFO  (SUITE-SpellCheckComponentTest-seed#[514FD50BC701AA0E]-worker) [    ] o.a.s.SolrTestCaseJ4 ###deleteCore
   [junit4]   2> 1254038 INFO  (SUITE-SpellCheckComponentTest-seed#[514FD50BC701AA0E]-worker) [    ] o.a.s.c.CoreContainer Shutting down CoreContainer instance=279821249
   [junit4]   2> 1254039 INFO  (coreCloseExecutor-5903-thread-1) [    ] o.a.s.c.SolrCore [collection1]  CLOSING SolrCore org.apache.solr.core.SolrCore@7b5ee8ec
   [junit4]   2> NOTE: leaving temporary files on disk at: /home/jenkins/workspace/Lucene-Solr-6.x-Linux/solr/build/solr-core/test/J1/temp/solr.handler.component.SpellCheckComponentTest_514FD50BC701AA0E-001
   [junit4]   2> NOTE: test params are: codec=Asserting(Lucene62): {start1=Lucene50(blocksize=128), range_facet_l_dv=PostingsFormat(name=Memory doPackFST= false), multiDefault=PostingsFormat(name=MockRandom), intDefault=BlockTreeOrds(blocksize=128), range_facet_l=BlockTreeOrds(blocksize=128), lowerfilt1and2=PostingsFormat(name=MockRandom), end4=Lucene50(blocksize=128), end3=PostingsFormat(name=MockRandom), end2=PostingsFormat(name=Memory doPackFST= false), end1=BlockTreeOrds(blocksize=128), lowerfilt=PostingsFormat(name=MockRandom), gram1=BlockTreeOrds(blocksize=128), id=PostingsFormat(name=Memory doPackFST= false), range_facet_i_dv=BlockTreeOrds(blocksize=128), gram2=PostingsFormat(name=Memory doPackFST= false), gram3=PostingsFormat(name=MockRandom), start3=PostingsFormat(name=Memory doPackFST= false), gram4=Lucene50(blocksize=128), start2=PostingsFormat(name=MockRandom), word=BlockTreeOrds(blocksize=128), timestamp=BlockTreeOrds(blocksize=128), start4=BlockTreeOrds(blocksize=128)}, docValues:{range_facet_l_dv=DocValuesFormat(name=Lucene54), range_facet_i_dv=DocValuesFormat(name=Direct), timestamp=DocValuesFormat(name=Direct)}, maxPointsInLeafNode=1894, maxMBSortInHeap=6.4584039122021775, sim=RandomSimilarity(queryNorm=true,coord=crazy): {}, locale=vun, timezone=CET
   [junit4]   2> NOTE: Linux 4.4.0-47-generic amd64/Oracle Corporation 9-ea (64-bit)/cpus=12,threads=1,free=205407584,total=518979584
   [junit4]   2> NOTE: All tests run in this JVM: [IndexSchemaTest, SolrIndexConfigTest, SpatialFilterTest, MultiTermTest, TestSimpleTrackingShardHandler, ConvertedLegacyTest, PreAnalyzedFieldManagedSchemaCloudTest, SliceStateTest, TestQueryUtils, TestSolrConfigHandlerCloud, CdcrUpdateLogTest, SampleTest, TestUniqueKeyFieldResource, HighlighterTest, TestSearcherReuse, DirectSolrConnectionTest, IgnoreCommitOptimizeUpdateProcessorFactoryTest, BadCopyFieldTest, DistributedQueryComponentOptimizationTest, SearchHandlerTest, TestExactSharedStatsCache, TestSlowCompositeReaderWrapper, TestLegacyFieldCache, TestClusterStateMutator, TestXmlQParserPlugin, ChaosMonkeySafeLeaderTest, TestElisionMultitermQuery, TestCharFilters, TestSolrCloudWithKerberosAlt, DistanceFunctionTest, TestMissingGroups, TestUninvertingReader, SpellCheckCollatorTest, SpellingQueryConverterTest, SimplePostToolTest, TestNonDefinedSimilarityFactory, RequestLoggingTest, TestFuzzyAnalyzedSuggestions, TestSolrIndexConfig, DistribJoinFromCollectionTest, TestCollapseQParserPlugin, SecurityConfHandlerTest, TestSystemIdResolver, CollectionsAPIDistributedZkTest, HLLSerializationTest, ShardRoutingTest, TestSchemaResource, LoggingHandlerTest, BasicAuthIntegrationTest, SSLMigrationTest, HdfsUnloadDistributedZkTest, RecoveryAfterSoftCommitTest, TestExclusionRuleCollectionAccess, TestSweetSpotSimilarityFactory, TestSolrXml, CustomCollectionTest, TermVectorComponentTest, TestQueryTypes, TestMiniSolrCloudClusterSSL, TestDynamicLoading, BitVectorTest, TestExpandComponent, ClusterStateUpdateTest, SortSpecParsingTest, TestAnalyzeInfixSuggestions, TestCSVResponseWriter, RAMDirectoryFactoryTest, ClassificationUpdateProcessorFactoryTest, IndexBasedSpellCheckerTest, TermsComponentTest, TestQueryWrapperFilter, TestShardHandlerFactory, TestStressUserVersions, TestSolr4Spatial2, DistributedFacetPivotLargeTest, TestFieldTypeCollectionResource, URLClassifyProcessorTest, TestLRUCache, SuggestComponentContextFilterQueryTest, ZkControllerTest, UpdateRequestProcessorFactoryTest, TestRTGBase, TestSearchPerf, SoftAutoCommitTest, TestLMDirichletSimilarityFactory, WordBreakSolrSpellCheckerTest, SolrInfoMBeanTest, SchemaVersionSpecificBehaviorTest, TestScoreJoinQPScore, ReplicationFactorTest, TestStressVersions, BJQParserTest, TestMinMaxOnMultiValuedField, TestHashPartitioner, TestFastOutputStream, TestReRankQParserPlugin, TestCustomDocTransformer, CopyFieldTest, TestManagedSchemaThreadSafety, TestLeaderElectionZkExpiry, DeleteStatusTest, LeaderElectionContextKeyTest, HdfsLockFactoryTest, TestRawResponseWriter, TestFieldSortValues, MultiThreadedOCPTest, FileUtilsTest, SolrCmdDistributorTest, TestDocBasedVersionConstraints, BasicDistributedZkTest, BasicDistributedZk2Test, SyncSliceTest, OpenCloseCoreStressTest, LeaderElectionIntegrationTest, RecoveryZkTest, FullSolrCloudDistribCmdsTest, TestReplicationHandler, TermVectorComponentDistributedTest, DistributedTermsComponentTest, TestCoreContainer, SimpleFacetsTest, TestSolr4Spatial, SpellCheckComponentTest]
   [junit4] Completed [343/658 (1!)] on J1 in 19.10s, 11 tests, 1 error <<< FAILURES!

[...truncated 51020 lines...]


Mime
View raw message