lucene-dev mailing list archives

Site index · List index
Message view « Date » · « Thread »
Top « Date » · « Thread »
From Policeman Jenkins Server <jenk...@thetaphi.de>
Subject [JENKINS] Lucene-Solr-6.x-Solaris (64bit/jdk1.8.0) - Build # 559 - Failure!
Date Mon, 19 Dec 2016 06:01:16 GMT
Build: https://jenkins.thetaphi.de/job/Lucene-Solr-6.x-Solaris/559/
Java: 64bit/jdk1.8.0 -XX:+UseCompressedOops -XX:+UseConcMarkSweepGC

3 tests failed.
FAILED:  junit.framework.TestSuite.org.apache.solr.core.TestLazyCores

Error Message:
ObjectTracker found 5 object(s) that were not released!!! [MDCAwareThreadPoolExecutor, MockDirectoryWrapper, SolrCore, MockDirectoryWrapper, MockDirectoryWrapper] org.apache.solr.common.util.ObjectReleaseTracker$ObjectTrackerException  at org.apache.solr.common.util.ObjectReleaseTracker.track(ObjectReleaseTracker.java:43)  at org.apache.solr.core.SolrCore.<init>(SolrCore.java:797)  at org.apache.solr.core.SolrCore.<init>(SolrCore.java:774)  at org.apache.solr.core.CoreContainer.create(CoreContainer.java:842)  at org.apache.solr.core.CoreContainer.lambda$load$0(CoreContainer.java:498)  at java.util.concurrent.FutureTask.run(FutureTask.java:266)  at org.apache.solr.common.util.ExecutorUtil$MDCAwareThreadPoolExecutor.lambda$execute$0(ExecutorUtil.java:229)  at java.util.concurrent.ThreadPoolExecutor.runWorker(ThreadPoolExecutor.java:1142)  at java.util.concurrent.ThreadPoolExecutor$Worker.run(ThreadPoolExecutor.java:617)  at java.lang.Thread.run(Thread.java:745)  org.apache.solr.common.util.ObjectReleaseTracker$ObjectTrackerException  at org.apache.solr.common.util.ObjectReleaseTracker.track(ObjectReleaseTracker.java:43)  at org.apache.solr.core.CachingDirectoryFactory.get(CachingDirectoryFactory.java:347)  at org.apache.solr.core.SolrCore.getNewIndexDir(SolrCore.java:331)  at org.apache.solr.core.SolrCore.initIndex(SolrCore.java:640)  at org.apache.solr.core.SolrCore.<init>(SolrCore.java:846)  at org.apache.solr.core.SolrCore.<init>(SolrCore.java:774)  at org.apache.solr.core.CoreContainer.create(CoreContainer.java:842)  at org.apache.solr.core.CoreContainer.lambda$load$0(CoreContainer.java:498)  at java.util.concurrent.FutureTask.run(FutureTask.java:266)  at org.apache.solr.common.util.ExecutorUtil$MDCAwareThreadPoolExecutor.lambda$execute$0(ExecutorUtil.java:229)  at java.util.concurrent.ThreadPoolExecutor.runWorker(ThreadPoolExecutor.java:1142)  at java.util.concurrent.ThreadPoolExecutor$Worker.run(ThreadPoolExecutor.java:617)  at java.lang.Thread.run(Thread.java:745)  org.apache.solr.common.util.ObjectReleaseTracker$ObjectTrackerException  at org.apache.solr.common.util.ObjectReleaseTracker.track(ObjectReleaseTracker.java:43)  at org.apache.solr.core.SolrCore.<init>(SolrCore.java:936)  at org.apache.solr.core.SolrCore.<init>(SolrCore.java:774)  at org.apache.solr.core.CoreContainer.create(CoreContainer.java:842)  at org.apache.solr.core.CoreContainer.lambda$load$0(CoreContainer.java:498)  at java.util.concurrent.FutureTask.run(FutureTask.java:266)  at org.apache.solr.common.util.ExecutorUtil$MDCAwareThreadPoolExecutor.lambda$execute$0(ExecutorUtil.java:229)  at java.util.concurrent.ThreadPoolExecutor.runWorker(ThreadPoolExecutor.java:1142)  at java.util.concurrent.ThreadPoolExecutor$Worker.run(ThreadPoolExecutor.java:617)  at java.lang.Thread.run(Thread.java:745)  org.apache.solr.common.util.ObjectReleaseTracker$ObjectTrackerException  at org.apache.solr.common.util.ObjectReleaseTracker.track(ObjectReleaseTracker.java:43)  at org.apache.solr.core.CachingDirectoryFactory.get(CachingDirectoryFactory.java:347)  at org.apache.solr.update.SolrIndexWriter.create(SolrIndexWriter.java:66)  at org.apache.solr.core.SolrCore.initIndex(SolrCore.java:672)  at org.apache.solr.core.SolrCore.<init>(SolrCore.java:846)  at org.apache.solr.core.SolrCore.<init>(SolrCore.java:774)  at org.apache.solr.core.CoreContainer.create(CoreContainer.java:842)  at org.apache.solr.core.CoreContainer.lambda$load$0(CoreContainer.java:498)  at java.util.concurrent.FutureTask.run(FutureTask.java:266)  at org.apache.solr.common.util.ExecutorUtil$MDCAwareThreadPoolExecutor.lambda$execute$0(ExecutorUtil.java:229)  at java.util.concurrent.ThreadPoolExecutor.runWorker(ThreadPoolExecutor.java:1142)  at java.util.concurrent.ThreadPoolExecutor$Worker.run(ThreadPoolExecutor.java:617)  at java.lang.Thread.run(Thread.java:745)  org.apache.solr.common.util.ObjectReleaseTracker$ObjectTrackerException  at org.apache.solr.common.util.ObjectReleaseTracker.track(ObjectReleaseTracker.java:43)  at org.apache.solr.core.CachingDirectoryFactory.get(CachingDirectoryFactory.java:347)  at org.apache.solr.core.SolrCore.initSnapshotMetaDataManager(SolrCore.java:433)  at org.apache.solr.core.SolrCore.<init>(SolrCore.java:840)  at org.apache.solr.core.SolrCore.<init>(SolrCore.java:774)  at org.apache.solr.core.CoreContainer.create(CoreContainer.java:842)  at org.apache.solr.core.CoreContainer.lambda$load$0(CoreContainer.java:498)  at java.util.concurrent.FutureTask.run(FutureTask.java:266)  at org.apache.solr.common.util.ExecutorUtil$MDCAwareThreadPoolExecutor.lambda$execute$0(ExecutorUtil.java:229)  at java.util.concurrent.ThreadPoolExecutor.runWorker(ThreadPoolExecutor.java:1142)  at java.util.concurrent.ThreadPoolExecutor$Worker.run(ThreadPoolExecutor.java:617)  at java.lang.Thread.run(Thread.java:745)  

Stack Trace:
java.lang.AssertionError: ObjectTracker found 5 object(s) that were not released!!! [MDCAwareThreadPoolExecutor, MockDirectoryWrapper, SolrCore, MockDirectoryWrapper, MockDirectoryWrapper]
org.apache.solr.common.util.ObjectReleaseTracker$ObjectTrackerException
	at org.apache.solr.common.util.ObjectReleaseTracker.track(ObjectReleaseTracker.java:43)
	at org.apache.solr.core.SolrCore.<init>(SolrCore.java:797)
	at org.apache.solr.core.SolrCore.<init>(SolrCore.java:774)
	at org.apache.solr.core.CoreContainer.create(CoreContainer.java:842)
	at org.apache.solr.core.CoreContainer.lambda$load$0(CoreContainer.java:498)
	at java.util.concurrent.FutureTask.run(FutureTask.java:266)
	at org.apache.solr.common.util.ExecutorUtil$MDCAwareThreadPoolExecutor.lambda$execute$0(ExecutorUtil.java:229)
	at java.util.concurrent.ThreadPoolExecutor.runWorker(ThreadPoolExecutor.java:1142)
	at java.util.concurrent.ThreadPoolExecutor$Worker.run(ThreadPoolExecutor.java:617)
	at java.lang.Thread.run(Thread.java:745)

org.apache.solr.common.util.ObjectReleaseTracker$ObjectTrackerException
	at org.apache.solr.common.util.ObjectReleaseTracker.track(ObjectReleaseTracker.java:43)
	at org.apache.solr.core.CachingDirectoryFactory.get(CachingDirectoryFactory.java:347)
	at org.apache.solr.core.SolrCore.getNewIndexDir(SolrCore.java:331)
	at org.apache.solr.core.SolrCore.initIndex(SolrCore.java:640)
	at org.apache.solr.core.SolrCore.<init>(SolrCore.java:846)
	at org.apache.solr.core.SolrCore.<init>(SolrCore.java:774)
	at org.apache.solr.core.CoreContainer.create(CoreContainer.java:842)
	at org.apache.solr.core.CoreContainer.lambda$load$0(CoreContainer.java:498)
	at java.util.concurrent.FutureTask.run(FutureTask.java:266)
	at org.apache.solr.common.util.ExecutorUtil$MDCAwareThreadPoolExecutor.lambda$execute$0(ExecutorUtil.java:229)
	at java.util.concurrent.ThreadPoolExecutor.runWorker(ThreadPoolExecutor.java:1142)
	at java.util.concurrent.ThreadPoolExecutor$Worker.run(ThreadPoolExecutor.java:617)
	at java.lang.Thread.run(Thread.java:745)

org.apache.solr.common.util.ObjectReleaseTracker$ObjectTrackerException
	at org.apache.solr.common.util.ObjectReleaseTracker.track(ObjectReleaseTracker.java:43)
	at org.apache.solr.core.SolrCore.<init>(SolrCore.java:936)
	at org.apache.solr.core.SolrCore.<init>(SolrCore.java:774)
	at org.apache.solr.core.CoreContainer.create(CoreContainer.java:842)
	at org.apache.solr.core.CoreContainer.lambda$load$0(CoreContainer.java:498)
	at java.util.concurrent.FutureTask.run(FutureTask.java:266)
	at org.apache.solr.common.util.ExecutorUtil$MDCAwareThreadPoolExecutor.lambda$execute$0(ExecutorUtil.java:229)
	at java.util.concurrent.ThreadPoolExecutor.runWorker(ThreadPoolExecutor.java:1142)
	at java.util.concurrent.ThreadPoolExecutor$Worker.run(ThreadPoolExecutor.java:617)
	at java.lang.Thread.run(Thread.java:745)

org.apache.solr.common.util.ObjectReleaseTracker$ObjectTrackerException
	at org.apache.solr.common.util.ObjectReleaseTracker.track(ObjectReleaseTracker.java:43)
	at org.apache.solr.core.CachingDirectoryFactory.get(CachingDirectoryFactory.java:347)
	at org.apache.solr.update.SolrIndexWriter.create(SolrIndexWriter.java:66)
	at org.apache.solr.core.SolrCore.initIndex(SolrCore.java:672)
	at org.apache.solr.core.SolrCore.<init>(SolrCore.java:846)
	at org.apache.solr.core.SolrCore.<init>(SolrCore.java:774)
	at org.apache.solr.core.CoreContainer.create(CoreContainer.java:842)
	at org.apache.solr.core.CoreContainer.lambda$load$0(CoreContainer.java:498)
	at java.util.concurrent.FutureTask.run(FutureTask.java:266)
	at org.apache.solr.common.util.ExecutorUtil$MDCAwareThreadPoolExecutor.lambda$execute$0(ExecutorUtil.java:229)
	at java.util.concurrent.ThreadPoolExecutor.runWorker(ThreadPoolExecutor.java:1142)
	at java.util.concurrent.ThreadPoolExecutor$Worker.run(ThreadPoolExecutor.java:617)
	at java.lang.Thread.run(Thread.java:745)

org.apache.solr.common.util.ObjectReleaseTracker$ObjectTrackerException
	at org.apache.solr.common.util.ObjectReleaseTracker.track(ObjectReleaseTracker.java:43)
	at org.apache.solr.core.CachingDirectoryFactory.get(CachingDirectoryFactory.java:347)
	at org.apache.solr.core.SolrCore.initSnapshotMetaDataManager(SolrCore.java:433)
	at org.apache.solr.core.SolrCore.<init>(SolrCore.java:840)
	at org.apache.solr.core.SolrCore.<init>(SolrCore.java:774)
	at org.apache.solr.core.CoreContainer.create(CoreContainer.java:842)
	at org.apache.solr.core.CoreContainer.lambda$load$0(CoreContainer.java:498)
	at java.util.concurrent.FutureTask.run(FutureTask.java:266)
	at org.apache.solr.common.util.ExecutorUtil$MDCAwareThreadPoolExecutor.lambda$execute$0(ExecutorUtil.java:229)
	at java.util.concurrent.ThreadPoolExecutor.runWorker(ThreadPoolExecutor.java:1142)
	at java.util.concurrent.ThreadPoolExecutor$Worker.run(ThreadPoolExecutor.java:617)
	at java.lang.Thread.run(Thread.java:745)


	at __randomizedtesting.SeedInfo.seed([520991A99683960]:0)
	at org.junit.Assert.fail(Assert.java:93)
	at org.junit.Assert.assertTrue(Assert.java:43)
	at org.junit.Assert.assertNull(Assert.java:551)
	at org.apache.solr.SolrTestCaseJ4.teardownTestCases(SolrTestCaseJ4.java:266)
	at sun.reflect.GeneratedMethodAccessor35.invoke(Unknown Source)
	at sun.reflect.DelegatingMethodAccessorImpl.invoke(DelegatingMethodAccessorImpl.java:43)
	at java.lang.reflect.Method.invoke(Method.java:498)
	at com.carrotsearch.randomizedtesting.RandomizedRunner.invoke(RandomizedRunner.java:1713)
	at com.carrotsearch.randomizedtesting.RandomizedRunner$7.evaluate(RandomizedRunner.java:870)
	at com.carrotsearch.randomizedtesting.rules.StatementAdapter.evaluate(StatementAdapter.java:36)
	at com.carrotsearch.randomizedtesting.rules.SystemPropertiesRestoreRule$1.evaluate(SystemPropertiesRestoreRule.java:57)
	at org.apache.lucene.util.AbstractBeforeAfterRule$1.evaluate(AbstractBeforeAfterRule.java:45)
	at com.carrotsearch.randomizedtesting.rules.StatementAdapter.evaluate(StatementAdapter.java:36)
	at org.apache.lucene.util.TestRuleStoreClassName$1.evaluate(TestRuleStoreClassName.java:41)
	at com.carrotsearch.randomizedtesting.rules.NoShadowingOrOverridesOnMethodsRule$1.evaluate(NoShadowingOrOverridesOnMethodsRule.java:40)
	at com.carrotsearch.randomizedtesting.rules.NoShadowingOrOverridesOnMethodsRule$1.evaluate(NoShadowingOrOverridesOnMethodsRule.java:40)
	at com.carrotsearch.randomizedtesting.rules.StatementAdapter.evaluate(StatementAdapter.java:36)
	at com.carrotsearch.randomizedtesting.rules.StatementAdapter.evaluate(StatementAdapter.java:36)
	at com.carrotsearch.randomizedtesting.rules.StatementAdapter.evaluate(StatementAdapter.java:36)
	at org.apache.lucene.util.TestRuleAssertionsRequired$1.evaluate(TestRuleAssertionsRequired.java:53)
	at org.apache.lucene.util.TestRuleMarkFailure$1.evaluate(TestRuleMarkFailure.java:47)
	at org.apache.lucene.util.TestRuleIgnoreAfterMaxFailures$1.evaluate(TestRuleIgnoreAfterMaxFailures.java:64)
	at org.apache.lucene.util.TestRuleIgnoreTestSuites$1.evaluate(TestRuleIgnoreTestSuites.java:54)
	at com.carrotsearch.randomizedtesting.rules.StatementAdapter.evaluate(StatementAdapter.java:36)
	at com.carrotsearch.randomizedtesting.ThreadLeakControl$StatementRunner.run(ThreadLeakControl.java:367)
	at java.lang.Thread.run(Thread.java:745)


FAILED:  junit.framework.TestSuite.org.apache.solr.core.TestLazyCores

Error Message:
1 thread leaked from SUITE scope at org.apache.solr.core.TestLazyCores:     1) Thread[id=46846, name=searcherExecutor-9169-thread-1, state=WAITING, group=TGRP-TestLazyCores]         at sun.misc.Unsafe.park(Native Method)         at java.util.concurrent.locks.LockSupport.park(LockSupport.java:175)         at java.util.concurrent.locks.AbstractQueuedSynchronizer$ConditionObject.await(AbstractQueuedSynchronizer.java:2039)         at java.util.concurrent.LinkedBlockingQueue.take(LinkedBlockingQueue.java:442)         at java.util.concurrent.ThreadPoolExecutor.getTask(ThreadPoolExecutor.java:1067)         at java.util.concurrent.ThreadPoolExecutor.runWorker(ThreadPoolExecutor.java:1127)         at java.util.concurrent.ThreadPoolExecutor$Worker.run(ThreadPoolExecutor.java:617)         at java.lang.Thread.run(Thread.java:745)

Stack Trace:
com.carrotsearch.randomizedtesting.ThreadLeakError: 1 thread leaked from SUITE scope at org.apache.solr.core.TestLazyCores: 
   1) Thread[id=46846, name=searcherExecutor-9169-thread-1, state=WAITING, group=TGRP-TestLazyCores]
        at sun.misc.Unsafe.park(Native Method)
        at java.util.concurrent.locks.LockSupport.park(LockSupport.java:175)
        at java.util.concurrent.locks.AbstractQueuedSynchronizer$ConditionObject.await(AbstractQueuedSynchronizer.java:2039)
        at java.util.concurrent.LinkedBlockingQueue.take(LinkedBlockingQueue.java:442)
        at java.util.concurrent.ThreadPoolExecutor.getTask(ThreadPoolExecutor.java:1067)
        at java.util.concurrent.ThreadPoolExecutor.runWorker(ThreadPoolExecutor.java:1127)
        at java.util.concurrent.ThreadPoolExecutor$Worker.run(ThreadPoolExecutor.java:617)
        at java.lang.Thread.run(Thread.java:745)
	at __randomizedtesting.SeedInfo.seed([520991A99683960]:0)


FAILED:  junit.framework.TestSuite.org.apache.solr.core.TestLazyCores

Error Message:
There are still zombie threads that couldn't be terminated:    1) Thread[id=46846, name=searcherExecutor-9169-thread-1, state=WAITING, group=TGRP-TestLazyCores]         at sun.misc.Unsafe.park(Native Method)         at java.util.concurrent.locks.LockSupport.park(LockSupport.java:175)         at java.util.concurrent.locks.AbstractQueuedSynchronizer$ConditionObject.await(AbstractQueuedSynchronizer.java:2039)         at java.util.concurrent.LinkedBlockingQueue.take(LinkedBlockingQueue.java:442)         at java.util.concurrent.ThreadPoolExecutor.getTask(ThreadPoolExecutor.java:1067)         at java.util.concurrent.ThreadPoolExecutor.runWorker(ThreadPoolExecutor.java:1127)         at java.util.concurrent.ThreadPoolExecutor$Worker.run(ThreadPoolExecutor.java:617)         at java.lang.Thread.run(Thread.java:745)

Stack Trace:
com.carrotsearch.randomizedtesting.ThreadLeakError: There are still zombie threads that couldn't be terminated:
   1) Thread[id=46846, name=searcherExecutor-9169-thread-1, state=WAITING, group=TGRP-TestLazyCores]
        at sun.misc.Unsafe.park(Native Method)
        at java.util.concurrent.locks.LockSupport.park(LockSupport.java:175)
        at java.util.concurrent.locks.AbstractQueuedSynchronizer$ConditionObject.await(AbstractQueuedSynchronizer.java:2039)
        at java.util.concurrent.LinkedBlockingQueue.take(LinkedBlockingQueue.java:442)
        at java.util.concurrent.ThreadPoolExecutor.getTask(ThreadPoolExecutor.java:1067)
        at java.util.concurrent.ThreadPoolExecutor.runWorker(ThreadPoolExecutor.java:1127)
        at java.util.concurrent.ThreadPoolExecutor$Worker.run(ThreadPoolExecutor.java:617)
        at java.lang.Thread.run(Thread.java:745)
	at __randomizedtesting.SeedInfo.seed([520991A99683960]:0)




Build Log:
[...truncated 12081 lines...]
   [junit4] Suite: org.apache.solr.core.TestLazyCores
   [junit4]   2> Creating dataDir: /export/home/jenkins/workspace/Lucene-Solr-6.x-Solaris/solr/build/solr-core/test/J1/temp/solr.core.TestLazyCores_520991A99683960-001/init-core-data-001
   [junit4]   2> 1508712 INFO  (SUITE-TestLazyCores-seed#[520991A99683960]-worker) [    ] o.a.s.SolrTestCaseJ4 Randomized ssl (false) and clientAuth (true) via: @org.apache.solr.util.RandomizeSSL(reason=, value=NaN, ssl=NaN, clientAuth=NaN)
   [junit4]   2> 1508714 INFO  (TEST-TestLazyCores.testLazySearch-seed#[520991A99683960]) [    ] o.a.s.SolrTestCaseJ4 ###Starting testLazySearch
   [junit4]   2> 1508734 INFO  (TEST-TestLazyCores.testLazySearch-seed#[520991A99683960]) [    ] o.a.s.u.UpdateShardHandler Creating UpdateShardHandler HTTP client with params: socketTimeout=600000&connTimeout=60000&retry=true
   [junit4]   2> 1508734 INFO  (TEST-TestLazyCores.testLazySearch-seed#[520991A99683960]) [    ] o.a.s.c.SolrCores Allocating transient cache for 4 transient cores
   [junit4]   2> 1508746 INFO  (coreLoadExecutor-8949-thread-3) [    x:collection5] o.a.s.c.SolrConfig Using Lucene MatchVersion: 6.4.0
   [junit4]   2> 1508746 INFO  (coreLoadExecutor-8949-thread-2) [    x:collection2] o.a.s.c.SolrConfig Using Lucene MatchVersion: 6.4.0
   [junit4]   2> 1508746 INFO  (coreLoadExecutor-8949-thread-1) [    x:collection1] o.a.s.c.SolrConfig Using Lucene MatchVersion: 6.4.0
   [junit4]   2> 1508758 INFO  (coreLoadExecutor-8949-thread-3) [    x:collection5] o.a.s.s.IndexSchema [collection5] Schema name=tiny
   [junit4]   2> 1508758 INFO  (coreLoadExecutor-8949-thread-2) [    x:collection2] o.a.s.s.IndexSchema [collection2] Schema name=tiny
   [junit4]   2> 1508758 INFO  (coreLoadExecutor-8949-thread-1) [    x:collection1] o.a.s.s.IndexSchema [collection1] Schema name=tiny
   [junit4]   2> 1508761 INFO  (coreLoadExecutor-8949-thread-3) [    x:collection5] o.a.s.s.IndexSchema Loaded schema tiny/1.1 with uniqueid field id
   [junit4]   2> 1508761 INFO  (coreLoadExecutor-8949-thread-2) [    x:collection2] o.a.s.s.IndexSchema Loaded schema tiny/1.1 with uniqueid field id
   [junit4]   2> 1508761 INFO  (coreLoadExecutor-8949-thread-1) [    x:collection1] o.a.s.s.IndexSchema Loaded schema tiny/1.1 with uniqueid field id
   [junit4]   2> 1508763 INFO  (coreLoadExecutor-8949-thread-3) [    x:collection5] o.a.s.c.CoreContainer Creating SolrCore 'collection5' using configuration from instancedir /export/home/jenkins/workspace/Lucene-Solr-6.x-Solaris/solr/build/solr-core/test/J1/temp/solr.core.TestLazyCores_520991A99683960-001/tempDir-001/collection5
   [junit4]   2> 1508763 INFO  (coreLoadExecutor-8949-thread-1) [    x:collection1] o.a.s.c.CoreContainer Creating SolrCore 'collection1' using configuration from instancedir /export/home/jenkins/workspace/Lucene-Solr-6.x-Solaris/solr/build/solr-core/test/J1/temp/solr.core.TestLazyCores_520991A99683960-001/tempDir-001/collection1
   [junit4]   2> 1508763 INFO  (coreLoadExecutor-8949-thread-2) [    x:collection2] o.a.s.c.CoreContainer Creating SolrCore 'collection2' using configuration from instancedir /export/home/jenkins/workspace/Lucene-Solr-6.x-Solaris/solr/build/solr-core/test/J1/temp/solr.core.TestLazyCores_520991A99683960-001/tempDir-001/collection2
   [junit4]   2> 1508763 INFO  (coreLoadExecutor-8949-thread-3) [    x:collection5] o.a.s.c.SolrCore [[collection5] ] Opening new SolrCore at [/export/home/jenkins/workspace/Lucene-Solr-6.x-Solaris/solr/build/solr-core/test/J1/temp/solr.core.TestLazyCores_520991A99683960-001/tempDir-001/collection5], dataDir=[/export/home/jenkins/workspace/Lucene-Solr-6.x-Solaris/solr/build/solr-core/test/J1/temp/solr.core.TestLazyCores_520991A99683960-001/tempDir-001/collection5/data/]
   [junit4]   2> 1508763 INFO  (coreLoadExecutor-8949-thread-1) [    x:collection1] o.a.s.c.SolrCore [[collection1] ] Opening new SolrCore at [/export/home/jenkins/workspace/Lucene-Solr-6.x-Solaris/solr/build/solr-core/test/J1/temp/solr.core.TestLazyCores_520991A99683960-001/tempDir-001/collection1], dataDir=[/export/home/jenkins/workspace/Lucene-Solr-6.x-Solaris/solr/build/solr-core/test/J1/temp/solr.core.TestLazyCores_520991A99683960-001/tempDir-001/collection1/data/]
   [junit4]   2> 1508763 INFO  (coreLoadExecutor-8949-thread-2) [    x:collection2] o.a.s.c.SolrCore [[collection2] ] Opening new SolrCore at [/export/home/jenkins/workspace/Lucene-Solr-6.x-Solaris/solr/build/solr-core/test/J1/temp/solr.core.TestLazyCores_520991A99683960-001/tempDir-001/collection2], dataDir=[/export/home/jenkins/workspace/Lucene-Solr-6.x-Solaris/solr/build/solr-core/test/J1/temp/solr.core.TestLazyCores_520991A99683960-001/tempDir-001/collection2/data/]
   [junit4]   2> 1508814 INFO  (coreLoadExecutor-8949-thread-3) [    x:collection5] o.a.s.u.RandomMergePolicy RandomMergePolicy wrapping class org.apache.lucene.index.TieredMergePolicy: [TieredMergePolicy: maxMergeAtOnce=38, maxMergeAtOnceExplicit=31, maxMergedSegmentMB=88.0234375, floorSegmentMB=1.5947265625, forceMergeDeletesPctAllowed=0.9103532200750553, segmentsPerTier=48.0, maxCFSSegmentSizeMB=8.796093022207999E12, noCFSRatio=0.1732849212417416
   [junit4]   2> 1508815 INFO  (coreLoadExecutor-8949-thread-2) [    x:collection2] o.a.s.u.RandomMergePolicy RandomMergePolicy wrapping class org.apache.lucene.index.TieredMergePolicy: [TieredMergePolicy: maxMergeAtOnce=38, maxMergeAtOnceExplicit=31, maxMergedSegmentMB=88.0234375, floorSegmentMB=1.5947265625, forceMergeDeletesPctAllowed=0.9103532200750553, segmentsPerTier=48.0, maxCFSSegmentSizeMB=8.796093022207999E12, noCFSRatio=0.1732849212417416
   [junit4]   2> 1508815 INFO  (coreLoadExecutor-8949-thread-1) [    x:collection1] o.a.s.u.RandomMergePolicy RandomMergePolicy wrapping class org.apache.lucene.index.TieredMergePolicy: [TieredMergePolicy: maxMergeAtOnce=38, maxMergeAtOnceExplicit=31, maxMergedSegmentMB=88.0234375, floorSegmentMB=1.5947265625, forceMergeDeletesPctAllowed=0.9103532200750553, segmentsPerTier=48.0, maxCFSSegmentSizeMB=8.796093022207999E12, noCFSRatio=0.1732849212417416
   [junit4]   2> 1508824 INFO  (coreLoadExecutor-8949-thread-1) [    x:collection1] o.a.s.u.CommitTracker Hard AutoCommit: disabled
   [junit4]   2> 1508824 INFO  (coreLoadExecutor-8949-thread-3) [    x:collection5] o.a.s.u.CommitTracker Hard AutoCommit: disabled
   [junit4]   2> 1508825 INFO  (coreLoadExecutor-8949-thread-2) [    x:collection2] o.a.s.u.CommitTracker Hard AutoCommit: disabled
   [junit4]   2> 1508825 INFO  (coreLoadExecutor-8949-thread-2) [    x:collection2] o.a.s.u.CommitTracker Soft AutoCommit: disabled
   [junit4]   2> 1508825 INFO  (coreLoadExecutor-8949-thread-3) [    x:collection5] o.a.s.u.CommitTracker Soft AutoCommit: disabled
   [junit4]   2> 1508825 INFO  (coreLoadExecutor-8949-thread-2) [    x:collection2] o.a.s.u.RandomMergePolicy RandomMergePolicy wrapping class org.apache.lucene.index.LogByteSizeMergePolicy: [LogByteSizeMergePolicy: minMergeSize=1677721, mergeFactor=31, maxMergeSize=2147483648, maxMergeSizeForForcedMerge=9223372036854775807, calibrateSizeByDeletes=false, maxMergeDocs=2147483647, maxCFSSegmentSizeMB=8.796093022207999E12, noCFSRatio=0.5213739801295223]
   [junit4]   2> 1508825 INFO  (coreLoadExecutor-8949-thread-3) [    x:collection5] o.a.s.u.RandomMergePolicy RandomMergePolicy wrapping class org.apache.lucene.index.LogByteSizeMergePolicy: [LogByteSizeMergePolicy: minMergeSize=1677721, mergeFactor=31, maxMergeSize=2147483648, maxMergeSizeForForcedMerge=9223372036854775807, calibrateSizeByDeletes=false, maxMergeDocs=2147483647, maxCFSSegmentSizeMB=8.796093022207999E12, noCFSRatio=0.5213739801295223]
   [junit4]   2> 1508824 INFO  (coreLoadExecutor-8949-thread-1) [    x:collection1] o.a.s.u.CommitTracker Soft AutoCommit: disabled
   [junit4]   2> 1508825 INFO  (coreLoadExecutor-8949-thread-2) [    x:collection2] o.a.s.s.SolrIndexSearcher Opening [Searcher@4688bf3b[collection2] main]
   [junit4]   2> 1508825 INFO  (coreLoadExecutor-8949-thread-1) [    x:collection1] o.a.s.u.RandomMergePolicy RandomMergePolicy wrapping class org.apache.lucene.index.LogByteSizeMergePolicy: [LogByteSizeMergePolicy: minMergeSize=1677721, mergeFactor=31, maxMergeSize=2147483648, maxMergeSizeForForcedMerge=9223372036854775807, calibrateSizeByDeletes=false, maxMergeDocs=2147483647, maxCFSSegmentSizeMB=8.796093022207999E12, noCFSRatio=0.5213739801295223]
   [junit4]   2> 1508826 INFO  (coreLoadExecutor-8949-thread-2) [    x:collection2] o.a.s.r.ManagedResourceStorage File-based storage initialized to use dir: /export/home/jenkins/workspace/Lucene-Solr-6.x-Solaris/solr/build/solr-core/test/J1/temp/solr.core.TestLazyCores_520991A99683960-001/tempDir-001/collection2/conf
   [junit4]   2> 1508826 INFO  (coreLoadExecutor-8949-thread-1) [    x:collection1] o.a.s.s.SolrIndexSearcher Opening [Searcher@4f31d93c[collection1] main]
   [junit4]   2> 1508825 INFO  (coreLoadExecutor-8949-thread-3) [    x:collection5] o.a.s.s.SolrIndexSearcher Opening [Searcher@27ea89a1[collection5] main]
   [junit4]   2> 1508826 INFO  (coreLoadExecutor-8949-thread-2) [    x:collection2] o.a.s.h.ReplicationHandler Commits will be reserved for  10000
   [junit4]   2> 1508826 INFO  (coreLoadExecutor-8949-thread-1) [    x:collection1] o.a.s.r.ManagedResourceStorage File-based storage initialized to use dir: /export/home/jenkins/workspace/Lucene-Solr-6.x-Solaris/solr/build/solr-core/test/J1/temp/solr.core.TestLazyCores_520991A99683960-001/tempDir-001/collection1/conf
   [junit4]   2> 1508826 INFO  (coreLoadExecutor-8949-thread-3) [    x:collection5] o.a.s.r.ManagedResourceStorage File-based storage initialized to use dir: /export/home/jenkins/workspace/Lucene-Solr-6.x-Solaris/solr/build/solr-core/test/J1/temp/solr.core.TestLazyCores_520991A99683960-001/tempDir-001/collection5/conf
   [junit4]   2> 1508826 INFO  (coreLoadExecutor-8949-thread-2) [    x:collection2] o.a.s.c.SolrCores Opening transient core collection2
   [junit4]   2> 1508826 INFO  (coreLoadExecutor-8949-thread-1) [    x:collection1] o.a.s.h.ReplicationHandler Commits will be reserved for  10000
   [junit4]   2> 1508826 INFO  (coreLoadExecutor-8949-thread-3) [    x:collection5] o.a.s.h.ReplicationHandler Commits will be reserved for  10000
   [junit4]   2> 1508826 INFO  (searcherExecutor-8951-thread-1-processing-x:collection1) [    x:collection1] o.a.s.c.SolrCore [collection1] Registered new searcher Searcher@4f31d93c[collection1] main{ExitableDirectoryReader(UninvertingDirectoryReader())}
   [junit4]   2> 1508826 INFO  (searcherExecutor-8952-thread-1-processing-x:collection2) [    x:collection2] o.a.s.c.SolrCore [collection2] Registered new searcher Searcher@4688bf3b[collection2] main{ExitableDirectoryReader(UninvertingDirectoryReader())}
   [junit4]   2> 1508826 INFO  (searcherExecutor-8950-thread-1-processing-x:collection5) [    x:collection5] o.a.s.c.SolrCore [collection5] Registered new searcher Searcher@27ea89a1[collection5] main{ExitableDirectoryReader(UninvertingDirectoryReader())}
   [junit4]   2> 1508833 INFO  (TEST-TestLazyCores.testLazySearch-seed#[520991A99683960]) [    x:collection4] o.a.s.c.SolrConfig Using Lucene MatchVersion: 6.4.0
   [junit4]   2> 1508839 INFO  (TEST-TestLazyCores.testLazySearch-seed#[520991A99683960]) [    x:collection4] o.a.s.s.IndexSchema [collection4] Schema name=tiny
   [junit4]   2> 1508840 INFO  (TEST-TestLazyCores.testLazySearch-seed#[520991A99683960]) [    x:collection4] o.a.s.s.IndexSchema Loaded schema tiny/1.1 with uniqueid field id
   [junit4]   2> 1508842 INFO  (TEST-TestLazyCores.testLazySearch-seed#[520991A99683960]) [    x:collection4] o.a.s.c.CoreContainer Creating SolrCore 'collection4' using configuration from instancedir /export/home/jenkins/workspace/Lucene-Solr-6.x-Solaris/solr/build/solr-core/test/J1/temp/solr.core.TestLazyCores_520991A99683960-001/tempDir-001/collection4
   [junit4]   2> 1508842 INFO  (TEST-TestLazyCores.testLazySearch-seed#[520991A99683960]) [    x:collection4] o.a.s.c.SolrCore [[collection4] ] Opening new SolrCore at [/export/home/jenkins/workspace/Lucene-Solr-6.x-Solaris/solr/build/solr-core/test/J1/temp/solr.core.TestLazyCores_520991A99683960-001/tempDir-001/collection4], dataDir=[/export/home/jenkins/workspace/Lucene-Solr-6.x-Solaris/solr/build/solr-core/test/J1/temp/solr.core.TestLazyCores_520991A99683960-001/tempDir-001/collection4/data/]
   [junit4]   2> 1508843 INFO  (TEST-TestLazyCores.testLazySearch-seed#[520991A99683960]) [    x:collection4] o.a.s.u.RandomMergePolicy RandomMergePolicy wrapping class org.apache.lucene.index.TieredMergePolicy: [TieredMergePolicy: maxMergeAtOnce=34, maxMergeAtOnceExplicit=17, maxMergedSegmentMB=53.8115234375, floorSegmentMB=1.8408203125, forceMergeDeletesPctAllowed=2.164381828279139, segmentsPerTier=11.0, maxCFSSegmentSizeMB=8.796093022207999E12, noCFSRatio=0.0
   [junit4]   2> 1508850 INFO  (TEST-TestLazyCores.testLazySearch-seed#[520991A99683960]) [    x:collection4] o.a.s.u.CommitTracker Hard AutoCommit: disabled
   [junit4]   2> 1508850 INFO  (TEST-TestLazyCores.testLazySearch-seed#[520991A99683960]) [    x:collection4] o.a.s.u.CommitTracker Soft AutoCommit: disabled
   [junit4]   2> 1508850 INFO  (TEST-TestLazyCores.testLazySearch-seed#[520991A99683960]) [    x:collection4] o.a.s.u.RandomMergePolicy RandomMergePolicy wrapping class org.apache.lucene.index.TieredMergePolicy: [TieredMergePolicy: maxMergeAtOnce=22, maxMergeAtOnceExplicit=23, maxMergedSegmentMB=54.3701171875, floorSegmentMB=2.0126953125, forceMergeDeletesPctAllowed=0.3762357144658579, segmentsPerTier=32.0, maxCFSSegmentSizeMB=8.796093022207999E12, noCFSRatio=0.0
   [junit4]   2> 1508850 INFO  (TEST-TestLazyCores.testLazySearch-seed#[520991A99683960]) [    x:collection4] o.a.s.s.SolrIndexSearcher Opening [Searcher@2148ebdd[collection4] main]
   [junit4]   2> 1508850 INFO  (TEST-TestLazyCores.testLazySearch-seed#[520991A99683960]) [    x:collection4] o.a.s.r.ManagedResourceStorage File-based storage initialized to use dir: /export/home/jenkins/workspace/Lucene-Solr-6.x-Solaris/solr/build/solr-core/test/J1/temp/solr.core.TestLazyCores_520991A99683960-001/tempDir-001/collection4/conf
   [junit4]   2> 1508850 INFO  (TEST-TestLazyCores.testLazySearch-seed#[520991A99683960]) [    x:collection4] o.a.s.h.ReplicationHandler Commits will be reserved for  10000
   [junit4]   2> 1508851 INFO  (searcherExecutor-8962-thread-1-processing-x:collection4) [    x:collection4] o.a.s.c.SolrCore [collection4] Registered new searcher Searcher@2148ebdd[collection4] main{ExitableDirectoryReader(UninvertingDirectoryReader())}
   [junit4]   2> 1508851 INFO  (TEST-TestLazyCores.testLazySearch-seed#[520991A99683960]) [    x:collection4] o.a.s.u.DirectUpdateHandler2 start commit{,optimize=false,openSearcher=true,waitSearcher=true,expungeDeletes=false,softCommit=false,prepareCommit=false}
   [junit4]   2> 1508851 INFO  (TEST-TestLazyCores.testLazySearch-seed#[520991A99683960]) [    x:collection4] o.a.s.u.SolrIndexWriter Calling setCommitData with IW:org.apache.solr.update.SolrIndexWriter@47ff90a3
   [junit4]   2> 1508852 INFO  (TEST-TestLazyCores.testLazySearch-seed#[520991A99683960]) [    x:collection4] o.a.s.s.SolrIndexSearcher Opening [Searcher@6a4d9088[collection4] main]
   [junit4]   2> 1508853 INFO  (TEST-TestLazyCores.testLazySearch-seed#[520991A99683960]) [    x:collection4] o.a.s.u.DirectUpdateHandler2 end_commit_flush
   [junit4]   2> 1508853 INFO  (searcherExecutor-8962-thread-1-processing-x:collection4) [    x:collection4] o.a.s.c.SolrCore [collection4] Registered new searcher Searcher@6a4d9088[collection4] main{ExitableDirectoryReader(UninvertingDirectoryReader(Uninverting(_0(6.4.0):C7)))}
   [junit4]   2> 1508853 INFO  (TEST-TestLazyCores.testLazySearch-seed#[520991A99683960]) [    x:collection4] o.a.s.c.S.Request [collection4]  webapp=null path=null params={q={!prefix+f%3Dv_t}hel&wt=xml} hits=2 status=0 QTime=0
   [junit4]   2> 1508855 INFO  (TEST-TestLazyCores.testLazySearch-seed#[520991A99683960]) [    x:collection4] o.a.s.c.S.Request [collection4]  webapp=null path=null params={q={!raw+f%3Dv_t}hello&wt=xml} hits=2 status=0 QTime=0
   [junit4]   2> 1508855 INFO  (TEST-TestLazyCores.testLazySearch-seed#[520991A99683960]) [    x:collection4] o.a.s.c.S.Request [collection4]  webapp=null path=null params={q={!raw+f%3Dv_t}Hello&wt=xml} hits=0 status=0 QTime=0
   [junit4]   2> 1508855 INFO  (TEST-TestLazyCores.testLazySearch-seed#[520991A99683960]) [    x:collection4] o.a.s.c.S.Request [collection4]  webapp=null path=null params={q={!raw+f%3Dv_f}1.5&wt=xml} hits=0 status=0 QTime=0
   [junit4]   2> 1508856 INFO  (TEST-TestLazyCores.testLazySearch-seed#[520991A99683960]) [    x:collection4] o.a.s.c.S.Request [collection1]  webapp=null path=null params={q={!raw+f%3Dv_t}hello&wt=xml} hits=0 status=0 QTime=0
   [junit4]   2> 1508856 INFO  (TEST-TestLazyCores.testLazySearch-seed#[520991A99683960]) [    x:collection4] o.a.s.c.CoreContainer Shutting down CoreContainer instance=349540913
   [junit4]   2> 1508856 INFO  (coreCloseExecutor-8966-thread-1-processing-x:collection4) [    x:collection1] o.a.s.c.SolrCore [collection1]  CLOSING SolrCore org.apache.solr.core.SolrCore@34f6f628
   [junit4]   2> 1508857 INFO  (coreCloseExecutor-8966-thread-2-processing-x:collection4) [    x:collection5] o.a.s.c.SolrCore [collection5]  CLOSING SolrCore org.apache.solr.core.SolrCore@75950045
   [junit4]   2> 1508857 INFO  (coreCloseExecutor-8966-thread-3-processing-x:collection4) [    x:collection4] o.a.s.c.SolrCore [collection4]  CLOSING SolrCore org.apache.solr.core.SolrCore@15f2c6d7
   [junit4]   2> 1508858 INFO  (coreCloseExecutor-8966-thread-4-processing-x:collection4) [    x:collection2] o.a.s.c.SolrCore [collection2]  CLOSING SolrCore org.apache.solr.core.SolrCore@48204fbd
   [junit4]   2> 1508859 INFO  (TEST-TestLazyCores.testLazySearch-seed#[520991A99683960]) [    x:collection4] o.a.s.SolrTestCaseJ4 ###Ending testLazySearch
   [junit4]   2> 1508860 INFO  (TEST-TestLazyCores.testCreateSame-seed#[520991A99683960]) [    x:collection4] o.a.s.SolrTestCaseJ4 ###Starting testCreateSame
   [junit4]   2> 1508879 INFO  (TEST-TestLazyCores.testCreateSame-seed#[520991A99683960]) [    x:collection4] o.a.s.u.UpdateShardHandler Creating UpdateShardHandler HTTP client with params: socketTimeout=600000&connTimeout=60000&retry=true
   [junit4]   2> 1508879 INFO  (TEST-TestLazyCores.testCreateSame-seed#[520991A99683960]) [    x:collection4] o.a.s.c.SolrCores Allocating transient cache for 4 transient cores
   [junit4]   2> 1508896 INFO  (coreLoadExecutor-8973-thread-1-processing-x:collection4) [    x:collection1] o.a.s.c.SolrConfig Using Lucene MatchVersion: 6.4.0
   [junit4]   2> 1508896 INFO  (coreLoadExecutor-8973-thread-3-processing-x:collection4) [    x:collection5] o.a.s.c.SolrConfig Using Lucene MatchVersion: 6.4.0
   [junit4]   2> 1508896 INFO  (coreLoadExecutor-8973-thread-2-processing-x:collection4) [    x:collection2] o.a.s.c.SolrConfig Using Lucene MatchVersion: 6.4.0
   [junit4]   2> 1508902 INFO  (coreLoadExecutor-8973-thread-2-processing-x:collection4) [    x:collection2] o.a.s.s.IndexSchema [collection2] Schema name=tiny
   [junit4]   2> 1508902 INFO  (coreLoadExecutor-8973-thread-1-processing-x:collection4) [    x:collection1] o.a.s.s.IndexSchema [collection1] Schema name=tiny
   [junit4]   2> 1508902 INFO  (coreLoadExecutor-8973-thread-3-processing-x:collection4) [    x:collection5] o.a.s.s.IndexSchema [collection5] Schema name=tiny
   [junit4]   2> 1508905 INFO  (coreLoadExecutor-8973-thread-2-processing-x:collection4) [    x:collection2] o.a.s.s.IndexSchema Loaded schema tiny/1.1 with uniqueid field id
   [junit4]   2> 1508905 INFO  (coreLoadExecutor-8973-thread-3-processing-x:collection4) [    x:collection5] o.a.s.s.IndexSchema Loaded schema tiny/1.1 with uniqueid field id
   [junit4]   2> 1508905 INFO  (coreLoadExecutor-8973-thread-1-processing-x:collection4) [    x:collection1] o.a.s.s.IndexSchema Loaded schema tiny/1.1 with uniqueid field id
   [junit4]   2> 1508907 INFO  (coreLoadExecutor-8973-thread-2-processing-x:collection4) [    x:collection2] o.a.s.c.CoreContainer Creating SolrCore 'collection2' using configuration from instancedir /export/home/jenkins/workspace/Lucene-Solr-6.x-Solaris/solr/build/solr-core/test/J1/temp/solr.core.TestLazyCores_520991A99683960-001/tempDir-002/collection2
   [junit4]   2> 1508907 INFO  (coreLoadExecutor-8973-thread-3-processing-x:collection4) [    x:collection5] o.a.s.c.CoreContainer Creating SolrCore 'collection5' using configuration from instancedir /export/home/jenkins/workspace/Lucene-Solr-6.x-Solaris/solr/build/solr-core/test/J1/temp/solr.core.TestLazyCores_520991A99683960-001/tempDir-002/collection5
   [junit4]   2> 1508907 INFO  (coreLoadExecutor-8973-thread-1-processing-x:collection4) [    x:collection1] o.a.s.c.CoreContainer Creating SolrCore 'collection1' using configuration from instancedir /export/home/jenkins/workspace/Lucene-Solr-6.x-Solaris/solr/build/solr-core/test/J1/temp/solr.core.TestLazyCores_520991A99683960-001/tempDir-002/collection1
   [junit4]   2> 1508907 INFO  (coreLoadExecutor-8973-thread-2-processing-x:collection4) [    x:collection2] o.a.s.c.SolrCore [[collection2] ] Opening new SolrCore at [/export/home/jenkins/workspace/Lucene-Solr-6.x-Solaris/solr/build/solr-core/test/J1/temp/solr.core.TestLazyCores_520991A99683960-001/tempDir-002/collection2], dataDir=[/export/home/jenkins/workspace/Lucene-Solr-6.x-Solaris/solr/build/solr-core/test/J1/temp/solr.core.TestLazyCores_520991A99683960-001/tempDir-002/collection2/data/]
   [junit4]   2> 1508907 INFO  (coreLoadExecutor-8973-thread-3-processing-x:collection4) [    x:collection5] o.a.s.c.SolrCore [[collection5] ] Opening new SolrCore at [/export/home/jenkins/workspace/Lucene-Solr-6.x-Solaris/solr/build/solr-core/test/J1/temp/solr.core.TestLazyCores_520991A99683960-001/tempDir-002/collection5], dataDir=[/export/home/jenkins/workspace/Lucene-Solr-6.x-Solaris/solr/build/solr-core/test/J1/temp/solr.core.TestLazyCores_520991A99683960-001/tempDir-002/collection5/data/]
   [junit4]   2> 1508907 INFO  (coreLoadExecutor-8973-thread-1-processing-x:collection4) [    x:collection1] o.a.s.c.SolrCore [[collection1] ] Opening new SolrCore at [/export/home/jenkins/workspace/Lucene-Solr-6.x-Solaris/solr/build/solr-core/test/J1/temp/solr.core.TestLazyCores_520991A99683960-001/tempDir-002/collection1], dataDir=[/export/home/jenkins/workspace/Lucene-Solr-6.x-Solaris/solr/build/solr-core/test/J1/temp/solr.core.TestLazyCores_520991A99683960-001/tempDir-002/collection1/data/]
   [junit4]   2> 1508908 INFO  (coreLoadExecutor-8973-thread-2-processing-x:collection4) [    x:collection2] o.a.s.u.RandomMergePolicy RandomMergePolicy wrapping class org.apache.lucene.index.TieredMergePolicy: [TieredMergePolicy: maxMergeAtOnce=38, maxMergeAtOnceExplicit=31, maxMergedSegmentMB=88.0234375, floorSegmentMB=1.5947265625, forceMergeDeletesPctAllowed=0.9103532200750553, segmentsPerTier=48.0, maxCFSSegmentSizeMB=8.796093022207999E12, noCFSRatio=0.1732849212417416
   [junit4]   2> 1508908 INFO  (coreLoadExecutor-8973-thread-1-processing-x:collection4) [    x:collection1] o.a.s.u.RandomMergePolicy RandomMergePolicy wrapping class org.apache.lucene.index.TieredMergePolicy: [TieredMergePolicy: maxMergeAtOnce=38, maxMergeAtOnceExplicit=31, maxMergedSegmentMB=88.0234375, floorSegmentMB=1.5947265625, forceMergeDeletesPctAllowed=0.9103532200750553, segmentsPerTier=48.0, maxCFSSegmentSizeMB=8.796093022207999E12, noCFSRatio=0.1732849212417416
   [junit4]   2> 1508909 INFO  (coreLoadExecutor-8973-thread-3-processing-x:collection4) [    x:collection5] o.a.s.u.RandomMergePolicy RandomMergePolicy wrapping class org.apache.lucene.index.TieredMergePolicy: [TieredMergePolicy: maxMergeAtOnce=38, maxMergeAtOnceExplicit=31, maxMergedSegmentMB=88.0234375, floorSegmentMB=1.5947265625, forceMergeDeletesPctAllowed=0.9103532200750553, segmentsPerTier=48.0, maxCFSSegmentSizeMB=8.796093022207999E12, noCFSRatio=0.1732849212417416
   [junit4]   2> 1508917 INFO  (coreLoadExecutor-8973-thread-3-processing-x:collection4) [    x:collection5] o.a.s.u.CommitTracker Hard AutoCommit: disabled
   [junit4]   2> 1508917 INFO  (coreLoadExecutor-8973-thread-3-processing-x:collection4) [    x:collection5] o.a.s.u.CommitTracker Soft AutoCommit: disabled
   [junit4]   2> 1508917 INFO  (coreLoadExecutor-8973-thread-3-processing-x:collection4) [    x:collection5] o.a.s.u.RandomMergePolicy RandomMergePolicy wrapping class org.apache.lucene.index.LogByteSizeMergePolicy: [LogByteSizeMergePolicy: minMergeSize=1677721, mergeFactor=31, maxMergeSize=2147483648, maxMergeSizeForForcedMerge=9223372036854775807, calibrateSizeByDeletes=false, maxMergeDocs=2147483647, maxCFSSegmentSizeMB=8.796093022207999E12, noCFSRatio=0.5213739801295223]
   [junit4]   2> 1508917 INFO  (coreLoadExecutor-8973-thread-3-processing-x:collection4) [    x:collection5] o.a.s.s.SolrIndexSearcher Opening [Searcher@5d4bcd4f[collection5] main]
   [junit4]   2> 1508917 INFO  (coreLoadExecutor-8973-thread-3-processing-x:collection4) [    x:collection5] o.a.s.r.ManagedResourceStorage File-based storage initialized to use dir: /export/home/jenkins/workspace/Lucene-Solr-6.x-Solaris/solr/build/solr-core/test/J1/temp/solr.core.TestLazyCores_520991A99683960-001/tempDir-002/collection5/conf
   [junit4]   2> 1508917 INFO  (coreLoadExecutor-8973-thread-3-processing-x:collection4) [    x:collection5] o.a.s.h.ReplicationHandler Commits will be reserved for  10000
   [junit4]   2> 1508918 INFO  (searcherExecutor-8975-thread-1-processing-x:collection5) [    x:collection5] o.a.s.c.SolrCore [collection5] Registered new searcher Searcher@5d4bcd4f[collection5] main{ExitableDirectoryReader(UninvertingDirectoryReader())}
   [junit4]   2> 1508924 INFO  (coreLoadExecutor-8973-thread-1-processing-x:collection4) [    x:collection1] o.a.s.u.CommitTracker Hard AutoCommit: disabled
   [junit4]   2> 1508924 INFO  (coreLoadExecutor-8973-thread-2-processing-x:collection4) [    x:collection2] o.a.s.u.CommitTracker Hard AutoCommit: disabled
   [junit4]   2> 1508925 INFO  (coreLoadExecutor-8973-thread-2-processing-x:collection4) [    x:collection2] o.a.s.u.CommitTracker Soft AutoCommit: disabled
   [junit4]   2> 1508924 INFO  (coreLoadExecutor-8973-thread-1-processing-x:collection4) [    x:collection1] o.a.s.u.CommitTracker Soft AutoCommit: disabled
   [junit4]   2> 1508925 INFO  (coreLoadExecutor-8973-thread-2-processing-x:collection4) [    x:collection2] o.a.s.u.RandomMergePolicy RandomMergePolicy wrapping class org.apache.lucene.index.LogByteSizeMergePolicy: [LogByteSizeMergePolicy: minMergeSize=1677721, mergeFactor=31, maxMergeSize=2147483648, maxMergeSizeForForcedMerge=9223372036854775807, calibrateSizeByDeletes=false, maxMergeDocs=2147483647, maxCFSSegmentSizeMB=8.796093022207999E12, noCFSRatio=0.5213739801295223]
   [junit4]   2> 1508925 INFO  (coreLoadExecutor-8973-thread-1-processing-x:collection4) [    x:collection1] o.a.s.u.RandomMergePolicy RandomMergePolicy wrapping class org.apache.lucene.index.LogByteSizeMergePolicy: [LogByteSizeMergePolicy: minMergeSize=1677721, mergeFactor=31, maxMergeSize=2147483648, maxMergeSizeForForcedMerge=9223372036854775807, calibrateSizeByDeletes=false, maxMergeDocs=2147483647, maxCFSSegmentSizeMB=8.796093022207999E12, noCFSRatio=0.5213739801295223]
   [junit4]   2> 1508925 INFO  (coreLoadExecutor-8973-thread-2-processing-x:collection4) [    x:collection2] o.a.s.s.SolrIndexSearcher Opening [Searcher@56d6380[collection2] main]
   [junit4]   2> 1508925 INFO  (coreLoadExecutor-8973-thread-1-processing-x:collection4) [    x:collection1] o.a.s.s.SolrIndexSearcher Opening [Searcher@3ac25556[collection1] main]
   [junit4]   2> 1508925 INFO  (coreLoadExecutor-8973-thread-2-processing-x:collection4) [    x:collection2] o.a.s.r.ManagedResourceStorage File-based storage initialized to use dir: /export/home/jenkins/workspace/Lucene-Solr-6.x-Solaris/solr/build/solr-core/test/J1/temp/solr.core.TestLazyCores_520991A99683960-001/tempDir-002/collection2/conf
   [junit4]   2> 1508925 INFO  (coreLoadExecutor-8973-thread-1-processing-x:collection4) [    x:collection1] o.a.s.r.ManagedResourceStorage File-based storage initialized to use dir: /export/home/jenkins/workspace/Lucene-Solr-6.x-Solaris/solr/build/solr-core/test/J1/temp/solr.core.TestLazyCores_520991A99683960-001/tempDir-002/collection1/conf
   [junit4]   2> 1508925 INFO  (coreLoadExecutor-8973-thread-2-processing-x:collection4) [    x:collection2] o.a.s.h.ReplicationHandler Commits will be reserved for  10000
   [junit4]   2> 1508925 INFO  (coreLoadExecutor-8973-thread-1-processing-x:collection4) [    x:collection1] o.a.s.h.ReplicationHandler Commits will be reserved for  10000
   [junit4]   2> 1508925 INFO  (coreLoadExecutor-8973-thread-2-processing-x:collection4) [    x:collection2] o.a.s.c.SolrCores Opening transient core collection2
   [junit4]   2> 1508925 INFO  (searcherExecutor-8976-thread-1-processing-x:collection1) [    x:collection1] o.a.s.c.SolrCore [collection1] Registered new searcher Searcher@3ac25556[collection1] main{ExitableDirectoryReader(UninvertingDirectoryReader())}
   [junit4]   2> 1508926 INFO  (searcherExecutor-8974-thread-1-processing-x:collection2) [    x:collection2] o.a.s.c.SolrCore [collection2] Registered new searcher Searcher@56d6380[collection2] main{ExitableDirectoryReader(UninvertingDirectoryReader())}
   [junit4]   2> 1508936 INFO  (TEST-TestLazyCores.testCreateSame-seed#[520991A99683960]) [    x:collection4] o.a.s.c.SolrConfig Using Lucene MatchVersion: 6.4.0
   [junit4]   2> 1508941 INFO  (TEST-TestLazyCores.testCreateSame-seed#[520991A99683960]) [    x:collection4] o.a.s.s.IndexSchema [collection4] Schema name=tiny
   [junit4]   2> 1508943 INFO  (TEST-TestLazyCores.testCreateSame-seed#[520991A99683960]) [    x:collection4] o.a.s.s.IndexSchema Loaded schema tiny/1.1 with uniqueid field id
   [junit4]   2> 1508944 INFO  (TEST-TestLazyCores.testCreateSame-seed#[520991A99683960]) [    x:collection4] o.a.s.c.CoreContainer Creating SolrCore 'collection4' using configuration from instancedir /export/home/jenkins/workspace/Lucene-Solr-6.x-Solaris/solr/build/solr-core/test/J1/temp/solr.core.TestLazyCores_520991A99683960-001/tempDir-002/collection4
   [junit4]   2> 1508945 INFO  (TEST-TestLazyCores.testCreateSame-seed#[520991A99683960]) [    x:collection4] o.a.s.c.SolrCore [[collection4] ] Opening new SolrCore at [/export/home/jenkins/workspace/Lucene-Solr-6.x-Solaris/solr/build/solr-core/test/J1/temp/solr.core.TestLazyCores_520991A99683960-001/tempDir-002/collection4], dataDir=[/export/home/jenkins/workspace/Lucene-Solr-6.x-Solaris/solr/build/solr-core/test/J1/temp/solr.core.TestLazyCores_520991A99683960-001/tempDir-002/collection4/data/]
   [junit4]   2> 1508946 INFO  (TEST-TestLazyCores.testCreateSame-seed#[520991A99683960]) [    x:collection4] o.a.s.u.RandomMergePolicy RandomMergePolicy wrapping class org.apache.lucene.index.LogDocMergePolicy: [LogDocMergePolicy: minMergeSize=1000, mergeFactor=33, maxMergeSize=9223372036854775807, maxMergeSizeForForcedMerge=9223372036854775807, calibrateSizeByDeletes=false, maxMergeDocs=2147483647, maxCFSSegmentSizeMB=8.796093022207999E12, noCFSRatio=0.3226232710072548]
   [junit4]   2> 1508952 INFO  (TEST-TestLazyCores.testCreateSame-seed#[520991A99683960]) [    x:collection4] o.a.s.u.CommitTracker Hard AutoCommit: disabled
   [junit4]   2> 1508952 INFO  (TEST-TestLazyCores.testCreateSame-seed#[520991A99683960]) [    x:collection4] o.a.s.u.CommitTracker Soft AutoCommit: disabled
   [junit4]   2> 1508952 INFO  (TEST-TestLazyCores.testCreateSame-seed#[520991A99683960]) [    x:collection4] o.a.s.u.RandomMergePolicy RandomMergePolicy wrapping class org.apache.lucene.index.LogByteSizeMergePolicy: [LogByteSizeMergePolicy: minMergeSize=1677721, mergeFactor=31, maxMergeSize=2147483648, maxMergeSizeForForcedMerge=9223372036854775807, calibrateSizeByDeletes=false, maxMergeDocs=2147483647, maxCFSSegmentSizeMB=8.796093022207999E12, noCFSRatio=1.0]
   [junit4]   2> 1508953 INFO  (TEST-TestLazyCores.testCreateSame-seed#[520991A99683960]) [    x:collection4] o.a.s.s.SolrIndexSearcher Opening [Searcher@2efcbd15[collection4] main]
   [junit4]   2> 1508953 INFO  (TEST-TestLazyCores.testCreateSame-seed#[520991A99683960]) [    x:collection4] o.a.s.r.ManagedResourceStorage File-based storage initialized to use dir: /export/home/jenkins/workspace/Lucene-Solr-6.x-Solaris/solr/build/solr-core/test/J1/temp/solr.core.TestLazyCores_520991A99683960-001/tempDir-002/collection4/conf
   [junit4]   2> 1508953 INFO  (TEST-TestLazyCores.testCreateSame-seed#[520991A99683960]) [    x:collection4] o.a.s.h.ReplicationHandler Commits will be reserved for  10000
   [junit4]   2> 1508953 INFO  (searcherExecutor-8987-thread-1-processing-x:collection4) [    x:collection4] o.a.s.c.SolrCore [collection4] Registered new searcher Searcher@2efcbd15[collection4] main{ExitableDirectoryReader(UninvertingDirectoryReader())}
   [junit4]   2> 1508959 INFO  (TEST-TestLazyCores.testCreateSame-seed#[520991A99683960]) [    x:collection4] o.a.s.c.SolrConfig Using Lucene MatchVersion: 6.4.0
   [junit4]   2> 1508965 INFO  (TEST-TestLazyCores.testCreateSame-seed#[520991A99683960]) [    x:collection4] o.a.s.s.IndexSchema [collection6] Schema name=tiny
   [junit4]   2> 1508967 INFO  (TEST-TestLazyCores.testCreateSame-seed#[520991A99683960]) [    x:collection4] o.a.s.s.IndexSchema Loaded schema tiny/1.1 with uniqueid field id
   [junit4]   2> 1508968 INFO  (TEST-TestLazyCores.testCreateSame-seed#[520991A99683960]) [    x:collection4] o.a.s.c.CoreContainer Creating SolrCore 'collection6' using configuration from instancedir /export/home/jenkins/workspace/Lucene-Solr-6.x-Solaris/solr/build/solr-core/test/J1/temp/solr.core.TestLazyCores_520991A99683960-001/tempDir-002/collection6
   [junit4]   2> 1508968 INFO  (TEST-TestLazyCores.testCreateSame-seed#[520991A99683960]) [    x:collection4] o.a.s.c.SolrCore [[collection6] ] Opening new SolrCore at [/export/home/jenkins/workspace/Lucene-Solr-6.x-Solaris/solr/build/solr-core/test/J1/temp/solr.core.TestLazyCores_520991A99683960-001/tempDir-002/collection6], dataDir=[/export/home/jenkins/workspace/Lucene-Solr-6.x-Solaris/solr/build/solr-core/test/J1/temp/solr.core.TestLazyCores_520991A99683960-001/tempDir-002/collection6/data/]
   [junit4]   2> 1508969 INFO  (TEST-TestLazyCores.testCreateSame-seed#[520991A99683960]) [    x:collection4] o.a.s.u.RandomMergePolicy RandomMergePolicy wrapping class org.apache.lucene.index.LogDocMergePolicy: [LogDocMergePolicy: minMergeSize=1000, mergeFactor=31, maxMergeSize=9223372036854775807, maxMergeSizeForForcedMerge=9223372036854775807, calibrateSizeByDeletes=false, maxMergeDocs=2147483647, maxCFSSegmentSizeMB=8.796093022207999E12, noCFSRatio=0.5865174074779143]
   [junit4]   2> 1508980 INFO  (TEST-TestLazyCores.testCreateSame-seed#[520991A99683960]) [    x:collection4] o.a.s.u.CommitTracker Hard AutoCommit: disabled
   [junit4]   2> 1508980 INFO  (TEST-TestLazyCores.testCreateSame-seed#[520991A99683960]) [    x:collection4] o.a.s.u.CommitTracker Soft AutoCommit: disabled
   [junit4]   2> 1508980 INFO  (TEST-TestLazyCores.testCreateSame-seed#[520991A99683960]) [    x:collection4] o.a.s.u.RandomMergePolicy RandomMergePolicy wrapping class org.apache.lucene.index.LogDocMergePolicy: [LogDocMergePolicy: minMergeSize=1000, mergeFactor=13, maxMergeSize=9223372036854775807, maxMergeSizeForForcedMerge=9223372036854775807, calibrateSizeByDeletes=false, maxMergeDocs=2147483647, maxCFSSegmentSizeMB=8.796093022207999E12, noCFSRatio=0.0]
   [junit4]   2> 1508980 INFO  (TEST-TestLazyCores.testCreateSame-seed#[520991A99683960]) [    x:collection4] o.a.s.s.SolrIndexSearcher Opening [Searcher@73d55e5b[collection6] main]
   [junit4]   2> 1508981 INFO  (TEST-TestLazyCores.testCreateSame-seed#[520991A99683960]) [    x:collection4] o.a.s.r.ManagedResourceStorage File-based storage initialized to use dir: /export/home/jenkins/workspace/Lucene-Solr-6.x-Solaris/solr/build/solr-core/test/J1/temp/solr.core.TestLazyCores_520991A99683960-001/tempDir-002/collection6/conf
   [junit4]   2> 1508981 INFO  (TEST-TestLazyCores.testCreateSame-seed#[520991A99683960]) [    x:collection4] o.a.s.h.ReplicationHandler Commits will be reserved for  10000
   [junit4]   2> 1508981 INFO  (searcherExecutor-8991-thread-1-processing-x:collection4) [    x:collection4] o.a.s.c.SolrCore [collection6] Registered new searcher Searcher@73d55e5b[collection6] main{ExitableDirectoryReader(UninvertingDirectoryReader())}
   [junit4]   2> 1508982 INFO  (TEST-TestLazyCores.testCreateSame-seed#[520991A99683960]) [    x:collection4] o.a.s.c.SolrCores Opening transient core collection6
   [junit4]   2> 1508995 INFO  (TEST-TestLazyCores.testCreateSame-seed#[520991A99683960]) [    x:collection4] o.a.s.h.a.CoreAdminOperation core create command schema=schema.xml&dataDir=t12&name=collection2&action=CREATE&config=solrconfig.xml&wt=xml
   [junit4]   2> 1508995 WARN  (TEST-TestLazyCores.testCreateSame-seed#[520991A99683960]) [    x:collection4] o.a.s.c.CoreContainer Creating a core with existing name is not allowed
   [junit4]   2> 1508995 INFO  (TEST-TestLazyCores.testCreateSame-seed#[520991A99683960]) [    x:collection4] o.a.s.h.a.CoreAdminOperation core create command schema=schema.xml&dataDir=t14&name=collection4&action=CREATE&config=solrconfig.xml&wt=xml
   [junit4]   2> 1508996 WARN  (TEST-TestLazyCores.testCreateSame-seed#[520991A99683960]) [    x:collection4] o.a.s.c.CoreContainer Creating a core with existing name is not allowed
   [junit4]   2> 1508996 INFO  (TEST-TestLazyCores.testCreateSame-seed#[520991A99683960]) [    x:collection4] o.a.s.h.a.CoreAdminOperation core create command schema=schema.xml&dataDir=t15&name=collection5&action=CREATE&config=solrconfig.xml&wt=xml
   [junit4]   2> 1508996 WARN  (TEST-TestLazyCores.testCreateSame-seed#[520991A99683960]) [    x:collection4] o.a.s.c.CoreContainer Creating a core with existing name is not allowed
   [junit4]   2> 1508996 INFO  (TEST-TestLazyCores.testCreateSame-seed#[520991A99683960]) [    x:collection4] o.a.s.h.a.CoreAdminOperation core create command schema=schema.xml&dataDir=t16&name=collection6&action=CREATE&config=solrconfig.xml&wt=xml
   [junit4]   2> 1508996 WARN  (TEST-TestLazyCores.testCreateSame-seed#[520991A99683960]) [    x:collection4] o.a.s.c.CoreContainer Creating a core with existing name is not allowed
   [junit4]   2> 1508997 INFO  (TEST-TestLazyCores.testCreateSame-seed#[520991A99683960]) [    x:collection4] o.a.s.c.CoreContainer Shutting down CoreContainer instance=1240344310
   [junit4]   2> 1508997 INFO  (coreCloseExecutor-8995-thread-1-processing-x:collection4) [    x:collection5] o.a.s.c.SolrCore [collection5]  CLOSING SolrCore org.apache.solr.core.SolrCore@393f33b0
   [junit4]   2> 1508997 INFO  (coreCloseExecutor-8995-thread-4-processing-x:collection4) [    x:collection2] o.a.s.c.SolrCore [collection2]  CLOSING SolrCore org.apache.solr.core.SolrCore@3b2b9976
   [junit4]   2> 1508997 INFO  (coreCloseExecutor-8995-thread-2-processing-x:collection4) [    x:collection1] o.a.s.c.SolrCore [collection1]  CLOSING SolrCore org.apache.solr.core.SolrCore@472997a7
   [junit4]   2> 1508998 INFO  (coreCloseExecutor-8995-thread-3-processing-x:collection4) [    x:collection4] o.a.s.c.SolrCore [collection4]  CLOSING SolrCore org.apache.solr.core.SolrCore@69d96cf5
   [junit4]   2> 1508998 INFO  (coreCloseExecutor-8995-thread-5-processing-x:collection4) [    x:collection6] o.a.s.c.SolrCore [collection6]  CLOSING SolrCore org.apache.solr.core.SolrCore@40f3a103
   [junit4]   2> 1509000 INFO  (TEST-TestLazyCores.testCreateSame-seed#[520991A99683960]) [    x:collection4] o.a.s.SolrTestCaseJ4 ###Ending testCreateSame
   [junit4]   2> 1509002 INFO  (TEST-TestLazyCores.testCreateTransientFromAdmin-seed#[520991A99683960]) [    x:collection4] o.a.s.SolrTestCaseJ4 ###Starting testCreateTransientFromAdmin
   [junit4]   2> 1509022 INFO  (TEST-TestLazyCores.testCreateTransientFromAdmin-seed#[520991A99683960]) [    x:collection4] o.a.s.u.UpdateShardHandler Creating UpdateShardHandler HTTP client with params: socketTimeout=600000&connTimeout=60000&retry=true
   [junit4]   2> 1509023 INFO  (TEST-TestLazyCores.testCreateTransientFromAdmin-seed#[520991A99683960]) [    x:collection4] o.a.s.c.SolrCores Allocating transient cache for 4 transient cores
   [junit4]   2> 1509089 INFO  (coreLoadExecutor-9002-thread-2-processing-x:collection4) [    x:collection2] o.a.s.c.SolrConfig Using Lucene MatchVersion: 6.4.0
   [junit4]   2> 1509094 INFO  (coreLoadExecutor-9002-thread-2-processing-x:collection4) [    x:collection2] o.a.s.s.IndexSchema [collection2] Schema name=tiny
   [junit4]   2> 1509095 INFO  (coreLoadExecutor-9002-thread-3-processing-x:collection4) [    x:collection5] o.a.s.c.SolrConfig Using Lucene MatchVersion: 6.4.0
   [junit4]   2> 1509096 INFO  (coreLoadExecutor-9002-thread-2-processing-x:collection4) [    x:collection2] o.a.s.s.IndexSchema Loaded schema tiny/1.1 with uniqueid field id
   [junit4]   2> 1509098 INFO  (coreLoadExecutor-9002-thread-2-processing-x:collection4) [    x:collection2] o.a.s.c.CoreContainer Creating SolrCore 'collection2' using configuration from instancedir /export/home/jenkins/workspace/Lucene-Solr-6.x-Solaris/solr/build/solr-core/test/J1/temp/solr.core.TestLazyCores_520991A99683960-001/tempDir-003/collection2
   [junit4]   2> 1509099 INFO  (coreLoadExecutor-9002-thread-2-processing-x:collection4) [    x:collection2] o.a.s.c.SolrCore [[collection2] ] Opening new SolrCore at [/export/home/jenkins/workspace/Lucene-Solr-6.x-Solaris/solr/build/solr-core/test/J1/temp/solr.core.TestLazyCores_520991A99683960-001/tempDir-003/collection2], dataDir=[/export/home/jenkins/workspace/Lucene-Solr-6.x-Solaris/solr/build/solr-core/test/J1/temp/solr.core.TestLazyCores_520991A99683960-001/tempDir-003/collection2/data/]
   [junit4]   2> 1509099 INFO  (coreLoadExecutor-9002-thread-2-processing-x:collection4) [    x:collection2] o.a.s.u.RandomMergePolicy RandomMergePolicy wrapping class org.apache.lucene.index.TieredMergePolicy: [TieredMergePolicy: maxMergeAtOnce=38, maxMergeAtOnceExplicit=31, maxMergedSegmentMB=88.0234375, floorSegmentMB=1.5947265625, forceMergeDeletesPctAllowed=0.9103532200750553, segmentsPerTier=48.0, maxCFSSegmentSizeMB=8.796093022207999E12, noCFSRatio=0.1732849212417416
   [junit4]   2> 1509101 INFO  (coreLoadExecutor-9002-thread-3-processing-x:collection4) [    x:collection5] o.a.s.s.IndexSchema [collection5] Schema name=tiny
   [junit4]   2> 1509103 INFO  (coreLoadExecutor-9002-thread-3-processing-x:collection4) [    x:collection5] o.a.s.s.IndexSchema Loaded schema tiny/1.1 with uniqueid field id
   [junit4]   2> 1509104 INFO  (coreLoadExecutor-9002-thread-3-processing-x:collection4) [    x:collection5] o.a.s.c.CoreContainer Creating SolrCore 'collection5' using configuration from instancedir /export/home/jenkins/workspace/Lucene-Solr-6.x-Solaris/solr/build/solr-core/test/J1/temp/solr.core.TestLazyCores_520991A99683960-001/tempDir-003/collection5
   [junit4]   2> 1509104 INFO  (coreLoadExecutor-9002-thread-3-processing-x:collection4) [    x:collection5] o.a.s.c.SolrCore [[collection5] ] Opening new SolrCore at [/export/home/jenkins/workspace/Lucene-Solr-6.x-Solaris/solr/build/solr-core/test/J1/temp/solr.core.TestLazyCores_520991A99683960-001/tempDir-003/collection5], dataDir=[/export/home/jenkins/workspace/Lucene-Solr-6.x-Solaris/solr/build/solr-core/test/J1/temp/solr.core.TestLazyCores_520991A99683960-001/tempDir-003/collection5/data/]
   [junit4]   2> 1509105 INFO  (coreLoadExecutor-9002-thread-3-processing-x:collection4) [    x:collection5] o.a.s.u.RandomMergePolicy RandomMergePolicy wrapping class org.apache.lucene.index.TieredMergePolicy: [TieredMergePolicy: maxMergeAtOnce=38, maxMergeAtOnceExplicit=31, maxMergedSegmentMB=88.0234375, floorSegmentMB=1.5947265625, forceMergeDeletesPctAllowed=0.9103532200750553, segmentsPerTier=48.0, maxCFSSegmentSizeMB=8.796093022207999E12, noCFSRatio=0.1732849212417416
   [junit4]   2> 1509108 INFO  (coreLoadExecutor-9002-thread-2-processing-x:collection4) [    x:collection2] o.a.s.u.CommitTracker Hard AutoCommit: disabled
   [junit4]   2> 1509108 INFO  (coreLoadExecutor-9002-thread-2-processing-x:collection4) [    x:collection2] o.a.s.u.CommitTracker Soft AutoCommit: disabled
   [junit4]   2> 1509108 INFO  (coreLoadExecutor-9002-thread-2-processing-x:collection4) [    x:collection2] o.a.s.u.RandomMergePolicy RandomMergePolicy wrapping class org.apache.lucene.index.LogByteSizeMergePolicy: [LogByteSizeMergePolicy: minMergeSize=1677721, mergeFactor=31, maxMergeSize=2147483648, maxMergeSizeForForcedMerge=9223372036854775807, calibrateSizeByDeletes=false, maxMergeDocs=2147483647, maxCFSSegmentSizeMB=8.796093022207999E12, noCFSRatio=0.5213739801295223]
   [junit4]   2> 1509108 INFO  (coreLoadExecutor-9002-thread-2-processing-x:collection4) [    x:collection2] o.a.s.s.SolrIndexSearcher Opening [Searcher@779226b8[collection2] main]
   [junit4]   2> 1509108 INFO  (coreLoadExecutor-9002-thread-2-processing-x:collection4) [    x:collection2] o.a.s.r.ManagedResourceStorage File-based storage initialized to use dir: /export/home/jenkins/workspace/Lucene-Solr-6.x-Solaris/solr/build/solr-core/test/J1/temp/solr.core.TestLazyCores_520991A99683960-001/tempDir-003/collection2/conf
   [junit4]   2> 1509109 INFO  (coreLoadExecutor-9002-thread-2-processing-x:collection4) [    x:collection2] o.a.s.h.ReplicationHandler Commits will be reserved for  10000
   [junit4]   2> 1509109 INFO  (coreLoadExecutor-9002-thread-2-processing-x:collection4) [    x:collection2] o.a.s.c.SolrCores Opening transient core collection2
   [junit4]   2> 1509109 INFO  (searcherExecutor-9003-thread-1-processing-x:collection2) [    x:collection2] o.a.s.c.SolrCore [collection2] Registered new searcher Searcher@779226b8[collection2] main{ExitableDirectoryReader(UninvertingDirectoryReader())}
   [junit4]   2> 1509112 INFO  (coreLoadExecutor-9002-thread-3-processing-x:collection4) [    x:collection5] o.a.s.u.CommitTracker Hard AutoCommit: disabled
   [junit4]   2> 1509112 INFO  (coreLoadExecutor-9002-thread-3-processing-x:collection4) [    x:collection5] o.a.s.u.CommitTracker Soft AutoCommit: disabled
   [junit4]   2> 1509112 INFO  (coreLoadExecutor-9002-thread-3-processing-x:collection4) [    x:collection5] o.a.s.u.RandomMergePolicy RandomMergePolicy wrapping class org.apache.lucene.index.LogByteSizeMergePolicy: [LogByteSizeMergePolicy: minMergeSize=1677721, mergeFactor=31, maxMergeSize=2147483648, maxMergeSizeForForcedMerge=9223372036854775807, calibrateSizeByDeletes=false, maxMergeDocs=2147483647, maxCFSSegmentSizeMB=8.796093022207999E12, noCFSRatio=0.5213739801295223]
   [junit4]   2> 1509113 INFO  (coreLoadExecutor-9002-thread-1-processing-x:collection4) [    x:collection1] o.a.s.c.SolrConfig Using Lucene MatchVersion: 6.4.0
   [junit4]   2> 1509118 INFO  (coreLoadExecutor-9002-thread-1-processing-x:collection4) [    x:collection1] o.a.s.s.IndexSchema [collection1] Schema name=tiny
   [junit4]   2> 1509124 INFO  (coreLoadExecutor-9002-thread-3-processing-x:collection4) [    x:collection5] o.a.s.s.SolrIndexSearcher Opening [Searcher@d781b1f[collection5] main]
   [junit4]   2> 1509125 INFO  (coreLoadExecutor-9002-thread-3-processing-x:collection4) [    x:collection5] o.a.s.r.ManagedResourceStorage File-based storage initialized to use dir: /export/home/jenkins/workspace/Lucene-Solr-6.x-Solaris/solr/build/solr-core/test/J1/temp/solr.core.TestLazyCores_520991A99683960-001/tempDir-003/collection5/conf
   [junit4]   2> 1509129 INFO  (coreLoadExecutor-9002-thread-3-processing-x:collection4) [    x:collection5] o.a.s.h.ReplicationHandler Commits will be reserved for  10000
   [junit4]   2> 1509129 INFO  (searcherExecutor-9004-thread-1-processing-x:collection5) [    x:collection5] o.a.s.c.SolrCore [collection5] Registered new searcher Searcher@d781b1f[collection5] main{ExitableDirectoryReader(UninvertingDirectoryReader())}
   [junit4]   2> 1509184 INFO  (coreLoadExecutor-9002-thread-1-processing-x:collection4) [    x:collection1] o.a.s.s.IndexSchema Loaded schema tiny/1.1 with uniqueid field id
   [junit4]   2> 1509186 INFO  (coreLoadExecutor-9002-thread-1-processing-x:collection4) [    x:collection1] o.a.s.c.CoreContainer Creating SolrCore 'collection1' using configuration from instancedir /export/home/jenkins/workspace/Lucene-Solr-6.x-Solaris/solr/build/solr-core/test/J1/temp/solr.core.TestLazyCores_520991A99683960-001/tempDir-003/collection1
   [junit4]   2> 1509186 INFO  (coreLoadExecutor-9002-thread-1-processing-x:collection4) [    x:collection1] o.a.s.c.SolrCore [[collection1] ] Opening new SolrCore at [/export/home/jenkins/workspace/Lucene-Solr-6.x-Solaris/solr/build/solr-core/test/J1/temp/solr.core.TestLazyCores_520991A99683960-001/tempDir-003/collection1], dataDir=[/export/home/jenkins/workspace/Lucene-Solr-6.x-Solaris/solr/build/solr-core/test/J1/temp/solr.core.TestLazyCores_520991A99683960-001/tempDir-003/collection1/data/]
   [junit4]   2> 1509187 INFO  (coreLoadExecutor-9002-thread-1-processing-x:collection4) [    x:collection1] o.a.s.u.RandomMergePolicy RandomMergePolicy wrapping class org.apache.lucene.index.TieredMergePolicy: [TieredMergePolicy: maxMergeAtOnce=38, maxMergeAtOnceExplicit=31, maxMergedSegmentMB=88.0234375, floorSegmentMB=1.5947265625, forceMergeDeletesPctAllowed=0.9103532200750553, segmentsPerTier=48.0, maxCFSSegmentSizeMB=8.796093022207999E12, noCFSRatio=0.1732849212417416
   [junit4]   2> 1509198 INFO  (coreLoadExecutor-9002-thread-1-processing-x:collection4) [    x:collection1] o.a.s.u.CommitTracker Hard AutoCommit: disabled
   [junit4]   2> 1509198 INFO  (coreLoadExecutor-9002-thread-1-processing-x:collection4) [    x:collection1] o.a.s.u.CommitTracker Soft AutoCommit: disabled
   [junit4]   2> 1509198 INFO  (coreLoadExecutor-9002-thread-1-processing-x:collection4) [    x:collection1] o.a.s.u.RandomMergePolicy RandomMergePolicy wrapping class org.apache.lucene.index.LogByteSizeMergePolicy: [LogByteSizeMergePolicy: minMergeSize=1677721, mergeFactor=31, maxMergeSize=2147483648, maxMergeSizeForForcedMerge=9223372036854775807, calibrateSizeByDeletes=false, maxMergeDocs=2147483647, maxCFSSegmentSizeMB=8.796093022207999E12, noCFSRatio=0.5213739801295223]
   [junit4]   2> 1509199 INFO  (coreLoadExecutor-9002-thread-1-processing-x:collection4) [    x:collection1] o.a.s.s.SolrIndexSearcher Opening [Searcher@3ae7bc25[collection1] main]
   [junit4]   2> 1509199 INFO  (coreLoadExecutor-9002-thread-1-processing-x:collection4) [    x:collection1] o.a.s.r.ManagedResourceStorage File-based storage initialized to use dir: /export/home/jenkins/workspace/Lucene-Solr-6.x-Solaris/solr/build/solr-core/test/J1/temp/solr.core.TestLazyCores_520991A99683960-001/tempDir-003/collection1/conf
   [junit4]   2> 1509200 INFO  (coreLoadExecutor-9002-thread-1-processing-x:collection4) [    x:collection1] o.a.s.h.ReplicationHandler Commits will be reserved for  10000
   [junit4]   2> 1509200 INFO  (searcherExecutor-9011-thread-1-processing-x:collection1) [    x:collection1] o.a.s.c.SolrCore [collection1] Registered new searcher Searcher@3ae7bc25[collection1] main{ExitableDirectoryReader(UninvertingDirectoryReader())}
   [junit4]   2> 1509211 INFO  (TEST-TestLazyCores.testCreateTransientFromAdmin-seed#[520991A99683960]) [    x:collection4] o.a.s.h.a.CoreAdminOperation core create command loadOnStartup=true&transient=true&name=core1&action=CREATE&wt=xml
   [junit4]   2> 1509223 INFO  (TEST-TestLazyCores.testCreateTransientFromAdmin-seed#[520991A99683960]) [    x:collection4] o.a.s.c.SolrConfig Using Lucene MatchVersion: 6.4.0
   [junit4]   2> 1509229 INFO  (TEST-TestLazyCores.testCreateTransientFromAdmin-seed#[520991A99683960]) [    x:collection4] o.a.s.s.IndexSchema [core1] Schema name=tiny
   [junit4]   2> 1509231 INFO  (TEST-TestLazyCores.testCreateTransientFromAdmin-seed#[520991A99683960]) [    x:collection4] o.a.s.s.IndexSchema Loaded schema tiny/1.1 with uniqueid field id
   [junit4]   2> 1509232 INFO  (TEST-TestLazyCores.testCreateTransientFromAdmin-seed#[520991A99683960]) [    x:collection4] o.a.s.c.CoreContainer Creating SolrCore 'core1' using configuration from instancedir /export/home/jenkins/workspace/Lucene-Solr-6.x-Solaris/solr/build/solr-core/test/J1/temp/solr.core.TestLazyCores_520991A99683960-001/tempDir-003/core1
   [junit4]   2> 1509233 INFO  (TEST-TestLazyCores.testCreateTransientFromAdmin-seed#[520991A99683960]) [    x:collection4] o.a.s.c.SolrCore [[core1] ] Opening new SolrCore at [/export/home/jenkins/workspace/Lucene-Solr-6.x-Solaris/solr/build/solr-core/test/J1/temp/solr.core.TestLazyCores_520991A99683960-001/tempDir-003/core1], dataDir=[/export/home/jenkins/workspace/Lucene-Solr-6.x-Solaris/solr/build/solr-core/test/J1/temp/solr.core.TestLazyCores_520991A99683960-001/tempDir-003/core1/data/]
   [junit4]   2> 1509234 INFO  (TEST-TestLazyCores.testCreateTransientFromAdmin-seed#[520991A99683960]) [    x:collection4] o.a.s.u.RandomMergePolicy RandomMergePolicy wrapping class org.apache.lucene.index.TieredMergePolicy: [TieredMergePolicy: maxMergeAtOnce=20, maxMergeAtOnceExplicit=24, maxMergedSegmentMB=29.8125, floorSegmentMB=1.1689453125, forceMergeDeletesPctAllowed=27.13113335889392, segmentsPerTier=21.0, maxCFSSegmentSizeMB=8.796093022207999E12, noCFSRatio=0.0
   [junit4]   2> 1509241 INFO  (TEST-TestLazyCores.testCreateTransientFromAdmin-seed#[520991A99683960]) [    x:collection4] o.a.s.u.CommitTracker Hard AutoCommit: disabled
   [junit4]   2> 1509241 INFO  (TEST-TestLazyCores.testCreateTransientFromAdmin-seed#[520991A99683960]) [    x:collection4] o.a.s.u.CommitTracker Soft AutoCommit: disabled
   [junit4]   2> 1509241 INFO  (TEST-TestLazyCores.testCreateTransientFromAdmin-seed#[520991A99683960]) [    x:collection4] o.a.s.u.RandomMergePolicy RandomMergePolicy wrapping class org.apache.lucene.index.TieredMergePolicy: [TieredMergePolicy: maxMergeAtOnce=47, maxMergeAtOnceExplicit=12, maxMergedSegmentMB=98.85546875, floorSegmentMB=0.60546875, forceMergeDeletesPctAllowed=4.535142330063099, segmentsPerTier=33.0, maxCFSSegmentSizeMB=8.796093022207999E12, noCFSRatio=1.0
   [junit4]   2> 1509241 INFO  (TEST-TestLazyCores.testCreateTransientFromAdmin-seed#[520991A99683960]) [    x:collection4] o.a.s.s.SolrIndexSearcher Opening [Searcher@7c13da3f[core1] main]
   [junit4]   2> 1509241 INFO  (TEST-TestLazyCores.testCreateTransientFromAdmin-seed#[520991A99683960]) [    x:collection4] o.a.s.r.ManagedResourceStorage File-based storage initialized to use dir: /export/home/jenkins/workspace/Lucene-Solr-6.x-Solaris/solr/build/solr-core/test/J1/temp/solr.core.TestLazyCores_520991A99683960-001/tempDir-003/core1/conf
   [junit4]   2> 1509242 INFO  (TEST-TestLazyCores.testCreateTransientFromAdmin-seed#[520991A99683960]) [    x:collection4] o.a.s.h.ReplicationHandler Commits will be reserved for  10000
   [junit4]   2> 1509242 INFO  (searcherExecutor-9016-thread-1-processing-x:collection4) [    x:collection4] o.a.s.c.SolrCore [core1] Registered new searcher Searcher@7c13da3f[core1] main{ExitableDirectoryReader(UninvertingDirectoryReader())}
   [junit4]   2> 1509242 INFO  (TEST-TestLazyCores.testCreateTransientFromAdmin-seed#[520991A99683960]) [    x:collection4] o.a.s.c.SolrCores Opening transient core core1
   [junit4]   2> 1509242 INFO  (TEST-TestLazyCores.testCreateTransientFromAdmin-seed#[520991A99683960]) [    x:collection4] o.a.s.h.a.CoreAdminOperation core create command loadOnStartup=false&transient=true&name=core2&action=CREATE&wt=xml
   [junit4]   2> 1509248 INFO  (TEST-TestLazyCores.testCreateTransientFromAdmin-seed#[520991A99683960]) [    x:collection4] o.a.s.c.SolrConfig Using Lucene MatchVersion: 6.4.0
   [junit4]   2> 1509254 INFO  (TEST-TestLazyCores.testCreateTransientFromAdmin-seed#[520991A99683960]) [    x:collection4] o.a.s.s.IndexSchema [core2] Schema name=tiny
   [junit4]   2> 1509256 INFO  (TEST-TestLazyCores.testCreateTransientFromAdmin-seed#[520991A99683960]) [    x:collection4] o.a.s.s.IndexSchema Loaded schema tiny/1.1 with uniqueid field id
   [junit4]   2> 1509258 INFO  (TEST-TestLazyCores.testCreateTransientFromAdmin-seed#[520991A99683960]) [    x:collection4] o.a.s.c.CoreContainer Creating SolrCore 'core2' using configuration from instancedir /export/home/jenkins/workspace/Lucene-Solr-6.x-Solaris/solr/build/solr-core/test/J1/temp/solr.core.TestLazyCores_520991A99683960-001/tempDir-003/core2
   [junit4]   2> 1509258 INFO  (TEST-TestLazyCores.testCreateTransientFromAdmin-seed#[520991A99683960]) [    x:collection4] o.a.s.c.SolrCore [[core2] ] Opening new SolrCore at [/export/home/jenkins/workspace/Lucene-Solr-6.x-Solaris/solr/build/solr-core/test/J1/temp/solr.core.TestLazyCores_520991A99683960-001/tempDir-003/core2], dataDir=[/export/home/jenkins/workspace/Lucene-Solr-6.x-Solaris/solr/build/solr-core/test/J1/temp/solr.core.TestLazyCores_520991A99683960-001/tempDir-003/core2/data/]
   [junit4]   2> 1509259 INFO  (TEST-TestLazyCores.testCreateTransientFromAdmin-seed#[520991A99683960]) [    x:collection4] o.a.s.u.RandomMergePolicy RandomMergePolicy wrapping class org.apache.lucene.index.AlcoholicMergePolicy: [AlcoholicMergePolicy: minMergeSize=0, mergeFactor=10, maxMergeSize=1460580337, maxMergeSizeForForcedMerge=9223372036854775807, calibrateSizeByDeletes=true, maxMergeDocs=2147483647, maxCFSSegmentSizeMB=8.796093022207999E12, noCFSRatio=0.1]
   [junit4]   2> 1509266 INFO  (TEST-TestLazyCores.testCreateTransientFromAdmin-seed#[520991A99683960]) [    x:collection4] o.a.s.u.CommitTracker Hard AutoCommit: disabled
   [junit4]   2> 1509266 INFO  (TEST-TestLazyCores.testCreateTransientFromAdmin-seed#[520991A99683960]) [    x:collection4] o.a.s.u.CommitTracker Soft AutoCommit: disabled
   [junit4]   2> 1509266 INFO  (TEST-TestLazyCores.testCreateTransientFromAdmin-seed#[520991A99683960]) [    x:collection4] o.a.s.u.RandomMergePolicy RandomMergePolicy wrapping class org.apache.lucene.index.LogByteSizeMergePolicy: [LogByteSizeMergePolicy: minMergeSize=1677721, mergeFactor=32, maxMergeSize=2147483648, maxMergeSizeForForcedMerge=9223372036854775807, calibrateSizeByDeletes=false, maxMergeDocs=2147483647, maxCFSSegmentSizeMB=8.796093022207999E12, noCFSRatio=0.21686142414330442]
   [junit4]   2> 1509267 INFO  (TEST-TestLazyCores.testCreateTransientFromAdmin-seed#[520991A99683960]) [    x:collection4] o.a.s.s.SolrIndexSearcher Opening [Searcher@5d8a67[core2] main]
   [junit4]   2> 1509267 INFO  (TEST-TestLazyCores.testCreateTransientFromAdmin-seed#[520991A99683960]) [    x:collection4] o.a.s.r.ManagedResourceStorage File-based storage initialized to use dir: /export/home/jenkins/workspace/Lucene-Solr-6.x-Solaris/solr/build/solr-core/test/J1/temp/solr.core.TestLazyCores_520991A99683960-001/tempDir-003/core2/conf
   [junit4]   2> 1509267 INFO  (TEST-TestLazyCores.testCreateTransientFromAdmin-seed#[520991A99683960]) [    x:collection4] o.a.s.h.ReplicationHandler Commits will be reserved for  10000
   [junit4]   2> 1509267 INFO  (searcherExecutor-9021-thread-1-processing-x:collection4) [    x:collection4] o.a.s.c.SolrCore [core2] Registered new searcher Searcher@5d8a67[core2] main{ExitableDirectoryReader(UninvertingDirectoryReader())}
   [junit4]   2> 1509267 INFO  (TEST-TestLazyCores.testCreateTransientFromAdmin-seed#[520991A99683960]) [    x:collection4] o.a.s.c.SolrCores Opening transient core core2
   [junit4]   2> 1509267 INFO  (TEST-TestLazyCores.testCreateTransientFromAdmin-seed#[520991A99683960]) [    x:collection4] o.a.s.h.a.CoreAdminOperation core create command loadOnStartup=true&transient=true&name=core3&action=CREATE&wt=xml
   [junit4]   2> 1509273 INFO  (TEST-TestLazyCores.testCreateTransientFromAdmin-seed#[520991A99683960]) [    x:collection4] o.a.s.c.SolrConfig Using Lucene MatchVersion: 6.4.0
   [junit4]   2> 1509287 INFO  (TEST-TestLazyCores.testCreateTransientFromAdmin-seed#[520991A99683960]) [    x:collection4] o.a.s.s.IndexSchema [core3] Schema name=tiny
   [junit4]   2> 1509290 INFO  (TEST-TestLazyCores.testCreateTransientFromAdmin-seed#[520991A99683960]) [    x:collection4] o.a.s.s.IndexSchema Loaded schema tiny/1.1 with uniqueid field id
   [junit4]   2> 1509292 INFO  (TEST-TestLazyCores.testCreateTransientFromAdmin-seed#[520991A99683960]) [    x:collection4] o.a.s.c.CoreContainer Creating SolrCore 'core3' using configuration from instancedir /export/home/jenkins/workspace/Lucene-Solr-6.x-Solaris/solr/build/solr-core/test/J1/temp/solr.core.TestLazyCores_520991A99683960-001/tempDir-003/core3
   [junit4]   2> 1509293 INFO  (TEST-TestLazyCores.testCreateTransientFromAdmin-seed#[520991A99683960]) [    x:collection4] o.a.s.c.SolrCore [[core3] ] Opening new SolrCore at [/export/home/jenkins/workspace/Lucene-Solr-6.x-Solaris/solr/build/solr-core/test/J1/temp/solr.core.TestLazyCores_520991A99683960-001/tempDir-003/core3], dataDir=[/export/home/jenkins/workspace/Lucene-Solr-6.x-Solaris/solr/build/solr-core/test/J1/temp/solr.core.TestLazyCores_520991A99683960-001/tempDir-003/core3/data/]
   [junit4]   2> 1509294 INFO  (TEST-TestLazyCores.testCreateTransientFromAdmin-seed#[520991A99683960]) [    x:collection4] o.a.s.u.RandomMergePolicy RandomMergePolicy wrapping class org.apache.lucene.index.TieredMergePolicy: [TieredMergePolicy: maxMergeAtOnce=42, maxMergeAtOnceExplicit=22, maxMergedSegmentMB=25.6396484375, floorSegmentMB=0.302734375, forceMergeDeletesPctAllowed=16.42753129537579, segmentsPerTier=32.0, maxCFSSegmentSizeMB=8.796093022207999E12, noCFSRatio=0.0
   [junit4]   2> 1509305 INFO  (TEST-TestLazyCores.testCreateTransientFromAdmin-seed#[520991A99683960]) [    x:collection4] o.a.s.u.CommitTracker Hard AutoCommit: disabled
   [junit4]   2> 1509305 INFO  (TEST-TestLazyCores.testCreateTransientFromAdmin-seed#[520991A99683960]) [    x:collection4] o.a.s.u.CommitTracker Soft AutoCommit: disabled
   [junit4]   2> 1509305 INFO  (TEST-TestLazyCores.testCreateTransientFromAdmin-seed#[520991A99683960]) [    x:collection4] o.a.s.u.RandomMergePolicy RandomMergePolicy wrapping class org.apache.lucene.index.LogByteSizeMergePolicy: [LogByteSizeMergePolicy: minMergeSize=1677721, mergeFactor=25, maxMergeSize=2147483648, maxMergeSizeForForcedMerge=9223372036854775807, calibrateSizeByDeletes=false, maxMergeDocs=2147483647, maxCFSSegmentSizeMB=8.796093022207999E12, noCFSRatio=0.3568148663910117]
   [junit4]   2> 1509306 INFO  (TEST-TestLazyCores.testCreateTransientFromAdmin-seed#[520991A99683960]) [    x:collection4] o.a.s.s.SolrIndexSearcher Opening [Searcher@4e7bc8d0[core3] main]
   [junit4]   2> 1509306 INFO  (TEST-TestLazyCores.testCreateTransientFromAdmin-seed#[520991A99683960]) [    x:collection4] o.a.s.r.ManagedResourceStorage File-based storage initialized to use dir: /export/home/jenkins/workspace/Lucene-Solr-6.x-Solaris/solr/build/solr-core/test/J1/temp/solr.core.TestLazyCores_520991A99683960-001/tempDir-003/core3/conf
   [junit4]   2> 1509307 INFO  (TEST-TestLazyCores.testCreateTransientFromAdmin-seed#[520991A99683960]) [    x:collection4] o.a.s.h.ReplicationHandler Commits will be reserved for  10000
   [junit4]   2> 1509307 INFO  (searcherExecutor-9026-thread-1-processing-x:collection4) [    x:collection4] o.a.s.c.SolrCore [core3] Registered new searcher Searcher@4e7bc8d0[core3] main{ExitableDirectoryReader(UninvertingDirectoryReader())}
   [junit4]   2> 1509307 INFO  (TEST-TestLazyCores.testCreateTransientFromAdmin-seed#[520991A99683960]) [    x:collection4] o.a.s.c.SolrCores Opening transient core core3
   [junit4]   2> 1509307 INFO  (TEST-TestLazyCores.testCreateTransientFromAdmin-seed#[520991A99683960]) [    x:collection4] o.a.s.h.a.CoreAdminOperation core create command loadOnStartup=false&transient=true&name=core4&action=CREATE&wt=xml
   [junit4]   2> 1509319 INFO  (TEST-TestLazyCores.testCreateTransientFromAdmin-seed#[520991A99683960]) [    x:collection4] o.a.s.c.SolrConfig Using Lucene MatchVersion: 6.4.0
   [junit4]   2> 1509327 INFO  (TEST-TestLazyCores.testCreateTransientFromAdmin-seed#[520991A99683960]) [    x:collection4] o.a.s.s.IndexSchema [core4] Schema name=tiny
   [junit4]   2> 1509329 INFO  (TEST-TestLazyCores.testCreateTransientFromAdmin-seed#[520991A99683960]) [    x:collection4] o.a.s.s.IndexSchema Loaded schema tiny/1.1 with uniqueid field id
   [junit4]   2> 1509331 INFO  (TEST-TestLazyCores.testCreateTransientFromAdmin-seed#[520991A99683960]) [    x:collection4] o.a.s.c.CoreContainer Creating SolrCore 'core4' using configuration from instancedir /export/home/jenkins/workspace/Lucene-Solr-6.x-Solaris/solr/build/solr-core/test/J1/temp/solr.core.TestLazyCores_520991A99683960-001/tempDir-003/core4
   [junit4]   2> 1509332 INFO  (TEST-TestLazyCores.testCreateTransientFromAdmin-seed#[520991A99683960]) [    x:collection4] o.a.s.c.SolrCore [[core4] ] Opening new SolrCore at [/export/home/jenkins/workspace/Lucene-Solr-6.x-Solaris/solr/build/solr-core/test/J1/temp/solr.core.TestLazyCores_520991A99683960-001/tempDir-003/core4], dataDir=[/export/home/jenkins/workspace/Lucene-Solr-6.x-Solaris/solr/build/solr-core/test/J1/temp/solr.core.TestLazyCores_520991A99683960-001/tempDir-003/core4/data/]
   [junit4]   2> 1509333 INFO  (TEST-TestLazyCores.testCreateTransientFromAdmin-seed#[520991A99683960]) [    x:collection4] o.a.s.u.RandomMergePolicy RandomMergePolicy wrapping class org.apache.lucene.index.LogDocMergePolicy: [LogDocMergePolicy: minMergeSize=1000, mergeFactor=41, maxMergeSize=9223372036854775807, maxMergeSizeForForcedMerge=9223372036854775807, calibrateSizeByDeletes=true, maxMergeDocs=2147483647, maxCFSSegmentSizeMB=8.796093022207999E12, noCFSRatio=0.7253951871115877]
   [junit4]   2> 1509348 INFO  (TEST-TestLazyCores.testCreateTransientFromAdmin-seed#[520991A99683960]) [    x:collection4] o.a.s.u.CommitTracker Hard AutoCommit: disabled
   [junit4]   2> 1509348 INFO  (TEST-TestLazyCores.testCreateTransientFromAdmin-seed#[520991A99683960]) [    x:collection4] o.a.s.u.CommitTracker Soft AutoCommit: disabled
   [junit4]   2> 1509348 INFO  (TEST-TestLazyCores.testCreateTransientFromAdmin-seed#[520991A99683960]) [    x:collection4] o.a.s.u.RandomMergePolicy RandomMergePolicy wrapping class org.apache.lucene.index.TieredMergePolicy: [TieredMergePolicy: maxMergeAtOnce=36, maxMergeAtOnceExplicit=29, maxMergedSegmentMB=59.7763671875, floorSegmentMB=1.630859375, forceMergeDeletesPctAllowed=22.379556021780754, segmentsPerTier=36.0, maxCFSSegmentSizeMB=8.796093022207999E12, noCFSRatio=0.13203128033445194
   [junit4]   2> 1509349 INFO  (TEST-TestLazyCores.testCreateTransientFromAdmin-seed#[520991A99683960]) [    x:collection4] o.a.s.s.SolrIndexSearcher Opening [Searcher@1928d10b[core4] main]
   [junit4]   2> 1509349 INFO  (TEST-TestLazyCores.testCreateTransientFromAdmin-seed#[520991A99683960]) [    x:collection4] o.a.s.r.ManagedResourceStorage File-based storage initialized to use dir: /export/home/jenkins/workspace/Lucene-Solr-6.x-Solaris/solr/build/solr-core/test/J1/temp/solr.core.TestLazyCores_520991A99683960-001/tempDir-003/core4/conf
   [junit4]   2> 1509349 INFO  (TEST-TestLazyCores.testCreateTransientFromAdmin-seed#[520991A99683960]) [    x:collection4] o.a.s.h.ReplicationHandler Commits will be reserved for  10000
   [junit4]   2> 1509350 INFO  (searcherExecutor-9031-thread-1-processing-x:collection4) [    x:collection4] o.a.s.c.SolrCore [core4] Registered new searcher Searcher@1928d10b[core4] main{ExitableDirectoryReader(UninvertingDirectoryReader())}
   [junit4]   2> 1509350 INFO  (TEST-TestLazyCores.testCreateTransientFromAdmin-seed#[520991A99683960]) [    x:collection4] o.a.s.c.SolrCores Opening transient core core4
   [junit4]   2> 1509350 INFO  (TEST-TestLazyCores.testCreateTransientFromAdmin-seed#[520991A99683960]) [    x:collection4] o.a.s.c.SolrCores Closing transient core [collection2]
   [junit4]   2> 1509350 INFO  (Thread-6837) [    x:collection4] o.a.s.c.SolrCore [collection2]  CLOSING SolrCore org.apache.solr.core.SolrCore@38525fc7
   [junit4]   2> 1509350 INFO  (TEST-TestLazyCores.testCreateTransientFromAdmin-seed#[520991A99683960]) [    x:collection4] o.a.s.h.a.CoreAdminOperation core create command loadOnStartup=false&transient=true&name=core5&action=CREATE&wt=xml
   [junit4]   2> 1509361 INFO  (TEST-TestLazyCores.testCreateTransientFromAdmin-seed#[520991A99683960]) [    x:collection4] o.a.s.c.SolrConfig Using Lucene MatchVersion: 6.4.0
   [junit4]   2> 1509370 INFO  (TEST-TestLazyCores.testCreateTransientFromAdmin-seed#[520991A99683960]) [    x:collection4] o.a.s.s.IndexSchema [core5] Schema name=tiny
   [junit4]   2> 1509373 INFO  (TEST-TestLazyCores.testCreateTransientFromAdmin-seed#[520991A99683960]) [    x:collection4] o.a.s.s.IndexSchema Loaded schema tiny/1.1 with uniqueid field id
   [junit4]   2> 1509376 INFO  (TEST-TestLazyCores.testCreateTransientFromAdmin-seed#[520991A99683960]) [    x:collection4] o.a.s.c.CoreContainer Creating SolrCore 'core5' using configuration from instancedir /export/home/jenkins/workspace/Lucene-Solr-6.x-Solaris/solr/build/solr-core/test/J1/temp/solr.core.TestLazyCores_520991A99683960-001/tempDir-003/core5
   [junit4]   2> 1509376 INFO  (TEST-TestLazyCores.testCreateTransientFromAdmin-seed#[520991A99683960]) [    x:collection4] o.a.s.c.SolrCore [[core5] ] Opening new SolrCore at [/export/home/jenkins/workspace/Lucene-Solr-6.x-Solaris/solr/build/solr-core/test/J1/temp/solr.core.TestLazyCores_520991A99683960-001/tempDir-003/core5], dataDir=[/export/home/jenkins/workspace/Lucene-Solr-6.x-Solaris/solr/build/solr-core/test/J1/temp/solr.core.TestLazyCores_520991A99683960-001/tempDir-003/core5/data/]
   [junit4]   2> 1509378 INFO  (TEST-TestLazyCores.testCreateTransientFromAdmin-seed#[520991A99683960]) [    x:collection4] o.a.s.u.RandomMergePolicy RandomMergePolicy wrapping class org.apache.lucene.index.TieredMergePolicy: [TieredMergePolicy: maxMergeAtOnce=34, maxMergeAtOnceExplicit=26, maxMergedSegmentMB=37.60546875, floorSegmentMB=0.333984375, forceMergeDeletesPctAllowed=11.04321729253638, segmentsPerTier=29.0, maxCFSSegmentSizeMB=8.796093022207999E12, noCFSRatio=0.33448656571925417
   [junit4]   2> 1509389 INFO  (TEST-TestLazyCores.testCreateTransientFromAdmin-seed#[520991A99683960]) [    x:collection4] o.a.s.u.CommitTracker Hard AutoCommit: disabled
   [junit4]   2> 1509389 INFO  (TEST-TestLazyCores.testCreateTransientFromAdmin-seed#[520991A99683960]) [    x:collection4] o.a.s.u.CommitTracker Soft AutoCommit: disabled
   [junit4]   2> 1509389 INFO  (TEST-TestLazyCores.testCreateTransientFromAdmin-seed#[520991A99683960]) [    x:collection4] o.a.s.u.RandomMergePolicy RandomMergePolicy wrapping class org.apache.lucene.index.LogByteSizeMergePolicy: [LogByteSizeMergePolicy: minMergeSize=1677721, mergeFactor=10, maxMergeSize=2147483648, maxMergeSizeForForcedMerge=9223372036854775807, calibrateSizeByDeletes=false, maxMergeDocs=2147483647, maxCFSSegmentSizeMB=8.796093022207999E12, noCFSRatio=0.0]
   [junit4]   2> 1509390 INFO  (TEST-TestLazyCores.testCreateTransientFromAdmin-seed#[520991A99683960]) [    x:collection4] o.a.s.s.SolrIndexSearcher Opening [Searcher@5d60379b[core5] main]
   [junit4]   2> 1509390 INFO  (TEST-TestLazyCores.testCreateTransientFromAdmin-seed#[520991A99683960]) [    x:collection4] o.a.s.r.ManagedResourceStorage File-based storage initialized to use dir: /export/home/jenkins/workspace/Lucene-Solr-6.x-Solaris/solr/build/solr-core/test/J1/temp/solr.core.TestLazyCores_520991A99683960-001/tempDir-003/core5/conf
   [junit4]   2> 1509390 INFO  (TEST-TestLazyCores.testCreateTransientFromAdmin-seed#[520991A99683960]) [    x:collection4] o.a.s.h.ReplicationHandler Commits will be reserved for  10000
   [junit4]   2> 1509390 INFO  (searcherExecutor-9036-thread-1-processing-x:collection4) [    x:collection4] o.a.s.c.SolrCore [core5] Registered new searcher Searcher@5d60379b[core5] main{ExitableDirectoryReader(UninvertingDirectoryReader())}
   [junit4]   2> 1509391 INFO  (TEST-TestLazyCores.testCreateTransientFromAdmin-seed#[520991A99683960]) [    x:collection4] o.a.s.c.SolrCores Opening transient core core5
   [junit4]   2> 1509391 INFO  (TEST-TestLazyCores.testCreateTransientFromAdmin-seed#[520991A99683960]) [    x:collection4] o.a.s.c.SolrCores Closing transient core [core1]
   [junit4]   2> 1509391 INFO  (Thread-6837) [    x:collection4] o.a.s.c.SolrCore [core1]  CLOSING SolrCore org.apache.solr.core.SolrCore@7516541c
   [junit4]   2> 1509465 INFO  (TEST-TestLazyCores.testCreateTransientFromAdmin-seed#[520991A99683960]) [    x:collection4] o.a.s.c.SolrConfig Using Lucene MatchVersion: 6.4.0
   [junit4]   2> 1509473 INFO  (TEST-TestLazyCores.testCreateTransientFromAdmin-seed#[520991A99683960]) [    x:collection4] o.a.s.s.IndexSchema [core1] Schema name=tiny
   [junit4]   2> 1509476 INFO  (TEST-TestLazyCores.testCreateTransientFromAdmin-seed#[520991A99683960]) [    x:collection4] o.a.s.s.IndexSchema Loaded schema tiny/1.1 with uniqueid field id
   [junit4]   2> 1509477 INFO  (TEST-TestLazyCores.testCreateTransientFromAdmin-seed#[520991A99683960]) [    x:collection4] o.a.s.c.CoreContainer Creating SolrCore 'core1' using configuration from instancedir /export/home/jenkins/workspace/Lucene-Solr-6.x-Solaris/solr/build/solr-core/test/J1/temp/solr.core.TestLazyCores_520991A99683960-001/tempDir-003/core1
   [junit4]   2> 1509478 INFO  (TEST-TestLazyCores.testCreateTransientFromAdmin-seed#[520991A99683960]) [    x:collection4] o.a.s.c.SolrCore [[core1] ] Opening new SolrCore at [/export/home/jenkins/workspace/Lucene-Solr-6.x-Solaris/solr/build/solr-core/test/J1/temp/solr.core.TestLazyCores_520991A99683960-001/tempDir-003/core1], dataDir=[/export/home/jenkins/workspace/Lucene-Solr-6.x-Solaris/solr/build/solr-core/test/J1/temp/solr.core.TestLazyCores_520991A99683960-001/tempDir-003/core1/data/]
   [junit4]   2> 1509479 INFO  (TEST-TestLazyCores.testCreateTransientFromAdmin-seed#[520991A99683960]) [    x:collection4] o.a.s.u.RandomMerge

[...truncated too long message...]

eTask.java:266)
   [junit4]    > 	at org.apache.solr.common.util.ExecutorUtil$MDCAwareThreadPoolExecutor.lambda$execute$0(ExecutorUtil.java:229)
   [junit4]    > 	at java.util.concurrent.ThreadPoolExecutor.runWorker(ThreadPoolExecutor.java:1142)
   [junit4]    > 	at java.util.concurrent.ThreadPoolExecutor$Worker.run(ThreadPoolExecutor.java:617)
   [junit4]    > 	at java.lang.Thread.run(Thread.java:745)
   [junit4]    > org.apache.solr.common.util.ObjectReleaseTracker$ObjectTrackerException
   [junit4]    > 	at org.apache.solr.common.util.ObjectReleaseTracker.track(ObjectReleaseTracker.java:43)
   [junit4]    > 	at org.apache.solr.core.CachingDirectoryFactory.get(CachingDirectoryFactory.java:347)
   [junit4]    > 	at org.apache.solr.core.SolrCore.getNewIndexDir(SolrCore.java:331)
   [junit4]    > 	at org.apache.solr.core.SolrCore.initIndex(SolrCore.java:640)
   [junit4]    > 	at org.apache.solr.core.SolrCore.<init>(SolrCore.java:846)
   [junit4]    > 	at org.apache.solr.core.SolrCore.<init>(SolrCore.java:774)
   [junit4]    > 	at org.apache.solr.core.CoreContainer.create(CoreContainer.java:842)
   [junit4]    > 	at org.apache.solr.core.CoreContainer.lambda$load$0(CoreContainer.java:498)
   [junit4]    > 	at java.util.concurrent.FutureTask.run(FutureTask.java:266)
   [junit4]    > 	at org.apache.solr.common.util.ExecutorUtil$MDCAwareThreadPoolExecutor.lambda$execute$0(ExecutorUtil.java:229)
   [junit4]    > 	at java.util.concurrent.ThreadPoolExecutor.runWorker(ThreadPoolExecutor.java:1142)
   [junit4]    > 	at java.util.concurrent.ThreadPoolExecutor$Worker.run(ThreadPoolExecutor.java:617)
   [junit4]    > 	at java.lang.Thread.run(Thread.java:745)
   [junit4]    > org.apache.solr.common.util.ObjectReleaseTracker$ObjectTrackerException
   [junit4]    > 	at org.apache.solr.common.util.ObjectReleaseTracker.track(ObjectReleaseTracker.java:43)
   [junit4]    > 	at org.apache.solr.core.SolrCore.<init>(SolrCore.java:936)
   [junit4]    > 	at org.apache.solr.core.SolrCore.<init>(SolrCore.java:774)
   [junit4]    > 	at org.apache.solr.core.CoreContainer.create(CoreContainer.java:842)
   [junit4]    > 	at org.apache.solr.core.CoreContainer.lambda$load$0(CoreContainer.java:498)
   [junit4]    > 	at java.util.concurrent.FutureTask.run(FutureTask.java:266)
   [junit4]    > 	at org.apache.solr.common.util.ExecutorUtil$MDCAwareThreadPoolExecutor.lambda$execute$0(ExecutorUtil.java:229)
   [junit4]    > 	at java.util.concurrent.ThreadPoolExecutor.runWorker(ThreadPoolExecutor.java:1142)
   [junit4]    > 	at java.util.concurrent.ThreadPoolExecutor$Worker.run(ThreadPoolExecutor.java:617)
   [junit4]    > 	at java.lang.Thread.run(Thread.java:745)
   [junit4]    > org.apache.solr.common.util.ObjectReleaseTracker$ObjectTrackerException
   [junit4]    > 	at org.apache.solr.common.util.ObjectReleaseTracker.track(ObjectReleaseTracker.java:43)
   [junit4]    > 	at org.apache.solr.core.CachingDirectoryFactory.get(CachingDirectoryFactory.java:347)
   [junit4]    > 	at org.apache.solr.update.SolrIndexWriter.create(SolrIndexWriter.java:66)
   [junit4]    > 	at org.apache.solr.core.SolrCore.initIndex(SolrCore.java:672)
   [junit4]    > 	at org.apache.solr.core.SolrCore.<init>(SolrCore.java:846)
   [junit4]    > 	at org.apache.solr.core.SolrCore.<init>(SolrCore.java:774)
   [junit4]    > 	at org.apache.solr.core.CoreContainer.create(CoreContainer.java:842)
   [junit4]    > 	at org.apache.solr.core.CoreContainer.lambda$load$0(CoreContainer.java:498)
   [junit4]    > 	at java.util.concurrent.FutureTask.run(FutureTask.java:266)
   [junit4]    > 	at org.apache.solr.common.util.ExecutorUtil$MDCAwareThreadPoolExecutor.lambda$execute$0(ExecutorUtil.java:229)
   [junit4]    > 	at java.util.concurrent.ThreadPoolExecutor.runWorker(ThreadPoolExecutor.java:1142)
   [junit4]    > 	at java.util.concurrent.ThreadPoolExecutor$Worker.run(ThreadPoolExecutor.java:617)
   [junit4]    > 	at java.lang.Thread.run(Thread.java:745)
   [junit4]    > org.apache.solr.common.util.ObjectReleaseTracker$ObjectTrackerException
   [junit4]    > 	at org.apache.solr.common.util.ObjectReleaseTracker.track(ObjectReleaseTracker.java:43)
   [junit4]    > 	at org.apache.solr.core.CachingDirectoryFactory.get(CachingDirectoryFactory.java:347)
   [junit4]    > 	at org.apache.solr.core.SolrCore.initSnapshotMetaDataManager(SolrCore.java:433)
   [junit4]    > 	at org.apache.solr.core.SolrCore.<init>(SolrCore.java:840)
   [junit4]    > 	at org.apache.solr.core.SolrCore.<init>(SolrCore.java:774)
   [junit4]    > 	at org.apache.solr.core.CoreContainer.create(CoreContainer.java:842)
   [junit4]    > 	at org.apache.solr.core.CoreContainer.lambda$load$0(CoreContainer.java:498)
   [junit4]    > 	at java.util.concurrent.FutureTask.run(FutureTask.java:266)
   [junit4]    > 	at org.apache.solr.common.util.ExecutorUtil$MDCAwareThreadPoolExecutor.lambda$execute$0(ExecutorUtil.java:229)
   [junit4]    > 	at java.util.concurrent.ThreadPoolExecutor.runWorker(ThreadPoolExecutor.java:1142)
   [junit4]    > 	at java.util.concurrent.ThreadPoolExecutor$Worker.run(ThreadPoolExecutor.java:617)
   [junit4]    > 	at java.lang.Thread.run(Thread.java:745)
   [junit4]    > 	at __randomizedtesting.SeedInfo.seed([520991A99683960]:0)
   [junit4]    > 	at org.apache.solr.SolrTestCaseJ4.teardownTestCases(SolrTestCaseJ4.java:266)
   [junit4]    > 	at java.lang.Thread.run(Thread.java:745)Throwable #2: com.carrotsearch.randomizedtesting.ThreadLeakError: 1 thread leaked from SUITE scope at org.apache.solr.core.TestLazyCores: 
   [junit4]    >    1) Thread[id=46846, name=searcherExecutor-9169-thread-1, state=WAITING, group=TGRP-TestLazyCores]
   [junit4]    >         at sun.misc.Unsafe.park(Native Method)
   [junit4]    >         at java.util.concurrent.locks.LockSupport.park(LockSupport.java:175)
   [junit4]    >         at java.util.concurrent.locks.AbstractQueuedSynchronizer$ConditionObject.await(AbstractQueuedSynchronizer.java:2039)
   [junit4]    >         at java.util.concurrent.LinkedBlockingQueue.take(LinkedBlockingQueue.java:442)
   [junit4]    >         at java.util.concurrent.ThreadPoolExecutor.getTask(ThreadPoolExecutor.java:1067)
   [junit4]    >         at java.util.concurrent.ThreadPoolExecutor.runWorker(ThreadPoolExecutor.java:1127)
   [junit4]    >         at java.util.concurrent.ThreadPoolExecutor$Worker.run(ThreadPoolExecutor.java:617)
   [junit4]    >         at java.lang.Thread.run(Thread.java:745)
   [junit4]    > 	at __randomizedtesting.SeedInfo.seed([520991A99683960]:0)Throwable #3: com.carrotsearch.randomizedtesting.ThreadLeakError: There are still zombie threads that couldn't be terminated:
   [junit4]    >    1) Thread[id=46846, name=searcherExecutor-9169-thread-1, state=WAITING, group=TGRP-TestLazyCores]
   [junit4]    >         at sun.misc.Unsafe.park(Native Method)
   [junit4]    >         at java.util.concurrent.locks.LockSupport.park(LockSupport.java:175)
   [junit4]    >         at java.util.concurrent.locks.AbstractQueuedSynchronizer$ConditionObject.await(AbstractQueuedSynchronizer.java:2039)
   [junit4]    >         at java.util.concurrent.LinkedBlockingQueue.take(LinkedBlockingQueue.java:442)
   [junit4]    >         at java.util.concurrent.ThreadPoolExecutor.getTask(ThreadPoolExecutor.java:1067)
   [junit4]    >         at java.util.concurrent.ThreadPoolExecutor.runWorker(ThreadPoolExecutor.java:1127)
   [junit4]    >         at java.util.concurrent.ThreadPoolExecutor$Worker.run(ThreadPoolExecutor.java:617)
   [junit4]    >         at java.lang.Thread.run(Thread.java:745)
   [junit4]    > 	at __randomizedtesting.SeedInfo.seed([520991A99683960]:0)
   [junit4] Completed [457/662 (1!)] on J1 in 179.64s, 8 tests, 1 failure, 2 errors <<< FAILURES!

[...truncated 44974 lines...]
-documentation-lint:
     [echo] checking for broken html...
    [jtidy] Checking for broken html (such as invalid tags)...
   [delete] Deleting directory /export/home/jenkins/workspace/Lucene-Solr-6.x-Solaris/lucene/build/jtidy_tmp
     [echo] Checking for broken links...
     [exec] 
     [exec] Crawl/parse...
     [exec] 
     [exec] Verify...
     [exec] 
     [exec] file:///build/docs/misc/org/apache/lucene/search/DocValuesStats.DoubleDocValuesStats.html
     [exec]   BROKEN LINK: file:///build/docs/core/org/apache/lucene/search/DocValuesStats.NumericDocValuesStats.html
     [exec] 
     [exec] file:///build/docs/misc/org/apache/lucene/search/DocValuesStats.LongDocValuesStats.html
     [exec]   BROKEN LINK: file:///build/docs/core/org/apache/lucene/search/DocValuesStats.NumericDocValuesStats.html
     [exec] 
     [exec] file:///build/docs/misc/org/apache/lucene/search/DocValuesStats.SortedDoubleDocValuesStats.html
     [exec]   BROKEN LINK: file:///build/docs/core/org/apache/lucene/search/DocValuesStats.SortedNumericDocValuesStats.html
     [exec] 
     [exec] file:///build/docs/misc/org/apache/lucene/search/DocValuesStats.SortedLongDocValuesStats.html
     [exec]   BROKEN LINK: file:///build/docs/core/org/apache/lucene/search/DocValuesStats.SortedNumericDocValuesStats.html
     [exec] 
     [exec] Broken javadocs links were found!

BUILD FAILED
/export/home/jenkins/workspace/Lucene-Solr-6.x-Solaris/build.xml:765: The following error occurred while executing this line:
/export/home/jenkins/workspace/Lucene-Solr-6.x-Solaris/build.xml:101: The following error occurred while executing this line:
/export/home/jenkins/workspace/Lucene-Solr-6.x-Solaris/lucene/build.xml:138: The following error occurred while executing this line:
/export/home/jenkins/workspace/Lucene-Solr-6.x-Solaris/lucene/build.xml:151: The following error occurred while executing this line:
/export/home/jenkins/workspace/Lucene-Solr-6.x-Solaris/lucene/common-build.xml:2478: exec returned: 1

Total time: 62 minutes 10 seconds
Build step 'Invoke Ant' marked build as failure
Archiving artifacts
[WARNINGS] Skipping publisher since build result is FAILURE
Recording test results
Email was triggered for: Failure - Any
Sending email for trigger: Failure - Any



Mime
View raw message