lucene-dev mailing list archives

Site index · List index
Message view « Date » · « Thread »
Top « Date » · « Thread »
From Policeman Jenkins Server <jenk...@thetaphi.de>
Subject [JENKINS] Lucene-Solr-master-Windows (64bit/jdk1.8.0_112) - Build # 6276 - Still Unstable!
Date Fri, 09 Dec 2016 16:09:17 GMT
Build: https://jenkins.thetaphi.de/job/Lucene-Solr-master-Windows/6276/
Java: 64bit/jdk1.8.0_112 -XX:-UseCompressedOops -XX:+UseSerialGC

1 tests failed.
FAILED:  org.apache.solr.cloud.TestSolrCloudWithDelegationTokens.testDelegationTokenCancelFail

Error Message:
expected:<200> but was:<404>

Stack Trace:
java.lang.AssertionError: expected:<200> but was:<404>
	at __randomizedtesting.SeedInfo.seed([F3E0AA87C55439D3:9B5F9FAD15CE2B3F]:0)
	at org.junit.Assert.fail(Assert.java:93)
	at org.junit.Assert.failNotEquals(Assert.java:647)
	at org.junit.Assert.assertEquals(Assert.java:128)
	at org.junit.Assert.assertEquals(Assert.java:472)
	at org.junit.Assert.assertEquals(Assert.java:456)
	at org.apache.solr.cloud.TestSolrCloudWithDelegationTokens.cancelDelegationToken(TestSolrCloudWithDelegationTokens.java:140)
	at org.apache.solr.cloud.TestSolrCloudWithDelegationTokens.testDelegationTokenCancelFail(TestSolrCloudWithDelegationTokens.java:294)
	at sun.reflect.NativeMethodAccessorImpl.invoke0(Native Method)
	at sun.reflect.NativeMethodAccessorImpl.invoke(NativeMethodAccessorImpl.java:62)
	at sun.reflect.DelegatingMethodAccessorImpl.invoke(DelegatingMethodAccessorImpl.java:43)
	at java.lang.reflect.Method.invoke(Method.java:498)
	at com.carrotsearch.randomizedtesting.RandomizedRunner.invoke(RandomizedRunner.java:1713)
	at com.carrotsearch.randomizedtesting.RandomizedRunner$8.evaluate(RandomizedRunner.java:907)
	at com.carrotsearch.randomizedtesting.RandomizedRunner$9.evaluate(RandomizedRunner.java:943)
	at com.carrotsearch.randomizedtesting.RandomizedRunner$10.evaluate(RandomizedRunner.java:957)
	at com.carrotsearch.randomizedtesting.rules.SystemPropertiesRestoreRule$1.evaluate(SystemPropertiesRestoreRule.java:57)
	at org.apache.lucene.util.TestRuleSetupTeardownChained$1.evaluate(TestRuleSetupTeardownChained.java:49)
	at org.apache.lucene.util.AbstractBeforeAfterRule$1.evaluate(AbstractBeforeAfterRule.java:45)
	at org.apache.lucene.util.TestRuleThreadAndTestName$1.evaluate(TestRuleThreadAndTestName.java:48)
	at org.apache.lucene.util.TestRuleIgnoreAfterMaxFailures$1.evaluate(TestRuleIgnoreAfterMaxFailures.java:64)
	at org.apache.lucene.util.TestRuleMarkFailure$1.evaluate(TestRuleMarkFailure.java:47)
	at com.carrotsearch.randomizedtesting.rules.StatementAdapter.evaluate(StatementAdapter.java:36)
	at com.carrotsearch.randomizedtesting.ThreadLeakControl$StatementRunner.run(ThreadLeakControl.java:367)
	at com.carrotsearch.randomizedtesting.ThreadLeakControl.forkTimeoutingTask(ThreadLeakControl.java:811)
	at com.carrotsearch.randomizedtesting.ThreadLeakControl$3.evaluate(ThreadLeakControl.java:462)
	at com.carrotsearch.randomizedtesting.RandomizedRunner.runSingleTest(RandomizedRunner.java:916)
	at com.carrotsearch.randomizedtesting.RandomizedRunner$5.evaluate(RandomizedRunner.java:802)
	at com.carrotsearch.randomizedtesting.RandomizedRunner$6.evaluate(RandomizedRunner.java:852)
	at com.carrotsearch.randomizedtesting.RandomizedRunner$7.evaluate(RandomizedRunner.java:863)
	at com.carrotsearch.randomizedtesting.rules.StatementAdapter.evaluate(StatementAdapter.java:36)
	at com.carrotsearch.randomizedtesting.rules.SystemPropertiesRestoreRule$1.evaluate(SystemPropertiesRestoreRule.java:57)
	at org.apache.lucene.util.AbstractBeforeAfterRule$1.evaluate(AbstractBeforeAfterRule.java:45)
	at com.carrotsearch.randomizedtesting.rules.StatementAdapter.evaluate(StatementAdapter.java:36)
	at org.apache.lucene.util.TestRuleStoreClassName$1.evaluate(TestRuleStoreClassName.java:41)
	at com.carrotsearch.randomizedtesting.rules.NoShadowingOrOverridesOnMethodsRule$1.evaluate(NoShadowingOrOverridesOnMethodsRule.java:40)
	at com.carrotsearch.randomizedtesting.rules.NoShadowingOrOverridesOnMethodsRule$1.evaluate(NoShadowingOrOverridesOnMethodsRule.java:40)
	at com.carrotsearch.randomizedtesting.rules.StatementAdapter.evaluate(StatementAdapter.java:36)
	at com.carrotsearch.randomizedtesting.rules.StatementAdapter.evaluate(StatementAdapter.java:36)
	at com.carrotsearch.randomizedtesting.rules.StatementAdapter.evaluate(StatementAdapter.java:36)
	at org.apache.lucene.util.TestRuleAssertionsRequired$1.evaluate(TestRuleAssertionsRequired.java:53)
	at org.apache.lucene.util.TestRuleMarkFailure$1.evaluate(TestRuleMarkFailure.java:47)
	at org.apache.lucene.util.TestRuleIgnoreAfterMaxFailures$1.evaluate(TestRuleIgnoreAfterMaxFailures.java:64)
	at org.apache.lucene.util.TestRuleIgnoreTestSuites$1.evaluate(TestRuleIgnoreTestSuites.java:54)
	at com.carrotsearch.randomizedtesting.rules.StatementAdapter.evaluate(StatementAdapter.java:36)
	at com.carrotsearch.randomizedtesting.ThreadLeakControl$StatementRunner.run(ThreadLeakControl.java:367)
	at java.lang.Thread.run(Thread.java:745)




Build Log:
[...truncated 10888 lines...]
   [junit4] Suite: org.apache.solr.cloud.TestSolrCloudWithDelegationTokens
   [junit4]   2> Creating dataDir: C:\Users\jenkins\workspace\Lucene-Solr-master-Windows\solr\build\solr-core\test\J0\temp\solr.cloud.TestSolrCloudWithDelegationTokens_F3E0AA87C55439D3-001\init-core-data-001
   [junit4]   2> 446511 INFO  (SUITE-TestSolrCloudWithDelegationTokens-seed#[F3E0AA87C55439D3]-worker) [    ] o.a.s.SolrTestCaseJ4 Randomized ssl (false) and clientAuth (false) via: @org.apache.solr.util.RandomizeSSL(reason=, value=NaN, ssl=NaN, clientAuth=NaN)
   [junit4]   2> 446516 INFO  (SUITE-TestSolrCloudWithDelegationTokens-seed#[F3E0AA87C55439D3]-worker) [    ] o.a.s.c.MiniSolrCloudCluster Starting cluster of 2 servers in C:\Users\jenkins\workspace\Lucene-Solr-master-Windows\solr\build\solr-core\test\J0\temp\solr.cloud.TestSolrCloudWithDelegationTokens_F3E0AA87C55439D3-001\tempDir-001
   [junit4]   2> 446516 INFO  (SUITE-TestSolrCloudWithDelegationTokens-seed#[F3E0AA87C55439D3]-worker) [    ] o.a.s.c.ZkTestServer STARTING ZK TEST SERVER
   [junit4]   2> 446517 INFO  (Thread-651) [    ] o.a.s.c.ZkTestServer client port:0.0.0.0/0.0.0.0:0
   [junit4]   2> 446517 INFO  (Thread-651) [    ] o.a.s.c.ZkTestServer Starting server
   [junit4]   2> 446617 INFO  (SUITE-TestSolrCloudWithDelegationTokens-seed#[F3E0AA87C55439D3]-worker) [    ] o.a.s.c.ZkTestServer start zk server on port:52148
   [junit4]   2> 446630 WARN  (NIOServerCxn.Factory:0.0.0.0/0.0.0.0:0) [    ] o.a.z.s.NIOServerCnxn caught end of stream exception
   [junit4]   2> EndOfStreamException: Unable to read additional data from client sessionid 0x158e4210b110000, likely client has closed socket
   [junit4]   2> 	at org.apache.zookeeper.server.NIOServerCnxn.doIO(NIOServerCnxn.java:228)
   [junit4]   2> 	at org.apache.zookeeper.server.NIOServerCnxnFactory.run(NIOServerCnxnFactory.java:208)
   [junit4]   2> 	at java.lang.Thread.run(Thread.java:745)
   [junit4]   2> 446636 INFO  (jetty-launcher-490-thread-1) [    ] o.e.j.s.Server jetty-9.3.14.v20161028
   [junit4]   2> 446636 INFO  (jetty-launcher-490-thread-2) [    ] o.e.j.s.Server jetty-9.3.14.v20161028
   [junit4]   2> 446637 INFO  (jetty-launcher-490-thread-2) [    ] o.e.j.s.h.ContextHandler Started o.e.j.s.ServletContextHandler@6d714aea{/solr,null,AVAILABLE}
   [junit4]   2> 446637 INFO  (jetty-launcher-490-thread-1) [    ] o.e.j.s.h.ContextHandler Started o.e.j.s.ServletContextHandler@1dbc5c9f{/solr,null,AVAILABLE}
   [junit4]   2> 446637 INFO  (jetty-launcher-490-thread-2) [    ] o.e.j.s.AbstractConnector Started ServerConnector@4bcf1554{HTTP/1.1,[http/1.1]}{127.0.0.1:52152}
   [junit4]   2> 446637 INFO  (jetty-launcher-490-thread-2) [    ] o.e.j.s.Server Started @451573ms
   [junit4]   2> 446637 INFO  (jetty-launcher-490-thread-2) [    ] o.a.s.c.s.e.JettySolrRunner Jetty properties: {hostContext=/solr, hostPort=52152}
   [junit4]   2> 446637 INFO  (jetty-launcher-490-thread-1) [    ] o.e.j.s.AbstractConnector Started ServerConnector@520a48d6{HTTP/1.1,[http/1.1]}{127.0.0.1:52155}
   [junit4]   2> 446637 ERROR (jetty-launcher-490-thread-2) [    ] o.a.s.s.StartupLoggingUtils Missing Java Option solr.log.dir. Logging may be missing or incomplete.
   [junit4]   2> 446637 INFO  (jetty-launcher-490-thread-1) [    ] o.e.j.s.Server Started @451573ms
   [junit4]   2> 446638 INFO  (jetty-launcher-490-thread-1) [    ] o.a.s.c.s.e.JettySolrRunner Jetty properties: {hostContext=/solr, hostPort=52155}
   [junit4]   2> 446638 INFO  (jetty-launcher-490-thread-2) [    ] o.a.s.s.SolrDispatchFilter  ___      _       Welcome to Apache Solr? version 7.0.0
   [junit4]   2> 446638 INFO  (jetty-launcher-490-thread-2) [    ] o.a.s.s.SolrDispatchFilter / __| ___| |_ _   Starting in cloud mode on port null
   [junit4]   2> 446638 INFO  (jetty-launcher-490-thread-2) [    ] o.a.s.s.SolrDispatchFilter \__ \/ _ \ | '_|  Install dir: null
   [junit4]   2> 446638 INFO  (jetty-launcher-490-thread-2) [    ] o.a.s.s.SolrDispatchFilter |___/\___/_|_|    Start time: 2016-12-09T15:08:40.710Z
   [junit4]   2> 446641 ERROR (jetty-launcher-490-thread-1) [    ] o.a.s.s.StartupLoggingUtils Missing Java Option solr.log.dir. Logging may be missing or incomplete.
   [junit4]   2> 446641 INFO  (jetty-launcher-490-thread-1) [    ] o.a.s.s.SolrDispatchFilter  ___      _       Welcome to Apache Solr? version 7.0.0
   [junit4]   2> 446641 INFO  (jetty-launcher-490-thread-1) [    ] o.a.s.s.SolrDispatchFilter / __| ___| |_ _   Starting in cloud mode on port null
   [junit4]   2> 446641 INFO  (jetty-launcher-490-thread-1) [    ] o.a.s.s.SolrDispatchFilter \__ \/ _ \ | '_|  Install dir: null
   [junit4]   2> 446641 INFO  (jetty-launcher-490-thread-1) [    ] o.a.s.s.SolrDispatchFilter |___/\___/_|_|    Start time: 2016-12-09T15:08:40.713Z
   [junit4]   2> 446657 INFO  (jetty-launcher-490-thread-2) [    ] o.a.s.s.SolrDispatchFilter solr.xml found in ZooKeeper. Loading...
   [junit4]   2> 446658 INFO  (jetty-launcher-490-thread-1) [    ] o.a.s.s.SolrDispatchFilter solr.xml found in ZooKeeper. Loading...
   [junit4]   2> 446679 INFO  (jetty-launcher-490-thread-2) [    ] o.a.s.c.ZkContainer Zookeeper client=127.0.0.1:52148/solr
   [junit4]   2> 446681 INFO  (jetty-launcher-490-thread-1) [    ] o.a.s.c.ZkContainer Zookeeper client=127.0.0.1:52148/solr
   [junit4]   2> 446685 WARN  (NIOServerCxn.Factory:0.0.0.0/0.0.0.0:0) [    ] o.a.z.s.NIOServerCnxn caught end of stream exception
   [junit4]   2> EndOfStreamException: Unable to read additional data from client sessionid 0x158e4210b110004, likely client has closed socket
   [junit4]   2> 	at org.apache.zookeeper.server.NIOServerCnxn.doIO(NIOServerCnxn.java:228)
   [junit4]   2> 	at org.apache.zookeeper.server.NIOServerCnxnFactory.run(NIOServerCnxnFactory.java:208)
   [junit4]   2> 	at java.lang.Thread.run(Thread.java:745)
   [junit4]   2> 446717 INFO  (jetty-launcher-490-thread-2) [n:127.0.0.1:52152_solr    ] o.a.s.c.OverseerElectionContext I am going to be the leader 127.0.0.1:52152_solr
   [junit4]   2> 446718 INFO  (jetty-launcher-490-thread-1) [n:127.0.0.1:52155_solr    ] o.a.s.c.ZkController Register node as live in ZooKeeper:/live_nodes/127.0.0.1:52155_solr
   [junit4]   2> 446719 INFO  (jetty-launcher-490-thread-2) [n:127.0.0.1:52152_solr    ] o.a.s.c.Overseer Overseer (id=97078222559182853-127.0.0.1:52152_solr-n_0000000000) starting
   [junit4]   2> 446720 INFO  (zkCallback-501-thread-1-processing-n:127.0.0.1:52155_solr) [n:127.0.0.1:52155_solr    ] o.a.s.c.c.ZkStateReader Updated live nodes from ZooKeeper... (0) -> (1)
   [junit4]   2> 446721 INFO  (zkCallback-500-thread-1-processing-n:127.0.0.1:52152_solr) [n:127.0.0.1:52152_solr    ] o.a.s.c.c.ZkStateReader Updated live nodes from ZooKeeper... (0) -> (1)
   [junit4]   2> 446731 INFO  (jetty-launcher-490-thread-2) [n:127.0.0.1:52152_solr    ] o.a.s.c.ZkController Register node as live in ZooKeeper:/live_nodes/127.0.0.1:52152_solr
   [junit4]   2> 446753 INFO  (jetty-launcher-490-thread-1) [n:127.0.0.1:52155_solr    ] o.a.s.c.CoreContainer Initializing authentication plugin: org.apache.solr.security.HttpParamDelegationTokenPlugin
   [junit4]   2> 446763 INFO  (zkCallback-500-thread-1-processing-n:127.0.0.1:52152_solr) [n:127.0.0.1:52152_solr    ] o.a.s.c.c.ZkStateReader Updated live nodes from ZooKeeper... (1) -> (2)
   [junit4]   2> 446763 INFO  (zkCallback-501-thread-1-processing-n:127.0.0.1:52155_solr) [n:127.0.0.1:52155_solr    ] o.a.s.c.c.ZkStateReader Updated live nodes from ZooKeeper... (1) -> (2)
   [junit4]   2> 446813 INFO  (jetty-launcher-490-thread-1) [n:127.0.0.1:52155_solr    ] o.a.s.s.KerberosPlugin Params: {token.valid=30, delegation-token.token-kind=solr-dt, cookie.domain=127.0.0.1, cookie.path=/, zk-dt-secret-manager.znodeWorkingPath=solr/security/zkdtsm, token.validity=36000, signer.secret.provider.zookeeper.path=/token, type=kerberos, zk-dt-secret-manager.enable=true, kerberos.name.rules=DEFAULT, signer.secret.provider=zookeeper}
   [junit4]   2> 446834 INFO  (jetty-launcher-490-thread-2) [n:127.0.0.1:52152_solr    ] o.a.s.c.CoreContainer Initializing authentication plugin: org.apache.solr.security.HttpParamDelegationTokenPlugin
   [junit4]   2> 446834 INFO  (jetty-launcher-490-thread-2) [n:127.0.0.1:52152_solr    ] o.a.s.s.KerberosPlugin Params: {token.valid=30, delegation-token.token-kind=solr-dt, cookie.domain=127.0.0.1, cookie.path=/, zk-dt-secret-manager.znodeWorkingPath=solr/security/zkdtsm, token.validity=36000, signer.secret.provider.zookeeper.path=/token, type=kerberos, zk-dt-secret-manager.enable=true, kerberos.name.rules=DEFAULT, signer.secret.provider=zookeeper}
   [junit4]   2> 447173 INFO  (jetty-launcher-490-thread-2) [n:127.0.0.1:52152_solr    ] o.a.c.f.i.CuratorFrameworkImpl Starting
   [junit4]   2> 447173 INFO  (jetty-launcher-490-thread-1) [n:127.0.0.1:52155_solr    ] o.a.c.f.i.CuratorFrameworkImpl Starting
   [junit4]   2> 447244 INFO  (jetty-launcher-490-thread-2-EventThread) [n:127.0.0.1:52152_solr    ] o.a.c.f.s.ConnectionStateManager State change: CONNECTED
   [junit4]   2> 447244 INFO  (jetty-launcher-490-thread-1-EventThread) [n:127.0.0.1:52155_solr    ] o.a.c.f.s.ConnectionStateManager State change: CONNECTED
   [junit4]   2> 447462 ERROR (jetty-launcher-490-thread-2) [n:127.0.0.1:52152_solr    ] o.a.h.u.Shell Failed to locate the winutils binary in the hadoop binary path
   [junit4]   2> java.io.IOException: Could not locate executable null\bin\winutils.exe in the Hadoop binaries.
   [junit4]   2> 	at org.apache.hadoop.util.Shell.getQualifiedBinPath(Shell.java:356)
   [junit4]   2> 	at org.apache.hadoop.util.Shell.getWinUtilsPath(Shell.java:371)
   [junit4]   2> 	at org.apache.hadoop.util.Shell.<clinit>(Shell.java:364)
   [junit4]   2> 	at org.apache.hadoop.util.StringUtils.<clinit>(StringUtils.java:80)
   [junit4]   2> 	at org.apache.hadoop.conf.Configuration.getBoolean(Configuration.java:1437)
   [junit4]   2> 	at org.apache.hadoop.security.token.delegation.web.DelegationTokenManager.<init>(DelegationTokenManager.java:115)
   [junit4]   2> 	at org.apache.hadoop.security.token.delegation.web.DelegationTokenAuthenticationHandler.initTokenManager(DelegationTokenAuthenticationHandler.java:148)
   [junit4]   2> 	at org.apache.hadoop.security.token.delegation.web.DelegationTokenAuthenticationHandler.init(DelegationTokenAuthenticationHandler.java:118)
   [junit4]   2> 	at org.apache.solr.security.HttpParamDelegationTokenPlugin$HttpParamDelegationTokenAuthenticationHandler.init(HttpParamDelegationTokenPlugin.java:178)
   [junit4]   2> 	at org.apache.hadoop.security.authentication.server.AuthenticationFilter.initializeAuthHandler(AuthenticationFilter.java:238)
   [junit4]   2> 	at org.apache.hadoop.security.token.delegation.web.DelegationTokenAuthenticationFilter.initializeAuthHandler(DelegationTokenAuthenticationFilter.java:209)
   [junit4]   2> 	at org.apache.solr.security.DelegationTokenKerberosFilter.initializeAuthHandler(DelegationTokenKerberosFilter.java:142)
   [junit4]   2> 	at org.apache.hadoop.security.authentication.server.AuthenticationFilter.init(AuthenticationFilter.java:227)
   [junit4]   2> 	at org.apache.hadoop.security.token.delegation.web.DelegationTokenAuthenticationFilter.init(DelegationTokenAuthenticationFilter.java:175)
   [junit4]   2> 	at org.apache.solr.security.DelegationTokenKerberosFilter.init(DelegationTokenKerberosFilter.java:71)
   [junit4]   2> 	at org.apache.solr.security.HttpParamDelegationTokenPlugin.init(HttpParamDelegationTokenPlugin.java:134)
   [junit4]   2> 	at org.apache.solr.core.CoreContainer.initializeAuthenticationPlugin(CoreContainer.java:320)
   [junit4]   2> 	at org.apache.solr.core.CoreContainer.reloadSecurityProperties(CoreContainer.java:577)
   [junit4]   2> 	at org.apache.solr.core.CoreContainer.load(CoreContainer.java:467)
   [junit4]   2> 	at org.apache.solr.servlet.SolrDispatchFilter.createCoreContainer(SolrDispatchFilter.java:204)
   [junit4]   2> 	at org.apache.solr.servlet.SolrDispatchFilter.init(SolrDispatchFilter.java:153)
   [junit4]   2> 	at org.eclipse.jetty.servlet.FilterHolder.initialize(FilterHolder.java:137)
   [junit4]   2> 	at org.eclipse.jetty.servlet.ServletHandler.initialize(ServletHandler.java:873)
   [junit4]   2> 	at org.eclipse.jetty.servlet.ServletHandler.updateMappings(ServletHandler.java:1565)
   [junit4]   2> 	at org.eclipse.jetty.servlet.ServletHandler.setFilterMappings(ServletHandler.java:1599)
   [junit4]   2> 	at org.eclipse.jetty.servlet.ServletHandler.addFilterMapping(ServletHandler.java:1285)
   [junit4]   2> 	at org.eclipse.jetty.servlet.ServletHandler.addFilterWithMapping(ServletHandler.java:1130)
   [junit4]   2> 	at org.eclipse.jetty.servlet.ServletContextHandler.addFilter(ServletContextHandler.java:448)
   [junit4]   2> 	at org.apache.solr.client.solrj.embedded.JettySolrRunner$1.lifeCycleStarted(JettySolrRunner.java:260)
   [junit4]   2> 	at org.eclipse.jetty.util.component.AbstractLifeCycle.setStarted(AbstractLifeCycle.java:179)
   [junit4]   2> 	at org.eclipse.jetty.util.component.AbstractLifeCycle.start(AbstractLifeCycle.java:69)
   [junit4]   2> 	at org.apache.solr.client.solrj.embedded.JettySolrRunner.start(JettySolrRunner.java:348)
   [junit4]   2> 	at org.apache.solr.client.solrj.embedded.JettySolrRunner.start(JettySolrRunner.java:321)
   [junit4]   2> 	at org.apache.solr.cloud.MiniSolrCloudCluster.startJettySolrRunner(MiniSolrCloudCluster.java:349)
   [junit4]   2> 	at org.apache.solr.cloud.MiniSolrCloudCluster.lambda$new$0(MiniSolrCloudCluster.java:212)
   [junit4]   2> 	at java.util.concurrent.FutureTask.run(FutureTask.java:266)
   [junit4]   2> 	at org.apache.solr.common.util.ExecutorUtil$MDCAwareThreadPoolExecutor.lambda$execute$0(ExecutorUtil.java:229)
   [junit4]   2> 	at java.util.concurrent.ThreadPoolExecutor.runWorker(ThreadPoolExecutor.java:1142)
   [junit4]   2> 	at java.util.concurrent.ThreadPoolExecutor$Worker.run(ThreadPoolExecutor.java:617)
   [junit4]   2> 	at java.lang.Thread.run(Thread.java:745)
   [junit4]   2> 447714 INFO  (jetty-launcher-490-thread-2) [n:127.0.0.1:52152_solr    ] o.a.s.c.CorePropertiesLocator Found 0 core definitions underneath C:\Users\jenkins\workspace\Lucene-Solr-master-Windows\solr\build\solr-core\test\J0\temp\solr.cloud.TestSolrCloudWithDelegationTokens_F3E0AA87C55439D3-001\tempDir-001\node2\.
   [junit4]   2> 447718 INFO  (jetty-launcher-490-thread-1) [n:127.0.0.1:52155_solr    ] o.a.s.c.CorePropertiesLocator Found 0 core definitions underneath C:\Users\jenkins\workspace\Lucene-Solr-master-Windows\solr\build\solr-core\test\J0\temp\solr.cloud.TestSolrCloudWithDelegationTokens_F3E0AA87C55439D3-001\tempDir-001\node1\.
   [junit4]   2> 447724 WARN  (NIOServerCxn.Factory:0.0.0.0/0.0.0.0:0) [    ] o.a.z.s.NIOServerCnxn caught end of stream exception
   [junit4]   2> EndOfStreamException: Unable to read additional data from client sessionid 0x158e4210b110009, likely client has closed socket
   [junit4]   2> 	at org.apache.zookeeper.server.NIOServerCnxn.doIO(NIOServerCnxn.java:228)
   [junit4]   2> 	at org.apache.zookeeper.server.NIOServerCnxnFactory.run(NIOServerCnxnFactory.java:208)
   [junit4]   2> 	at java.lang.Thread.run(Thread.java:745)
   [junit4]   2> 447749 INFO  (TEST-TestSolrCloudWithDelegationTokens.testDelegationTokenCancel-seed#[F3E0AA87C55439D3]) [    ] o.a.s.SolrTestCaseJ4 ###Starting testDelegationTokenCancel
   [junit4]   2> 449183 ERROR (qtp178855296-3191) [    ] o.a.h.s.t.d.ZKDelegationTokenSecretManager No node in path [/ZKDTSMTokensRoot/DT_1]
   [junit4]   2> 449251 WARN  (TEST-TestSolrCloudWithDelegationTokens.testDelegationTokenCancel-seed#[F3E0AA87C55439D3]) [    ] o.a.h.c.p.ResponseProcessCookies Invalid cookie header: "Set-Cookie: hadoop.auth=; Path=/; Domain=127.0.0.1; Expires= , 01-1-45 00:00:00 GMT; HttpOnly". Invalid 'expires' attribute: , 01-1-45 00:00:00 GMT
   [junit4]   2> 449257 INFO  (TEST-TestSolrCloudWithDelegationTokens.testDelegationTokenCancel-seed#[F3E0AA87C55439D3]) [    ] o.a.s.c.c.ZkStateReader Updated live nodes from ZooKeeper... (0) -> (2)
   [junit4]   2> 449258 INFO  (TEST-TestSolrCloudWithDelegationTokens.testDelegationTokenCancel-seed#[F3E0AA87C55439D3]) [    ] o.a.s.c.s.i.ZkClientClusterStateProvider Cluster at 127.0.0.1:52148/solr ready
   [junit4]   2> 449261 WARN  (TEST-TestSolrCloudWithDelegationTokens.testDelegationTokenCancel-seed#[F3E0AA87C55439D3]) [    ] o.a.h.c.p.ResponseProcessCookies Invalid cookie header: "Set-Cookie: hadoop.auth=; Path=/; Domain=127.0.0.1; Expires= , 01-1-45 00:00:00 GMT; HttpOnly". Invalid 'expires' attribute: , 01-1-45 00:00:00 GMT
   [junit4]   2> 449263 WARN  (NIOServerCxn.Factory:0.0.0.0/0.0.0.0:0) [    ] o.a.z.s.NIOServerCnxn caught end of stream exception
   [junit4]   2> EndOfStreamException: Unable to read additional data from client sessionid 0x158e4210b11000a, likely client has closed socket
   [junit4]   2> 	at org.apache.zookeeper.server.NIOServerCnxn.doIO(NIOServerCnxn.java:228)
   [junit4]   2> 	at org.apache.zookeeper.server.NIOServerCnxnFactory.run(NIOServerCnxnFactory.java:208)
   [junit4]   2> 	at java.lang.Thread.run(Thread.java:745)
   [junit4]   2> 449277 INFO  (TEST-TestSolrCloudWithDelegationTokens.testDelegationTokenCancel-seed#[F3E0AA87C55439D3]) [    ] o.a.s.c.c.ZkStateReader Updated live nodes from ZooKeeper... (0) -> (2)
   [junit4]   2> 449278 INFO  (TEST-TestSolrCloudWithDelegationTokens.testDelegationTokenCancel-seed#[F3E0AA87C55439D3]) [    ] o.a.s.c.s.i.ZkClientClusterStateProvider Cluster at 127.0.0.1:52148/solr ready
   [junit4]   2> 449280 ERROR (qtp540707947-3168) [    ] o.a.h.s.t.d.ZKDelegationTokenSecretManager No node in path [/ZKDTSMTokensRoot/DT_2]
   [junit4]   2> 449287 WARN  (NIOServerCxn.Factory:0.0.0.0/0.0.0.0:0) [    ] o.a.z.s.NIOServerCnxn caught end of stream exception
   [junit4]   2> EndOfStreamException: Unable to read additional data from client sessionid 0x158e4210b11000b, likely client has closed socket
   [junit4]   2> 	at org.apache.zookeeper.server.NIOServerCnxn.doIO(NIOServerCnxn.java:228)
   [junit4]   2> 	at org.apache.zookeeper.server.NIOServerCnxnFactory.run(NIOServerCnxnFactory.java:208)
   [junit4]   2> 	at java.lang.Thread.run(Thread.java:745)
   [junit4]   2> 449293 WARN  (TEST-TestSolrCloudWithDelegationTokens.testDelegationTokenCancel-seed#[F3E0AA87C55439D3]) [    ] o.a.h.c.p.ResponseProcessCookies Invalid cookie header: "Set-Cookie: hadoop.auth=; Path=/; Domain=127.0.0.1; Expires= , 01-1-45 00:00:00 GMT; HttpOnly". Invalid 'expires' attribute: , 01-1-45 00:00:00 GMT
   [junit4]   2> 449297 WARN  (TEST-TestSolrCloudWithDelegationTokens.testDelegationTokenCancel-seed#[F3E0AA87C55439D3]) [    ] o.a.h.c.p.ResponseProcessCookies Invalid cookie header: "Set-Cookie: hadoop.auth=; Path=/; Domain=127.0.0.1; Expires= , 01-1-45 00:00:00 GMT; HttpOnly". Invalid 'expires' attribute: , 01-1-45 00:00:00 GMT
   [junit4]   2> 449297 INFO  (TEST-TestSolrCloudWithDelegationTokens.testDelegationTokenCancel-seed#[F3E0AA87C55439D3]) [    ] o.a.s.SolrTestCaseJ4 ###Ending testDelegationTokenCancel
   [junit4]   2> 449313 INFO  (TEST-TestSolrCloudWithDelegationTokens.testDelegationTokenVerify-seed#[F3E0AA87C55439D3]) [    ] o.a.s.SolrTestCaseJ4 ###Starting testDelegationTokenVerify
   [junit4]   2> 449339 INFO  (TEST-TestSolrCloudWithDelegationTokens.testDelegationTokenVerify-seed#[F3E0AA87C55439D3]) [    ] o.a.s.c.c.ZkStateReader Updated live nodes from ZooKeeper... (0) -> (2)
   [junit4]   2> 449340 INFO  (TEST-TestSolrCloudWithDelegationTokens.testDelegationTokenVerify-seed#[F3E0AA87C55439D3]) [    ] o.a.s.c.s.i.ZkClientClusterStateProvider Cluster at 127.0.0.1:52148/solr ready
   [junit4]   2> 449354 INFO  (qtp540707947-3180) [n:127.0.0.1:52155_solr    ] o.a.s.h.a.CollectionsHandler Invoked Collection Action :list with params action=LIST&delegation=GgADYmFyA2JhcgCKAVjkIRX6igFZCC2Z-gMDFM4A12QwXlByUf2UH7oReO5gB8gvB3NvbHItZHQA&wt=javabin&version=2 and sendToOCPQueue=true
   [junit4]   2> 449354 INFO  (qtp540707947-3180) [n:127.0.0.1:52155_solr    ] o.a.s.s.HttpSolrCall [admin] webapp=null path=/admin/collections params={action=LIST&delegation=GgADYmFyA2JhcgCKAVjkIRX6igFZCC2Z-gMDFM4A12QwXlByUf2UH7oReO5gB8gvB3NvbHItZHQA&wt=javabin&version=2} status=0 QTime=0
   [junit4]   2> 449355 WARN  (NIOServerCxn.Factory:0.0.0.0/0.0.0.0:0) [    ] o.a.z.s.NIOServerCnxn caught end of stream exception
   [junit4]   2> EndOfStreamException: Unable to read additional data from client sessionid 0x158e4210b11000c, likely client has closed socket
   [junit4]   2> 	at org.apache.zookeeper.server.NIOServerCnxn.doIO(NIOServerCnxn.java:228)
   [junit4]   2> 	at org.apache.zookeeper.server.NIOServerCnxnFactory.run(NIOServerCnxnFactory.java:208)
   [junit4]   2> 	at java.lang.Thread.run(Thread.java:745)
   [junit4]   2> 449362 INFO  (TEST-TestSolrCloudWithDelegationTokens.testDelegationTokenVerify-seed#[F3E0AA87C55439D3]) [    ] o.a.s.c.c.ZkStateReader Updated live nodes from ZooKeeper... (0) -> (2)
   [junit4]   2> 449362 INFO  (TEST-TestSolrCloudWithDelegationTokens.testDelegationTokenVerify-seed#[F3E0AA87C55439D3]) [    ] o.a.s.c.s.i.ZkClientClusterStateProvider Cluster at 127.0.0.1:52148/solr ready
   [junit4]   2> 449373 WARN  (TEST-TestSolrCloudWithDelegationTokens.testDelegationTokenVerify-seed#[F3E0AA87C55439D3]) [    ] o.a.h.c.p.ResponseProcessCookies Invalid cookie header: "Set-Cookie: hadoop.auth=; Path=/; Domain=127.0.0.1; Expires= , 01-1-45 00:00:00 GMT; HttpOnly". Invalid 'expires' attribute: , 01-1-45 00:00:00 GMT
   [junit4]   2> 449374 WARN  (NIOServerCxn.Factory:0.0.0.0/0.0.0.0:0) [    ] o.a.z.s.NIOServerCnxn caught end of stream exception
   [junit4]   2> EndOfStreamException: Unable to read additional data from client sessionid 0x158e4210b11000d, likely client has closed socket
   [junit4]   2> 	at org.apache.zookeeper.server.NIOServerCnxn.doIO(NIOServerCnxn.java:228)
   [junit4]   2> 	at org.apache.zookeeper.server.NIOServerCnxnFactory.run(NIOServerCnxnFactory.java:208)
   [junit4]   2> 	at java.lang.Thread.run(Thread.java:745)
   [junit4]   2> 449379 INFO  (qtp540707947-3195) [n:127.0.0.1:52155_solr    ] o.a.s.h.a.CollectionsHandler Invoked Collection Action :list with params action=LIST&delegation=GgADYmFyA2JhcgCKAVjkIRX6igFZCC2Z-gMDFM4A12QwXlByUf2UH7oReO5gB8gvB3NvbHItZHQA&wt=javabin&version=2 and sendToOCPQueue=true
   [junit4]   2> 449379 INFO  (qtp540707947-3195) [n:127.0.0.1:52155_solr    ] o.a.s.s.HttpSolrCall [admin] webapp=null path=/admin/collections params={action=LIST&delegation=GgADYmFyA2JhcgCKAVjkIRX6igFZCC2Z-gMDFM4A12QwXlByUf2UH7oReO5gB8gvB3NvbHItZHQA&wt=javabin&version=2} status=0 QTime=0
   [junit4]   2> 449385 INFO  (TEST-TestSolrCloudWithDelegationTokens.testDelegationTokenVerify-seed#[F3E0AA87C55439D3]) [    ] o.a.s.c.c.ZkStateReader Updated live nodes from ZooKeeper... (0) -> (2)
   [junit4]   2> 449386 INFO  (TEST-TestSolrCloudWithDelegationTokens.testDelegationTokenVerify-seed#[F3E0AA87C55439D3]) [    ] o.a.s.c.s.i.ZkClientClusterStateProvider Cluster at 127.0.0.1:52148/solr ready
   [junit4]   2> 449389 WARN  (TEST-TestSolrCloudWithDelegationTokens.testDelegationTokenVerify-seed#[F3E0AA87C55439D3]) [    ] o.a.h.c.p.ResponseProcessCookies Invalid cookie header: "Set-Cookie: hadoop.auth=; Path=/; Domain=127.0.0.1; Expires= , 01-1-45 00:00:00 GMT; HttpOnly". Invalid 'expires' attribute: , 01-1-45 00:00:00 GMT
   [junit4]   2> 449389 WARN  (NIOServerCxn.Factory:0.0.0.0/0.0.0.0:0) [    ] o.a.z.s.NIOServerCnxn caught end of stream exception
   [junit4]   2> EndOfStreamException: Unable to read additional data from client sessionid 0x158e4210b11000e, likely client has closed socket
   [junit4]   2> 	at org.apache.zookeeper.server.NIOServerCnxn.doIO(NIOServerCnxn.java:228)
   [junit4]   2> 	at org.apache.zookeeper.server.NIOServerCnxnFactory.run(NIOServerCnxnFactory.java:208)
   [junit4]   2> 	at java.lang.Thread.run(Thread.java:745)
   [junit4]   2> 449390 INFO  (TEST-TestSolrCloudWithDelegationTokens.testDelegationTokenVerify-seed#[F3E0AA87C55439D3]) [    ] o.a.s.SolrTestCaseJ4 ###Ending testDelegationTokenVerify
   [junit4]   2> 449407 INFO  (TEST-TestSolrCloudWithDelegationTokens.testDelegationTokenCancelFail-seed#[F3E0AA87C55439D3]) [    ] o.a.s.SolrTestCaseJ4 ###Starting testDelegationTokenCancelFail
   [junit4]   2> 449430 INFO  (TEST-TestSolrCloudWithDelegationTokens.testDelegationTokenCancelFail-seed#[F3E0AA87C55439D3]) [    ] o.a.s.SolrTestCaseJ4 ###Ending testDelegationTokenCancelFail
   [junit4]   2> NOTE: reproduce with: ant test  -Dtestcase=TestSolrCloudWithDelegationTokens -Dtests.method=testDelegationTokenCancelFail -Dtests.seed=F3E0AA87C55439D3 -Dtests.slow=true -Dtests.locale=ja-JP-u-ca-japanese-x-lvariant-JP -Dtests.timezone=Africa/Dakar -Dtests.asserts=true -Dtests.file.encoding=ISO-8859-1
   [junit4] FAILURE 0.04s J0 | TestSolrCloudWithDelegationTokens.testDelegationTokenCancelFail <<<
   [junit4]    > Throwable #1: java.lang.AssertionError: expected:<200> but was:<404>
   [junit4]    > 	at __randomizedtesting.SeedInfo.seed([F3E0AA87C55439D3:9B5F9FAD15CE2B3F]:0)
   [junit4]    > 	at org.apache.solr.cloud.TestSolrCloudWithDelegationTokens.cancelDelegationToken(TestSolrCloudWithDelegationTokens.java:140)
   [junit4]    > 	at org.apache.solr.cloud.TestSolrCloudWithDelegationTokens.testDelegationTokenCancelFail(TestSolrCloudWithDelegationTokens.java:294)
   [junit4]    > 	at java.lang.Thread.run(Thread.java:745)
   [junit4]   2> 449448 INFO  (TEST-TestSolrCloudWithDelegationTokens.testDelegationOtherOp-seed#[F3E0AA87C55439D3]) [    ] o.a.s.SolrTestCaseJ4 ###Starting testDelegationOtherOp
   [junit4]   2> 449453 INFO  (TEST-TestSolrCloudWithDelegationTokens.testDelegationOtherOp-seed#[F3E0AA87C55439D3]) [    ] o.a.s.c.c.ZkStateReader Updated live nodes from ZooKeeper... (0) -> (2)
   [junit4]   2> 449454 INFO  (TEST-TestSolrCloudWithDelegationTokens.testDelegationOtherOp-seed#[F3E0AA87C55439D3]) [    ] o.a.s.c.s.i.ZkClientClusterStateProvider Cluster at 127.0.0.1:52148/solr ready
   [junit4]   2> 449456 INFO  (qtp540707947-3168) [n:127.0.0.1:52155_solr    ] o.a.s.h.a.CollectionsHandler Invoked Collection Action :list with params op=someSolrOperation&action=LIST&wt=javabin&version=2 and sendToOCPQueue=true
   [junit4]   2> 449456 INFO  (qtp540707947-3168) [n:127.0.0.1:52155_solr    ] o.a.s.s.HttpSolrCall [admin] webapp=null path=/admin/collections params={op=someSolrOperation&action=LIST&wt=javabin&version=2} status=0 QTime=0
   [junit4]   2> 449458 WARN  (TEST-TestSolrCloudWithDelegationTokens.testDelegationOtherOp-seed#[F3E0AA87C55439D3]) [    ] o.a.h.c.p.ResponseProcessCookies Invalid cookie header: "Set-Cookie: hadoop.auth="u=bar&p=bar&t=test&e=1481332123527&s=DIzea5HeUU1er3iwNic9pcUYbsc="; Path=/; Domain=127.0.0.1; Expires= , 10-12-28 01:08:43 GMT; HttpOnly". Invalid 'expires' attribute: , 10-12-28 01:08:43 GMT
   [junit4]   2> 449459 WARN  (NIOServerCxn.Factory:0.0.0.0/0.0.0.0:0) [    ] o.a.z.s.NIOServerCnxn caught end of stream exception
   [junit4]   2> EndOfStreamException: Unable to read additional data from client sessionid 0x158e4210b11000f, likely client has closed socket
   [junit4]   2> 	at org.apache.zookeeper.server.NIOServerCnxn.doIO(NIOServerCnxn.java:228)
   [junit4]   2> 	at org.apache.zookeeper.server.NIOServerCnxnFactory.run(NIOServerCnxnFactory.java:208)
   [junit4]   2> 	at java.lang.Thread.run(Thread.java:745)
   [junit4]   2> 449461 INFO  (TEST-TestSolrCloudWithDelegationTokens.testDelegationOtherOp-seed#[F3E0AA87C55439D3]) [    ] o.a.s.SolrTestCaseJ4 ###Ending testDelegationOtherOp
   [junit4]   2> 449483 INFO  (TEST-TestSolrCloudWithDelegationTokens.testDelegationTokenRenew-seed#[F3E0AA87C55439D3]) [    ] o.a.s.SolrTestCaseJ4 ###Starting testDelegationTokenRenew
   [junit4]   2> 449518 INFO  (TEST-TestSolrCloudWithDelegationTokens.testDelegationTokenRenew-seed#[F3E0AA87C55439D3]) [    ] o.a.s.c.c.ZkStateReader Updated live nodes from ZooKeeper... (0) -> (2)
   [junit4]   2> 449518 INFO  (TEST-TestSolrCloudWithDelegationTokens.testDelegationTokenRenew-seed#[F3E0AA87C55439D3]) [    ] o.a.s.c.s.i.ZkClientClusterStateProvider Cluster at 127.0.0.1:52148/solr ready
   [junit4]   2> 449521 INFO  (qtp540707947-3168) [n:127.0.0.1:52155_solr    ] o.a.s.h.a.CollectionsHandler Invoked Collection Action :list with params action=LIST&delegation=GgADYmFyA2JhcgCKAVjkIRaligFZCC2apQUDFPV7alvsR_u9wjqP0YpdSWi6WjhEB3NvbHItZHQA&wt=javabin&version=2 and sendToOCPQueue=true
   [junit4]   2> 449521 INFO  (qtp540707947-3168) [n:127.0.0.1:52155_solr    ] o.a.s.s.HttpSolrCall [admin] webapp=null path=/admin/collections params={action=LIST&delegation=GgADYmFyA2JhcgCKAVjkIRaligFZCC2apQUDFPV7alvsR_u9wjqP0YpdSWi6WjhEB3NvbHItZHQA&wt=javabin&version=2} status=0 QTime=0
   [junit4]   2> 449524 WARN  (NIOServerCxn.Factory:0.0.0.0/0.0.0.0:0) [    ] o.a.z.s.NIOServerCnxn caught end of stream exception
   [junit4]   2> EndOfStreamException: Unable to read additional data from client sessionid 0x158e4210b110010, likely client has closed socket
   [junit4]   2> 	at org.apache.zookeeper.server.NIOServerCnxn.doIO(NIOServerCnxn.java:228)
   [junit4]   2> 	at org.apache.zookeeper.server.NIOServerCnxnFactory.run(NIOServerCnxnFactory.java:208)
   [junit4]   2> 	at java.lang.Thread.run(Thread.java:745)
   [junit4]   2> 449529 WARN  (TEST-TestSolrCloudWithDelegationTokens.testDelegationTokenRenew-seed#[F3E0AA87C55439D3]) [    ] o.a.h.c.p.ResponseProcessCookies Invalid cookie header: "Set-Cookie: hadoop.auth=; Path=/; Domain=127.0.0.1; Expires= , 01-1-45 00:00:00 GMT; HttpOnly". Invalid 'expires' attribute: , 01-1-45 00:00:00 GMT
   [junit4]   2> 449533 INFO  (qtp540707947-3168) [n:127.0.0.1:52155_solr    ] o.a.s.h.a.CollectionsHandler Invoked Collection Action :list with params action=LIST&delegation=GgADYmFyA2JhcgCKAVjkIRaligFZCC2apQUDFPV7alvsR_u9wjqP0YpdSWi6WjhEB3NvbHItZHQA&wt=javabin&version=2 and sendToOCPQueue=true
   [junit4]   2> 449533 INFO  (qtp540707947-3168) [n:127.0.0.1:52155_solr    ] o.a.s.s.HttpSolrCall [admin] webapp=null path=/admin/collections params={action=LIST&delegation=GgADYmFyA2JhcgCKAVjkIRaligFZCC2apQUDFPV7alvsR_u9wjqP0YpdSWi6WjhEB3NvbHItZHQA&wt=javabin&version=2} status=0 QTime=0
   [junit4]   2> 449537 WARN  (TEST-TestSolrCloudWithDelegationTokens.testDelegationTokenRenew-seed#[F3E0AA87C55439D3]) [    ] o.a.h.c.p.ResponseProcessCookies Invalid cookie header: "Set-Cookie: hadoop.auth=; Path=/; Domain=127.0.0.1; Expires= , 01-1-45 00:00:00 GMT; HttpOnly". Invalid 'expires' attribute: , 01-1-45 00:00:00 GMT
   [junit4]   2> 449563 INFO  (TEST-TestSolrCloudWithDelegationTokens.testDelegationTokenRenew-seed#[F3E0AA87C55439D3]) [    ] o.a.s.c.c.ZkStateReader Updated live nodes from ZooKeeper... (0) -> (2)
   [junit4]   2> 449563 INFO  (TEST-TestSolrCloudWithDelegationTokens.testDelegationTokenRenew-seed#[F3E0AA87C55439D3]) [    ] o.a.s.c.s.i.ZkClientClusterStateProvider Cluster at 127.0.0.1:52148/solr ready
   [junit4]   2> 449565 INFO  (qtp540707947-3178) [n:127.0.0.1:52155_solr    ] o.a.s.h.a.CollectionsHandler Invoked Collection Action :list with params action=LIST&delegation=GgADYmFyA2JhcgCKAVjkIRbZigFZCC2a2QYDFAO0AmxHirVVdLuSWWU-Xm3GhgVBB3NvbHItZHQA&wt=javabin&version=2 and sendToOCPQueue=true
   [junit4]   2> 449565 INFO  (qtp540707947-3178) [n:127.0.0.1:52155_solr    ] o.a.s.s.HttpSolrCall [admin] webapp=null path=/admin/collections params={action=LIST&delegation=GgADYmFyA2JhcgCKAVjkIRbZigFZCC2a2QYDFAO0AmxHirVVdLuSWWU-Xm3GhgVBB3NvbHItZHQA&wt=javabin&version=2} status=0 QTime=0
   [junit4]   2> 449566 WARN  (NIOServerCxn.Factory:0.0.0.0/0.0.0.0:0) [    ] o.a.z.s.NIOServerCnxn caught end of stream exception
   [junit4]   2> EndOfStreamException: Unable to read additional data from client sessionid 0x158e4210b110011, likely client has closed socket
   [junit4]   2> 	at org.apache.zookeeper.server.NIOServerCnxn.doIO(NIOServerCnxn.java:228)
   [junit4]   2> 	at org.apache.zookeeper.server.NIOServerCnxnFactory.run(NIOServerCnxnFactory.java:208)
   [junit4]   2> 	at java.lang.Thread.run(Thread.java:745)
   [junit4]   2> 449570 WARN  (TEST-TestSolrCloudWithDelegationTokens.testDelegationTokenRenew-seed#[F3E0AA87C55439D3]) [    ] o.a.h.c.p.ResponseProcessCookies Invalid cookie header: "Set-Cookie: hadoop.auth=; Path=/; Domain=127.0.0.1; Expires= , 01-1-45 00:00:00 GMT; HttpOnly". Invalid 'expires' attribute: , 01-1-45 00:00:00 GMT
   [junit4]   2> 449573 INFO  (qtp540707947-3180) [n:127.0.0.1:52155_solr    ] o.a.s.h.a.CollectionsHandler Invoked Collection Action :list with params action=LIST&delegation=GgADYmFyA2JhcgCKAVjkIRbZigFZCC2a2QYDFAO0AmxHirVVdLuSWWU-Xm3GhgVBB3NvbHItZHQA&wt=javabin&version=2 and sendToOCPQueue=true
   [junit4]   2> 449574 INFO  (qtp540707947-3180) [n:127.0.0.1:52155_solr    ] o.a.s.s.HttpSolrCall [admin] webapp=null path=/admin/collections params={action=LIST&delegation=GgADYmFyA2JhcgCKAVjkIRbZigFZCC2a2QYDFAO0AmxHirVVdLuSWWU-Xm3GhgVBB3NvbHItZHQA&wt=javabin&version=2} status=0 QTime=0
   [junit4]   2> 449582 INFO  (TEST-TestSolrCloudWithDelegationTokens.testDelegationTokenRenew-seed#[F3E0AA87C55439D3]) [    ] o.a.s.c.c.ZkStateReader Updated live nodes from ZooKeeper... (0) -> (2)
   [junit4]   2> 449584 INFO  (TEST-TestSolrCloudWithDelegationTokens.testDelegationTokenRenew-seed#[F3E0AA87C55439D3]) [    ] o.a.s.c.s.i.ZkClientClusterStateProvider Cluster at 127.0.0.1:52148/solr ready
   [junit4]   2> 449586 WARN  (TEST-TestSolrCloudWithDelegationTokens.testDelegationTokenRenew-seed#[F3E0AA87C55439D3]) [    ] o.a.h.c.p.ResponseProcessCookies Invalid cookie header: "Set-Cookie: hadoop.auth=; Path=/; Domain=127.0.0.1; Expires= , 01-1-45 00:00:00 GMT; HttpOnly". Invalid 'expires' attribute: , 01-1-45 00:00:00 GMT
   [junit4]   2> 449588 WARN  (NIOServerCxn.Factory:0.0.0.0/0.0.0.0:0) [    ] o.a.z.s.NIOServerCnxn caught end of stream exception
   [junit4]   2> EndOfStreamException: Unable to read additional data from client sessionid 0x158e4210b110012, likely client has closed socket
   [junit4]   2> 	at org.apache.zookeeper.server.NIOServerCnxn.doIO(NIOServerCnxn.java:228)
   [junit4]   2> 	at org.apache.zookeeper.server.NIOServerCnxnFactory.run(NIOServerCnxnFactory.java:208)
   [junit4]   2> 	at java.lang.Thread.run(Thread.java:745)
   [junit4]   2> 449604 INFO  (qtp178855296-3191) [n:127.0.0.1:52152_solr    ] o.a.s.h.a.CollectionsHandler Invoked Collection Action :list with params action=LIST&delegation=GgADYmFyA2JhcgCKAVjkIRcNigFZCC2bDQcDFFKW_dxcYpPJfbcBsWO1KlXMlbhbB3NvbHItZHQA&wt=javabin&version=2 and sendToOCPQueue=true
   [junit4]   2> 449604 INFO  (qtp178855296-3191) [n:127.0.0.1:52152_solr    ] o.a.s.s.HttpSolrCall [admin] webapp=null path=/admin/collections params={action=LIST&delegation=GgADYmFyA2JhcgCKAVjkIRcNigFZCC2bDQcDFFKW_dxcYpPJfbcBsWO1KlXMlbhbB3NvbHItZHQA&wt=javabin&version=2} status=0 QTime=0
   [junit4]   2> 449611 INFO  (TEST-TestSolrCloudWithDelegationTokens.testDelegationTokenRenew-seed#[F3E0AA87C55439D3]) [    ] o.a.s.c.c.ZkStateReader Updated live nodes from ZooKeeper... (0) -> (2)
   [junit4]   2> 449612 INFO  (TEST-TestSolrCloudWithDelegationTokens.testDelegationTokenRenew-seed#[F3E0AA87C55439D3]) [    ] o.a.s.c.s.i.ZkClientClusterStateProvider Cluster at 127.0.0.1:52148/solr ready
   [junit4]   2> 449615 WARN  (TEST-TestSolrCloudWithDelegationTokens.testDelegationTokenRenew-seed#[F3E0AA87C55439D3]) [    ] o.a.h.c.p.ResponseProcessCookies Invalid cookie header: "Set-Cookie: hadoop.auth=; Path=/; Domain=127.0.0.1; Expires= , 01-1-45 00:00:00 GMT; HttpOnly". Invalid 'expires' attribute: , 01-1-45 00:00:00 GMT
   [junit4]   2> 449615 WARN  (NIOServerCxn.Factory:0.0.0.0/0.0.0.0:0) [    ] o.a.z.s.NIOServerCnxn caught end of stream exception
   [junit4]   2> EndOfStreamException: Unable to read additional data from client sessionid 0x158e4210b110013, likely client has closed socket
   [junit4]   2> 	at org.apache.zookeeper.server.NIOServerCnxn.doIO(NIOServerCnxn.java:228)
   [junit4]   2> 	at org.apache.zookeeper.server.NIOServerCnxnFactory.run(NIOServerCnxnFactory.java:208)
   [junit4]   2> 	at java.lang.Thread.run(Thread.java:745)
   [junit4]   2> 449620 INFO  (qtp540707947-3180) [n:127.0.0.1:52155_solr    ] o.a.s.h.a.CollectionsHandler Invoked Collection Action :list with params action=LIST&delegation=GgADYmFyA2JhcgCKAVjkIRcNigFZCC2bDQcDFFKW_dxcYpPJfbcBsWO1KlXMlbhbB3NvbHItZHQA&wt=javabin&version=2 and sendToOCPQueue=true
   [junit4]   2> 449620 INFO  (qtp540707947-3180) [n:127.0.0.1:52155_solr    ] o.a.s.s.HttpSolrCall [admin] webapp=null path=/admin/collections params={action=LIST&delegation=GgADYmFyA2JhcgCKAVjkIRcNigFZCC2bDQcDFFKW_dxcYpPJfbcBsWO1KlXMlbhbB3NvbHItZHQA&wt=javabin&version=2} status=0 QTime=0
   [junit4]   2> 449625 WARN  (TEST-TestSolrCloudWithDelegationTokens.testDelegationTokenRenew-seed#[F3E0AA87C55439D3]) [    ] o.a.h.c.p.ResponseProcessCookies Invalid cookie header: "Set-Cookie: hadoop.auth=; Path=/; Domain=127.0.0.1; Expires= , 01-1-45 00:00:00 GMT; HttpOnly". Invalid 'expires' attribute: , 01-1-45 00:00:00 GMT
   [junit4]   2> 449658 INFO  (TEST-TestSolrCloudWithDelegationTokens.testDelegationTokenRenew-seed#[F3E0AA87C55439D3]) [    ] o.a.s.c.c.ZkStateReader Updated live nodes from ZooKeeper... (0) -> (2)
   [junit4]   2> 449660 INFO  (TEST-TestSolrCloudWithDelegationTokens.testDelegationTokenRenew-seed#[F3E0AA87C55439D3]) [    ] o.a.s.c.s.i.ZkClientClusterStateProvider Cluster at 127.0.0.1:52148/solr ready
   [junit4]   2> 449661 INFO  (qtp540707947-3178) [n:127.0.0.1:52155_solr    ] o.a.s.h.a.CollectionsHandler Invoked Collection Action :list with params action=LIST&delegation=GgADYmFyA2JhcgCKAVjkIRcyigFZCC2bMggDFEb_lq_lL7nwM1tWvM0n-fAWLk7yB3NvbHItZHQA&wt=javabin&version=2 and sendToOCPQueue=true
   [junit4]   2> 449661 INFO  (qtp540707947-3178) [n:127.0.0.1:52155_solr    ] o.a.s.s.HttpSolrCall [admin] webapp=null path=/admin/collections params={action=LIST&delegation=GgADYmFyA2JhcgCKAVjkIRcyigFZCC2bMggDFEb_lq_lL7nwM1tWvM0n-fAWLk7yB3NvbHItZHQA&wt=javabin&version=2} status=0 QTime=0
   [junit4]   2> 449662 WARN  (NIOServerCxn.Factory:0.0.0.0/0.0.0.0:0) [    ] o.a.z.s.NIOServerCnxn caught end of stream exception
   [junit4]   2> EndOfStreamException: Unable to read additional data from client sessionid 0x158e4210b110014, likely client has closed socket
   [junit4]   2> 	at org.apache.zookeeper.server.NIOServerCnxn.doIO(NIOServerCnxn.java:228)
   [junit4]   2> 	at org.apache.zookeeper.server.NIOServerCnxnFactory.run(NIOServerCnxnFactory.java:208)
   [junit4]   2> 	at java.lang.Thread.run(Thread.java:745)
   [junit4]   2> 449666 WARN  (TEST-TestSolrCloudWithDelegationTokens.testDelegationTokenRenew-seed#[F3E0AA87C55439D3]) [    ] o.a.h.c.p.ResponseProcessCookies Invalid cookie header: "Set-Cookie: hadoop.auth=; Path=/; Domain=127.0.0.1; Expires= , 01-1-45 00:00:00 GMT; HttpOnly". Invalid 'expires' attribute: , 01-1-45 00:00:00 GMT
   [junit4]   2> 449672 INFO  (TEST-TestSolrCloudWithDelegationTokens.testDelegationTokenRenew-seed#[F3E0AA87C55439D3]) [    ] o.a.s.c.c.ZkStateReader Updated live nodes from ZooKeeper... (0) -> (2)
   [junit4]   2> 449673 INFO  (TEST-TestSolrCloudWithDelegationTokens.testDelegationTokenRenew-seed#[F3E0AA87C55439D3]) [    ] o.a.s.c.s.i.ZkClientClusterStateProvider Cluster at 127.0.0.1:52148/solr ready
   [junit4]   2> 449675 INFO  (qtp540707947-3194) [n:127.0.0.1:52155_solr    ] o.a.s.h.a.CollectionsHandler Invoked Collection Action :list with params action=LIST&delegation=GgADYmFyA2JhcgCKAVjkIRcyigFZCC2bMggDFEb_lq_lL7nwM1tWvM0n-fAWLk7yB3NvbHItZHQA&wt=javabin&version=2 and sendToOCPQueue=true
   [junit4]   2> 449675 INFO  (qtp540707947-3194) [n:127.0.0.1:52155_solr    ] o.a.s.s.HttpSolrCall [admin] webapp=null path=/admin/collections params={action=LIST&delegation=GgADYmFyA2JhcgCKAVjkIRcyigFZCC2bMggDFEb_lq_lL7nwM1tWvM0n-fAWLk7yB3NvbHItZHQA&wt=javabin&version=2} status=0 QTime=0
   [junit4]   2> 449677 WARN  (NIOServerCxn.Factory:0.0.0.0/0.0.0.0:0) [    ] o.a.z.s.NIOServerCnxn caught end of stream exception
   [junit4]   2> EndOfStreamException: Unable to read additional data from client sessionid 0x158e4210b110015, likely client has closed socket
   [junit4]   2> 	at org.apache.zookeeper.server.NIOServerCnxn.doIO(NIOServerCnxn.java:228)
   [junit4]   2> 	at org.apache.zookeeper.server.NIOServerCnxnFactory.run(NIOServerCnxnFactory.java:208)
   [junit4]   2> 	at java.lang.Thread.run(Thread.java:745)
   [junit4]   2> 449680 WARN  (TEST-TestSolrCloudWithDelegationTokens.testDelegationTokenRenew-seed#[F3E0AA87C55439D3]) [    ] o.a.h.c.p.ResponseProcessCookies Invalid cookie header: "Set-Cookie: hadoop.auth=; Path=/; Domain=127.0.0.1; Expires= , 01-1-45 00:00:00 GMT; HttpOnly". Invalid 'expires' attribute: , 01-1-45 00:00:00 GMT
   [junit4]   2> 449681 INFO  (TEST-TestSolrCloudWithDelegationTokens.testDelegationTokenRenew-seed#[F3E0AA87C55439D3]) [    ] o.a.s.SolrTestCaseJ4 ###Ending testDelegationTokenRenew
   [junit4]   2> 449698 INFO  (TEST-TestSolrCloudWithDelegationTokens.testZNodePaths-seed#[F3E0AA87C55439D3]) [    ] o.a.s.SolrTestCaseJ4 ###Starting testZNodePaths
   [junit4]   2> 449710 WARN  (NIOServerCxn.Factory:0.0.0.0/0.0.0.0:0) [    ] o.a.z.s.NIOServerCnxn caught end of stream exception
   [junit4]   2> EndOfStreamException: Unable to read additional data from client sessionid 0x158e4210b110016, likely client has closed socket
   [junit4]   2> 	at org.apache.zookeeper.server.NIOServerCnxn.doIO(NIOServerCnxn.java:228)
   [junit4]   2> 	at org.apache.zookeeper.server.NIOServerCnxnFactory.run(NIOServerCnxnFactory.java:208)
   [junit4]   2> 	at java.lang.Thread.run(Thread.java:745)
   [junit4]   2> 449711 INFO  (TEST-TestSolrCloudWithDelegationTokens.testZNodePaths-seed#[F3E0AA87C55439D3]) [    ] o.a.s.SolrTestCaseJ4 ###Ending testZNodePaths
   [junit4]   2> 449737 INFO  (TEST-TestSolrCloudWithDelegationTokens.testDelegationTokenRenewFail-seed#[F3E0AA87C55439D3]) [    ] o.a.s.SolrTestCaseJ4 ###Starting testDelegationTokenRenewFail
   [junit4]   2> 449742 WARN  (qtp178855296-3175) [    ] o.a.h.s.a.s.AuthenticationFilter Authentication exception: org.apache.hadoop.security.AccessControlException: foo tries to renew a token with renewer bar
   [junit4]   2> 449743 WARN  (qtp178855296-3175) [    ] o.a.s.s.KerberosPlugin Could not find org.apache.solr.security.kerberosplugin.requestcontinues
   [junit4]   2> 449743 WARN  (TEST-TestSolrCloudWithDelegationTokens.testDelegationTokenRenewFail-seed#[F3E0AA87C55439D3]) [    ] o.a.h.c.p.ResponseProcessCookies Invalid cookie header: "Set-Cookie: hadoop.auth=; Path=/; Domain=127.0.0.1; Expires= , 01-1-45 00:00:00 GMT; HttpOnly". Invalid 'expires' attribute: , 01-1-45 00:00:00 GMT
   [junit4]   2> 449744 WARN  (qtp540707947-3168) [n:127.0.0.1:52155_solr    ] o.a.h.s.a.s.AuthenticationFilter Authentication exception: org.apache.hadoop.security.AccessControlException: foo tries to renew a token with renewer bar
   [junit4]   2> 449746 WARN  (qtp540707947-3168) [n:127.0.0.1:52155_solr    ] o.a.s.s.KerberosPlugin Could not find org.apache.solr.security.kerberosplugin.requestcontinues
   [junit4]   2> 449748 WARN  (TEST-TestSolrCloudWithDelegationTokens.testDelegationTokenRenewFail-seed#[F3E0AA87C55439D3]) [    ] o.a.h.c.p.ResponseProcessCookies Invalid cookie header: "Set-Cookie: hadoop.auth=; Path=/; Domain=127.0.0.1; Expires= , 01-1-45 00:00:00 GMT; HttpOnly". Invalid 'expires' attribute: , 01-1-45 00:00:00 GMT
   [junit4]   2> 449754 WARN  (qtp178855296-3192) [    ] o.a.h.s.a.s.AuthenticationFilter Authentication exception: org.apache.hadoop.security.AccessControlException: notRenewUser tries to renew a token with renewer renewUser
   [junit4]   2> 449757 WARN  (qtp178855296-3192) [    ] o.a.s.s.KerberosPlugin Could not find org.apache.solr.security.kerberosplugin.requestcontinues
   [junit4]   2> 449757 WARN  (TEST-TestSolrCloudWithDelegationTokens.testDelegationTokenRenewFail-seed#[F3E0AA87C55439D3]) [    ] o.a.h.c.p.ResponseProcessCookies Invalid cookie header: "Set-Cookie: hadoop.auth=; Path=/; Domain=127.0.0.1; Expires= , 01-1-45 00:00:00 GMT; HttpOnly". Invalid 'expires' attribute: , 01-1-45 00:00:00 GMT
   [junit4]   2> 449758 WARN  (qtp540707947-3168) [n:127.0.0.1:52155_solr    ] o.a.h.s.a.s.AuthenticationFilter Authentication exception: org.apache.hadoop.security.AccessControlException: notRenewUser tries to renew a token with renewer renewUser
   [junit4]   2> 449758 WARN  (qtp540707947-3168) [n:127.0.0.1:52155_solr    ] o.a.s.s.KerberosPlugin Could not find org.apache.solr.security.kerberosplugin.requestcontinues
   [junit4]   2> 449759 WARN  (TEST-TestSolrCloudWithDelegationTokens.testDelegationTokenRenewFail-seed#[F3E0AA87C55439D3]) [    ] o.a.h.c.p.ResponseProcessCookies Invalid cookie header: "Set-Cookie: hadoop.auth=; Path=/; Domain=127.0.0.1; Expires= , 01-1-45 00:00:00 GMT; HttpOnly". Invalid 'expires' attribute: , 01-1-45 00:00:00 GMT
   [junit4]   2> 449759 INFO  (TEST-TestSolrCloudWithDelegationTokens.testDelegationTokenRenewFail-seed#[F3E0AA87C55439D3]) [    ] o.a.s.SolrTestCaseJ4 ###Ending testDelegationTokenRenewFail
   [junit4]   2> 449788 INFO  (TEST-TestSolrCloudWithDelegationTokens.testDelegationTokenSolrClient-seed#[F3E0AA87C55439D3]) [    ] o.a.s.SolrTestCaseJ4 ###Starting testDelegationTokenSolrClient
   [junit4]   2> 449796 WARN  (TEST-TestSolrCloudWithDelegationTokens.testDelegationTokenSolrClient-seed#[F3E0AA87C55439D3]) [    ] o.a.h.c.p.ResponseProcessCookies Invalid cookie header: "Set-Cookie: hadoop.auth=; Path=/; Domain=127.0.0.1; Expires= , 01-1-45 00:00:00 GMT; HttpOnly". Invalid 'expires' attribute: , 01-1-45 00:00:00 GMT
   [junit4]   2> 449801 INFO  (qtp178855296-3191) [n:127.0.0.1:52152_solr    ] o.a.s.h.a.CollectionsHandler Invoked Collection Action :list with params action=LIST&delegation=GgADYmFyA2JhcgCKAVjkIRfVigFZCC2b1QwDFODjLwJ8AnOLr9OApm3Zo1uD6RKrB3NvbHItZHQA&wt=javabin&version=2 and sendToOCPQueue=true
   [junit4]   2> 449801 INFO  (qtp178855296-3191) [n:127.0.0.1:52152_solr    ] o.a.s.s.HttpSolrCall [admin] webapp=null path=/admin/collections params={action=LIST&delegation=GgADYmFyA2JhcgCKAVjkIRfVigFZCC2b1QwDFODjLwJ8AnOLr9OApm3Zo1uD6RKrB3NvbHItZHQA&wt=javabin&version=2} status=0 QTime=0
   [junit4]   2> 449801 INFO  (TEST-TestSolrCloudWithDelegationTokens.testDelegationTokenSolrClient-seed#[F3E0AA87C55439D3]) [    ] o.a.s.SolrTestCaseJ4 ###Ending testDelegationTokenSolrClient
   [junit4]   2> 449805 INFO  (jetty-launcher-490-thread-1) [    ] o.e.j.s.AbstractConnector Stopped ServerConnector@4bcf1554{HTTP/1.1,[http/1.1]}{127.0.0.1:0}
   [junit4]   2> 449805 INFO  (jetty-launcher-490-thread-2) [    ] o.e.j.s.AbstractConnector Stopped ServerConnector@520a48d6{HTTP/1.1,[http/1.1]}{127.0.0.1:0}
   [junit4]   2> 449805 INFO  (jetty-launcher-490-thread-1) [    ] o.a.s.c.CoreContainer Shutting down CoreContainer instance=997781367
   [junit4]   2> 449806 INFO  (jetty-launcher-490-thread-2) [    ] o.a.s.c.CoreContainer Shutting down CoreContainer instance=1021957031
   [junit4]   2> 449810 INFO  (jetty-launcher-490-thread-1) [    ] o.a.s.c.Overseer Overseer (id=97078222559182853-127.0.0.1:52152_solr-n_0000000000) closing
   [junit4]   2> 449810 INFO  (OverseerStateUpdate-97078222559182853-127.0.0.1:52152_solr-n_0000000000) [n:127.0.0.1:52152_solr    ] o.a.s.c.Overseer Overseer Loop exiting : 127.0.0.1:52152_solr
   [junit4]   2> 451312 WARN  (zkCallback-501-thread-1-processing-n:127.0.0.1:52155_solr) [n:127.0.0.1:52155_solr    ] o.a.s.c.c.ZkStateReader ZooKeeper watch triggered, but Solr cannot talk to ZK: [KeeperErrorCode = Session expired for /live_nodes]
   [junit4]   2> 451312 WARN  (zkCallback-500-thread-2-processing-n:127.0.0.1:52152_solr) [n:127.0.0.1:52152_solr    ] o.a.s.c.c.ZkStateReader ZooKeeper watch triggered, but Solr cannot talk to ZK: [KeeperErrorCode = Session expired for /live_nodes]
   [junit4]   2> 451312 ERROR (Thread[Thread-674,5,TGRP-TestSolrCloudWithDelegationTokens]) [n:127.0.0.1:52152_solr    ] o.a.h.s.t.d.AbstractDelegationTokenSecretManager ExpiredTokenRemover received java.lang.InterruptedException: sleep interrupted
   [junit4]   2> 451312 ERROR (Thread[Thread-676,5,TGRP-TestSolrCloudWithDelegationTokens]) [n:127.0.0.1:52155_solr    ] o.a.h.s.t.d.AbstractDelegationTokenSecretManager ExpiredTokenRemover received java.lang.InterruptedException: sleep interrupted
   [junit4]   2> 451343 INFO  (jetty-launcher-490-thread-1) [    ] o.e.j.s.h.ContextHandler Stopped o.e.j.s.ServletContextHandler@6d714aea{/solr,null,UNAVAILABLE}
   [junit4]   2> 451344 INFO  (jetty-launcher-490-thread-2) [    ] o.e.j.s.h.ContextHandler Stopped o.e.j.s.ServletContextHandler@1dbc5c9f{/solr,null,UNAVAILABLE}
   [junit4]   2> 451348 INFO  (SUITE-TestSolrCloudWithDelegationTokens-seed#[F3E0AA87C55439D3]-worker) [    ] o.a.s.c.ZkTestServer connecting to 127.0.0.1:52148 52148
   [junit4]   2> 451349 INFO  (Thread-651) [    ] o.a.s.c.ZkTestServer connecting to 127.0.0.1:52148 52148
   [junit4]   2> 451351 WARN  (Thread-651) [    ] o.a.s.c.ZkTestServer Watch limit violations: 
   [junit4]   2> Maximum concurrent create/delete watches above limit:
   [junit4]   2> 
   [junit4]   2> 	14	/solr/aliases.json
   [junit4]   2> 	14	/solr/clusterprops.json
   [junit4]   2> 	2	/solr/security.json
   [junit4]   2> 
   [junit4]   2> Maximum concurrent data watches above limit:
   [junit4]   2> 
   [junit4]   2> 	14	/solr/clusterstate.json
   [junit4]   2> 	4	/solr/security/zkdtsm/ZKDTSMRoot/ZKDTSMKeyIdRoot
   [junit4]   2> 	2	/solr/security/zkdtsm/ZKDTSMRoot/ZKDTSMTokensRoot/DT_7
   [junit4]   2> 	2	/solr/security/zkdtsm/ZKDTSMRoot/ZKDTSMTokensRoot/DT_6
   [junit4]   2> 	2	/solr/security/zkdtsm/ZKDTSMRoot/ZKDTSMTokensRoot/DT_9
   [junit4]   2> 	2	/solr/security/zkdtsm/ZKDTSMRoot/ZKDTSMTokensRoot/DT_8
   [junit4]   2> 	2	/solr/security/zkdtsm/ZKDTSMRoot/ZKDTSMMasterKeyRoot/DK_1
   [junit4]   2> 	2	/solr/security/zkdtsm/ZKDTSMRoot/ZKDTSMTokensRoot/DT_1
   [junit4]   2> 	2	/solr/security/zkdtsm/ZKDTSMRoot/ZKDTSMMasterKeyRoot/DK_3
   [junit4]   2> 	2	/solr/security/zkdtsm/ZKDTSMRoot/ZKDTSMTokensRoot/DT_3
   [junit4]   2> 	2	/solr/security/zkdtsm/ZKDTSMRoot/ZKDTSMMasterKeyRoot/DK_2
   [junit4]   2> 	2	/solr/security/zkdtsm/ZKDTSMRoot/ZKDTSMTokensRoot/DT_2
   [junit4]   2> 	2	/solr/security/zkdtsm/ZKDTSMRoot/ZKDTSMTokensRoot/DT_5
   [junit4]   2> 	2	/solr/security/zkdtsm/ZKDTSMRoot/ZKDTSMMasterKeyRoot/DK_4
   [junit4]   2> 	2	/solr/security/zkdtsm/ZKDTSMRoot/ZKDTSMTokensRoot/DT_4
   [junit4]   2> 	2	/solr/security/zkdtsm/ZKDTSMRoot/ZKDTSMTokensRoot/DT_12
   [junit4]   2> 	2	/solr/security/zkdtsm/ZKDTSMRoot/ZKDTSMSeqNumRoot
   [junit4]   2> 	2	/solr/security/zkdtsm/ZKDTSMRoot/ZKDTSMTokensRoot/DT_11
   [junit4]   2> 	2	/solr/security/zkdtsm/ZKDTSMRoot/ZKDTSMTokensRoot/DT_10
   [junit4]   2> 
   [junit4]   2> Maximum concurrent children watches above limit:
   [junit4]   2> 
   [junit4]   2> 	14	/solr/live_nodes
   [junit4]   2> 	14	/solr/collections
   [junit4]   2> 	3	/solr/overseer/queue
   [junit4]   2> 	3	/solr/overseer/collection-queue-work
   [junit4]   2> 	2	/solr/security/zkdtsm/ZKDTSMRoot/ZKDTSMMasterKeyRoot
   [junit4]   2> 	2	/solr/overseer/queue-work
   [junit4]   2> 	2	/solr/security/zkdtsm/ZKDTSMRoot/ZKDTSMTokensRoot
   [junit4]   2> 
   [junit4]   2> 451351 INFO  (SUITE-TestSolrCloudWithDelegationTokens-seed#[F3E0AA87C55439D3]-worker) [    ] o.a.s.SolrTestCaseJ4 ###deleteCore
   [junit4]   2> NOTE: leaving temporary files on disk at: C:\Users\jenkins\workspace\Lucene-Solr-master-Windows\solr\build\solr-core\test\J0\temp\solr.cloud.TestSolrCloudWithDelegationTokens_F3E0AA87C55439D3-001
   [junit4]   2> Dec 09, 2016 3:08:45 PM com.carrotsearch.randomizedtesting.ThreadLeakControl checkThreadLeaks
   [junit4]   2> WARNING: Will linger awaiting termination of 3 leaked thread(s).
   [junit4]   2> NOTE: test params are: codec=CheapBastard, sim=RandomSimilarity(queryNorm=true): {}, locale=ja-JP-u-ca-japanese-x-lvariant-JP, timezone=Africa/Dakar
   [junit4]   2> NOTE: Windows 10 10.0 amd64/Oracle Corporation 1.8.0_112 (64-bit)/cpus=3,threads=1,free=138703568,total=368001024
   [junit4]   2> NOTE: All tests run in this JVM: [CollectionStateFormat2Test, TestRandomDVFaceting, SyncSliceTest, TestSchemaVersionResource, LeaderFailoverAfterPartitionTest, OverseerTaskQueueTest, TestDistribDocBasedVersion, TestSolrFieldCacheMBean, SolrRequestParserTest, TestPseudoReturnFields, TestTolerantSearch, TestSQLHandlerNonCloud, TestXmlQParser, SolrCLIZkUtilsTest, TestHdfsUpdateLog, TestInitQParser, PreAnalyzedFieldManagedSchemaCloudTest, TestLFUCache, NumericFieldsTest, TestScoreJoinQPNoScore, TestFieldCacheWithThreads, DistributedQueryComponentCustomSortTest, TestLeaderInitiatedRecoveryThread, TestFieldCacheSanityChecker, CoreAdminRequestStatusTest, BufferStoreTest, PrimUtilsTest, TestCollationFieldDocValues, HighlighterTest, TestFieldCacheSortRandom, TestCorePropertiesReload, SortSpecParsingTest, DistributedMLTComponentTest, PrimitiveFieldTypeTest, DocValuesMultiTest, XmlUpdateRequestHandlerTest, TestConfigSetProperties, LeaderElectionTest, TestSlowCompositeReaderWrapper, ZkStateReaderTest, TestFastLRUCache, BasicDistributedZkTest, SuggestComponentTest, TestFunctionQuery, TestSolrCloudWithDelegationTokens]
   [junit4] Completed [86/659 (1!)] on J0 in 5.63s, 8 tests, 1 failure <<< FAILURES!

[...truncated 64292 lines...]


Mime
View raw message