lucene-dev mailing list archives

Site index · List index
Message view « Date » · « Thread »
Top « Date » · « Thread »
From Policeman Jenkins Server <jenk...@thetaphi.de>
Subject [JENKINS] Lucene-Solr-6.x-Windows (32bit/jdk1.8.0_112) - Build # 616 - Unstable!
Date Sun, 11 Dec 2016 19:36:38 GMT
Build: https://jenkins.thetaphi.de/job/Lucene-Solr-6.x-Windows/616/
Java: 32bit/jdk1.8.0_112 -server -XX:+UseG1GC

1 tests failed.
FAILED:  junit.framework.TestSuite.org.apache.solr.handler.dataimport.TestEphemeralCache

Error Message:
Could not remove the following files (in the order of attempts):    C:\Users\jenkins\workspace\Lucene-Solr-6.x-Windows\solr\build\contrib\solr-dataimporthandler\test\J0\temp\solr.handler.dataimport.TestEphemeralCache_DA8B79FCBB35CCD6-001\core-home-001\collection1:
java.nio.file.DirectoryNotEmptyException: C:\Users\jenkins\workspace\Lucene-Solr-6.x-Windows\solr\build\contrib\solr-dataimporthandler\test\J0\temp\solr.handler.dataimport.TestEphemeralCache_DA8B79FCBB35CCD6-001\core-home-001\collection1
   C:\Users\jenkins\workspace\Lucene-Solr-6.x-Windows\solr\build\contrib\solr-dataimporthandler\test\J0\temp\solr.handler.dataimport.TestEphemeralCache_DA8B79FCBB35CCD6-001\core-home-001:
java.nio.file.DirectoryNotEmptyException: C:\Users\jenkins\workspace\Lucene-Solr-6.x-Windows\solr\build\contrib\solr-dataimporthandler\test\J0\temp\solr.handler.dataimport.TestEphemeralCache_DA8B79FCBB35CCD6-001\core-home-001


Stack Trace:
java.io.IOException: Could not remove the following files (in the order of attempts):
   C:\Users\jenkins\workspace\Lucene-Solr-6.x-Windows\solr\build\contrib\solr-dataimporthandler\test\J0\temp\solr.handler.dataimport.TestEphemeralCache_DA8B79FCBB35CCD6-001\core-home-001\collection1:
java.nio.file.DirectoryNotEmptyException: C:\Users\jenkins\workspace\Lucene-Solr-6.x-Windows\solr\build\contrib\solr-dataimporthandler\test\J0\temp\solr.handler.dataimport.TestEphemeralCache_DA8B79FCBB35CCD6-001\core-home-001\collection1
   C:\Users\jenkins\workspace\Lucene-Solr-6.x-Windows\solr\build\contrib\solr-dataimporthandler\test\J0\temp\solr.handler.dataimport.TestEphemeralCache_DA8B79FCBB35CCD6-001\core-home-001:
java.nio.file.DirectoryNotEmptyException: C:\Users\jenkins\workspace\Lucene-Solr-6.x-Windows\solr\build\contrib\solr-dataimporthandler\test\J0\temp\solr.handler.dataimport.TestEphemeralCache_DA8B79FCBB35CCD6-001\core-home-001

	at __randomizedtesting.SeedInfo.seed([DA8B79FCBB35CCD6]:0)
	at org.apache.lucene.util.IOUtils.rm(IOUtils.java:323)
	at org.apache.lucene.util.TestRuleTemporaryFilesCleanup.afterAlways(TestRuleTemporaryFilesCleanup.java:216)
	at com.carrotsearch.randomizedtesting.rules.TestRuleAdapter$1.afterAlways(TestRuleAdapter.java:31)
	at com.carrotsearch.randomizedtesting.rules.StatementAdapter.evaluate(StatementAdapter.java:43)
	at com.carrotsearch.randomizedtesting.rules.StatementAdapter.evaluate(StatementAdapter.java:36)
	at org.apache.lucene.util.TestRuleAssertionsRequired$1.evaluate(TestRuleAssertionsRequired.java:53)
	at org.apache.lucene.util.TestRuleMarkFailure$1.evaluate(TestRuleMarkFailure.java:47)
	at org.apache.lucene.util.TestRuleIgnoreAfterMaxFailures$1.evaluate(TestRuleIgnoreAfterMaxFailures.java:64)
	at org.apache.lucene.util.TestRuleIgnoreTestSuites$1.evaluate(TestRuleIgnoreTestSuites.java:54)
	at com.carrotsearch.randomizedtesting.rules.StatementAdapter.evaluate(StatementAdapter.java:36)
	at com.carrotsearch.randomizedtesting.ThreadLeakControl$StatementRunner.run(ThreadLeakControl.java:367)
	at java.lang.Thread.run(Thread.java:745)




Build Log:
[...truncated 17514 lines...]
   [junit4] Suite: org.apache.solr.handler.dataimport.TestEphemeralCache
   [junit4]   2> Creating dataDir: C:\Users\jenkins\workspace\Lucene-Solr-6.x-Windows\solr\build\contrib\solr-dataimporthandler\test\J0\temp\solr.handler.dataimport.TestEphemeralCache_DA8B79FCBB35CCD6-001\init-core-data-001
   [junit4]   2> 33167 T299 oas.SolrTestCaseJ4.buildSSLConfig Randomized ssl (false) and
clientAuth (false) via: @org.apache.solr.util.RandomizeSSL(reason=, value=NaN, ssl=NaN, clientAuth=NaN)
   [junit4]   2> 33229 T299 oas.SolrTestCaseJ4.initCore ####initCore
   [junit4]   2> 33259 T299 oasc.SolrConfig.<init> Using Lucene MatchVersion: 6.4.0
   [junit4]   2> 33274 T299 oass.IndexSchema.readSchema [null] Schema name=dih_test
   [junit4]   2> 33291 T299 oass.IndexSchema.readSchema WARN [null] default search field
in schema is desc. WARNING: Deprecated, please use 'df' on request instead.
   [junit4]   2> 33292 T299 oass.IndexSchema.readSchema WARN [null] query parser default
operator is OR. WARNING: Deprecated, please use 'q.op' on request instead.
   [junit4]   2> 33292 T299 oass.IndexSchema.readSchema Loaded schema dih_test/4.0 with
uniqueid field id
   [junit4]   2> 33300 T299 oasu.UpdateShardHandler.<init> Creating UpdateShardHandler
HTTP client with params: socketTimeout=30000&connTimeout=30000&retry=true
   [junit4]   2> 33322 T302 oasc.SolrConfig.<init> Using Lucene MatchVersion: 6.4.0
   [junit4]   2> 33336 T302 oass.IndexSchema.readSchema [collection1] Schema name=dih_test
   [junit4]   2> 33344 T302 oass.IndexSchema.readSchema WARN [collection1] default search
field in schema is desc. WARNING: Deprecated, please use 'df' on request instead.
   [junit4]   2> 33345 T302 oass.IndexSchema.readSchema WARN [collection1] query parser
default operator is OR. WARNING: Deprecated, please use 'q.op' on request instead.
   [junit4]   2> 33345 T302 oass.IndexSchema.readSchema Loaded schema dih_test/4.0 with
uniqueid field id
   [junit4]   2> 33352 T302 oasc.CoreContainer.create Creating SolrCore 'collection1' using
configuration from instancedir C:\Users\jenkins\workspace\Lucene-Solr-6.x-Windows\solr\build\contrib\solr-dataimporthandler\test\J0\temp\solr.handler.dataimport.TestEphemeralCache_DA8B79FCBB35CCD6-001\core-home-001\collection1
   [junit4]   2> 33353 T302 x:x:collection1 oasc.SolrCore.<init> [[collection1] ]
Opening new SolrCore at [C:\Users\jenkins\workspace\Lucene-Solr-6.x-Windows\solr\build\contrib\solr-dataimporthandler\test\J0\temp\solr.handler.dataimport.TestEphemeralCache_DA8B79FCBB35CCD6-001\core-home-001\collection1],
dataDir=[C:\Users\jenkins\workspace\Lucene-Solr-6.x-Windows\solr\build\contrib\solr-dataimporthandler\test\J0\temp\solr.handler.dataimport.TestEphemeralCache_DA8B79FCBB35CCD6-001\init-core-data-001\]
   [junit4]   2> 33432 T302 x:x:collection1 oasu.CommitTracker.<init> Hard AutoCommit:
disabled
   [junit4]   2> 33432 T302 x:x:collection1 oasu.CommitTracker.<init> Soft AutoCommit:
disabled
   [junit4]   2> 33434 T302 x:x:collection1 oass.SolrIndexSearcher.<init> Opening
[Searcher@c8e5f1[collection1] main]
   [junit4]   2> 33435 T302 x:x:collection1 oasr.ManagedResourceStorage$FileStorageIO.configure
File-based storage initialized to use dir: C:\Users\jenkins\workspace\Lucene-Solr-6.x-Windows\solr\build\contrib\solr-dataimporthandler\test\J0\temp\solr.handler.dataimport.TestEphemeralCache_DA8B79FCBB35CCD6-001\core-home-001\collection1\conf
   [junit4]   2> 33436 T302 x:x:collection1 oash.ReplicationHandler.inform Commits will
be reserved for  10000
   [junit4]   2> 33436 T305 x:x:collection1 oasc.QuerySenderListener.newSearcher QuerySenderListener
sending requests to Searcher@c8e5f1[collection1] main{ExitableDirectoryReader(UninvertingDirectoryReader())}
   [junit4]   2> 33450 T305 x:x:collection1 oasc.QuerySenderListener.newSearcher QuerySenderListener
done.
   [junit4]   2> 33450 T305 x:x:collection1 oasc.SolrCore.registerSearcher [collection1]
Registered new searcher Searcher@c8e5f1[collection1] main{ExitableDirectoryReader(UninvertingDirectoryReader())}
   [junit4]   2> 33452 T299 oas.SolrTestCaseJ4.initCore ####initCore end
   [junit4]   2> 33454 T299 oas.SolrTestCaseJ4.setUp ###Starting test
   [junit4]   2> ASYNC  NEW_CORE C25 name=collection1 org.apache.solr.core.SolrCore@1291107
   [junit4]   2> 33468 T299 C25 oashdc.DIHConfiguration.verifyWithSchema id is a required
field in SolrSchema . But not found in DataConfig
   [junit4]   2> 33468 T299 C25 oashd.DataImporter.loadDataConfig Data Configuration loaded
successfully
   [junit4]   2> 33468 T299 C25 oashd.DataImporter.doFullImport Starting Full Import
   [junit4]   2> 33469 T299 C25 oashd.SimplePropertiesWriter.readIndexerProperties WARN
Unable to read: dataimport.properties
   [junit4]   2> 33470 T299 C25 oasu.DirectUpdateHandler2.deleteAll [collection1] REMOVING
ALL DOCUMENTS FROM INDEX
   [junit4]   2> 33520 T299 C25 oashd.DocBuilder.finish Import completed successfully
   [junit4]   2> 33521 T299 C25 oasu.DirectUpdateHandler2.commit start commit{,optimize=false,openSearcher=true,waitSearcher=true,expungeDeletes=false,softCommit=false,prepareCommit=false}
   [junit4]   2> 33521 T299 C25 oasu.SolrIndexWriter.setCommitData Calling setCommitData
with IW:org.apache.solr.update.SolrIndexWriter@1bceb4d
   [junit4]   2> 33585 T299 C25 oass.SolrIndexSearcher.<init> Opening [Searcher@16857db[collection1]
main]
   [junit4]   2> 33586 T299 C25 oasu.DirectUpdateHandler2.commit end_commit_flush
   [junit4]   2> 33586 T305 C25 oasc.QuerySenderListener.newSearcher QuerySenderListener
sending requests to Searcher@16857db[collection1] main{ExitableDirectoryReader(UninvertingDirectoryReader(Uninverting(_0(6.4.0):c5)))}
   [junit4]   2> 33587 T305 C25 oasc.SolrCore.execute [collection1]  webapp=null path=null
params={q=solr&distrib=false&start=0&rows=10&event=newSearcher} hits=0 status=0
QTime=0
   [junit4]   2> 33587 T305 C25 oasc.SolrCore.execute [collection1]  webapp=null path=null
params={q=rocks&distrib=false&start=0&rows=10&event=newSearcher} hits=0 status=0
QTime=0
   [junit4]   2> 33588 T305 C25 oasc.SolrCore.execute [collection1]  webapp=null path=null
params={q=static+newSearcher+warming+query+from+solrconfig.xml&distrib=false&event=newSearcher}
hits=0 status=0 QTime=0
   [junit4]   2> 33588 T305 C25 oasc.QuerySenderListener.newSearcher QuerySenderListener
done.
   [junit4]   2> 33588 T305 C25 oasc.SolrCore.registerSearcher [collection1] Registered
new searcher Searcher@16857db[collection1] main{ExitableDirectoryReader(UninvertingDirectoryReader(Uninverting(_0(6.4.0):c5)))}
   [junit4]   2> 33588 T299 C25 oashd.SimplePropertiesWriter.readIndexerProperties WARN
Unable to read: dataimport.properties
   [junit4]   2> 33590 T299 C25 oashd.SimplePropertiesWriter.persist Wrote last indexed
time to dataimport.properties
   [junit4]   2> 33590 T299 C25 oashd.DocBuilder.execute Time taken = 0:0:0.120
   [junit4]   2> 33590 T299 C25 oasup.LogUpdateProcessorFactory$LogUpdateProcessor.finish
[collection1]  webapp=null path=null params={debug=on&commit=true&dataConfig=<dataConfig>+<dataSource+type%3D"MockDataSource"+/>+<document>+++<entity++++++name%3D"PARENT"+++++processor%3D"SqlEntityProcessor"+++++cacheImpl%3D"org.apache.solr.handler.dataimport.DestroyCountCache"+++++cacheName%3D"PARENT"+++++query%3D"SELECT+*+FROM+PARENT"+++++>+++++<entity+++++++name%3D"CHILD_1"+++++++processor%3D"SqlEntityProcessor"+++++++cacheImpl%3D"org.apache.solr.handler.dataimport.DestroyCountCache"+++++++cacheName%3D"CHILD"+++++++cacheKey%3D"id"+++++++cacheLookup%3D"PARENT.id"+++++++fieldNames%3D"id,+++++++++child1a_mult_s,+child1b_s"+++++++fieldTypes%3D"BIGDECIMAL,+STRING,+++++++++STRING"+++++++query%3D"SELECT+*+FROM+CHILD_1"++++++++++++/>+++++<entity+++++++name%3D"CHILD_2"+++++++processor%3D"SqlEntityProcessor"+++++++cacheImpl%3D"org.apache.solr.handler.dataimport.DestroyCountCache"+++++++cacheKey%3D"id"+++++++cacheLookup%3D"PARENT.id"+++++++query%3D"SELECT+*+FROM+CHILD_2"++++++++++++/>+++</entity>+</document></dataConfig>&clean=true&wt=xml&command=full-import}{deleteByQuery=*:*,add=[1,
2, 3, 4, 5],commit=} 0 126
   [junit4]   2> 33592 T299 C25 oasc.SolrCore.execute [collection1]  webapp=null path=null
params={q=*:*&qt=standard&start=0&rows=20&version=2.2} hits=5 status=0 QTime=0
   [junit4]   2> 33598 T299 C25 oasc.SolrCore.execute [collection1]  webapp=null path=null
params={q=id:1&qt=standard&start=0&rows=20&version=2.2} hits=1 status=0 QTime=0
   [junit4]   2> 33599 T299 C25 oasc.SolrCore.execute [collection1]  webapp=null path=null
params={q=id:6&qt=standard&start=0&rows=20&version=2.2} hits=0 status=0 QTime=0
   [junit4]   2> 33600 T299 C25 oasc.SolrCore.execute [collection1]  webapp=null path=null
params={q=parent_s:four&qt=standard&start=0&rows=20&version=2.2} hits=1 status=0
QTime=0
   [junit4]   2> 33625 T299 C25 oasc.SolrCore.execute [collection1]  webapp=null path=null
params={q=child1a_mult_s:this\+is\+the\+numbe*&qt=standard&start=0&rows=20&version=2.2}
hits=2 status=0 QTime=12
   [junit4]   2> 33630 T299 C25 oasc.SolrCore.execute [collection1]  webapp=null path=null
params={q=child2a_mult_s:Child\+2\+say*&qt=standard&start=0&rows=20&version=2.2}
hits=4 status=0 QTime=3
   [junit4]   2> 33635 T299 C25 oasc.SolrCore.execute [collection1]  webapp=null path=null
params={q=child1b_s:CHILD1B&qt=standard&start=0&rows=20&version=2.2} hits=1
status=0 QTime=3
   [junit4]   2> 33636 T299 C25 oasc.SolrCore.execute [collection1]  webapp=null path=null
params={q=child2b_s:CHILD2B&qt=standard&start=0&rows=20&version=2.2} hits=1
status=0 QTime=0
   [junit4]   2> 33639 T299 C25 oasc.SolrCore.execute [collection1]  webapp=null path=null
params={q=child1a_mult_s:one&qt=standard&start=0&rows=20&version=2.2} hits=1
status=0 QTime=2
   [junit4]   2> 33640 T299 C25 oasc.SolrCore.execute [collection1]  webapp=null path=null
params={q=child1a_mult_s:uno&qt=standard&start=0&rows=20&version=2.2} hits=1
status=0 QTime=0
   [junit4]   2> 33643 T299 C25 oasc.SolrCore.execute [collection1]  webapp=null path=null
params={q=child1a_mult_s:(uno+OR+one)&qt=standard&start=0&rows=20&version=2.2}
hits=1 status=0 QTime=0
   [junit4]   2> 33653 T299 oas.SolrTestCaseJ4.tearDown ###Ending test
   [junit4]   2> 33654 T299 oas.SolrTestCaseJ4.deleteCore ###deleteCore
   [junit4]   2> 33654 T299 oasc.CoreContainer.shutdown Shutting down CoreContainer instance=27867588
   [junit4]   2> 33662 T306 x:x:collection1 oasc.SolrCore.close [collection1]  CLOSING
SolrCore org.apache.solr.core.SolrCore@1291107
   [junit4]   2> NOTE: test params are: codec=Asserting(Lucene62): {child1a_mult_s=Lucene50(blocksize=128),
child1b_s=PostingsFormat(name=LuceneFixedGap), child2a_mult_s=Lucene50(blocksize=128), child2b_s=PostingsFormat(name=Direct),
parent_s=PostingsFormat(name=Direct), id=Lucene50(blocksize=128), timestamp=PostingsFormat(name=Direct)},
docValues:{}, maxPointsInLeafNode=1729, maxMBSortInHeap=5.017980084411247, sim=RandomSimilarity(queryNorm=true,coord=crazy):
{}, locale=sr-ME, timezone=Asia/Hong_Kong
   [junit4]   2> NOTE: Windows 10 10.0 x86/Oracle Corporation 1.8.0_112 (32-bit)/cpus=3,threads=1,free=44562568,total=67108864
   [junit4]   2> NOTE: All tests run in this JVM: [TestZKPropertiesWriter, TestWriterImpl,
TestSolrEntityProcessorEndToEnd, TestContentStreamDataSource, TestDocBuilder2, TestFileListWithLineEntityProcessor,
TestBuiltInEvaluators, TestEphemeralCache]
   [junit4]   2> NOTE: reproduce with: ant test  -Dtestcase=TestEphemeralCache -Dtests.seed=DA8B79FCBB35CCD6
-Dtests.slow=true -Dtests.locale=sr-ME -Dtests.timezone=Asia/Hong_Kong -Dtests.asserts=true
-Dtests.file.encoding=Cp1252
   [junit4] ERROR   0.00s J0 | TestEphemeralCache (suite) <<<
   [junit4]    > Throwable #1: java.io.IOException: Could not remove the following files
(in the order of attempts):
   [junit4]    >    C:\Users\jenkins\workspace\Lucene-Solr-6.x-Windows\solr\build\contrib\solr-dataimporthandler\test\J0\temp\solr.handler.dataimport.TestEphemeralCache_DA8B79FCBB35CCD6-001\core-home-001\collection1:
java.nio.file.DirectoryNotEmptyException: C:\Users\jenkins\workspace\Lucene-Solr-6.x-Windows\solr\build\contrib\solr-dataimporthandler\test\J0\temp\solr.handler.dataimport.TestEphemeralCache_DA8B79FCBB35CCD6-001\core-home-001\collection1
   [junit4]    >    C:\Users\jenkins\workspace\Lucene-Solr-6.x-Windows\solr\build\contrib\solr-dataimporthandler\test\J0\temp\solr.handler.dataimport.TestEphemeralCache_DA8B79FCBB35CCD6-001\core-home-001:
java.nio.file.DirectoryNotEmptyException: C:\Users\jenkins\workspace\Lucene-Solr-6.x-Windows\solr\build\contrib\solr-dataimporthandler\test\J0\temp\solr.handler.dataimport.TestEphemeralCache_DA8B79FCBB35CCD6-001\core-home-001
   [junit4]    > 	at __randomizedtesting.SeedInfo.seed([DA8B79FCBB35CCD6]:0)
   [junit4]    > 	at org.apache.lucene.util.IOUtils.rm(IOUtils.java:323)
   [junit4]    > 	at java.lang.Thread.run(Thread.java:745)
   [junit4] Completed [26/38 (1!)] on J0 in 0.60s, 1 test, 1 error <<< FAILURES!

[...truncated 49917 lines...]


Mime
View raw message