lucene-dev mailing list archives

Site index · List index
Message view « Date » · « Thread »
Top « Date » · « Thread »
From Policeman Jenkins Server <jenk...@thetaphi.de>
Subject [JENKINS-EA] Lucene-Solr-master-Linux (32bit/jdk-9-ea+147) - Build # 18576 - Still Unstable!
Date Tue, 20 Dec 2016 20:46:29 GMT
Build: https://jenkins.thetaphi.de/job/Lucene-Solr-master-Linux/18576/
Java: 32bit/jdk-9-ea+147 -client -XX:+UseParallelGC

1 tests failed.
FAILED:  org.apache.solr.handler.admin.MetricsHandlerTest.test

Error Message:
Unable to make member of class com.sun.management.internal.OperatingSystemImpl accessible:
 module jdk.management does not export com.sun.management.internal to unnamed module @1a5db8e

Stack Trace:
java.lang.reflect.InaccessibleObjectException: Unable to make member of class com.sun.management.internal.OperatingSystemImpl
accessible:  module jdk.management does not export com.sun.management.internal to unnamed
module @1a5db8e
	at __randomizedtesting.SeedInfo.seed([DBD49BD6595B7890:5380A40CF7A71568]:0)
	at java.base/jdk.internal.reflect.Reflection.throwInaccessibleObjectException(Reflection.java:424)
	at java.base/java.lang.reflect.AccessibleObject.checkCanSetAccessible(AccessibleObject.java:174)
	at java.base/java.lang.reflect.Method.checkCanSetAccessible(Method.java:192)
	at java.base/java.lang.reflect.Method.setAccessible(Method.java:186)
	at com.codahale.metrics.jvm.FileDescriptorRatioGauge.invoke(FileDescriptorRatioGauge.java:48)
	at com.codahale.metrics.jvm.FileDescriptorRatioGauge.getRatio(FileDescriptorRatioGauge.java:35)
	at com.codahale.metrics.RatioGauge.getValue(RatioGauge.java:64)
	at com.codahale.metrics.RatioGauge.getValue(RatioGauge.java:11)
	at org.apache.solr.util.stats.MetricUtils.gaugeToNamedList(MetricUtils.java:135)
	at org.apache.solr.util.stats.MetricUtils.lambda$toNamedList$2(MetricUtils.java:87)
	at java.base/java.util.stream.ForEachOps$ForEachOp$OfRef.accept(ForEachOps.java:184)
	at java.base/java.util.stream.ReferencePipeline$2$1.accept(ReferencePipeline.java:177)
	at java.base/java.util.TreeMap$KeySpliterator.forEachRemaining(TreeMap.java:2739)
	at java.base/java.util.stream.AbstractPipeline.copyInto(AbstractPipeline.java:484)
	at java.base/java.util.stream.AbstractPipeline.wrapAndCopyInto(AbstractPipeline.java:474)
	at java.base/java.util.stream.ForEachOps$ForEachOp.evaluateSequential(ForEachOps.java:151)
	at java.base/java.util.stream.ForEachOps$ForEachOp$OfRef.evaluateSequential(ForEachOps.java:174)
	at java.base/java.util.stream.AbstractPipeline.evaluate(AbstractPipeline.java:234)
	at java.base/java.util.stream.ReferencePipeline.forEach(ReferencePipeline.java:430)
	at org.apache.solr.util.stats.MetricUtils.toNamedList(MetricUtils.java:80)
	at org.apache.solr.handler.admin.MetricsHandler.handleRequestBody(MetricsHandler.java:93)
	at org.apache.solr.handler.admin.MetricsHandlerTest.test(MetricsHandlerTest.java:41)
	at java.base/jdk.internal.reflect.NativeMethodAccessorImpl.invoke0(Native Method)
	at java.base/jdk.internal.reflect.NativeMethodAccessorImpl.invoke(NativeMethodAccessorImpl.java:62)
	at java.base/jdk.internal.reflect.DelegatingMethodAccessorImpl.invoke(DelegatingMethodAccessorImpl.java:43)
	at java.base/java.lang.reflect.Method.invoke(Method.java:538)
	at com.carrotsearch.randomizedtesting.RandomizedRunner.invoke(RandomizedRunner.java:1713)
	at com.carrotsearch.randomizedtesting.RandomizedRunner$8.evaluate(RandomizedRunner.java:907)
	at com.carrotsearch.randomizedtesting.RandomizedRunner$9.evaluate(RandomizedRunner.java:943)
	at com.carrotsearch.randomizedtesting.RandomizedRunner$10.evaluate(RandomizedRunner.java:957)
	at com.carrotsearch.randomizedtesting.rules.SystemPropertiesRestoreRule$1.evaluate(SystemPropertiesRestoreRule.java:57)
	at org.apache.lucene.util.TestRuleSetupTeardownChained$1.evaluate(TestRuleSetupTeardownChained.java:49)
	at org.apache.lucene.util.AbstractBeforeAfterRule$1.evaluate(AbstractBeforeAfterRule.java:45)
	at org.apache.lucene.util.TestRuleThreadAndTestName$1.evaluate(TestRuleThreadAndTestName.java:48)
	at org.apache.lucene.util.TestRuleIgnoreAfterMaxFailures$1.evaluate(TestRuleIgnoreAfterMaxFailures.java:64)
	at org.apache.lucene.util.TestRuleMarkFailure$1.evaluate(TestRuleMarkFailure.java:47)
	at com.carrotsearch.randomizedtesting.rules.StatementAdapter.evaluate(StatementAdapter.java:36)
	at com.carrotsearch.randomizedtesting.ThreadLeakControl$StatementRunner.run(ThreadLeakControl.java:367)
	at com.carrotsearch.randomizedtesting.ThreadLeakControl.forkTimeoutingTask(ThreadLeakControl.java:811)
	at com.carrotsearch.randomizedtesting.ThreadLeakControl$3.evaluate(ThreadLeakControl.java:462)
	at com.carrotsearch.randomizedtesting.RandomizedRunner.runSingleTest(RandomizedRunner.java:916)
	at com.carrotsearch.randomizedtesting.RandomizedRunner$5.evaluate(RandomizedRunner.java:802)
	at com.carrotsearch.randomizedtesting.RandomizedRunner$6.evaluate(RandomizedRunner.java:852)
	at com.carrotsearch.randomizedtesting.RandomizedRunner$7.evaluate(RandomizedRunner.java:863)
	at com.carrotsearch.randomizedtesting.rules.StatementAdapter.evaluate(StatementAdapter.java:36)
	at com.carrotsearch.randomizedtesting.rules.SystemPropertiesRestoreRule$1.evaluate(SystemPropertiesRestoreRule.java:57)
	at org.apache.lucene.util.AbstractBeforeAfterRule$1.evaluate(AbstractBeforeAfterRule.java:45)
	at com.carrotsearch.randomizedtesting.rules.StatementAdapter.evaluate(StatementAdapter.java:36)
	at org.apache.lucene.util.TestRuleStoreClassName$1.evaluate(TestRuleStoreClassName.java:41)
	at com.carrotsearch.randomizedtesting.rules.NoShadowingOrOverridesOnMethodsRule$1.evaluate(NoShadowingOrOverridesOnMethodsRule.java:40)
	at com.carrotsearch.randomizedtesting.rules.NoShadowingOrOverridesOnMethodsRule$1.evaluate(NoShadowingOrOverridesOnMethodsRule.java:40)
	at com.carrotsearch.randomizedtesting.rules.StatementAdapter.evaluate(StatementAdapter.java:36)
	at com.carrotsearch.randomizedtesting.rules.StatementAdapter.evaluate(StatementAdapter.java:36)
	at com.carrotsearch.randomizedtesting.rules.StatementAdapter.evaluate(StatementAdapter.java:36)
	at org.apache.lucene.util.TestRuleAssertionsRequired$1.evaluate(TestRuleAssertionsRequired.java:53)
	at org.apache.lucene.util.TestRuleMarkFailure$1.evaluate(TestRuleMarkFailure.java:47)
	at org.apache.lucene.util.TestRuleIgnoreAfterMaxFailures$1.evaluate(TestRuleIgnoreAfterMaxFailures.java:64)
	at org.apache.lucene.util.TestRuleIgnoreTestSuites$1.evaluate(TestRuleIgnoreTestSuites.java:54)
	at com.carrotsearch.randomizedtesting.rules.StatementAdapter.evaluate(StatementAdapter.java:36)
	at com.carrotsearch.randomizedtesting.ThreadLeakControl$StatementRunner.run(ThreadLeakControl.java:367)
	at java.base/java.lang.Thread.run(Thread.java:844)




Build Log:
[...truncated 12383 lines...]
   [junit4] Suite: org.apache.solr.handler.admin.MetricsHandlerTest
   [junit4]   2> Creating dataDir: /home/jenkins/workspace/Lucene-Solr-master-Linux/solr/build/solr-core/test/J0/temp/solr.handler.admin.MetricsHandlerTest_DBD49BD6595B7890-001/init-core-data-001
   [junit4]   2> 1802910 INFO  (SUITE-MetricsHandlerTest-seed#[DBD49BD6595B7890]-worker)
[    ] o.a.s.SolrTestCaseJ4 Randomized ssl (true) and clientAuth (false) via: @org.apache.solr.util.RandomizeSSL(reason="",
ssl=0.0/0.0, value=0.0/0.0, clientAuth=0.0/0.0)
   [junit4]   2> 1802912 INFO  (SUITE-MetricsHandlerTest-seed#[DBD49BD6595B7890]-worker)
[    ] o.a.s.SolrTestCaseJ4 ####initCore
   [junit4]   2> 1802913 INFO  (SUITE-MetricsHandlerTest-seed#[DBD49BD6595B7890]-worker)
[    ] o.a.s.c.SolrResourceLoader [null] Added 2 libs to classloader, from paths: [/home/jenkins/workspace/Lucene-Solr-master-Linux/solr/core/src/test-files/solr/collection1/lib,
/home/jenkins/workspace/Lucene-Solr-master-Linux/solr/core/src/test-files/solr/collection1/lib/classes]
   [junit4]   2> 1802996 INFO  (SUITE-MetricsHandlerTest-seed#[DBD49BD6595B7890]-worker)
[    ] o.a.s.c.SolrConfig Using Lucene MatchVersion: 7.0.0
   [junit4]   2> 1803025 INFO  (SUITE-MetricsHandlerTest-seed#[DBD49BD6595B7890]-worker)
[    ] o.a.s.s.IndexSchema [null] Schema name=test
   [junit4]   2> 1803097 WARN  (SUITE-MetricsHandlerTest-seed#[DBD49BD6595B7890]-worker)
[    ] o.a.s.s.IndexSchema [null] default search field in schema is text. WARNING: Deprecated,
please use 'df' on request instead.
   [junit4]   2> 1803099 INFO  (SUITE-MetricsHandlerTest-seed#[DBD49BD6595B7890]-worker)
[    ] o.a.s.s.IndexSchema Loaded schema test/1.0 with uniqueid field id
   [junit4]   2> 1803124 WARN  (SUITE-MetricsHandlerTest-seed#[DBD49BD6595B7890]-worker)
[    ] o.a.s.m.r.SolrJmxReporter No serviceUrl or agentId was configured, using first MBeanServer.
   [junit4]   2> 1803136 INFO  (SUITE-MetricsHandlerTest-seed#[DBD49BD6595B7890]-worker)
[    ] o.a.s.m.r.SolrJmxReporter JMX monitoring enabled at server: com.sun.jmx.mbeanserver.JmxMBeanServer@15274b0
   [junit4]   2> 1803136 WARN  (SUITE-MetricsHandlerTest-seed#[DBD49BD6595B7890]-worker)
[    ] o.a.s.m.r.SolrJmxReporter No serviceUrl or agentId was configured, using first MBeanServer.
   [junit4]   2> 1803140 INFO  (SUITE-MetricsHandlerTest-seed#[DBD49BD6595B7890]-worker)
[    ] o.a.s.m.r.SolrJmxReporter JMX monitoring enabled at server: com.sun.jmx.mbeanserver.JmxMBeanServer@15274b0
   [junit4]   2> 1803141 WARN  (SUITE-MetricsHandlerTest-seed#[DBD49BD6595B7890]-worker)
[    ] o.a.s.m.r.SolrJmxReporter No serviceUrl or agentId was configured, using first MBeanServer.
   [junit4]   2> 1803141 INFO  (SUITE-MetricsHandlerTest-seed#[DBD49BD6595B7890]-worker)
[    ] o.a.s.m.r.SolrJmxReporter JMX monitoring enabled at server: com.sun.jmx.mbeanserver.JmxMBeanServer@15274b0
   [junit4]   2> 1803141 WARN  (SUITE-MetricsHandlerTest-seed#[DBD49BD6595B7890]-worker)
[    ] o.a.s.m.r.SolrJmxReporter No serviceUrl or agentId was configured, using first MBeanServer.
   [junit4]   2> 1803141 INFO  (SUITE-MetricsHandlerTest-seed#[DBD49BD6595B7890]-worker)
[    ] o.a.s.m.r.SolrJmxReporter JMX monitoring enabled at server: com.sun.jmx.mbeanserver.JmxMBeanServer@15274b0
   [junit4]   2> 1803143 INFO  (coreLoadExecutor-7609-thread-1) [    ] o.a.s.c.SolrResourceLoader
[null] Added 2 libs to classloader, from paths: [/home/jenkins/workspace/Lucene-Solr-master-Linux/solr/core/src/test-files/solr/collection1/lib,
/home/jenkins/workspace/Lucene-Solr-master-Linux/solr/core/src/test-files/solr/collection1/lib/classes]
   [junit4]   2> 1803215 INFO  (coreLoadExecutor-7609-thread-1) [    ] o.a.s.c.SolrConfig
Using Lucene MatchVersion: 7.0.0
   [junit4]   2> 1803239 INFO  (coreLoadExecutor-7609-thread-1) [    ] o.a.s.s.IndexSchema
[collection1] Schema name=test
   [junit4]   2> 1803315 WARN  (coreLoadExecutor-7609-thread-1) [    ] o.a.s.s.IndexSchema
[collection1] default search field in schema is text. WARNING: Deprecated, please use 'df'
on request instead.
   [junit4]   2> 1803317 INFO  (coreLoadExecutor-7609-thread-1) [    ] o.a.s.s.IndexSchema
Loaded schema test/1.0 with uniqueid field id
   [junit4]   2> 1803334 INFO  (coreLoadExecutor-7609-thread-1) [    ] o.a.s.c.CoreContainer
Creating SolrCore 'collection1' using configuration from instancedir /home/jenkins/workspace/Lucene-Solr-master-Linux/solr/core/src/test-files/solr/collection1
   [junit4]   2> 1803335 INFO  (coreLoadExecutor-7609-thread-1) [    ] o.a.s.c.SolrCore
[[collection1] ] Opening new SolrCore at [/home/jenkins/workspace/Lucene-Solr-master-Linux/solr/core/src/test-files/solr/collection1],
dataDir=[/home/jenkins/workspace/Lucene-Solr-master-Linux/solr/build/solr-core/test/J0/temp/solr.handler.admin.MetricsHandlerTest_DBD49BD6595B7890-001/init-core-data-001/]
   [junit4]   2> 1803335 WARN  (coreLoadExecutor-7609-thread-1) [    ] o.a.s.m.r.SolrJmxReporter
No serviceUrl or agentId was configured, using first MBeanServer.
   [junit4]   2> 1803335 INFO  (coreLoadExecutor-7609-thread-1) [    ] o.a.s.m.r.SolrJmxReporter
JMX monitoring enabled at server: com.sun.jmx.mbeanserver.JmxMBeanServer@15274b0
   [junit4]   2> 1803336 INFO  (coreLoadExecutor-7609-thread-1) [    ] o.a.s.c.JmxMonitoredMap
JMX monitoring is enabled. Adding Solr mbeans to JMX Server: com.sun.jmx.mbeanserver.JmxMBeanServer@15274b0
   [junit4]   2> 1803337 INFO  (coreLoadExecutor-7609-thread-1) [    ] o.a.s.u.RandomMergePolicy
RandomMergePolicy wrapping class org.apache.lucene.index.MockRandomMergePolicy: org.apache.lucene.index.MockRandomMergePolicy@ce5fc0
   [junit4]   2> 1803356 INFO  (coreLoadExecutor-7609-thread-1) [    ] o.a.s.u.UpdateHandler
Using UpdateLog implementation: org.apache.solr.update.UpdateLog
   [junit4]   2> 1803356 INFO  (coreLoadExecutor-7609-thread-1) [    ] o.a.s.u.UpdateLog
Initializing UpdateLog: dataDir= defaultSyncLevel=FLUSH numRecordsToKeep=100 maxNumLogsToKeep=10
numVersionBuckets=65536
   [junit4]   2> 1803357 INFO  (coreLoadExecutor-7609-thread-1) [    ] o.a.s.u.CommitTracker
Hard AutoCommit: disabled
   [junit4]   2> 1803357 INFO  (coreLoadExecutor-7609-thread-1) [    ] o.a.s.u.CommitTracker
Soft AutoCommit: disabled
   [junit4]   2> 1803357 INFO  (coreLoadExecutor-7609-thread-1) [    ] o.a.s.u.RandomMergePolicy
RandomMergePolicy wrapping class org.apache.lucene.index.TieredMergePolicy: [TieredMergePolicy:
maxMergeAtOnce=36, maxMergeAtOnceExplicit=49, maxMergedSegmentMB=42.240234375, floorSegmentMB=0.2705078125,
forceMergeDeletesPctAllowed=11.320694124382648, segmentsPerTier=36.0, maxCFSSegmentSizeMB=8.796093022207999E12,
noCFSRatio=0.4524016981062845
   [junit4]   2> 1803357 INFO  (coreLoadExecutor-7609-thread-1) [    ] o.a.s.s.SolrIndexSearcher
Opening [Searcher@a5ebab[collection1] main]
   [junit4]   2> 1803357 INFO  (coreLoadExecutor-7609-thread-1) [    ] o.a.s.h.c.SpellCheckComponent
Initializing spell checkers
   [junit4]   2> 1803401 INFO  (coreLoadExecutor-7609-thread-1) [    ] o.a.s.s.DirectSolrSpellChecker
init: {name=direct,classname=DirectSolrSpellChecker,field=lowerfilt,minQueryLength=3}
   [junit4]   2> 1803631 INFO  (coreLoadExecutor-7609-thread-1) [    ] o.a.s.h.ReplicationHandler
Commits will be reserved for  10000
   [junit4]   2> 1803632 INFO  (searcherExecutor-7610-thread-1) [    ] o.a.s.h.c.SpellCheckComponent
Loading spell index for spellchecker: default
   [junit4]   2> 1803632 INFO  (searcherExecutor-7610-thread-1) [    ] o.a.s.h.c.SpellCheckComponent
Loading spell index for spellchecker: direct
   [junit4]   2> 1803632 INFO  (searcherExecutor-7610-thread-1) [    ] o.a.s.h.c.SpellCheckComponent
Loading spell index for spellchecker: wordbreak
   [junit4]   2> 1803632 INFO  (searcherExecutor-7610-thread-1) [    ] o.a.s.h.c.SpellCheckComponent
Loading spell index for spellchecker: multipleFields
   [junit4]   2> 1803632 INFO  (coreLoadExecutor-7609-thread-1) [    ] o.a.s.u.UpdateLog
Could not find max version in index or recent updates, using new clock 1554268585826713600
   [junit4]   2> 1803633 INFO  (searcherExecutor-7610-thread-1) [    ] o.a.s.h.c.SpellCheckComponent
Loading spell index for spellchecker: jarowinkler
   [junit4]   2> 1803633 INFO  (searcherExecutor-7610-thread-1) [    ] o.a.s.h.c.SpellCheckComponent
Loading spell index for spellchecker: external
   [junit4]   2> 1803633 INFO  (searcherExecutor-7610-thread-1) [    ] o.a.s.h.c.SpellCheckComponent
Loading spell index for spellchecker: freq
   [junit4]   2> 1803634 INFO  (searcherExecutor-7610-thread-1) [    ] o.a.s.h.c.SpellCheckComponent
Loading spell index for spellchecker: fqcn
   [junit4]   2> 1803634 INFO  (searcherExecutor-7610-thread-1) [    ] o.a.s.h.c.SpellCheckComponent
Loading spell index for spellchecker: perDict
   [junit4]   2> 1803635 INFO  (searcherExecutor-7610-thread-1) [    ] o.a.s.c.SolrCore
[collection1] Registered new searcher Searcher@a5ebab[collection1] main{ExitableDirectoryReader(UninvertingDirectoryReader())}
   [junit4]   2> 1803636 INFO  (SUITE-MetricsHandlerTest-seed#[DBD49BD6595B7890]-worker)
[    ] o.a.s.SolrTestCaseJ4 ####initCore end
   [junit4]   2> 1803638 INFO  (TEST-MetricsHandlerTest.test-seed#[DBD49BD6595B7890]) [
   ] o.a.s.SolrTestCaseJ4 ###Starting test
   [junit4]   2> 1803648 INFO  (TEST-MetricsHandlerTest.test-seed#[DBD49BD6595B7890]) [
   ] o.a.s.SolrTestCaseJ4 ###Ending test
   [junit4]   2> NOTE: reproduce with: ant test  -Dtestcase=MetricsHandlerTest -Dtests.method=test
-Dtests.seed=DBD49BD6595B7890 -Dtests.multiplier=3 -Dtests.slow=true -Dtests.locale=lrc-IR
-Dtests.timezone=Asia/Pontianak -Dtests.asserts=true -Dtests.file.encoding=UTF-8
   [junit4] ERROR   0.01s J0 | MetricsHandlerTest.test <<<
   [junit4]    > Throwable #1: java.lang.reflect.InaccessibleObjectException: Unable to
make member of class com.sun.management.internal.OperatingSystemImpl accessible:  module jdk.management
does not export com.sun.management.internal to unnamed module @1a5db8e
   [junit4]    > 	at __randomizedtesting.SeedInfo.seed([DBD49BD6595B7890:5380A40CF7A71568]:0)
   [junit4]    > 	at java.base/jdk.internal.reflect.Reflection.throwInaccessibleObjectException(Reflection.java:424)
   [junit4]    > 	at java.base/java.lang.reflect.AccessibleObject.checkCanSetAccessible(AccessibleObject.java:174)
   [junit4]    > 	at java.base/java.lang.reflect.Method.checkCanSetAccessible(Method.java:192)
   [junit4]    > 	at java.base/java.lang.reflect.Method.setAccessible(Method.java:186)
   [junit4]    > 	at com.codahale.metrics.jvm.FileDescriptorRatioGauge.invoke(FileDescriptorRatioGauge.java:48)
   [junit4]    > 	at com.codahale.metrics.jvm.FileDescriptorRatioGauge.getRatio(FileDescriptorRatioGauge.java:35)
   [junit4]    > 	at com.codahale.metrics.RatioGauge.getValue(RatioGauge.java:64)
   [junit4]    > 	at com.codahale.metrics.RatioGauge.getValue(RatioGauge.java:11)
   [junit4]    > 	at org.apache.solr.util.stats.MetricUtils.gaugeToNamedList(MetricUtils.java:135)
   [junit4]    > 	at org.apache.solr.util.stats.MetricUtils.lambda$toNamedList$2(MetricUtils.java:87)
   [junit4]    > 	at java.base/java.util.stream.ForEachOps$ForEachOp$OfRef.accept(ForEachOps.java:184)
   [junit4]    > 	at java.base/java.util.stream.ReferencePipeline$2$1.accept(ReferencePipeline.java:177)
   [junit4]    > 	at java.base/java.util.TreeMap$KeySpliterator.forEachRemaining(TreeMap.java:2739)
   [junit4]    > 	at java.base/java.util.stream.AbstractPipeline.copyInto(AbstractPipeline.java:484)
   [junit4]    > 	at java.base/java.util.stream.AbstractPipeline.wrapAndCopyInto(AbstractPipeline.java:474)
   [junit4]    > 	at java.base/java.util.stream.ForEachOps$ForEachOp.evaluateSequential(ForEachOps.java:151)
   [junit4]    > 	at java.base/java.util.stream.ForEachOps$ForEachOp$OfRef.evaluateSequential(ForEachOps.java:174)
   [junit4]    > 	at java.base/java.util.stream.AbstractPipeline.evaluate(AbstractPipeline.java:234)
   [junit4]    > 	at java.base/java.util.stream.ReferencePipeline.forEach(ReferencePipeline.java:430)
   [junit4]    > 	at org.apache.solr.util.stats.MetricUtils.toNamedList(MetricUtils.java:80)
   [junit4]    > 	at org.apache.solr.handler.admin.MetricsHandler.handleRequestBody(MetricsHandler.java:93)
   [junit4]    > 	at org.apache.solr.handler.admin.MetricsHandlerTest.test(MetricsHandlerTest.java:41)
   [junit4]    > 	at java.base/jdk.internal.reflect.NativeMethodAccessorImpl.invoke0(Native
Method)
   [junit4]    > 	at java.base/jdk.internal.reflect.NativeMethodAccessorImpl.invoke(NativeMethodAccessorImpl.java:62)
   [junit4]    > 	at java.base/jdk.internal.reflect.DelegatingMethodAccessorImpl.invoke(DelegatingMethodAccessorImpl.java:43)
   [junit4]    > 	at java.base/java.lang.reflect.Method.invoke(Method.java:538)
   [junit4]    > 	at java.base/java.lang.Thread.run(Thread.java:844)
   [junit4]   2> 1803651 INFO  (SUITE-MetricsHandlerTest-seed#[DBD49BD6595B7890]-worker)
[    ] o.a.s.SolrTestCaseJ4 ###deleteCore
   [junit4]   2> 1803651 INFO  (SUITE-MetricsHandlerTest-seed#[DBD49BD6595B7890]-worker)
[    ] o.a.s.c.CoreContainer Shutting down CoreContainer instance=9276721
   [junit4]   2> 1803651 INFO  (coreCloseExecutor-7615-thread-1) [    ] o.a.s.c.SolrCore
[collection1]  CLOSING SolrCore org.apache.solr.core.SolrCore@1ff72dd
   [junit4]   2> 1803658 INFO  (coreCloseExecutor-7615-thread-1) [    ] o.a.s.m.SolrMetricManager
Closing metric reporters for: solr.core.collection1
   [junit4]   2> 1803662 INFO  (SUITE-MetricsHandlerTest-seed#[DBD49BD6595B7890]-worker)
[    ] o.a.s.m.SolrMetricManager Closing metric reporters for: solr.node
   [junit4]   2> NOTE: leaving temporary files on disk at: /home/jenkins/workspace/Lucene-Solr-master-Linux/solr/build/solr-core/test/J0/temp/solr.handler.admin.MetricsHandlerTest_DBD49BD6595B7890-001
   [junit4]   2> NOTE: test params are: codec=DummyCompressingStoredFields(storedFieldsFormat=CompressingStoredFieldsFormat(compressionMode=DUMMY,
chunkSize=15529, maxDocsPerChunk=6, blockSize=9), termVectorsFormat=CompressingTermVectorsFormat(compressionMode=DUMMY,
chunkSize=15529, blockSize=9)), sim=RandomSimilarity(queryNorm=false): {}, locale=lrc-IR,
timezone=Asia/Pontianak
   [junit4]   2> NOTE: Linux 4.4.0-53-generic i386/Oracle Corporation 9-ea (32-bit)/cpus=12,threads=1,free=184495472,total=390594560
   [junit4]   2> NOTE: All tests run in this JVM: [PeerSyncReplicationTest, TestFaceting,
TestManagedSchema, TestXmlQParserPlugin, TestConfigSetsAPI, DeleteLastCustomShardedReplicaTest,
TestSlowCompositeReaderWrapper, TestCSVLoader, StandardRequestHandlerTest, TestReplicationHandlerBackup,
DefaultValueUpdateProcessorTest, UniqFieldsUpdateProcessorFactoryTest, TestPseudoReturnFields,
DocumentAnalysisRequestHandlerTest, TestFilteredDocIdSet, DirectoryFactoryTest, SearchHandlerTest,
SyncSliceTest, TestConfigSetImmutable, BJQParserTest, ZkStateReaderTest, HttpSolrCallGetCoreTest,
CollectionTooManyReplicasTest, TestCryptoKeys, TestFieldCacheSortRandom, TestDocBasedVersionConstraints,
CopyFieldTest, BlockJoinFacetSimpleTest, SuggestComponentContextFilterQueryTest, HdfsLockFactoryTest,
TestRTGBase, TestLocalFSCloudBackupRestore, TestRandomFlRTGCloud, TestFoldingMultitermQuery,
TestJoin, DistributedFacetPivotSmallTest, DistributedQueryComponentOptimizationTest, PathHierarchyTokenizerFactoryTest,
SystemInfoHandlerTest, DeleteShardTest, NotRequiredUniqueKeyTest, HdfsRecoveryZkTest, TestSubQueryTransformerCrossCore,
TestInitQParser, TestSearcherReuse, QueryResultKeyTest, TestFastWriter, CdcrVersionReplicationTest,
TestCorePropertiesReload, PluginInfoTest, TestCodecSupport, PeerSyncTest, DistributedDebugComponentTest,
MinimalSchemaTest, TestRealTimeGet, BasicZkTest, CurrencyFieldOpenExchangeTest, TestOmitPositions,
BasicAuthStandaloneTest, ActionThrottleTest, TestSolrConfigHandler, TestUninvertingReader,
BlockDirectoryTest, JavabinLoaderTest, SpellPossibilityIteratorTest, TestStressLucene, FileBasedSpellCheckerTest,
TestJmxMonitoredMap, TestDistributedSearch, DistribDocExpirationUpdateProcessorTest, TestLMJelinekMercerSimilarityFactory,
TestReplicationHandler, TestExactStatsCache, OverriddenZkACLAndCredentialsProvidersTest, TestEmbeddedSolrServerConstructors,
TestBlobHandler, ReplaceNodeTest, OverseerRolesTest, TestAnalyzedSuggestions, TestSolrCoreProperties,
TestFieldCacheReopen, TestNamedUpdateProcessors, TestSizeLimitedDistributedMap, TestPushWriter,
SignatureUpdateProcessorFactoryTest, TestLeaderElectionWithEmptyReplica, TestPKIAuthenticationPlugin,
RequiredFieldsTest, DistributedVersionInfoTest, MergeStrategyTest, CloneFieldUpdateProcessorFactoryTest,
TestJmxIntegration, ZkNodePropsTest, TestLFUCache, XsltUpdateRequestHandlerTest, CreateCollectionCleanupTest,
CdcrReplicationDistributedZkTest, TestSQLHandler, LeaderFailureAfterFreshStartTest, TestLazyCores,
TestDynamicFieldCollectionResource, SolrMetricReporterTest, TestStressUserVersions, HLLUtilTest,
TestBadConfig, CloudExitableDirectoryReaderTest, SecurityConfHandlerTest, AsyncCallRequestStatusResponseTest,
LeaderElectionIntegrationTest, FullSolrCloudDistribCmdsTest, TestZkChroot, TestRecovery, TermVectorComponentDistributedTest,
SimpleFacetsTest, TestSolr4Spatial, SolrCoreTest, SpellCheckComponentTest, QueryElevationComponentTest,
BadIndexSchemaTest, TestFiltering, TestTrie, SuggesterWFSTTest, PolyFieldTest, NoCacheHeaderTest,
SchemaVersionSpecificBehaviorTest, FieldMutatingUpdateProcessorTest, TestAtomicUpdateErrorCases,
QueryEqualityTest, DistanceFunctionTest, SolrInfoMBeanTest, TestSurroundQueryParser, DocumentBuilderTest,
TermVectorComponentTest, TestSolrQueryParser, IndexSchemaRuntimeFieldTest, TestCollationField,
ReturnFieldsTest, PingRequestHandlerTest, TestSolrDeletionPolicy2, MultiTermTest, TestDocSet,
TestBinaryField, TestSearchPerf, NumericFieldsTest, TestElisionMultitermQuery, TestConfig,
OutputWriterTest, TestPostingsSolrHighlighter, DirectSolrConnectionTest, TestLuceneMatchVersion,
SynonymTokenizerTest, TestXIncludeConfig, EchoParamsTest, TestDFRSimilarityFactory, TestPerFieldSimilarity,
TestIBSimilarityFactory, TestFastOutputStream, OpenExchangeRatesOrgProviderTest, DateMathParserTest,
TestSystemIdResolver, TestSuggestSpellingConverter, DateFieldTest, ClusterStateTest, TestLRUCache,
CursorPagingTest, SolrTestCaseJ4Test, TestCrossCoreJoin, TestHighlightDedupGrouping, TestSimpleTrackingShardHandler,
AssignTest, CdcrReplicationHandlerTest, CollectionReloadTest, HttpPartitionTest, SolrXmlInZkTest,
TestAuthenticationFramework, TestCloudPseudoReturnFields, TestCloudRecovery, TestDistribDocBasedVersion,
TestMiniSolrCloudClusterSSL, TestSSLRandomization, TestSegmentSorting, TestSolrCloudWithDelegationTokens,
TestSolrCloudWithSecureImpersonation, TestStressCloudBlindAtomicUpdates, TestTolerantUpdateProcessorCloud,
TriLevelCompositeIdRoutingTest, HdfsDirectoryFactoryTest, TestBackupRepositoryFactory, TestImplicitCoreProperties,
TestInfoStreamLogging, TestInitParams, TestNRTOpen, TestReloadAndDeleteDocs, TestSolrXml,
TestSolrCloudSnapshots, MetricsHandlerTest]
   [junit4] Completed [536/669 (1!)] on J0 in 0.77s, 1 test, 1 error <<< FAILURES!

[...truncated 51892 lines...]


Mime
View raw message