lucene-dev mailing list archives

Site index · List index
Message view « Date » · « Thread »
Top « Date » · « Thread »
From Policeman Jenkins Server <jenk...@thetaphi.de>
Subject [JENKINS] Lucene-Solr-master-Solaris (64bit/jdk1.8.0) - Build # 1009 - Unstable!
Date Wed, 14 Dec 2016 00:58:54 GMT
Build: https://jenkins.thetaphi.de/job/Lucene-Solr-master-Solaris/1009/
Java: 64bit/jdk1.8.0 -XX:-UseCompressedOops -XX:+UseConcMarkSweepGC

3 tests failed.
FAILED:  junit.framework.TestSuite.org.apache.solr.core.TestLazyCores

Error Message:
ObjectTracker found 5 object(s) that were not released!!! [MockDirectoryWrapper, MockDirectoryWrapper, MDCAwareThreadPoolExecutor, SolrCore, MockDirectoryWrapper] org.apache.solr.common.util.ObjectReleaseTracker$ObjectTrackerException  at org.apache.solr.common.util.ObjectReleaseTracker.track(ObjectReleaseTracker.java:43)  at org.apache.solr.core.CachingDirectoryFactory.get(CachingDirectoryFactory.java:347)  at org.apache.solr.update.SolrIndexWriter.create(SolrIndexWriter.java:66)  at org.apache.solr.core.SolrCore.initIndex(SolrCore.java:690)  at org.apache.solr.core.SolrCore.<init>(SolrCore.java:864)  at org.apache.solr.core.SolrCore.<init>(SolrCore.java:792)  at org.apache.solr.core.CoreContainer.create(CoreContainer.java:868)  at org.apache.solr.core.CoreContainer.lambda$load$0(CoreContainer.java:517)  at java.util.concurrent.FutureTask.run(FutureTask.java:266)  at org.apache.solr.common.util.ExecutorUtil$MDCAwareThreadPoolExecutor.lambda$execute$0(ExecutorUtil.java:229)  at java.util.concurrent.ThreadPoolExecutor.runWorker(ThreadPoolExecutor.java:1142)  at java.util.concurrent.ThreadPoolExecutor$Worker.run(ThreadPoolExecutor.java:617)  at java.lang.Thread.run(Thread.java:745)  org.apache.solr.common.util.ObjectReleaseTracker$ObjectTrackerException  at org.apache.solr.common.util.ObjectReleaseTracker.track(ObjectReleaseTracker.java:43)  at org.apache.solr.core.CachingDirectoryFactory.get(CachingDirectoryFactory.java:347)  at org.apache.solr.core.SolrCore.initSnapshotMetaDataManager(SolrCore.java:433)  at org.apache.solr.core.SolrCore.<init>(SolrCore.java:858)  at org.apache.solr.core.SolrCore.<init>(SolrCore.java:792)  at org.apache.solr.core.CoreContainer.create(CoreContainer.java:868)  at org.apache.solr.core.CoreContainer.lambda$load$0(CoreContainer.java:517)  at java.util.concurrent.FutureTask.run(FutureTask.java:266)  at org.apache.solr.common.util.ExecutorUtil$MDCAwareThreadPoolExecutor.lambda$execute$0(ExecutorUtil.java:229)  at java.util.concurrent.ThreadPoolExecutor.runWorker(ThreadPoolExecutor.java:1142)  at java.util.concurrent.ThreadPoolExecutor$Worker.run(ThreadPoolExecutor.java:617)  at java.lang.Thread.run(Thread.java:745)  org.apache.solr.common.util.ObjectReleaseTracker$ObjectTrackerException  at org.apache.solr.common.util.ObjectReleaseTracker.track(ObjectReleaseTracker.java:43)  at org.apache.solr.core.SolrCore.<init>(SolrCore.java:815)  at org.apache.solr.core.SolrCore.<init>(SolrCore.java:792)  at org.apache.solr.core.CoreContainer.create(CoreContainer.java:868)  at org.apache.solr.core.CoreContainer.lambda$load$0(CoreContainer.java:517)  at java.util.concurrent.FutureTask.run(FutureTask.java:266)  at org.apache.solr.common.util.ExecutorUtil$MDCAwareThreadPoolExecutor.lambda$execute$0(ExecutorUtil.java:229)  at java.util.concurrent.ThreadPoolExecutor.runWorker(ThreadPoolExecutor.java:1142)  at java.util.concurrent.ThreadPoolExecutor$Worker.run(ThreadPoolExecutor.java:617)  at java.lang.Thread.run(Thread.java:745)  org.apache.solr.common.util.ObjectReleaseTracker$ObjectTrackerException  at org.apache.solr.common.util.ObjectReleaseTracker.track(ObjectReleaseTracker.java:43)  at org.apache.solr.core.SolrCore.<init>(SolrCore.java:954)  at org.apache.solr.core.SolrCore.<init>(SolrCore.java:792)  at org.apache.solr.core.CoreContainer.create(CoreContainer.java:868)  at org.apache.solr.core.CoreContainer.lambda$load$0(CoreContainer.java:517)  at java.util.concurrent.FutureTask.run(FutureTask.java:266)  at org.apache.solr.common.util.ExecutorUtil$MDCAwareThreadPoolExecutor.lambda$execute$0(ExecutorUtil.java:229)  at java.util.concurrent.ThreadPoolExecutor.runWorker(ThreadPoolExecutor.java:1142)  at java.util.concurrent.ThreadPoolExecutor$Worker.run(ThreadPoolExecutor.java:617)  at java.lang.Thread.run(Thread.java:745)  org.apache.solr.common.util.ObjectReleaseTracker$ObjectTrackerException  at org.apache.solr.common.util.ObjectReleaseTracker.track(ObjectReleaseTracker.java:43)  at org.apache.solr.core.CachingDirectoryFactory.get(CachingDirectoryFactory.java:347)  at org.apache.solr.core.SolrCore.getNewIndexDir(SolrCore.java:331)  at org.apache.solr.core.SolrCore.initIndex(SolrCore.java:658)  at org.apache.solr.core.SolrCore.<init>(SolrCore.java:864)  at org.apache.solr.core.SolrCore.<init>(SolrCore.java:792)  at org.apache.solr.core.CoreContainer.create(CoreContainer.java:868)  at org.apache.solr.core.CoreContainer.lambda$load$0(CoreContainer.java:517)  at java.util.concurrent.FutureTask.run(FutureTask.java:266)  at org.apache.solr.common.util.ExecutorUtil$MDCAwareThreadPoolExecutor.lambda$execute$0(ExecutorUtil.java:229)  at java.util.concurrent.ThreadPoolExecutor.runWorker(ThreadPoolExecutor.java:1142)  at java.util.concurrent.ThreadPoolExecutor$Worker.run(ThreadPoolExecutor.java:617)  at java.lang.Thread.run(Thread.java:745)  

Stack Trace:
java.lang.AssertionError: ObjectTracker found 5 object(s) that were not released!!! [MockDirectoryWrapper, MockDirectoryWrapper, MDCAwareThreadPoolExecutor, SolrCore, MockDirectoryWrapper]
org.apache.solr.common.util.ObjectReleaseTracker$ObjectTrackerException
	at org.apache.solr.common.util.ObjectReleaseTracker.track(ObjectReleaseTracker.java:43)
	at org.apache.solr.core.CachingDirectoryFactory.get(CachingDirectoryFactory.java:347)
	at org.apache.solr.update.SolrIndexWriter.create(SolrIndexWriter.java:66)
	at org.apache.solr.core.SolrCore.initIndex(SolrCore.java:690)
	at org.apache.solr.core.SolrCore.<init>(SolrCore.java:864)
	at org.apache.solr.core.SolrCore.<init>(SolrCore.java:792)
	at org.apache.solr.core.CoreContainer.create(CoreContainer.java:868)
	at org.apache.solr.core.CoreContainer.lambda$load$0(CoreContainer.java:517)
	at java.util.concurrent.FutureTask.run(FutureTask.java:266)
	at org.apache.solr.common.util.ExecutorUtil$MDCAwareThreadPoolExecutor.lambda$execute$0(ExecutorUtil.java:229)
	at java.util.concurrent.ThreadPoolExecutor.runWorker(ThreadPoolExecutor.java:1142)
	at java.util.concurrent.ThreadPoolExecutor$Worker.run(ThreadPoolExecutor.java:617)
	at java.lang.Thread.run(Thread.java:745)

org.apache.solr.common.util.ObjectReleaseTracker$ObjectTrackerException
	at org.apache.solr.common.util.ObjectReleaseTracker.track(ObjectReleaseTracker.java:43)
	at org.apache.solr.core.CachingDirectoryFactory.get(CachingDirectoryFactory.java:347)
	at org.apache.solr.core.SolrCore.initSnapshotMetaDataManager(SolrCore.java:433)
	at org.apache.solr.core.SolrCore.<init>(SolrCore.java:858)
	at org.apache.solr.core.SolrCore.<init>(SolrCore.java:792)
	at org.apache.solr.core.CoreContainer.create(CoreContainer.java:868)
	at org.apache.solr.core.CoreContainer.lambda$load$0(CoreContainer.java:517)
	at java.util.concurrent.FutureTask.run(FutureTask.java:266)
	at org.apache.solr.common.util.ExecutorUtil$MDCAwareThreadPoolExecutor.lambda$execute$0(ExecutorUtil.java:229)
	at java.util.concurrent.ThreadPoolExecutor.runWorker(ThreadPoolExecutor.java:1142)
	at java.util.concurrent.ThreadPoolExecutor$Worker.run(ThreadPoolExecutor.java:617)
	at java.lang.Thread.run(Thread.java:745)

org.apache.solr.common.util.ObjectReleaseTracker$ObjectTrackerException
	at org.apache.solr.common.util.ObjectReleaseTracker.track(ObjectReleaseTracker.java:43)
	at org.apache.solr.core.SolrCore.<init>(SolrCore.java:815)
	at org.apache.solr.core.SolrCore.<init>(SolrCore.java:792)
	at org.apache.solr.core.CoreContainer.create(CoreContainer.java:868)
	at org.apache.solr.core.CoreContainer.lambda$load$0(CoreContainer.java:517)
	at java.util.concurrent.FutureTask.run(FutureTask.java:266)
	at org.apache.solr.common.util.ExecutorUtil$MDCAwareThreadPoolExecutor.lambda$execute$0(ExecutorUtil.java:229)
	at java.util.concurrent.ThreadPoolExecutor.runWorker(ThreadPoolExecutor.java:1142)
	at java.util.concurrent.ThreadPoolExecutor$Worker.run(ThreadPoolExecutor.java:617)
	at java.lang.Thread.run(Thread.java:745)

org.apache.solr.common.util.ObjectReleaseTracker$ObjectTrackerException
	at org.apache.solr.common.util.ObjectReleaseTracker.track(ObjectReleaseTracker.java:43)
	at org.apache.solr.core.SolrCore.<init>(SolrCore.java:954)
	at org.apache.solr.core.SolrCore.<init>(SolrCore.java:792)
	at org.apache.solr.core.CoreContainer.create(CoreContainer.java:868)
	at org.apache.solr.core.CoreContainer.lambda$load$0(CoreContainer.java:517)
	at java.util.concurrent.FutureTask.run(FutureTask.java:266)
	at org.apache.solr.common.util.ExecutorUtil$MDCAwareThreadPoolExecutor.lambda$execute$0(ExecutorUtil.java:229)
	at java.util.concurrent.ThreadPoolExecutor.runWorker(ThreadPoolExecutor.java:1142)
	at java.util.concurrent.ThreadPoolExecutor$Worker.run(ThreadPoolExecutor.java:617)
	at java.lang.Thread.run(Thread.java:745)

org.apache.solr.common.util.ObjectReleaseTracker$ObjectTrackerException
	at org.apache.solr.common.util.ObjectReleaseTracker.track(ObjectReleaseTracker.java:43)
	at org.apache.solr.core.CachingDirectoryFactory.get(CachingDirectoryFactory.java:347)
	at org.apache.solr.core.SolrCore.getNewIndexDir(SolrCore.java:331)
	at org.apache.solr.core.SolrCore.initIndex(SolrCore.java:658)
	at org.apache.solr.core.SolrCore.<init>(SolrCore.java:864)
	at org.apache.solr.core.SolrCore.<init>(SolrCore.java:792)
	at org.apache.solr.core.CoreContainer.create(CoreContainer.java:868)
	at org.apache.solr.core.CoreContainer.lambda$load$0(CoreContainer.java:517)
	at java.util.concurrent.FutureTask.run(FutureTask.java:266)
	at org.apache.solr.common.util.ExecutorUtil$MDCAwareThreadPoolExecutor.lambda$execute$0(ExecutorUtil.java:229)
	at java.util.concurrent.ThreadPoolExecutor.runWorker(ThreadPoolExecutor.java:1142)
	at java.util.concurrent.ThreadPoolExecutor$Worker.run(ThreadPoolExecutor.java:617)
	at java.lang.Thread.run(Thread.java:745)


	at __randomizedtesting.SeedInfo.seed([9D99B84DF18D5652]:0)
	at org.junit.Assert.fail(Assert.java:93)
	at org.junit.Assert.assertTrue(Assert.java:43)
	at org.junit.Assert.assertNull(Assert.java:551)
	at org.apache.solr.SolrTestCaseJ4.teardownTestCases(SolrTestCaseJ4.java:266)
	at sun.reflect.GeneratedMethodAccessor42.invoke(Unknown Source)
	at sun.reflect.DelegatingMethodAccessorImpl.invoke(DelegatingMethodAccessorImpl.java:43)
	at java.lang.reflect.Method.invoke(Method.java:498)
	at com.carrotsearch.randomizedtesting.RandomizedRunner.invoke(RandomizedRunner.java:1713)
	at com.carrotsearch.randomizedtesting.RandomizedRunner$7.evaluate(RandomizedRunner.java:870)
	at com.carrotsearch.randomizedtesting.rules.StatementAdapter.evaluate(StatementAdapter.java:36)
	at com.carrotsearch.randomizedtesting.rules.SystemPropertiesRestoreRule$1.evaluate(SystemPropertiesRestoreRule.java:57)
	at org.apache.lucene.util.AbstractBeforeAfterRule$1.evaluate(AbstractBeforeAfterRule.java:45)
	at com.carrotsearch.randomizedtesting.rules.StatementAdapter.evaluate(StatementAdapter.java:36)
	at org.apache.lucene.util.TestRuleStoreClassName$1.evaluate(TestRuleStoreClassName.java:41)
	at com.carrotsearch.randomizedtesting.rules.NoShadowingOrOverridesOnMethodsRule$1.evaluate(NoShadowingOrOverridesOnMethodsRule.java:40)
	at com.carrotsearch.randomizedtesting.rules.NoShadowingOrOverridesOnMethodsRule$1.evaluate(NoShadowingOrOverridesOnMethodsRule.java:40)
	at com.carrotsearch.randomizedtesting.rules.StatementAdapter.evaluate(StatementAdapter.java:36)
	at com.carrotsearch.randomizedtesting.rules.StatementAdapter.evaluate(StatementAdapter.java:36)
	at com.carrotsearch.randomizedtesting.rules.StatementAdapter.evaluate(StatementAdapter.java:36)
	at org.apache.lucene.util.TestRuleAssertionsRequired$1.evaluate(TestRuleAssertionsRequired.java:53)
	at org.apache.lucene.util.TestRuleMarkFailure$1.evaluate(TestRuleMarkFailure.java:47)
	at org.apache.lucene.util.TestRuleIgnoreAfterMaxFailures$1.evaluate(TestRuleIgnoreAfterMaxFailures.java:64)
	at org.apache.lucene.util.TestRuleIgnoreTestSuites$1.evaluate(TestRuleIgnoreTestSuites.java:54)
	at com.carrotsearch.randomizedtesting.rules.StatementAdapter.evaluate(StatementAdapter.java:36)
	at com.carrotsearch.randomizedtesting.ThreadLeakControl$StatementRunner.run(ThreadLeakControl.java:367)
	at java.lang.Thread.run(Thread.java:745)


FAILED:  junit.framework.TestSuite.org.apache.solr.core.TestLazyCores

Error Message:
1 thread leaked from SUITE scope at org.apache.solr.core.TestLazyCores:     1) Thread[id=17963, name=searcherExecutor-6283-thread-1, state=WAITING, group=TGRP-TestLazyCores]         at sun.misc.Unsafe.park(Native Method)         at java.util.concurrent.locks.LockSupport.park(LockSupport.java:175)         at java.util.concurrent.locks.AbstractQueuedSynchronizer$ConditionObject.await(AbstractQueuedSynchronizer.java:2039)         at java.util.concurrent.LinkedBlockingQueue.take(LinkedBlockingQueue.java:442)         at java.util.concurrent.ThreadPoolExecutor.getTask(ThreadPoolExecutor.java:1067)         at java.util.concurrent.ThreadPoolExecutor.runWorker(ThreadPoolExecutor.java:1127)         at java.util.concurrent.ThreadPoolExecutor$Worker.run(ThreadPoolExecutor.java:617)         at java.lang.Thread.run(Thread.java:745)

Stack Trace:
com.carrotsearch.randomizedtesting.ThreadLeakError: 1 thread leaked from SUITE scope at org.apache.solr.core.TestLazyCores: 
   1) Thread[id=17963, name=searcherExecutor-6283-thread-1, state=WAITING, group=TGRP-TestLazyCores]
        at sun.misc.Unsafe.park(Native Method)
        at java.util.concurrent.locks.LockSupport.park(LockSupport.java:175)
        at java.util.concurrent.locks.AbstractQueuedSynchronizer$ConditionObject.await(AbstractQueuedSynchronizer.java:2039)
        at java.util.concurrent.LinkedBlockingQueue.take(LinkedBlockingQueue.java:442)
        at java.util.concurrent.ThreadPoolExecutor.getTask(ThreadPoolExecutor.java:1067)
        at java.util.concurrent.ThreadPoolExecutor.runWorker(ThreadPoolExecutor.java:1127)
        at java.util.concurrent.ThreadPoolExecutor$Worker.run(ThreadPoolExecutor.java:617)
        at java.lang.Thread.run(Thread.java:745)
	at __randomizedtesting.SeedInfo.seed([9D99B84DF18D5652]:0)


FAILED:  junit.framework.TestSuite.org.apache.solr.core.TestLazyCores

Error Message:
There are still zombie threads that couldn't be terminated:    1) Thread[id=17963, name=searcherExecutor-6283-thread-1, state=WAITING, group=TGRP-TestLazyCores]         at sun.misc.Unsafe.park(Native Method)         at java.util.concurrent.locks.LockSupport.park(LockSupport.java:175)         at java.util.concurrent.locks.AbstractQueuedSynchronizer$ConditionObject.await(AbstractQueuedSynchronizer.java:2039)         at java.util.concurrent.LinkedBlockingQueue.take(LinkedBlockingQueue.java:442)         at java.util.concurrent.ThreadPoolExecutor.getTask(ThreadPoolExecutor.java:1067)         at java.util.concurrent.ThreadPoolExecutor.runWorker(ThreadPoolExecutor.java:1127)         at java.util.concurrent.ThreadPoolExecutor$Worker.run(ThreadPoolExecutor.java:617)         at java.lang.Thread.run(Thread.java:745)

Stack Trace:
com.carrotsearch.randomizedtesting.ThreadLeakError: There are still zombie threads that couldn't be terminated:
   1) Thread[id=17963, name=searcherExecutor-6283-thread-1, state=WAITING, group=TGRP-TestLazyCores]
        at sun.misc.Unsafe.park(Native Method)
        at java.util.concurrent.locks.LockSupport.park(LockSupport.java:175)
        at java.util.concurrent.locks.AbstractQueuedSynchronizer$ConditionObject.await(AbstractQueuedSynchronizer.java:2039)
        at java.util.concurrent.LinkedBlockingQueue.take(LinkedBlockingQueue.java:442)
        at java.util.concurrent.ThreadPoolExecutor.getTask(ThreadPoolExecutor.java:1067)
        at java.util.concurrent.ThreadPoolExecutor.runWorker(ThreadPoolExecutor.java:1127)
        at java.util.concurrent.ThreadPoolExecutor$Worker.run(ThreadPoolExecutor.java:617)
        at java.lang.Thread.run(Thread.java:745)
	at __randomizedtesting.SeedInfo.seed([9D99B84DF18D5652]:0)




Build Log:
[...truncated 12097 lines...]
   [junit4] Suite: org.apache.solr.core.TestLazyCores
   [junit4]   2> Creating dataDir: /export/home/jenkins/workspace/Lucene-Solr-master-Solaris/solr/build/solr-core/test/J0/temp/solr.core.TestLazyCores_9D99B84DF18D5652-001/init-core-data-001
   [junit4]   2> 1522599 INFO  (SUITE-TestLazyCores-seed#[9D99B84DF18D5652]-worker) [    ] o.a.s.SolrTestCaseJ4 Randomized ssl (false) and clientAuth (false) via: @org.apache.solr.util.RandomizeSSL(reason=, value=NaN, ssl=NaN, clientAuth=NaN)
   [junit4]   2> 1522601 INFO  (TEST-TestLazyCores.testCreateTransientFromAdmin-seed#[9D99B84DF18D5652]) [    ] o.a.s.SolrTestCaseJ4 ###Starting testCreateTransientFromAdmin
   [junit4]   2> 1522632 INFO  (TEST-TestLazyCores.testCreateTransientFromAdmin-seed#[9D99B84DF18D5652]) [    ] o.a.s.c.SolrCores Allocating transient cache for 4 transient cores
   [junit4]   2> 1522658 WARN  (coreLoadExecutor-6042-thread-1) [    x:collection1] o.a.s.c.Config Beginning with Solr 5.5, <mergePolicy> is deprecated, use <mergePolicyFactory> instead.
   [junit4]   2> 1522659 WARN  (coreLoadExecutor-6042-thread-2) [    x:collection2] o.a.s.c.Config Beginning with Solr 5.5, <mergePolicy> is deprecated, use <mergePolicyFactory> instead.
   [junit4]   2> 1522672 INFO  (coreLoadExecutor-6042-thread-2) [    x:collection2] o.a.s.c.SolrConfig Using Lucene MatchVersion: 7.0.0
   [junit4]   2> 1522671 WARN  (coreLoadExecutor-6042-thread-3) [    x:collection5] o.a.s.c.Config Beginning with Solr 5.5, <mergePolicy> is deprecated, use <mergePolicyFactory> instead.
   [junit4]   2> 1522659 INFO  (coreLoadExecutor-6042-thread-1) [    x:collection1] o.a.s.c.SolrConfig Using Lucene MatchVersion: 7.0.0
   [junit4]   2> 1522684 INFO  (coreLoadExecutor-6042-thread-3) [    x:collection5] o.a.s.c.SolrConfig Using Lucene MatchVersion: 7.0.0
   [junit4]   2> 1522699 INFO  (coreLoadExecutor-6042-thread-1) [    x:collection1] o.a.s.s.IndexSchema [collection1] Schema name=tiny
   [junit4]   2> 1522699 INFO  (coreLoadExecutor-6042-thread-2) [    x:collection2] o.a.s.s.IndexSchema [collection2] Schema name=tiny
   [junit4]   2> 1522711 INFO  (coreLoadExecutor-6042-thread-1) [    x:collection1] o.a.s.s.IndexSchema Loaded schema tiny/1.1 with uniqueid field id
   [junit4]   2> 1522719 INFO  (coreLoadExecutor-6042-thread-1) [    x:collection1] o.a.s.c.CoreContainer Creating SolrCore 'collection1' using configuration from instancedir /export/home/jenkins/workspace/Lucene-Solr-master-Solaris/solr/build/solr-core/test/J0/temp/solr.core.TestLazyCores_9D99B84DF18D5652-001/tempDir-001/collection1
   [junit4]   2> 1522719 INFO  (coreLoadExecutor-6042-thread-1) [    x:collection1] o.a.s.c.SolrCore [[collection1] ] Opening new SolrCore at [/export/home/jenkins/workspace/Lucene-Solr-master-Solaris/solr/build/solr-core/test/J0/temp/solr.core.TestLazyCores_9D99B84DF18D5652-001/tempDir-001/collection1], dataDir=[/export/home/jenkins/workspace/Lucene-Solr-master-Solaris/solr/build/solr-core/test/J0/temp/solr.core.TestLazyCores_9D99B84DF18D5652-001/tempDir-001/collection1/data/]
   [junit4]   2> 1522720 INFO  (coreLoadExecutor-6042-thread-1) [    x:collection1] o.a.s.u.RandomMergePolicy RandomMergePolicy wrapping class org.apache.lucene.index.AlcoholicMergePolicy: [AlcoholicMergePolicy: minMergeSize=0, mergeFactor=10, maxMergeSize=1724443341, maxMergeSizeForForcedMerge=9223372036854775807, calibrateSizeByDeletes=true, maxMergeDocs=2147483647, maxCFSSegmentSizeMB=8.796093022207999E12, noCFSRatio=0.1]
   [junit4]   2> 1522724 INFO  (coreLoadExecutor-6042-thread-2) [    x:collection2] o.a.s.s.IndexSchema Loaded schema tiny/1.1 with uniqueid field id
   [junit4]   2> 1522726 INFO  (coreLoadExecutor-6042-thread-2) [    x:collection2] o.a.s.c.CoreContainer Creating SolrCore 'collection2' using configuration from instancedir /export/home/jenkins/workspace/Lucene-Solr-master-Solaris/solr/build/solr-core/test/J0/temp/solr.core.TestLazyCores_9D99B84DF18D5652-001/tempDir-001/collection2
   [junit4]   2> 1522726 INFO  (coreLoadExecutor-6042-thread-2) [    x:collection2] o.a.s.c.SolrCore [[collection2] ] Opening new SolrCore at [/export/home/jenkins/workspace/Lucene-Solr-master-Solaris/solr/build/solr-core/test/J0/temp/solr.core.TestLazyCores_9D99B84DF18D5652-001/tempDir-001/collection2], dataDir=[/export/home/jenkins/workspace/Lucene-Solr-master-Solaris/solr/build/solr-core/test/J0/temp/solr.core.TestLazyCores_9D99B84DF18D5652-001/tempDir-001/collection2/data/]
   [junit4]   2> 1522729 INFO  (coreLoadExecutor-6042-thread-2) [    x:collection2] o.a.s.u.RandomMergePolicy RandomMergePolicy wrapping class org.apache.lucene.index.AlcoholicMergePolicy: [AlcoholicMergePolicy: minMergeSize=0, mergeFactor=10, maxMergeSize=1724443341, maxMergeSizeForForcedMerge=9223372036854775807, calibrateSizeByDeletes=true, maxMergeDocs=2147483647, maxCFSSegmentSizeMB=8.796093022207999E12, noCFSRatio=0.1]
   [junit4]   2> 1522731 INFO  (coreLoadExecutor-6042-thread-1) [    x:collection1] o.a.s.u.CommitTracker Hard AutoCommit: disabled
   [junit4]   2> 1522731 INFO  (coreLoadExecutor-6042-thread-1) [    x:collection1] o.a.s.u.CommitTracker Soft AutoCommit: disabled
   [junit4]   2> 1522732 INFO  (coreLoadExecutor-6042-thread-1) [    x:collection1] o.a.s.u.RandomMergePolicy RandomMergePolicy wrapping class org.apache.lucene.index.AlcoholicMergePolicy: [AlcoholicMergePolicy: minMergeSize=0, mergeFactor=10, maxMergeSize=1138771033, maxMergeSizeForForcedMerge=9223372036854775807, calibrateSizeByDeletes=true, maxMergeDocs=2147483647, maxCFSSegmentSizeMB=8.796093022207999E12, noCFSRatio=0.1]
   [junit4]   2> 1522732 INFO  (coreLoadExecutor-6042-thread-1) [    x:collection1] o.a.s.s.SolrIndexSearcher Opening [Searcher@4a108784[collection1] main]
   [junit4]   2> 1522732 INFO  (coreLoadExecutor-6042-thread-1) [    x:collection1] o.a.s.r.ManagedResourceStorage File-based storage initialized to use dir: /export/home/jenkins/workspace/Lucene-Solr-master-Solaris/solr/build/solr-core/test/J0/temp/solr.core.TestLazyCores_9D99B84DF18D5652-001/tempDir-001/collection1/conf
   [junit4]   2> 1522733 INFO  (coreLoadExecutor-6042-thread-1) [    x:collection1] o.a.s.h.ReplicationHandler Commits will be reserved for  10000
   [junit4]   2> 1522733 INFO  (searcherExecutor-6043-thread-1-processing-x:collection1) [    x:collection1] o.a.s.c.SolrCore [collection1] Registered new searcher Searcher@4a108784[collection1] main{ExitableDirectoryReader(UninvertingDirectoryReader())}
   [junit4]   2> 1522739 INFO  (coreLoadExecutor-6042-thread-2) [    x:collection2] o.a.s.u.CommitTracker Hard AutoCommit: disabled
   [junit4]   2> 1522739 INFO  (coreLoadExecutor-6042-thread-2) [    x:collection2] o.a.s.u.CommitTracker Soft AutoCommit: disabled
   [junit4]   2> 1522739 INFO  (coreLoadExecutor-6042-thread-2) [    x:collection2] o.a.s.u.RandomMergePolicy RandomMergePolicy wrapping class org.apache.lucene.index.AlcoholicMergePolicy: [AlcoholicMergePolicy: minMergeSize=0, mergeFactor=10, maxMergeSize=1138771033, maxMergeSizeForForcedMerge=9223372036854775807, calibrateSizeByDeletes=true, maxMergeDocs=2147483647, maxCFSSegmentSizeMB=8.796093022207999E12, noCFSRatio=0.1]
   [junit4]   2> 1522739 INFO  (coreLoadExecutor-6042-thread-2) [    x:collection2] o.a.s.s.SolrIndexSearcher Opening [Searcher@3d12770c[collection2] main]
   [junit4]   2> 1522740 INFO  (coreLoadExecutor-6042-thread-2) [    x:collection2] o.a.s.r.ManagedResourceStorage File-based storage initialized to use dir: /export/home/jenkins/workspace/Lucene-Solr-master-Solaris/solr/build/solr-core/test/J0/temp/solr.core.TestLazyCores_9D99B84DF18D5652-001/tempDir-001/collection2/conf
   [junit4]   2> 1522740 INFO  (coreLoadExecutor-6042-thread-2) [    x:collection2] o.a.s.h.ReplicationHandler Commits will be reserved for  10000
   [junit4]   2> 1522740 INFO  (searcherExecutor-6044-thread-1-processing-x:collection2) [    x:collection2] o.a.s.c.SolrCore [collection2] Registered new searcher Searcher@3d12770c[collection2] main{ExitableDirectoryReader(UninvertingDirectoryReader())}
   [junit4]   2> 1522740 INFO  (coreLoadExecutor-6042-thread-2) [    x:collection2] o.a.s.c.SolrCores Opening transient core collection2
   [junit4]   2> 1522741 INFO  (coreLoadExecutor-6042-thread-3) [    x:collection5] o.a.s.s.IndexSchema [collection5] Schema name=tiny
   [junit4]   2> 1522745 INFO  (coreLoadExecutor-6042-thread-3) [    x:collection5] o.a.s.s.IndexSchema Loaded schema tiny/1.1 with uniqueid field id
   [junit4]   2> 1522746 INFO  (coreLoadExecutor-6042-thread-3) [    x:collection5] o.a.s.c.CoreContainer Creating SolrCore 'collection5' using configuration from instancedir /export/home/jenkins/workspace/Lucene-Solr-master-Solaris/solr/build/solr-core/test/J0/temp/solr.core.TestLazyCores_9D99B84DF18D5652-001/tempDir-001/collection5
   [junit4]   2> 1522746 INFO  (coreLoadExecutor-6042-thread-3) [    x:collection5] o.a.s.c.SolrCore [[collection5] ] Opening new SolrCore at [/export/home/jenkins/workspace/Lucene-Solr-master-Solaris/solr/build/solr-core/test/J0/temp/solr.core.TestLazyCores_9D99B84DF18D5652-001/tempDir-001/collection5], dataDir=[/export/home/jenkins/workspace/Lucene-Solr-master-Solaris/solr/build/solr-core/test/J0/temp/solr.core.TestLazyCores_9D99B84DF18D5652-001/tempDir-001/collection5/data/]
   [junit4]   2> 1522747 INFO  (coreLoadExecutor-6042-thread-3) [    x:collection5] o.a.s.u.RandomMergePolicy RandomMergePolicy wrapping class org.apache.lucene.index.AlcoholicMergePolicy: [AlcoholicMergePolicy: minMergeSize=0, mergeFactor=10, maxMergeSize=1724443341, maxMergeSizeForForcedMerge=9223372036854775807, calibrateSizeByDeletes=true, maxMergeDocs=2147483647, maxCFSSegmentSizeMB=8.796093022207999E12, noCFSRatio=0.1]
   [junit4]   2> 1522757 INFO  (coreLoadExecutor-6042-thread-3) [    x:collection5] o.a.s.u.CommitTracker Hard AutoCommit: disabled
   [junit4]   2> 1522757 INFO  (coreLoadExecutor-6042-thread-3) [    x:collection5] o.a.s.u.CommitTracker Soft AutoCommit: disabled
   [junit4]   2> 1522766 INFO  (coreLoadExecutor-6042-thread-3) [    x:collection5] o.a.s.u.RandomMergePolicy RandomMergePolicy wrapping class org.apache.lucene.index.AlcoholicMergePolicy: [AlcoholicMergePolicy: minMergeSize=0, mergeFactor=10, maxMergeSize=1138771033, maxMergeSizeForForcedMerge=9223372036854775807, calibrateSizeByDeletes=true, maxMergeDocs=2147483647, maxCFSSegmentSizeMB=8.796093022207999E12, noCFSRatio=0.1]
   [junit4]   2> 1522767 INFO  (coreLoadExecutor-6042-thread-3) [    x:collection5] o.a.s.s.SolrIndexSearcher Opening [Searcher@4745667f[collection5] main]
   [junit4]   2> 1522767 INFO  (coreLoadExecutor-6042-thread-3) [    x:collection5] o.a.s.r.ManagedResourceStorage File-based storage initialized to use dir: /export/home/jenkins/workspace/Lucene-Solr-master-Solaris/solr/build/solr-core/test/J0/temp/solr.core.TestLazyCores_9D99B84DF18D5652-001/tempDir-001/collection5/conf
   [junit4]   2> 1522767 INFO  (coreLoadExecutor-6042-thread-3) [    x:collection5] o.a.s.h.ReplicationHandler Commits will be reserved for  10000
   [junit4]   2> 1522767 INFO  (searcherExecutor-6051-thread-1-processing-x:collection5) [    x:collection5] o.a.s.c.SolrCore [collection5] Registered new searcher Searcher@4745667f[collection5] main{ExitableDirectoryReader(UninvertingDirectoryReader())}
   [junit4]   2> 1522789 INFO  (TEST-TestLazyCores.testCreateTransientFromAdmin-seed#[9D99B84DF18D5652]) [    ] o.a.s.h.a.CoreAdminOperation core create command loadOnStartup=true&transient=true&name=core1&action=CREATE&wt=xml
   [junit4]   2> 1522799 WARN  (TEST-TestLazyCores.testCreateTransientFromAdmin-seed#[9D99B84DF18D5652]) [    x:core1] o.a.s.c.Config Beginning with Solr 5.5, <mergePolicy> is deprecated, use <mergePolicyFactory> instead.
   [junit4]   2> 1522800 INFO  (TEST-TestLazyCores.testCreateTransientFromAdmin-seed#[9D99B84DF18D5652]) [    x:core1] o.a.s.c.SolrConfig Using Lucene MatchVersion: 7.0.0
   [junit4]   2> 1522818 INFO  (TEST-TestLazyCores.testCreateTransientFromAdmin-seed#[9D99B84DF18D5652]) [    x:core1] o.a.s.s.IndexSchema [core1] Schema name=tiny
   [junit4]   2> 1522821 INFO  (TEST-TestLazyCores.testCreateTransientFromAdmin-seed#[9D99B84DF18D5652]) [    x:core1] o.a.s.s.IndexSchema Loaded schema tiny/1.1 with uniqueid field id
   [junit4]   2> 1522823 INFO  (TEST-TestLazyCores.testCreateTransientFromAdmin-seed#[9D99B84DF18D5652]) [    x:core1] o.a.s.c.CoreContainer Creating SolrCore 'core1' using configuration from instancedir /export/home/jenkins/workspace/Lucene-Solr-master-Solaris/solr/build/solr-core/test/J0/temp/solr.core.TestLazyCores_9D99B84DF18D5652-001/tempDir-001/core1
   [junit4]   2> 1522829 INFO  (TEST-TestLazyCores.testCreateTransientFromAdmin-seed#[9D99B84DF18D5652]) [    x:core1] o.a.s.c.SolrCore [[core1] ] Opening new SolrCore at [/export/home/jenkins/workspace/Lucene-Solr-master-Solaris/solr/build/solr-core/test/J0/temp/solr.core.TestLazyCores_9D99B84DF18D5652-001/tempDir-001/core1], dataDir=[/export/home/jenkins/workspace/Lucene-Solr-master-Solaris/solr/build/solr-core/test/J0/temp/solr.core.TestLazyCores_9D99B84DF18D5652-001/tempDir-001/core1/data/]
   [junit4]   2> 1522830 INFO  (TEST-TestLazyCores.testCreateTransientFromAdmin-seed#[9D99B84DF18D5652]) [    x:core1] o.a.s.u.RandomMergePolicy RandomMergePolicy wrapping class org.apache.lucene.index.LogDocMergePolicy: [LogDocMergePolicy: minMergeSize=1000, mergeFactor=4, maxMergeSize=9223372036854775807, maxMergeSizeForForcedMerge=9223372036854775807, calibrateSizeByDeletes=true, maxMergeDocs=2147483647, maxCFSSegmentSizeMB=8.796093022207999E12, noCFSRatio=0.0]
   [junit4]   2> 1522839 INFO  (TEST-TestLazyCores.testCreateTransientFromAdmin-seed#[9D99B84DF18D5652]) [    x:core1] o.a.s.u.CommitTracker Hard AutoCommit: disabled
   [junit4]   2> 1522840 INFO  (TEST-TestLazyCores.testCreateTransientFromAdmin-seed#[9D99B84DF18D5652]) [    x:core1] o.a.s.u.CommitTracker Soft AutoCommit: disabled
   [junit4]   2> 1522840 INFO  (TEST-TestLazyCores.testCreateTransientFromAdmin-seed#[9D99B84DF18D5652]) [    x:core1] o.a.s.u.RandomMergePolicy RandomMergePolicy wrapping class org.apache.lucene.index.AlcoholicMergePolicy: [AlcoholicMergePolicy: minMergeSize=0, mergeFactor=10, maxMergeSize=1721251784, maxMergeSizeForForcedMerge=9223372036854775807, calibrateSizeByDeletes=true, maxMergeDocs=2147483647, maxCFSSegmentSizeMB=8.796093022207999E12, noCFSRatio=0.1]
   [junit4]   2> 1522840 INFO  (TEST-TestLazyCores.testCreateTransientFromAdmin-seed#[9D99B84DF18D5652]) [    x:core1] o.a.s.s.SolrIndexSearcher Opening [Searcher@31af8f9e[core1] main]
   [junit4]   2> 1522841 INFO  (TEST-TestLazyCores.testCreateTransientFromAdmin-seed#[9D99B84DF18D5652]) [    x:core1] o.a.s.r.ManagedResourceStorage File-based storage initialized to use dir: /export/home/jenkins/workspace/Lucene-Solr-master-Solaris/solr/build/solr-core/test/J0/temp/solr.core.TestLazyCores_9D99B84DF18D5652-001/tempDir-001/core1/conf
   [junit4]   2> 1522841 INFO  (TEST-TestLazyCores.testCreateTransientFromAdmin-seed#[9D99B84DF18D5652]) [    x:core1] o.a.s.h.ReplicationHandler Commits will be reserved for  10000
   [junit4]   2> 1522841 INFO  (searcherExecutor-6056-thread-1-processing-x:core1) [    x:core1] o.a.s.c.SolrCore [core1] Registered new searcher Searcher@31af8f9e[core1] main{ExitableDirectoryReader(UninvertingDirectoryReader())}
   [junit4]   2> 1522842 INFO  (TEST-TestLazyCores.testCreateTransientFromAdmin-seed#[9D99B84DF18D5652]) [    x:core1] o.a.s.c.SolrCores Opening transient core core1
   [junit4]   2> 1522842 INFO  (TEST-TestLazyCores.testCreateTransientFromAdmin-seed#[9D99B84DF18D5652]) [    x:core1] o.a.s.h.a.CoreAdminOperation core create command loadOnStartup=false&transient=true&name=core2&action=CREATE&wt=xml
   [junit4]   2> 1522851 WARN  (TEST-TestLazyCores.testCreateTransientFromAdmin-seed#[9D99B84DF18D5652]) [    x:core1] o.a.s.c.Config Beginning with Solr 5.5, <mergePolicy> is deprecated, use <mergePolicyFactory> instead.
   [junit4]   2> 1522853 INFO  (TEST-TestLazyCores.testCreateTransientFromAdmin-seed#[9D99B84DF18D5652]) [    x:core1] o.a.s.c.SolrConfig Using Lucene MatchVersion: 7.0.0
   [junit4]   2> 1522867 INFO  (TEST-TestLazyCores.testCreateTransientFromAdmin-seed#[9D99B84DF18D5652]) [    x:core1] o.a.s.s.IndexSchema [core2] Schema name=tiny
   [junit4]   2> 1522873 INFO  (TEST-TestLazyCores.testCreateTransientFromAdmin-seed#[9D99B84DF18D5652]) [    x:core1] o.a.s.s.IndexSchema Loaded schema tiny/1.1 with uniqueid field id
   [junit4]   2> 1522875 INFO  (TEST-TestLazyCores.testCreateTransientFromAdmin-seed#[9D99B84DF18D5652]) [    x:core1] o.a.s.c.CoreContainer Creating SolrCore 'core2' using configuration from instancedir /export/home/jenkins/workspace/Lucene-Solr-master-Solaris/solr/build/solr-core/test/J0/temp/solr.core.TestLazyCores_9D99B84DF18D5652-001/tempDir-001/core2
   [junit4]   2> 1522875 INFO  (TEST-TestLazyCores.testCreateTransientFromAdmin-seed#[9D99B84DF18D5652]) [    x:core1] o.a.s.c.SolrCore [[core2] ] Opening new SolrCore at [/export/home/jenkins/workspace/Lucene-Solr-master-Solaris/solr/build/solr-core/test/J0/temp/solr.core.TestLazyCores_9D99B84DF18D5652-001/tempDir-001/core2], dataDir=[/export/home/jenkins/workspace/Lucene-Solr-master-Solaris/solr/build/solr-core/test/J0/temp/solr.core.TestLazyCores_9D99B84DF18D5652-001/tempDir-001/core2/data/]
   [junit4]   2> 1522877 INFO  (TEST-TestLazyCores.testCreateTransientFromAdmin-seed#[9D99B84DF18D5652]) [    x:core1] o.a.s.u.RandomMergePolicy RandomMergePolicy wrapping class org.apache.lucene.index.LogByteSizeMergePolicy: [LogByteSizeMergePolicy: minMergeSize=1677721, mergeFactor=25, maxMergeSize=2147483648, maxMergeSizeForForcedMerge=9223372036854775807, calibrateSizeByDeletes=false, maxMergeDocs=2147483647, maxCFSSegmentSizeMB=8.796093022207999E12, noCFSRatio=1.0]
   [junit4]   2> 1522885 INFO  (TEST-TestLazyCores.testCreateTransientFromAdmin-seed#[9D99B84DF18D5652]) [    x:core1] o.a.s.u.CommitTracker Hard AutoCommit: disabled
   [junit4]   2> 1522885 INFO  (TEST-TestLazyCores.testCreateTransientFromAdmin-seed#[9D99B84DF18D5652]) [    x:core1] o.a.s.u.CommitTracker Soft AutoCommit: disabled
   [junit4]   2> 1522886 INFO  (TEST-TestLazyCores.testCreateTransientFromAdmin-seed#[9D99B84DF18D5652]) [    x:core1] o.a.s.u.RandomMergePolicy RandomMergePolicy wrapping class org.apache.lucene.index.AlcoholicMergePolicy: [AlcoholicMergePolicy: minMergeSize=0, mergeFactor=10, maxMergeSize=2093442821, maxMergeSizeForForcedMerge=9223372036854775807, calibrateSizeByDeletes=true, maxMergeDocs=2147483647, maxCFSSegmentSizeMB=8.796093022207999E12, noCFSRatio=0.1]
   [junit4]   2> 1522886 INFO  (TEST-TestLazyCores.testCreateTransientFromAdmin-seed#[9D99B84DF18D5652]) [    x:core1] o.a.s.s.SolrIndexSearcher Opening [Searcher@3baefb05[core2] main]
   [junit4]   2> 1522886 INFO  (TEST-TestLazyCores.testCreateTransientFromAdmin-seed#[9D99B84DF18D5652]) [    x:core1] o.a.s.r.ManagedResourceStorage File-based storage initialized to use dir: /export/home/jenkins/workspace/Lucene-Solr-master-Solaris/solr/build/solr-core/test/J0/temp/solr.core.TestLazyCores_9D99B84DF18D5652-001/tempDir-001/core2/conf
   [junit4]   2> 1522887 INFO  (TEST-TestLazyCores.testCreateTransientFromAdmin-seed#[9D99B84DF18D5652]) [    x:core1] o.a.s.h.ReplicationHandler Commits will be reserved for  10000
   [junit4]   2> 1522887 INFO  (searcherExecutor-6061-thread-1-processing-x:core1) [    x:core1] o.a.s.c.SolrCore [core2] Registered new searcher Searcher@3baefb05[core2] main{ExitableDirectoryReader(UninvertingDirectoryReader())}
   [junit4]   2> 1522887 INFO  (TEST-TestLazyCores.testCreateTransientFromAdmin-seed#[9D99B84DF18D5652]) [    x:core1] o.a.s.c.SolrCores Opening transient core core2
   [junit4]   2> 1522887 INFO  (TEST-TestLazyCores.testCreateTransientFromAdmin-seed#[9D99B84DF18D5652]) [    x:core1] o.a.s.h.a.CoreAdminOperation core create command loadOnStartup=true&transient=true&name=core3&action=CREATE&wt=xml
   [junit4]   2> 1522896 WARN  (TEST-TestLazyCores.testCreateTransientFromAdmin-seed#[9D99B84DF18D5652]) [    x:core1] o.a.s.c.Config Beginning with Solr 5.5, <mergePolicy> is deprecated, use <mergePolicyFactory> instead.
   [junit4]   2> 1522897 INFO  (TEST-TestLazyCores.testCreateTransientFromAdmin-seed#[9D99B84DF18D5652]) [    x:core1] o.a.s.c.SolrConfig Using Lucene MatchVersion: 7.0.0
   [junit4]   2> 1522908 INFO  (TEST-TestLazyCores.testCreateTransientFromAdmin-seed#[9D99B84DF18D5652]) [    x:core1] o.a.s.s.IndexSchema [core3] Schema name=tiny
   [junit4]   2> 1522915 INFO  (TEST-TestLazyCores.testCreateTransientFromAdmin-seed#[9D99B84DF18D5652]) [    x:core1] o.a.s.s.IndexSchema Loaded schema tiny/1.1 with uniqueid field id
   [junit4]   2> 1522916 INFO  (TEST-TestLazyCores.testCreateTransientFromAdmin-seed#[9D99B84DF18D5652]) [    x:core1] o.a.s.c.CoreContainer Creating SolrCore 'core3' using configuration from instancedir /export/home/jenkins/workspace/Lucene-Solr-master-Solaris/solr/build/solr-core/test/J0/temp/solr.core.TestLazyCores_9D99B84DF18D5652-001/tempDir-001/core3
   [junit4]   2> 1522916 INFO  (TEST-TestLazyCores.testCreateTransientFromAdmin-seed#[9D99B84DF18D5652]) [    x:core1] o.a.s.c.SolrCore [[core3] ] Opening new SolrCore at [/export/home/jenkins/workspace/Lucene-Solr-master-Solaris/solr/build/solr-core/test/J0/temp/solr.core.TestLazyCores_9D99B84DF18D5652-001/tempDir-001/core3], dataDir=[/export/home/jenkins/workspace/Lucene-Solr-master-Solaris/solr/build/solr-core/test/J0/temp/solr.core.TestLazyCores_9D99B84DF18D5652-001/tempDir-001/core3/data/]
   [junit4]   2> 1522917 INFO  (TEST-TestLazyCores.testCreateTransientFromAdmin-seed#[9D99B84DF18D5652]) [    x:core1] o.a.s.u.RandomMergePolicy RandomMergePolicy wrapping class org.apache.lucene.index.LogByteSizeMergePolicy: [LogByteSizeMergePolicy: minMergeSize=1677721, mergeFactor=24, maxMergeSize=2147483648, maxMergeSizeForForcedMerge=9223372036854775807, calibrateSizeByDeletes=true, maxMergeDocs=2147483647, maxCFSSegmentSizeMB=8.796093022207999E12, noCFSRatio=0.6206401208433939]
   [junit4]   2> 1522925 INFO  (TEST-TestLazyCores.testCreateTransientFromAdmin-seed#[9D99B84DF18D5652]) [    x:core1] o.a.s.u.CommitTracker Hard AutoCommit: disabled
   [junit4]   2> 1522925 INFO  (TEST-TestLazyCores.testCreateTransientFromAdmin-seed#[9D99B84DF18D5652]) [    x:core1] o.a.s.u.CommitTracker Soft AutoCommit: disabled
   [junit4]   2> 1522925 INFO  (TEST-TestLazyCores.testCreateTransientFromAdmin-seed#[9D99B84DF18D5652]) [    x:core1] o.a.s.u.RandomMergePolicy RandomMergePolicy wrapping class org.apache.lucene.index.TieredMergePolicy: [TieredMergePolicy: maxMergeAtOnce=40, maxMergeAtOnceExplicit=29, maxMergedSegmentMB=80.091796875, floorSegmentMB=2.0048828125, forceMergeDeletesPctAllowed=7.056205893530424, segmentsPerTier=14.0, maxCFSSegmentSizeMB=8.796093022207999E12, noCFSRatio=0.3551463703869888
   [junit4]   2> 1522925 INFO  (TEST-TestLazyCores.testCreateTransientFromAdmin-seed#[9D99B84DF18D5652]) [    x:core1] o.a.s.s.SolrIndexSearcher Opening [Searcher@2ee92dd0[core3] main]
   [junit4]   2> 1522925 INFO  (TEST-TestLazyCores.testCreateTransientFromAdmin-seed#[9D99B84DF18D5652]) [    x:core1] o.a.s.r.ManagedResourceStorage File-based storage initialized to use dir: /export/home/jenkins/workspace/Lucene-Solr-master-Solaris/solr/build/solr-core/test/J0/temp/solr.core.TestLazyCores_9D99B84DF18D5652-001/tempDir-001/core3/conf
   [junit4]   2> 1522926 INFO  (TEST-TestLazyCores.testCreateTransientFromAdmin-seed#[9D99B84DF18D5652]) [    x:core1] o.a.s.h.ReplicationHandler Commits will be reserved for  10000
   [junit4]   2> 1522926 INFO  (searcherExecutor-6066-thread-1-processing-x:core1) [    x:core1] o.a.s.c.SolrCore [core3] Registered new searcher Searcher@2ee92dd0[core3] main{ExitableDirectoryReader(UninvertingDirectoryReader())}
   [junit4]   2> 1522926 INFO  (TEST-TestLazyCores.testCreateTransientFromAdmin-seed#[9D99B84DF18D5652]) [    x:core1] o.a.s.c.SolrCores Opening transient core core3
   [junit4]   2> 1522926 INFO  (TEST-TestLazyCores.testCreateTransientFromAdmin-seed#[9D99B84DF18D5652]) [    x:core1] o.a.s.h.a.CoreAdminOperation core create command loadOnStartup=false&transient=true&name=core4&action=CREATE&wt=xml
   [junit4]   2> 1522933 WARN  (TEST-TestLazyCores.testCreateTransientFromAdmin-seed#[9D99B84DF18D5652]) [    x:core1] o.a.s.c.Config Beginning with Solr 5.5, <mergePolicy> is deprecated, use <mergePolicyFactory> instead.
   [junit4]   2> 1522934 INFO  (TEST-TestLazyCores.testCreateTransientFromAdmin-seed#[9D99B84DF18D5652]) [    x:core1] o.a.s.c.SolrConfig Using Lucene MatchVersion: 7.0.0
   [junit4]   2> 1522946 INFO  (TEST-TestLazyCores.testCreateTransientFromAdmin-seed#[9D99B84DF18D5652]) [    x:core1] o.a.s.s.IndexSchema [core4] Schema name=tiny
   [junit4]   2> 1522952 INFO  (TEST-TestLazyCores.testCreateTransientFromAdmin-seed#[9D99B84DF18D5652]) [    x:core1] o.a.s.s.IndexSchema Loaded schema tiny/1.1 with uniqueid field id
   [junit4]   2> 1522953 INFO  (TEST-TestLazyCores.testCreateTransientFromAdmin-seed#[9D99B84DF18D5652]) [    x:core1] o.a.s.c.CoreContainer Creating SolrCore 'core4' using configuration from instancedir /export/home/jenkins/workspace/Lucene-Solr-master-Solaris/solr/build/solr-core/test/J0/temp/solr.core.TestLazyCores_9D99B84DF18D5652-001/tempDir-001/core4
   [junit4]   2> 1522954 INFO  (TEST-TestLazyCores.testCreateTransientFromAdmin-seed#[9D99B84DF18D5652]) [    x:core1] o.a.s.c.SolrCore [[core4] ] Opening new SolrCore at [/export/home/jenkins/workspace/Lucene-Solr-master-Solaris/solr/build/solr-core/test/J0/temp/solr.core.TestLazyCores_9D99B84DF18D5652-001/tempDir-001/core4], dataDir=[/export/home/jenkins/workspace/Lucene-Solr-master-Solaris/solr/build/solr-core/test/J0/temp/solr.core.TestLazyCores_9D99B84DF18D5652-001/tempDir-001/core4/data/]
   [junit4]   2> 1522955 INFO  (TEST-TestLazyCores.testCreateTransientFromAdmin-seed#[9D99B84DF18D5652]) [    x:core1] o.a.s.u.RandomMergePolicy RandomMergePolicy wrapping class org.apache.lucene.index.LogByteSizeMergePolicy: [LogByteSizeMergePolicy: minMergeSize=1677721, mergeFactor=41, maxMergeSize=2147483648, maxMergeSizeForForcedMerge=9223372036854775807, calibrateSizeByDeletes=false, maxMergeDocs=2147483647, maxCFSSegmentSizeMB=8.796093022207999E12, noCFSRatio=0.0]
   [junit4]   2> 1522962 INFO  (TEST-TestLazyCores.testCreateTransientFromAdmin-seed#[9D99B84DF18D5652]) [    x:core1] o.a.s.u.CommitTracker Hard AutoCommit: disabled
   [junit4]   2> 1522962 INFO  (TEST-TestLazyCores.testCreateTransientFromAdmin-seed#[9D99B84DF18D5652]) [    x:core1] o.a.s.u.CommitTracker Soft AutoCommit: disabled
   [junit4]   2> 1522962 INFO  (TEST-TestLazyCores.testCreateTransientFromAdmin-seed#[9D99B84DF18D5652]) [    x:core1] o.a.s.u.RandomMergePolicy RandomMergePolicy wrapping class org.apache.lucene.index.TieredMergePolicy: [TieredMergePolicy: maxMergeAtOnce=21, maxMergeAtOnceExplicit=11, maxMergedSegmentMB=87.8720703125, floorSegmentMB=0.2841796875, forceMergeDeletesPctAllowed=25.06291332340984, segmentsPerTier=24.0, maxCFSSegmentSizeMB=8.796093022207999E12, noCFSRatio=0.1982245001608611
   [junit4]   2> 1522962 INFO  (TEST-TestLazyCores.testCreateTransientFromAdmin-seed#[9D99B84DF18D5652]) [    x:core1] o.a.s.s.SolrIndexSearcher Opening [Searcher@1f2ffa7[core4] main]
   [junit4]   2> 1522962 INFO  (TEST-TestLazyCores.testCreateTransientFromAdmin-seed#[9D99B84DF18D5652]) [    x:core1] o.a.s.r.ManagedResourceStorage File-based storage initialized to use dir: /export/home/jenkins/workspace/Lucene-Solr-master-Solaris/solr/build/solr-core/test/J0/temp/solr.core.TestLazyCores_9D99B84DF18D5652-001/tempDir-001/core4/conf
   [junit4]   2> 1522963 INFO  (TEST-TestLazyCores.testCreateTransientFromAdmin-seed#[9D99B84DF18D5652]) [    x:core1] o.a.s.h.ReplicationHandler Commits will be reserved for  10000
   [junit4]   2> 1522963 INFO  (searcherExecutor-6071-thread-1-processing-x:core1) [    x:core1] o.a.s.c.SolrCore [core4] Registered new searcher Searcher@1f2ffa7[core4] main{ExitableDirectoryReader(UninvertingDirectoryReader())}
   [junit4]   2> 1522963 INFO  (TEST-TestLazyCores.testCreateTransientFromAdmin-seed#[9D99B84DF18D5652]) [    x:core1] o.a.s.c.SolrCores Opening transient core core4
   [junit4]   2> 1522963 INFO  (TEST-TestLazyCores.testCreateTransientFromAdmin-seed#[9D99B84DF18D5652]) [    x:core1] o.a.s.c.SolrCores Closing transient core [collection2]
   [junit4]   2> 1522963 INFO  (TEST-TestLazyCores.testCreateTransientFromAdmin-seed#[9D99B84DF18D5652]) [    x:core1] o.a.s.h.a.CoreAdminOperation core create command loadOnStartup=false&transient=true&name=core5&action=CREATE&wt=xml
   [junit4]   2> 1522963 INFO  (Thread-7236) [    ] o.a.s.c.SolrCore [collection2]  CLOSING SolrCore org.apache.solr.core.SolrCore@1e1fb7d6
   [junit4]   2> 1522971 WARN  (TEST-TestLazyCores.testCreateTransientFromAdmin-seed#[9D99B84DF18D5652]) [    x:core1] o.a.s.c.Config Beginning with Solr 5.5, <mergePolicy> is deprecated, use <mergePolicyFactory> instead.
   [junit4]   2> 1522972 INFO  (TEST-TestLazyCores.testCreateTransientFromAdmin-seed#[9D99B84DF18D5652]) [    x:core1] o.a.s.c.SolrConfig Using Lucene MatchVersion: 7.0.0
   [junit4]   2> 1523024 INFO  (TEST-TestLazyCores.testCreateTransientFromAdmin-seed#[9D99B84DF18D5652]) [    x:core1] o.a.s.s.IndexSchema [core5] Schema name=tiny
   [junit4]   2> 1523034 INFO  (TEST-TestLazyCores.testCreateTransientFromAdmin-seed#[9D99B84DF18D5652]) [    x:core1] o.a.s.s.IndexSchema Loaded schema tiny/1.1 with uniqueid field id
   [junit4]   2> 1523037 INFO  (TEST-TestLazyCores.testCreateTransientFromAdmin-seed#[9D99B84DF18D5652]) [    x:core1] o.a.s.c.CoreContainer Creating SolrCore 'core5' using configuration from instancedir /export/home/jenkins/workspace/Lucene-Solr-master-Solaris/solr/build/solr-core/test/J0/temp/solr.core.TestLazyCores_9D99B84DF18D5652-001/tempDir-001/core5
   [junit4]   2> 1523037 INFO  (TEST-TestLazyCores.testCreateTransientFromAdmin-seed#[9D99B84DF18D5652]) [    x:core1] o.a.s.c.SolrCore [[core5] ] Opening new SolrCore at [/export/home/jenkins/workspace/Lucene-Solr-master-Solaris/solr/build/solr-core/test/J0/temp/solr.core.TestLazyCores_9D99B84DF18D5652-001/tempDir-001/core5], dataDir=[/export/home/jenkins/workspace/Lucene-Solr-master-Solaris/solr/build/solr-core/test/J0/temp/solr.core.TestLazyCores_9D99B84DF18D5652-001/tempDir-001/core5/data/]
   [junit4]   2> 1523039 INFO  (TEST-TestLazyCores.testCreateTransientFromAdmin-seed#[9D99B84DF18D5652]) [    x:core1] o.a.s.u.RandomMergePolicy RandomMergePolicy wrapping class org.apache.lucene.index.LogDocMergePolicy: [LogDocMergePolicy: minMergeSize=1000, mergeFactor=23, maxMergeSize=9223372036854775807, maxMergeSizeForForcedMerge=9223372036854775807, calibrateSizeByDeletes=false, maxMergeDocs=2147483647, maxCFSSegmentSizeMB=8.796093022207999E12, noCFSRatio=1.0]
   [junit4]   2> 1523050 INFO  (TEST-TestLazyCores.testCreateTransientFromAdmin-seed#[9D99B84DF18D5652]) [    x:core1] o.a.s.u.CommitTracker Hard AutoCommit: disabled
   [junit4]   2> 1523051 INFO  (TEST-TestLazyCores.testCreateTransientFromAdmin-seed#[9D99B84DF18D5652]) [    x:core1] o.a.s.u.CommitTracker Soft AutoCommit: disabled
   [junit4]   2> 1523051 INFO  (TEST-TestLazyCores.testCreateTransientFromAdmin-seed#[9D99B84DF18D5652]) [    x:core1] o.a.s.u.RandomMergePolicy RandomMergePolicy wrapping class org.apache.lucene.index.LogDocMergePolicy: [LogDocMergePolicy: minMergeSize=1000, mergeFactor=19, maxMergeSize=9223372036854775807, maxMergeSizeForForcedMerge=9223372036854775807, calibrateSizeByDeletes=true, maxMergeDocs=2147483647, maxCFSSegmentSizeMB=8.796093022207999E12, noCFSRatio=1.0]
   [junit4]   2> 1523051 INFO  (TEST-TestLazyCores.testCreateTransientFromAdmin-seed#[9D99B84DF18D5652]) [    x:core1] o.a.s.s.SolrIndexSearcher Opening [Searcher@4c9804ac[core5] main]
   [junit4]   2> 1523051 INFO  (TEST-TestLazyCores.testCreateTransientFromAdmin-seed#[9D99B84DF18D5652]) [    x:core1] o.a.s.r.ManagedResourceStorage File-based storage initialized to use dir: /export/home/jenkins/workspace/Lucene-Solr-master-Solaris/solr/build/solr-core/test/J0/temp/solr.core.TestLazyCores_9D99B84DF18D5652-001/tempDir-001/core5/conf
   [junit4]   2> 1523052 INFO  (TEST-TestLazyCores.testCreateTransientFromAdmin-seed#[9D99B84DF18D5652]) [    x:core1] o.a.s.h.ReplicationHandler Commits will be reserved for  10000
   [junit4]   2> 1523052 INFO  (searcherExecutor-6076-thread-1-processing-x:core1) [    x:core1] o.a.s.c.SolrCore [core5] Registered new searcher Searcher@4c9804ac[core5] main{ExitableDirectoryReader(UninvertingDirectoryReader())}
   [junit4]   2> 1523052 INFO  (TEST-TestLazyCores.testCreateTransientFromAdmin-seed#[9D99B84DF18D5652]) [    x:core1] o.a.s.c.SolrCores Opening transient core core5
   [junit4]   2> 1523052 INFO  (TEST-TestLazyCores.testCreateTransientFromAdmin-seed#[9D99B84DF18D5652]) [    x:core1] o.a.s.c.SolrCores Closing transient core [core1]
   [junit4]   2> 1523053 INFO  (Thread-7236) [    ] o.a.s.c.SolrCore [core1]  CLOSING SolrCore org.apache.solr.core.SolrCore@255140c3
   [junit4]   2> 1523063 WARN  (TEST-TestLazyCores.testCreateTransientFromAdmin-seed#[9D99B84DF18D5652]) [    x:core1] o.a.s.c.Config Beginning with Solr 5.5, <mergePolicy> is deprecated, use <mergePolicyFactory> instead.
   [junit4]   2> 1523064 INFO  (TEST-TestLazyCores.testCreateTransientFromAdmin-seed#[9D99B84DF18D5652]) [    x:core1] o.a.s.c.SolrConfig Using Lucene MatchVersion: 7.0.0
   [junit4]   2> 1523078 INFO  (TEST-TestLazyCores.testCreateTransientFromAdmin-seed#[9D99B84DF18D5652]) [    x:core1] o.a.s.s.IndexSchema [core1] Schema name=tiny
   [junit4]   2> 1523085 INFO  (TEST-TestLazyCores.testCreateTransientFromAdmin-seed#[9D99B84DF18D5652]) [    x:core1] o.a.s.s.IndexSchema Loaded schema tiny/1.1 with uniqueid field id
   [junit4]   2> 1523087 INFO  (TEST-TestLazyCores.testCreateTransientFromAdmin-seed#[9D99B84DF18D5652]) [    x:core1] o.a.s.c.CoreContainer Creating SolrCore 'core1' using configuration from instancedir /export/home/jenkins/workspace/Lucene-Solr-master-Solaris/solr/build/solr-core/test/J0/temp/solr.core.TestLazyCores_9D99B84DF18D5652-001/tempDir-001/core1
   [junit4]   2> 1523087 INFO  (TEST-TestLazyCores.testCreateTransientFromAdmin-seed#[9D99B84DF18D5652]) [    x:core1] o.a.s.c.SolrCore [[core1] ] Opening new SolrCore at [/export/home/jenkins/workspace/Lucene-Solr-master-Solaris/solr/build/solr-core/test/J0/temp/solr.core.TestLazyCores_9D99B84DF18D5652-001/tempDir-001/core1], dataDir=[/export/home/jenkins/workspace/Lucene-Solr-master-Solaris/solr/build/solr-core/test/J0/temp/solr.core.TestLazyCores_9D99B84DF18D5652-001/tempDir-001/core1/data/]
   [junit4]   2> 1523089 INFO  (TEST-TestLazyCores.testCreateTransientFromAdmin-seed#[9D99B84DF18D5652]) [    x:core1] o.a.s.u.RandomMergePolicy RandomMergePolicy wrapping class org.apache.lucene.index.TieredMergePolicy: [TieredMergePolicy: maxMergeAtOnce=45, maxMergeAtOnceExplicit=24, maxMergedSegmentMB=24.4775390625, floorSegmentMB=2.13671875, forceMergeDeletesPctAllowed=22.035053964336793, segmentsPerTier=22.0, maxCFSSegmentSizeMB=8.796093022207999E12, noCFSRatio=0.21250168392409421
   [junit4]   2> 1523099 INFO  (TEST-TestLazyCores.testCreateTransientFromAdmin-seed#[9D99B84DF18D5652]) [    x:core1] o.a.s.u.CommitTracker Hard AutoCommit: disabled
   [junit4]   2> 1523099 INFO  (TEST-TestLazyCores.testCreateTransientFromAdmin-seed#[9D99B84DF18D5652]) [    x:core1] o.a.s.u.CommitTracker Soft AutoCommit: disabled
   [junit4]   2> 1523099 INFO  (TEST-TestLazyCores.testCreateTransientFromAdmin-seed#[9D99B84DF18D5652]) [    x:core1] o.a.s.u.RandomMergePolicy RandomMergePolicy wrapping class org.apache.lucene.index.TieredMergePolicy: [TieredMergePolicy: maxMergeAtOnce=11, maxMergeAtOnceExplicit=28, maxMergedSegmentMB=91.07421875, floorSegmentMB=1.5244140625, forceMergeDeletesPctAllowed=28.577210334267562, segmentsPerTier=31.0, maxCFSSegmentSizeMB=8.796093022207999E12, noCFSRatio=0.39445723231492813
   [junit4]   2> 1523099 INFO  (TEST-TestLazyCores.testCreateTransientFromAdmin-seed#[9D99B84DF18D5652]) [    x:core1] o.a.s.s.SolrIndexSearcher Opening [Searcher@3505564f[core1] main]
   [junit4]   2> 1523100 INFO  (TEST-TestLazyCores.testCreateTransientFromAdmin-seed#[9D99B84DF18D5652]) [    x:core1] o.a.s.r.ManagedResourceStorage File-based storage initialized to use dir: /export/home/jenkins/workspace/Lucene-Solr-master-Solaris/solr/build/solr-core/test/J0/temp/solr.core.TestLazyCores_9D99B84DF18D5652-001/tempDir-001/core1/conf
   [junit4]   2> 1523100 INFO  (TEST-TestLazyCores.testCreateTransientFromAdmin-seed#[9D99B84DF18D5652]) [    x:core1] o.a.s.h.ReplicationHandler Commits will be reserved for  10000
   [junit4]   2> 1523100 INFO  (searcherExecutor-6080-thread-1-processing-x:core1) [    x:core1] o.a.s.c.SolrCore [core1] Registered new searcher Searcher@3505564f[core1] main{ExitableDirectoryReader(UninvertingDirectoryReader())}
   [junit4]   2> 1523100 INFO  (TEST-TestLazyCores.testCreateTransientFromAdmin-seed#[9D99B84DF18D5652]) [    x:core1] o.a.s.c.SolrCores Opening transient core core1
   [junit4]   2> 1523101 INFO  (TEST-TestLazyCores.testCreateTransientFromAdmin-seed#[9D99B84DF18D5652]) [    x:core1] o.a.s.c.SolrCores Closing transient core [core2]
   [junit4]   2> 1523101 INFO  (Thread-7236) [    ] o.a.s.c.SolrCore [core2]  CLOSING SolrCore org.apache.solr.core.SolrCore@1dbcee5
   [junit4]   2> 1523111 WARN  (TEST-TestLazyCores.testCreateTransientFromAdmin-seed#[9D99B84DF18D5652]) [    x:core1] o.a.s.c.Config Beginning with Solr 5.5, <mergePolicy> is deprecated, use <mergePolicyFactory> instead.
   [junit4]   2> 1523112 INFO  (TEST-TestLazyCores.testCreateTransientFromAdmin-seed#[9D99B84DF18D5652]) [    x:core1] o.a.s.c.SolrConfig Using Lucene MatchVersion: 7.0.0
   [junit4]   2> 1523131 INFO  (TEST-TestLazyCores.testCreateTransientFromAdmin-seed#[9D99B84DF18D5652]) [    x:core1] o.a.s.s.IndexSchema [core2] Schema name=tiny
   [junit4]   2> 1523134 INFO  (TEST-TestLazyCores.testCreateTransientFromAdmin-seed#[9D99B84DF18D5652]) [    x:core1] o.a.s.s.IndexSchema Loaded schema tiny/1.1 with uniqueid field id
   [junit4]   2> 1523136 INFO  (TEST-TestLazyCores.testCreateTransientFromAdmin-seed#[9D99B84DF18D5652]) [    x:core1] o.a.s.c.CoreContainer Creating SolrCore 'core2' using configuration from instancedir /export/home/jenkins/workspace/Lucene-Solr-master-Solaris/solr/build/solr-core/test/J0/temp/solr.core.TestLazyCores_9D99B84DF18D5652-001/tempDir-001/core2
   [junit4]   2> 1523136 INFO  (TEST-TestLazyCores.testCreateTransientFromAdmin-seed#[9D99B84DF18D5652]) [    x:core1] o.a.s.c.SolrCore [[core2] ] Opening new SolrCore at [/export/home/jenkins/workspace/Lucene-Solr-master-Solaris/solr/build/solr-core/test/J0/temp/solr.core.TestLazyCores_9D99B84DF18D5652-001/tempDir-001/core2], dataDir=[/export/home/jenkins/workspace/Lucene-Solr-master-Solaris/solr/build/solr-core/test/J0/temp/solr.core.TestLazyCores_9D99B84DF18D5652-001/tempDir-001/core2/data/]
   [junit4]   2> 1523138 INFO  (TEST-TestLazyCores.testCreateTransientFromAdmin-seed#[9D99B84DF18D5652]) [    x:core1] o.a.s.u.RandomMergePolicy RandomMergePolicy wrapping class org.apache.lucene.index.TieredMergePolicy: [TieredMergePolicy: maxMergeAtOnce=28, maxMergeAtOnceExplicit=32, maxMergedSegmentMB=17.7275390625, floorSegmentMB=1.2529296875, forceMergeDeletesPctAllowed=24.277297136611477, segmentsPerTier=29.0, maxCFSSegmentSizeMB=8.796093022207999E12, noCFSRatio=0.0
   [junit4]   2> 1523147 INFO  (TEST-TestLazyCores.testCreateTransientFromAdmin-seed#[9D99B84DF18D5652]) [    x:core1] o.a.s.u.CommitTracker Hard AutoCommit: disabled
   [junit4]   2> 1523147 INFO  (TEST-TestLazyCores.testCreateTransientFromAdmin-seed#[9D99B84DF18D5652]) [    x:core1] o.a.s.u.CommitTracker Soft AutoCommit: disabled
   [junit4]   2> 1523148 INFO  (TEST-TestLazyCores.testCreateTransientFromAdmin-seed#[9D99B84DF18D5652]) [    x:core1] o.a.s.u.RandomMergePolicy RandomMergePolicy wrapping class org.apache.lucene.index.TieredMergePolicy: [TieredMergePolicy: maxMergeAtOnce=31, maxMergeAtOnceExplicit=46, maxMergedSegmentMB=4.91015625, floorSegmentMB=0.4521484375, forceMergeDeletesPctAllowed=21.92599423981237, segmentsPerTier=50.0, maxCFSSegmentSizeMB=8.796093022207999E12, noCFSRatio=0.5968999955385209
   [junit4]   2> 1523148 INFO  (TEST-TestLazyCores.testCreateTransientFromAdmin-seed#[9D99B84DF18D5652]) [    x:core1] o.a.s.s.SolrIndexSearcher Opening [Searcher@3a32b384[core2] main]
   [junit4]   2> 1523148 INFO  (TEST-TestLazyCores.testCreateTransientFromAdmin-seed#[9D99B84DF18D5652]) [    x:core1] o.a.s.r.ManagedResourceStorage File-based storage initialized to use dir: /export/home/jenkins/workspace/Lucene-Solr-master-Solaris/solr/build/solr-core/test/J0/temp/solr.core.TestLazyCores_9D99B84DF18D5652-001/tempDir-001/core2/conf
   [junit4]   2> 1523149 INFO  (TEST-TestLazyCores.testCreateTransientFromAdmin-seed#[9D99B84DF18D5652]) [    x:core1] o.a.s.h.ReplicationHandler Commits will be reserved for  10000
   [junit4]   2> 1523149 INFO  (searcherExecutor-6084-thread-1-processing-x:core1) [    x:core1] o.a.s.c.SolrCore [core2] Registered new searcher Searcher@3a32b384[core2] main{ExitableDirectoryReader(UninvertingDirectoryReader())}
   [junit4]   2> 1523149 INFO  (TEST-TestLazyCores.testCreateTransientFromAdmin-seed#[9D99B84DF18D5652]) [    x:core1] o.a.s.c.SolrCores Opening transient core core2
   [junit4]   2> 1523149 INFO  (TEST-TestLazyCores.testCreateTransientFromAdmin-seed#[9D99B84DF18D5652]) [    x:core1] o.a.s.c.SolrCores Closing transient core [core3]
   [junit4]   2> 1523149 INFO  (Thread-7236) [    ] o.a.s.c.SolrCore [core3]  CLOSING SolrCore org.apache.solr.core.SolrCore@4de4115f
   [junit4]   2> 1523161 WARN  (TEST-TestLazyCores.testCreateTransientFromAdmin-seed#[9D99B84DF18D5652]) [    x:core1] o.a.s.c.Config Beginning with Solr 5.5, <mergePolicy> is deprecated, use <mergePolicyFactory> instead.
   [junit4]   2> 1523167 INFO  (TEST-TestLazyCores.testCreateTransientFromAdmin-seed#[9D99B84DF18D5652]) [    x:core1] o.a.s.c.SolrConfig Using Lucene MatchVersion: 7.0.0
   [junit4]   2> 1523184 INFO  (TEST-TestLazyCores.testCreateTransientFromAdmin-seed#[9D99B84DF18D5652]) [    x:core1] o.a.s.s.IndexSchema [core3] Schema name=tiny
   [junit4]   2> 1523188 INFO  (TEST-TestLazyCores.testCreateTransientFromAdmin-seed#[9D99B84DF18D5652]) [    x:core1] o.a.s.s.IndexSchema Loaded schema tiny/1.1 with uniqueid field id
   [junit4]   2> 1523190 INFO  (TEST-TestLazyCores.testCreateTransientFromAdmin-seed#[9D99B84DF18D5652]) [    x:core1] o.a.s.c.CoreContainer Creating SolrCore 'core3' using configuration from instancedir /export/home/jenkins/workspace/Lucene-Solr-master-Solaris/solr/build/solr-core/test/J0/temp/solr.core.TestLazyCores_9D99B84DF18D5652-001/tempDir-001/core3
   [junit4]   2> 1523190 INFO  (TEST-TestLazyCores.testCreateTransientFromAdmin-seed#[9D99B84DF18D5652]) [    x:core1] o.a.s.c.SolrCore [[core3] ] Opening new SolrCore at [/export/home/jenkins/workspace/Lucene-Solr-master-Solaris/solr/build/solr-core/test/J0/temp/solr.core.TestLazyCores_9D99B84DF18D5652-001/tempDir-001/core3], dataDir=[/export/home/jenkins/workspace/Lucene-Solr-master-Solaris/solr/build/solr-core/test/J0/temp/solr.core.TestLazyCores_9D99B84DF18D5652-001/tempDir-001/core3/data/]
   [junit4]   2> 1523191 INFO  (TEST-TestLazyCores.testCreateTransientFromAdmin-seed#[9D99B84DF18D5652]) [    x:core1] o.a.s.u.RandomMergePolicy RandomMergePolicy wrapping class org.apache.lucene.index.TieredMergePolicy: [TieredMergePolicy: maxMergeAtOnce=12, maxMergeAtOnceExplicit=47, maxMergedSegmentMB=8.7861328125, floorSegmentMB=1.7607421875, forceMergeDeletesPctAllowed=9.9169517820389, segmentsPerTier=42.0, maxCFSSegmentSizeMB=8.796093022207999E12, noCFSRatio=0.0
   [junit4]   2> 1523202 INFO  (TEST-TestLazyCores.testCreateTransientFromAdmin-seed#[9D99B84DF18D5652]) [    x:core1] o.a.s.u.CommitTracker Hard AutoCommit: disabled
   [junit4]   2> 1523202 INFO  (TEST-TestLazyCores.testCreateTransientFromAdmin-seed#[9D99B84DF18D5652]) [    x:core1] o.a.s.u.CommitTracker Soft AutoCommit: disabled
   [junit4]   2> 1523241 INFO  (TEST-TestLazyCores.testCreateTransientFromAdmin-seed#[9D99B84DF18D5652]) [    x:core1] o.a.s.u.RandomMergePolicy RandomMergePolicy wrapping class org.apache.lucene.index.LogByteSizeMergePolicy: [LogByteSizeMergePolicy: minMergeSize=1677721, mergeFactor=48, maxMergeSize=2147483648, maxMergeSizeForForcedMerge=9223372036854775807, calibrateSizeByDeletes=false, maxMergeDocs=2147483647, maxCFSSegmentSizeMB=8.796093022207999E12, noCFSRatio=0.8519833029374968]
   [junit4]   2> 1523242 INFO  (TEST-TestLazyCores.testCreateTransientFromAdmin-seed#[9D99B84DF18D5652]) [    x:core1] o.a.s.s.SolrIndexSearcher Opening [Searcher@2249527c[core3] main]
   [junit4]   2> 1523242 INFO  (TEST-TestLazyCores.testCreateTransientFromAdmin-seed#[9D99B84DF18D5652]) [    x:core1] o.a.s.r.ManagedResourceStorage File-based storage initialized to use dir: /export/home/jenkins/workspace/Lucene-Solr-master-Solaris/solr/build/solr-core/test/J0/temp/solr.core.TestLazyCores_9D99B84DF18D5652-001/tempDir-001/core3/conf
   [junit4]   2> 1523243 INFO  (TEST-TestLazyCores.testCreateTransientFromAdmin-seed#[9D99B84DF18D5652]) [    x:core1] o.a.s.h.ReplicationHandler Commits will be reserved for  10000
   [junit4]   2> 1523243 INFO  (searcherExecutor-6088-thread-1-processing-x:core1) [    x:core1] o.a.s.c.SolrCore [core3] Registered new searcher Searcher@2249527c[core3] main{ExitableDirectoryReader(UninvertingDirectoryReader())}
   [junit4]   2> 1523243 INFO  (TEST-TestLazyCores.testCreateTransientFromAdmin-seed#[9D99B84DF18D5652]) [    x:core1] o.a.s.c.SolrCores Opening transient core core3
   [junit4]   2> 1523243 INFO  (TEST-TestLazyCores.testCreateTransientFromAdmin-seed#[9D99B84DF18D5652]) [    x:core1] o.a.s.c.SolrCores Closing transient core [core4]
   [junit4]   2> 1523243 INFO  (Thread-7236) [    ] o.a.s.c.SolrCore [core4]  CLOSING SolrCore org.apache.solr.core.SolrCore@1d12f2b6
   [junit4]   2> 1523259 WARN  (TEST-TestLazyCores.testCreateTransientFromAdmin-seed#[9D99B84DF18D5652]) [    x:core1] o.a.s.c.Config Beginning with Solr 5.5, <mergePolicy> is deprecated, use <mergePolicyFactory> instead.
   [junit4]   2> 1523260 INFO  (TEST-TestLazyCores.testCreateTransientFromAdmin-seed#[9D99B84DF18D5652]) [    x:core1] o.a.s.c.SolrConfig Using Lucene MatchVersion: 7.0.0
   [junit4]   2> 1523314 INFO  (TEST-TestLazyCores.testCreateTransientFromAdmin-seed#[9D99B84DF18D5652]) [    x:core1] o.a.s.s.IndexSchema [core4] Schema name=tiny
   [junit4]   2> 1523317 INFO  (TEST-TestLazyCores.testCreateTransientFromAdmin-seed#[9D99B84DF18D5652]) [    x:core1] o.a.s.s.IndexSchema Loaded schema tiny/1.1 with uniqueid field id
   [junit4]   2> 1523319 INFO  (TEST-TestLazyCores.testCreateTransientFromAdmin-seed#[9D99B84DF18D5652]) [    x:core1] o.a.s.c.CoreContainer Creating SolrCore 'core4' using configuration from instancedir /export/home/jenkins/workspace/Lucene-Solr-master-Solaris/solr/build/solr-core/test/J0/temp/solr.core.TestLazyCores_9D99B84DF18D5652-001/tempDir-001/core4
   [junit4]   2> 1523320 INFO  (TEST-TestLazyCores.testCreateTransientFromAdmin-seed#[9D99B84DF18D5652]) [    x:core1] o.a.s.c.SolrCore [[core4] ] Opening new SolrCore at [/export/home/jenkins/workspace/Lucene-Solr-master-Solaris/solr/build/solr-core/test/J0/temp/solr.core.TestLazyCores_9D99B84DF18D5652-001/tempDir-001/core4], dataDir=[/export/home/jenkins/workspace/Lucene-Solr-master-Solaris/solr/build/solr-core/test/J0/temp/solr.core.TestLazyCores_9D99B84DF18D5652-001/tempDir-001/core4/data/]
   [junit4]   2> 1523322 INFO  (TEST-TestLazyCores.testCreateTransientFromAdmin-seed#[9D99B84DF18D5652]) [    x:core1] o.a.s.u.RandomMergePolicy RandomMergePolicy wrapping class org.apache.lucene.index.AlcoholicMergePolicy: [AlcoholicMergePolicy: minMergeSize=0, mergeFactor=10, maxMergeSize=306648006, maxMergeSizeForForcedMerge=9223372036854775807, calibrateSizeByDeletes=true, maxMergeDocs=2147483647, maxCFSSegmentSizeMB=8.796093022207999E12, noCFSRatio=0.1]
   [junit4]   2> 1523333 INFO  (TEST-TestLazyCores.testCreateTransientFromAdmin-seed#[9D99B84DF18D5652]) [    x:core1] o.a.s.u.CommitTracker Hard AutoCommit: disabled
   [junit4]   2> 1523333 INFO  (TEST-TestLazyCores.testCreateTransientFromAdmin-seed#[9D99B84DF18D5652]) [    x:core1] o.a.s.u.CommitTracker Soft AutoCommit: disabled
   [junit4]   2> 1523334 INFO  (TEST-TestLazyCores.testCreateTransientFromAdmin-seed#[9D99B84DF18D5652]) [    x:core1] o.a.s.u.RandomMergePolicy RandomMergePolicy wrapping class org.apache.lucene.index.LogByteSizeMergePolicy: [LogByteSizeMergePolicy: minMergeSize=1677721, mergeFactor=32, maxMergeSize=2147483648, maxMergeSizeForForcedMerge=9223372036854775807, calibrateSizeByDeletes=true, maxMergeDocs=2147483647, maxCFSSegmentSizeMB=8.796093022207999E12, noCFSRatio=0.8270739722126235]
   [junit4]   2> 1523334 INFO  (TEST-TestLazyCores.testCreateTransientFromAdmin-seed#[9D99B84DF18D5652]) [    x:core1] o.a.s.s.SolrIndexSearcher Opening [Searcher@265ef9db[core4] main]
   [junit4]   2> 1523334 INFO  (TEST-TestLazyCores.testCreateTransientFromAdmin-seed#[9D99B84DF18D5652]) [    x:core1] o.a.s.r.ManagedResourceStorage File-based storage initialized to use dir: /export/home/jenkins/workspace/Lucene-Solr-master-Solaris/solr/build/solr-core/test/J0/temp/solr.core.TestLazyCores_9D99B84DF18D5652-001/tempDir-001/core4/conf
   [junit4]   2> 1523335 INFO  (TEST-TestLazyCores.testCreateTransientFromAdmin-seed#[9D99B84DF18D5652]) [    x:core1] o.a.s.h.ReplicationHandler Commits will be reserved for  10000
   [junit4]   2> 1523335 INFO  (searcherExecutor-6092-thread-1-processing-x:core1) [    x:core1] o.a.s.c.SolrCore [core4] Registered new searcher Searcher@265ef9db[core4] main{ExitableDirectoryReader(UninvertingDirectoryReader())}
   [junit4]   2> 1523335 INFO  (TEST-TestLazyCores.testCreateTransientFromAdmin-seed#[9D99B84DF18D5652]) [    x:core1] o.a.s.c.SolrCores Opening transient core core4
   [junit4]   2> 1523335 INFO  (TEST-TestLazyCores.testCreateTransientFromAdmin-seed#[9D99B84DF18D5652]) [    x:core1] o.a.s.c.SolrCores Closing transient core [core5]
   [junit4]   2> 1523335 INFO  (Thread-7236) [    ] o.a.s.c.SolrCore [core5]  CLOSING SolrCore org.apache.solr.core.SolrCore@1c736159
   [junit4]   2> 1523349 WARN  (TEST-TestLazyCores.testCreateTransientFromAdmin-seed#[9D99B84DF18D5652]) [    x:core1] o.a.s.c.Config Beginning with Solr 5.5, <mergePolicy> is deprecated, use <mergePolicyFactory> instead.
   [junit4]   2> 1523350 INFO  (TEST-TestLazyCores.testCreateTransientFromAdmin-seed#[9D99B84DF18D5652]) [    x:core1] o.a.s.c.SolrConfig Using Lucene MatchVersion: 7.0.0
   [junit4]   2> 1523450 INFO  (TEST-TestLazyCores.testCreateTransientFromAdmin-seed#[9D99B84DF18D5652]) [    x:core1] o.a.s.s.IndexSchema [core5] Schema name=tiny
   [junit4]   2> 1523453 INFO  (TEST-TestLazyCores.testCreateTransientFromAdmin-seed#[9D99B84DF18D5652]) [    x:core1] o.a.s.s.IndexSchema Loaded schema tiny/1.1 with uniqueid field id
   [junit4]   2> 1523454 INFO  (TEST-TestLazyCores.testCreateTransientFromAdmin-seed#[9D99B84DF18D5652]) [    x:core1] o.a.s.c.CoreContainer Creating SolrCore 'core5' using configuration from instancedir /export/home/jenkins/workspace/Lucene-Solr-master-Solaris/solr/build/solr-core/test/J0/temp/solr.core.TestLazyCores_9D99B84DF18D5652-001/tempDir-001/core5
   [junit4]   2> 1523454 INFO  (TEST-TestLazyCores.testCreateTransientFromAdmin-seed#[9D99B84DF18D5652]) [    x:core1] o.a.s.c.SolrCore [[core5] ] Opening new SolrCore at [/export/home/jenkins/workspace/Lucene-Solr-master-Solaris/solr/build/solr-core/test/J0/temp/solr.core.TestLazyCores_9D99B84DF18D5652-001/tempDir-001/core5], dataDir=[/export/home/jenkins/workspace/Lucene-Solr-master-Solaris/solr/build/solr-core/test/J0/temp/solr.core.TestLazyCores_9D99B84DF18D5652-001/tempDir-001/core5/data/]
   [junit4]   2> 1523455 INFO  (TEST-TestLazyCores.testCreateTransientFromAdmin-seed#[9D99B84DF18D5652]) [    x:core1] o.a.s.u.RandomMergePolicy RandomMergePolicy wrapping class org.apache.lucene.index.AlcoholicMergePolicy: [AlcoholicMergePolicy: minMergeSize=0, mergeFactor=10, maxMergeSize=437754457, maxMergeSizeForForcedMerge=9223372036854775807, calibrateSizeByDeletes=true, maxMergeDocs=2147483647, maxCFSSegmentSizeMB=8.796093022207999E12, noCFSRatio=0.1]
   [junit4]   2> 1523465 INFO  (TEST-TestLazyCores.testCreateTransientFromAdmin-seed#[9D99B84DF18D5652]) [    x:core1] o.a.s.u.CommitTracker Hard AutoCommit: disabled
   [junit4]   2> 1523465 INFO  (TEST-TestLazyCores.testCreateTransientFromAdmin-seed#[9D99B84DF18D5652]) [    x:core1] o.a.s.u.CommitTracker Soft AutoCommit: disabled
   [junit4]   2> 1523465 INFO  (TEST-TestLazyCores.testCreateTransientFromAdmin-seed#[9D99B84DF18D5652]) [    x:core1] o.a.s.u.RandomMergePolicy RandomMergePolicy wrapping class org.apache.lucene.index.LogDocMergePolicy: [LogDocMergePolicy: minMergeSize=1000, mergeFactor=12, maxMergeSize=9223372036854775807, maxMergeSizeForForcedMerge=9223372036854775807, calibrateSizeByDeletes=false, maxMergeDocs=2147483647, maxCFSSegmentSizeMB=8.796093022207999E12, noCFSRatio=0.5529278991296798]
   [junit4]   2> 1523466 INFO  (TEST-TestLazyCores.testCreateTransientFromAdmin-seed#[9D99B84DF18D5652]) [    x:core1] o.a.s.s.SolrIndexSearcher Opening [Searcher@5b9fd3b5[core5] main]
   [junit4]   2> 1523466 INFO  (TEST-TestLazyCores.testCreateTransientFromAdmin-seed#[9D99B84DF18D5652]) [    x:core1] o.a.s.r.ManagedResourceStorage File-based storage initialized to use dir: /export/home/jenkins/workspace/Lucene-Solr-master-Solaris/solr/build/solr-core/test/J0/temp/solr.core.TestLazyCores_9D99B84DF18D5652-001/tempDir-001/core5/conf
   [junit4]   2> 1523466 INFO  (TEST-TestLazyCores.testCreateTransientFromAdmin-seed#[9D99B84DF18D5652]) [    x:core1] o.a.s.h.ReplicationHandler Commits will be reserved for  10000
   [junit4]   2> 1523466 INFO  (searcherExecutor-6096-thread-1-processing-x:core1) [    x:core1] o.a.s.c.SolrCore [core5] Registered new searcher Searcher@5b9fd3b5[core5] main{ExitableDirectoryReader(UninvertingDirectoryReader())}
   [junit4]   2> 1523467 INFO  (TEST-TestLazyCores.testCreateTransientFromAdmin-seed#[9D99B84DF18D5652]) [    x:core1] o.a.s.c.SolrCores Opening transient core core5
   [junit4]   2> 1523467 INFO  (TEST-TestLazyCores.testCreateTransientFromAdmin-seed#[9D99B84DF18D5652]) [    x:core1] o.a.s.c.SolrCores Closing transient core [core1]
   [junit4]   2> 1523469 INFO  (TEST-TestLazyCores.testCreateTransientFromAdmin-seed#[9D99B84DF18D5652]) [    x:core1] o.a.s.c.SolrCore Core core2 is not yet closed, waiting 100 ms before checking again.
   [junit4]   2> 1523569 INFO  (TEST-TestLazyCores.testCreateTransientFromAdmin-seed#[9D99B84DF18D5652]) [    x:core1] o.a.s.c.SolrCore Core core2 is not yet closed, waiting 100 ms before checking again.
   [junit4]   2> 1523670 INFO  (TEST-TestLazyCores.testCreateTransientFromAdmin-seed#[9D99B84DF18D5652]) [    x:core1] o.a.s.c.SolrCore Core core2 is not yet closed, waiting 100 ms before checking again.
   [junit4]   2> 1523773 INFO  (TEST-TestLazyCores.testCreateTransientFromAdmin-seed#[9D99B84DF18D5652]) [    x:core1] o.a.s.c.SolrCore Core core2 is not yet closed, waiting 100 ms before checking again.
   [junit4]   2> 1523873 INFO  (TEST-TestLazyCores.testCreateTransientFromAdmin-seed#[9D99B84DF18D5652]) [    x:core1] o.a.s.c.SolrCore Core core2 is not yet closed, waiting 100 ms before checking again.
   [junit4]   2> 1523973 INFO  (TEST-TestLazyCores.testCreateTransientFromAdmin-seed#[9D99B84DF18D5652]) [    x:core1] o.a.s.c.SolrCore Core core2 is not yet closed, waiting 100 ms before checking again.
   [junit4]   2> 1524073 INFO  (TEST-TestLazyCores.testCreateTransientFromAdmin-seed#[9D99B84DF18D5652]) [    x:core1] o.a.s.c.SolrCore Core core2 is not yet closed, waiting 100 ms before checking again.
   [junit4]   2> 1524174 INFO  (TEST-TestLazyCores.testCreateTransientFromAdmin-seed#[9D99B84DF18D5652]) [    x:core1] o.a.s.c.SolrCore Core core2 is not yet closed, waiting 100 ms before checking again.
   [junit4]   2> 1524274 INFO  (TEST-TestLazyCores.testCreateTransientFromAdmin-seed#[9D99B84DF18D5652]) [    x:core1] o.a.s.c.SolrCore Core core2 is not yet closed, waiting 100 ms before checking again.
   [junit4]   2> 1524374 INFO  (TEST-TestLazyCores.testCreateTransientFromAdmin-seed#[9D99B84DF18D5652]) [    x:core1] o.a.s.c.SolrCore Core core2 is not yet closed, waiting 100 ms before checking again.
   [junit4]   2> 1524444 INFO  (Thread-7237) [    x:core1] o.a.s.c.SolrCore [core1]  CLOSING SolrCore org.apache.solr.core.SolrCore@2358a4f5
   [junit4]   2> 1524445 INFO  (Thread-7237) [    x:core1] o.a.s.c.SolrCore [core2]  CLOSING SolrCore org.apache.solr.core.SolrCore@52f47ed4
   [junit4]   2> 1524480 INFO  (TEST-TestLazyCores.testCreateTransientFromAdmin-seed#[9D99B84DF18D5652]) [    x:core1] o.a.s.c.SolrCore [core3]  CLOSING SolrCore org.apache.solr.core.SolrCore@38bc8953
   [junit4]   2> 1524481 INFO  (TEST-TestLazyCores.testCreateTransientFromAdmin-seed#[9D99B84DF18D5652]) [    x:core1] o.a.s.c.SolrCore [core4]  CLOSING SolrCore org.apache.solr.core.SolrCore@6ce2a0d4
   [junit4]   2> 1524481 INFO  (TEST-TestLazyCores.testCreateTransientFromAdmin-seed#[9D99B84DF18D5652]) [    x:core1] o.a.s.c.SolrCore [core5]  CLOSING SolrCore org.apache.solr.core.SolrCore@370e42c8
   [junit4]   2> 1524482 INFO  (TEST-TestLazyCores.testCreateTransientFromAdmin-seed#[9D99B84DF18D5652]) [    x:core1] o.a.s.c.CoreContainer Shutting down CoreContainer instance=817992569
   [junit4]   2> 1524482 INFO  (coreCloseExecutor-6105-thread-1-processing-x:core1) [    x:collection1] o.a.s.c.SolrCore [collection1]  CLOSING SolrCore org.apache.solr.core.SolrCore@988ef4f
   [junit4]   2> 1524485 INFO  (coreCloseExecutor-6105-thread-2-processing-x:core1) [    x:collection5] o.a.s.c.SolrCore [collection5]  CLOSING SolrCore org.apache.solr.core.SolrCore@2001d06
   [junit4]   2> 1524486 INFO  (TEST-TestLazyCores.testCreateTransientFromAdmin-seed#[9D99B84DF18D5652]) [    x:core1] o.a.s.SolrTestCaseJ4 ###Ending testCreateTransientFromAdmin
   [junit4]   2> 1524488 INFO  (TEST-TestLazyCores.testBadConfigsGenerateErrors-seed#[9D99B84DF18D5652]) [    x:core1] o.a.s.SolrTestCaseJ4 ###Starting testBadConfigsGenerateErrors
   [junit4]   2> 1524531 INFO  (TEST-TestLazyCores.testBadConfigsGenerateErrors-seed#[9D99B84DF18D5652]) [    x:core1] o.a.s.c.CorePropertiesLocator Found 6 core definitions underneath /export/home/jenkins/workspace/Lucene-Solr-master-Solaris/solr/build/solr-core/test/J0/temp/solr.core.TestLazyCores_9D99B84DF18D5652-001/tempDir-002
   [junit4]   2> 1524531 INFO  (TEST-TestLazyCores.testBadConfigsGenerateErrors-seed#[9D99B84DF18D5652]) [    x:core1] o.a.s.c.CorePropertiesLocator Cores are: [core1, badConfig1, badSchema2, core2, badConfig2, badSchema1]
   [junit4]   2> 1524537 INFO  (coreLoadExecutor-6112-thread-2-processing-x:core1) [    x:badConfig1] o.a.s.c.Config Ignoring exception matching \QSAXParseException\E
   [junit4]   2> 1524538 ERROR (coreLoadExecutor-6112-thread-2-processing-x:core1) [    x:badConfig1] o.a.s.c.CoreContainer Error creating core [badConfig1]: Could not load conf for core badConfig1: Error loading solr config from /export/home/jenkins/workspace/Lucene-Solr-master-Solaris/solr/build/solr-core/test/J0/temp/solr.core.TestLazyCores_9D99B84DF18D5652-001/tempDir-002/badConfig1/conf/solrconfig.xml
   [junit4]   2> org.apache.solr.common.SolrException: Could not load conf for core badConfig1: Error loading solr config from /export/home/jenkins/workspace/Lucene-Solr-master-Solaris/solr/build/solr-core/test/J0/temp/solr.core.TestLazyCores_9D99B84DF18D5652-001/tempDir-002/badConfig1/conf/solrconfig.xml
   [junit4]   2> 	at org.apache.solr.core.ConfigSetService.getConfig(ConfigSetService.java:84)
   [junit4]   2> 	at org.apache.solr.core.CoreContainer.create(CoreContainer.java:866)
   [junit4]   2> 	at org.apache.solr.core.CoreContainer.lambda$load$0(CoreContainer.java:517)
   [junit4]   2> 	at java.util.concurrent.FutureTask.run(FutureTask.java:266)
   [junit4]   2> 	at org.apache.solr.common.util.ExecutorUtil$MDCAwareThreadPoolExecutor.lambda$execute$0(ExecutorUtil.java:229)
   [junit4]   2> 	at java.util.concurrent.ThreadPoolExecutor.runWorker(ThreadPoolExecutor.java:1142)
   [junit4]   2> 	at java.util.concurrent.ThreadPoolExecutor$Worker.run(ThreadPoolExecutor.java:617)
   [junit4]   2> 	at java.lang.Thread.run(Thread.java:745)
   [junit4]   2> Caused by: org.apache.solr.common.SolrException: Error loading solr config from /export/home/jenkins/workspace/Lucene-Solr-master-Solaris/solr/build/solr-core/test/J0/temp/solr.core.TestLazyCores_9D99B84DF18D5652-001/tempDir-002/badConfig1/conf/solrconfig.xml
   [junit4]   2> 	at org.apache.solr.core.SolrConfig.readFromResourceLoader(SolrConfig.java:187)
   [junit4]   2> 	at org.apache.solr.core.ConfigSetService.createSolrConfig(ConfigSetService.java:96)
   [junit4]   2> 	at org.apache.solr.core.ConfigSetService.getConfig(ConfigSetService.java:77)
   [junit4]   2> 	... 7 more
   [junit4]   2> Caused by: org.apache.solr.common.SolrException: org.xml.sax.SAXParseException; systemId: solrres:/solrconfig.xml; lineNumber: 56; columnNumber: 5; The element type "reqsthalr" must be terminated by the matching end-tag "</reqsthalr>".
   [junit4]   2> 	at org.apache.solr.core.Config.<init>(Config.java:154)
   [junit4]   2> 	at org.apache.solr.core.Config.<init>(Config.java:90)
   [junit4]   2> 	at org.apache.solr.core.SolrConfig.<init>(SolrConfig.java:202)
   [junit4]   2> 	at org.apache.solr.core.SolrConfig.readFromResourceLoader(SolrConfig.java:179)
   [junit4]   2> 	... 9 more
   [junit4]   2> Caused by: org.xml.sax.SAXParseException; systemId: solrres:/solrconfig.xml; lineNumber: 56; columnNumber: 5; The element type "reqsthalr" must be terminated by the matching end-tag "</reqsthalr>".
   [junit4]   2> 	at com.sun.org.apache.xerces.internal.util.ErrorHandlerWrapper.createSAXParseException(ErrorHandlerWrapper.java:203)
   [junit4]   2> 	at com.sun.org.apache.xerces.internal.util.ErrorHandlerWrapper.fatalError(ErrorHandlerWrapper.java:177)
   [junit4]   2> 	at com.sun.org.apache.xerces.internal.impl.XMLErrorReporter.reportError(XMLErrorReporter.java:400)
   [junit4]   2> 	at com.sun.org.apache.xerces.internal.impl.XMLErrorReporter.reportError(XMLErrorReporter.java:327)
   [junit4]   2> 	at com.sun.org.apache.xerces.internal.impl.XMLScanner.reportFatalError(XMLScanner.java:1472)
   [junit4]   2> 	at com.sun.org.apache.xerces.internal.impl.XMLDocumentFragmentScannerImpl.scanEndElement(XMLDocumentFragmentScannerImpl.java:1749)
   [junit4]   2> 	at com.sun.org.apache.xerces.internal.impl.XMLDocumentFragmentScannerImpl$FragmentContentDriver.next(XMLDocumentFragmentScannerImpl.java:2967)
   [junit4]   2> 	at com.sun.org.apache.xerces.internal.impl.XMLDocumentScannerImpl.next(XMLDocumentScannerImpl.java:602)
   [junit4]   2> 	at com.sun.org.apache.xerces.internal.impl.XMLNSDocumentScannerImpl.next(XMLNSDocumentScannerImpl.java:112)
   [junit4]   2> 	at com.sun.org.apache.xerces.internal.impl.XMLDocumentFragmentScannerImpl.scanDocument(XMLDocumentFragmentScannerImpl.java:505)
   [junit4]   2> 	at com.sun.org.apache.xerces.internal.parsers.XML11Configuration.parse(XML11Configuration.java:841)
   [junit4]   2> 	at com.sun.org.apache.xerces.internal.parsers.XML11Configuration.parse(XML11Configuration.java:770)
   [junit4]   2> 	at com.sun.org.apache.xerces.internal.parsers.XMLParser.parse(XMLParser.java:141)
   [junit4]   2> 	at com.sun.org.apache.xerces.internal.parsers.DOMParser.parse(DOMParser.java:243)
   [junit4]   2> 	at com.sun.org.apache.xerces.internal.jaxp.DocumentBuilderImpl.parse(DocumentBuilderImpl.java:339)
   [junit4]   2> 	at org.apache.solr.core.Config.<init>(Config.java:143)
   [junit4]   2> 	... 12 more
   [junit4]   2> 1524561 WARN  (coreLoadExecutor-6112-thread-3-processing-x:core1) [    x:badSchema2] o.a.s.c.Config Beginning with Solr 5.5, <mergePolicy> is deprecated, use <mergePolicyFactory> instead.
   [junit4]   2> 1524562 WARN  (coreLoadExecutor-6112-thread-1-processing-x:core1) [    x:core1] o.a.s.c.Config Beginning with Solr 5.5, <mergePolicy> is deprecated, use <mergePolicyFactory> instead.
   [junit4]   2> 1524562 INFO  (coreLoadExecutor-6112-thread-3-processing-x:core1) [    x:badSchema2] o.a.s.c.SolrConfig Using Lucene MatchVersion: 7.0.0
   [junit4]   2> 1524563 INFO  (coreLoadExecutor-6112-thread-1-processing-x:core1) [    x:core1] o.a.s.c.SolrConfig Using Lucene MatchVersion: 7.0.0
   [junit4]   2> 1524594 WARN  (coreLoadExecutor-6112-thread-2-processing-x:core1) [    x:core2] o.a.s.c.Config Beginning with Solr 5.5, <mergePolicy> is deprecated, use <mergePolicyFactory> instead.
   [junit4]   2> 1524595 INFO  (coreLoadExecutor-6112-thread-3-processing-x:core1) [    x:badSchema2] o.a.s.c.Config Ignoring exception matching \QSAXParseException\E
   [junit4]   2> 1524595 INFO  (coreLoadExecutor-6112-thread-2-processing-x:core1) [    x:core2] o.a.s.c.SolrConfig Using Lucene MatchVersion: 7.0.0
   [junit4]   2> 1524595 ERROR (coreLoadExecutor-6112-thread-3-processing-x:core1) [    x:badSchema2] o.a.s.c.CoreContainer Error creating core [badSchema2]: Could not load conf for core badSchema2: Can't load schema /export/home/jenkins/workspace/Lucene-Solr-master-Solaris/solr/build/solr-core/test/J0/temp/solr.core.TestLazyCores_9D99B84DF18D5652-001/tempDir-002/badSchema2/conf/schema.xml: org.xml.sax.SAXParseException; systemId: solrres:/schema.xml; lineNumber: 34; columnNumber: 5; The element type "filedType" must be terminated by the matching end-tag "</filedType>".
   [junit4]   2> org.apache.solr.common.SolrException: Could not load conf for core badSchema2: Can't load schema /export/home/jenkins/workspace/Lucene-Solr-master-Solaris/solr/build/solr-core/test/J0/temp/solr.core.TestLazyCores_9D99B84DF18D5652-001/tempDir-002/badSchema2/conf/schema.xml: org.xml.sax.SAXParseException; systemId: solrres:/schema.xml; lineNumber: 34; columnNumber: 5; The element type "filedType" must be terminated by the matching end-tag "</filedType>".
   [junit4]   2> 	at org.apache.solr.core.ConfigSetService.getConfig(ConfigSetService.java:84)
   [junit4]   2> 	at org.apache.solr.core.CoreContainer.create(CoreContainer.java:866)
   [junit4]   2> 	at org.apache.solr.core.CoreContainer.lambda$load$0(CoreContainer.java:517)
   [junit4]   2> 	at java.util.concurrent.FutureTask.run(FutureTask.java:266)
   [junit4]   2> 	at org.apache.solr.common.util.ExecutorUtil$MDCAwareThreadPoolExecutor.lambda$execute$0(ExecutorUtil.java:229)
   [junit4]   2> 	at java.util.concurrent.ThreadPoolExecutor.runWorker(ThreadPoolExecutor.java:1142)
   [junit4]   2> 	at java.util.concurrent.ThreadPoolExecutor$Worker.run(ThreadPoolExecutor.java:617)
   [junit4]   2> 	at java.lang.Thread.run(Thread.java:745)
   [junit4]   2> Caused by: org.apache.solr.common.SolrException: Can't load schema /export/home/jenkins/workspace/Lucene-Solr-master-Solaris/solr/build/solr-core/test/J0/temp/solr.core.TestLazyCores_9D99B84DF18D5652-001/tempDir-002/badSchema2/conf/schema.xml: org.xml.sax.SAXParseException; systemId: solrres:/schema.xml; lineNumber: 34; columnNumber: 5; The element type "filedType" must be terminated by the matching end-tag "</filedType>".
   [junit4]   2> 	at org.apache.solr.schema.IndexSchema.readSchema(IndexSchema.java:598)
   [junit4]   2> 	at org.apache.solr.schema.IndexSchema.<init>(IndexSchema.java:183)
   [junit4]   2> 	at org.apache.solr.schema.IndexSchemaFactory.create(IndexSchemaFactory.java:56)
   [junit4]   2> 	at org.apache.solr.schema.IndexSchemaFactory.buildIndexSchema(IndexSchemaFactory.java:75)
   [junit4]   2> 	at org.apache.solr.core.ConfigSetService.createIndexSchema(ConfigSetService.java:106)
   [junit4]   2> 	at org.apache.solr.core.ConfigSetService.getConfig(ConfigSetService.java:78)
   [junit4]   2> 	... 7 more
   [junit4]   2> Caused by: org.apache.solr.common.SolrException: org.xml.sax.SAXParseException; systemId: solrres:/schema.xml; lineNumber: 34; columnNumber: 5; The element type "filedType" must be terminated by the matching end-tag "</filedType>".
   [junit4]   2> 	at org.apache.solr.core.Config.<init>(Config.java:154)
   [junit4]   2> 	at org.apache.solr.core.Config.<init>(Config.java:90)
   [junit4]   2> 	at org.apache.solr.schema.IndexSchema.readSchema(IndexSchema.java:460)
   [junit4]   2> 	... 12 more
   [junit4]   2> Caused by: org.xml.sax.SAXParseException; systemId: solrres:/schema.xml; lineNumber: 34; columnNumber: 5; The element type "filedType" must be terminated by the matching end-tag "</filedType>".
   [junit4]   2> 	at com.sun.org.apache.xerces.internal.util.ErrorHandlerWrapper.createSAXParseException(ErrorHandlerWrapper.java:203)
   [junit4]   2> 	at com.sun.org.apache.xerces.internal.util.ErrorHandlerWrapper.fatalError(ErrorHandlerWrapper.java:177)
   [junit4]   2> 	at com.sun.org.apache.xerces.internal.impl.XMLErrorReporter.reportError(XMLErrorReporter.java:400)
   [junit4]   2> 	at com.sun.org.apache.xerces.internal.impl.XMLErrorReporter.reportError(XMLErrorReporter.java:327)
   [junit4]   2> 	at com.sun.org.apache.xerces.internal.impl.XMLScanner.reportFatalError(XMLScanner.java:1472)
   [junit4]   2> 	at com.sun.org.apache.xerces.internal.impl.XMLDocumentFragmentScannerImpl.scanEndElement(XMLDocumentFragmentScannerImpl.java:1749)
   [junit4]   2> 	at com.sun.org.apache.xerces.internal.impl.XMLDocumentFragmentScannerImpl$FragmentContentDriver.next(XMLDocumentFragmentScannerImpl.java:2967)
   [junit4]   2> 	at com.sun.org.apache.xerces.internal.impl.XMLDocumentScannerImpl.next(XMLDocumentScannerImpl.java:602)
   [junit4]   2> 	at com.sun.org.apache.xerces.internal.impl.XMLNSDocumentScannerImpl.next(XMLNSDocumentScannerImpl.java:112)
   [junit4]   2> 	at com.sun.org.apache.xerces.internal.impl.XMLDocumentFragmentScannerImpl.scanDocument(XMLDocumentFragmentScannerImpl.java:505)
   [junit4]   2> 	at com.sun.org.apache.xerces.internal.parsers.XML11Configuration.parse(XML11Configuration.java:841)
   [junit4]   2> 	at com.sun.org.apache.xerces.internal.parsers.XML11Configuration.parse(XML11Configuration.java:770)
   [junit4]   2> 	at com.sun.org.apache.xerces.internal.parsers.XMLParser.parse(XMLParser.java:141)
   [junit4]   2> 	at com.sun.org.apache.xerces.internal.parsers.DOMParser.parse(DOMParser.java:243)
   [junit4]   2> 	at com.sun.org.apache.xerces.internal.jaxp.DocumentBuilderImpl.parse(DocumentBuilderImpl.java:339)
   [junit4]   2> 	at org.apache.solr.core.Config.<init>(Config.java:143)
   [junit4]   2> 	... 14 more
   [junit4]   2> 1524613 INFO  (coreLoadExecutor-6112-thread-1-processing-x:core1) [    x:core1] o.a.s.s.IndexSchema [core1] Schema name=tiny
   [junit4]   2> 1524639 INFO  (coreLoadExecutor-6112-thread-2-processing-x:core1) [    x:core2] o.a.s.s.IndexSchema [core2] Schema name=tiny
   [junit4]   2> 1524640 INFO  (coreLoadExecutor-6112-thread-1-processing-x:core1) [    x:core1] o.a.s.s.IndexSchema Loaded schema tiny/1.1 with uniqueid field id
   [junit4]   2> 1524641 INFO  (coreLoadExecutor-6112-thread-2-processing-x:core1) [    x:core2] o.a.s.s.IndexSchema Loaded schema tiny/1.1 with uniqueid field id
   [junit4]   2> 1524642 INFO  (coreLoadExecutor-6112-thread-3-processing-x:core1) [    x:badConfig2] o.a.s.c.Config Ignoring exception matching \QSAXParseException\E
   [junit4]   2> 1524643 ERROR (coreLoadExecutor-6112-thread-3-processing-x:core1) [    x:badConfig2] o.a.s.c.CoreContainer Error creating core [badConfig2]: Could not load conf for core badConfig2: Error loading solr config from /export/home/jenkins/workspace/Lucene-Solr-master-Solaris/solr/build/solr-core/test/J0/temp/solr.core.TestLazyCores_9D99B84DF18D5652-001/tempDir-002/badConfig2/conf/solrconfig.xml
   [junit4]   2> org.apache.solr.common.SolrException: Could not load conf for core badConfig2: Error loading solr config from /export/home/jenkins/workspace/Lucene-Solr-master-Solaris/solr/build/solr-core/test/J0/temp/solr.core.TestLazyCores_9D99B84DF18D5652-001/tempDir-002/badConfig2/conf/solrconfig.xml
   [junit4]   2> 	at org.apache.solr.core.ConfigSetService.getConfig(ConfigSetService.java:84)
   [junit4]   2> 	at org.apache.solr.core.CoreContainer.create(CoreContainer.java:866)
   [junit4]   2> 	at org.apache.solr.core.CoreContainer.lambda$load$0(CoreContainer.java:517)
   [junit4]   2> 	at java.util.concurrent.FutureTask.run(FutureTask.java:266)
   [junit4]   2> 	at org.apache.solr.common.util.ExecutorUtil$MDCAwareThreadPoolExecutor.lambda$execute$0(ExecutorUtil.java:229)
   [junit4]   2> 	at java.util.concurrent.ThreadPoolExecutor.runWorker(ThreadPoolExecutor.java:1142)
   [junit4]   2> 	at java.util.concurrent.ThreadPoolExecutor$Worker.run(ThreadPoolExecutor.java:617)
   [junit4]   2> 	at java.lang.Thread.run(Thread.java:745)
   [junit4]   2> Caused by: org.apache.solr.common.SolrException: Error loading solr config from /export/home/jenkins/workspace/Lucene-Solr-master-Solaris/solr/build/solr-core/test/J0/temp/solr.core.TestLazyCores_9D99B84DF18D5652-001/tempDir-002/badConfig2/conf/solrconfig.xml
   [junit4]   2> 	at org.apache.solr.core.SolrConfig.readFromResourceLoader(SolrConfig.java:187)
   [junit4]   2> 	at org.apache.solr.core.ConfigSetService.createSolrConfig(ConfigSetService.java:96)
   [junit4]   2> 	at org.apache.solr.core.ConfigSetService.getConfig(ConfigSetService.java:77)
   [junit4]   2> 	... 7 more
   [junit4]   2> Caused by: org.apache.solr.common.SolrException: org.xml.sax.SAXParseException; systemId: solrres:/solrconfig.xml; lineNumber: 56; columnNumber: 5; The element type "reqsthalr" must be terminated by the matching end-tag "</reqsthalr>".
   [junit4]   2> 	at org.apache.solr.core.Config.<init>(Config.java:154)
   [junit4]   2> 	at org.apache.solr.cor

[...truncated too long message...]

eUpdatingTest, LeaderElectionTest, TestCloudPivotFacet, QueryEqualityTest, HighlighterMaxOffsetTest, AnalyticsQueryTest, SchemaVersionSpecificBehaviorTest, TestDynamicFieldResource, TestConfigReload, ShardRoutingTest, TestUpdate, HdfsBasicDistributedZk2Test, TestSolrCloudWithSecureImpersonation, TestCloudRecovery, TestPerFieldSimilarity, DistributedSpellCheckComponentTest, PrimUtilsTest, SegmentsInfoRequestHandlerTest, TestMacroExpander, DistributedQueryComponentCustomSortTest, AssignTest, TestCharFilters, DocValuesMultiTest, TestDistributedSearch, HdfsCollectionsAPIDistributedZkTest, HLLUtilTest, BooleanFieldTest, LeaderFailoverAfterPartitionTest, SyncSliceTest, AddSchemaFieldsUpdateProcessorFactoryTest, TestLRUCache, DirectSolrConnectionTest, SolrTestCaseJ4Test, TestPushWriter, TestCSVLoader, SimplePostToolTest, CollectionsAPIDistributedZkTest, BasicZkTest, RecoveryZkTest, FullSolrCloudDistribCmdsTest, TestRandomFaceting, ZkSolrClientTest, TestZkChroot, TestFaceting, TestRecovery, TestRealTimeGet, TestReload, SimpleFacetsTest, SolrCoreTest, SpellCheckComponentTest, SolrCmdDistributorTest, QueryElevationComponentTest, ConvertedLegacyTest, TestLazyCores]
   [junit4]   2> NOTE: reproduce with: ant test  -Dtestcase=TestLazyCores -Dtests.seed=9D99B84DF18D5652 -Dtests.slow=true -Dtests.locale=hi -Dtests.timezone=Eire -Dtests.asserts=true -Dtests.file.encoding=ISO-8859-1
   [junit4] ERROR   0.00s J0 | TestLazyCores (suite) <<<
   [junit4]    > Throwable #1: java.lang.AssertionError: ObjectTracker found 5 object(s) that were not released!!! [MockDirectoryWrapper, MockDirectoryWrapper, MDCAwareThreadPoolExecutor, SolrCore, MockDirectoryWrapper]
   [junit4]    > org.apache.solr.common.util.ObjectReleaseTracker$ObjectTrackerException
   [junit4]    > 	at org.apache.solr.common.util.ObjectReleaseTracker.track(ObjectReleaseTracker.java:43)
   [junit4]    > 	at org.apache.solr.core.CachingDirectoryFactory.get(CachingDirectoryFactory.java:347)
   [junit4]    > 	at org.apache.solr.update.SolrIndexWriter.create(SolrIndexWriter.java:66)
   [junit4]    > 	at org.apache.solr.core.SolrCore.initIndex(SolrCore.java:690)
   [junit4]    > 	at org.apache.solr.core.SolrCore.<init>(SolrCore.java:864)
   [junit4]    > 	at org.apache.solr.core.SolrCore.<init>(SolrCore.java:792)
   [junit4]    > 	at org.apache.solr.core.CoreContainer.create(CoreContainer.java:868)
   [junit4]    > 	at org.apache.solr.core.CoreContainer.lambda$load$0(CoreContainer.java:517)
   [junit4]    > 	at java.util.concurrent.FutureTask.run(FutureTask.java:266)
   [junit4]    > 	at org.apache.solr.common.util.ExecutorUtil$MDCAwareThreadPoolExecutor.lambda$execute$0(ExecutorUtil.java:229)
   [junit4]    > 	at java.util.concurrent.ThreadPoolExecutor.runWorker(ThreadPoolExecutor.java:1142)
   [junit4]    > 	at java.util.concurrent.ThreadPoolExecutor$Worker.run(ThreadPoolExecutor.java:617)
   [junit4]    > 	at java.lang.Thread.run(Thread.java:745)
   [junit4]    > org.apache.solr.common.util.ObjectReleaseTracker$ObjectTrackerException
   [junit4]    > 	at org.apache.solr.common.util.ObjectReleaseTracker.track(ObjectReleaseTracker.java:43)
   [junit4]    > 	at org.apache.solr.core.CachingDirectoryFactory.get(CachingDirectoryFactory.java:347)
   [junit4]    > 	at org.apache.solr.core.SolrCore.initSnapshotMetaDataManager(SolrCore.java:433)
   [junit4]    > 	at org.apache.solr.core.SolrCore.<init>(SolrCore.java:858)
   [junit4]    > 	at org.apache.solr.core.SolrCore.<init>(SolrCore.java:792)
   [junit4]    > 	at org.apache.solr.core.CoreContainer.create(CoreContainer.java:868)
   [junit4]    > 	at org.apache.solr.core.CoreContainer.lambda$load$0(CoreContainer.java:517)
   [junit4]    > 	at java.util.concurrent.FutureTask.run(FutureTask.java:266)
   [junit4]    > 	at org.apache.solr.common.util.ExecutorUtil$MDCAwareThreadPoolExecutor.lambda$execute$0(ExecutorUtil.java:229)
   [junit4]    > 	at java.util.concurrent.ThreadPoolExecutor.runWorker(ThreadPoolExecutor.java:1142)
   [junit4]    > 	at java.util.concurrent.ThreadPoolExecutor$Worker.run(ThreadPoolExecutor.java:617)
   [junit4]    > 	at java.lang.Thread.run(Thread.java:745)
   [junit4]    > org.apache.solr.common.util.ObjectReleaseTracker$ObjectTrackerException
   [junit4]    > 	at org.apache.solr.common.util.ObjectReleaseTracker.track(ObjectReleaseTracker.java:43)
   [junit4]    > 	at org.apache.solr.core.SolrCore.<init>(SolrCore.java:815)
   [junit4]    > 	at org.apache.solr.core.SolrCore.<init>(SolrCore.java:792)
   [junit4]    > 	at org.apache.solr.core.CoreContainer.create(CoreContainer.java:868)
   [junit4]    > 	at org.apache.solr.core.CoreContainer.lambda$load$0(CoreContainer.java:517)
   [junit4]    > 	at java.util.concurrent.FutureTask.run(FutureTask.java:266)
   [junit4]    > 	at org.apache.solr.common.util.ExecutorUtil$MDCAwareThreadPoolExecutor.lambda$execute$0(ExecutorUtil.java:229)
   [junit4]    > 	at java.util.concurrent.ThreadPoolExecutor.runWorker(ThreadPoolExecutor.java:1142)
   [junit4]    > 	at java.util.concurrent.ThreadPoolExecutor$Worker.run(ThreadPoolExecutor.java:617)
   [junit4]    > 	at java.lang.Thread.run(Thread.java:745)
   [junit4]    > org.apache.solr.common.util.ObjectReleaseTracker$ObjectTrackerException
   [junit4]    > 	at org.apache.solr.common.util.ObjectReleaseTracker.track(ObjectReleaseTracker.java:43)
   [junit4]    > 	at org.apache.solr.core.SolrCore.<init>(SolrCore.java:954)
   [junit4]    > 	at org.apache.solr.core.SolrCore.<init>(SolrCore.java:792)
   [junit4]    > 	at org.apache.solr.core.CoreContainer.create(CoreContainer.java:868)
   [junit4]    > 	at org.apache.solr.core.CoreContainer.lambda$load$0(CoreContainer.java:517)
   [junit4]    > 	at java.util.concurrent.FutureTask.run(FutureTask.java:266)
   [junit4]    > 	at org.apache.solr.common.util.ExecutorUtil$MDCAwareThreadPoolExecutor.lambda$execute$0(ExecutorUtil.java:229)
   [junit4]    > 	at java.util.concurrent.ThreadPoolExecutor.runWorker(ThreadPoolExecutor.java:1142)
   [junit4]    > 	at java.util.concurrent.ThreadPoolExecutor$Worker.run(ThreadPoolExecutor.java:617)
   [junit4]    > 	at java.lang.Thread.run(Thread.java:745)
   [junit4]    > org.apache.solr.common.util.ObjectReleaseTracker$ObjectTrackerException
   [junit4]    > 	at org.apache.solr.common.util.ObjectReleaseTracker.track(ObjectReleaseTracker.java:43)
   [junit4]    > 	at org.apache.solr.core.CachingDirectoryFactory.get(CachingDirectoryFactory.java:347)
   [junit4]    > 	at org.apache.solr.core.SolrCore.getNewIndexDir(SolrCore.java:331)
   [junit4]    > 	at org.apache.solr.core.SolrCore.initIndex(SolrCore.java:658)
   [junit4]    > 	at org.apache.solr.core.SolrCore.<init>(SolrCore.java:864)
   [junit4]    > 	at org.apache.solr.core.SolrCore.<init>(SolrCore.java:792)
   [junit4]    > 	at org.apache.solr.core.CoreContainer.create(CoreContainer.java:868)
   [junit4]    > 	at org.apache.solr.core.CoreContainer.lambda$load$0(CoreContainer.java:517)
   [junit4]    > 	at java.util.concurrent.FutureTask.run(FutureTask.java:266)
   [junit4]    > 	at org.apache.solr.common.util.ExecutorUtil$MDCAwareThreadPoolExecutor.lambda$execute$0(ExecutorUtil.java:229)
   [junit4]    > 	at java.util.concurrent.ThreadPoolExecutor.runWorker(ThreadPoolExecutor.java:1142)
   [junit4]    > 	at java.util.concurrent.ThreadPoolExecutor$Worker.run(ThreadPoolExecutor.java:617)
   [junit4]    > 	at java.lang.Thread.run(Thread.java:745)
   [junit4]    > 	at __randomizedtesting.SeedInfo.seed([9D99B84DF18D5652]:0)
   [junit4]    > 	at org.apache.solr.SolrTestCaseJ4.teardownTestCases(SolrTestCaseJ4.java:266)
   [junit4]    > 	at java.lang.Thread.run(Thread.java:745)Throwable #2: com.carrotsearch.randomizedtesting.ThreadLeakError: 1 thread leaked from SUITE scope at org.apache.solr.core.TestLazyCores: 
   [junit4]    >    1) Thread[id=17963, name=searcherExecutor-6283-thread-1, state=WAITING, group=TGRP-TestLazyCores]
   [junit4]    >         at sun.misc.Unsafe.park(Native Method)
   [junit4]    >         at java.util.concurrent.locks.LockSupport.park(LockSupport.java:175)
   [junit4]    >         at java.util.concurrent.locks.AbstractQueuedSynchronizer$ConditionObject.await(AbstractQueuedSynchronizer.java:2039)
   [junit4]    >         at java.util.concurrent.LinkedBlockingQueue.take(LinkedBlockingQueue.java:442)
   [junit4]    >         at java.util.concurrent.ThreadPoolExecutor.getTask(ThreadPoolExecutor.java:1067)
   [junit4]    >         at java.util.concurrent.ThreadPoolExecutor.runWorker(ThreadPoolExecutor.java:1127)
   [junit4]    >         at java.util.concurrent.ThreadPoolExecutor$Worker.run(ThreadPoolExecutor.java:617)
   [junit4]    >         at java.lang.Thread.run(Thread.java:745)
   [junit4]    > 	at __randomizedtesting.SeedInfo.seed([9D99B84DF18D5652]:0)Throwable #3: com.carrotsearch.randomizedtesting.ThreadLeakError: There are still zombie threads that couldn't be terminated:
   [junit4]    >    1) Thread[id=17963, name=searcherExecutor-6283-thread-1, state=WAITING, group=TGRP-TestLazyCores]
   [junit4]    >         at sun.misc.Unsafe.park(Native Method)
   [junit4]    >         at java.util.concurrent.locks.LockSupport.park(LockSupport.java:175)
   [junit4]    >         at java.util.concurrent.locks.AbstractQueuedSynchronizer$ConditionObject.await(AbstractQueuedSynchronizer.java:2039)
   [junit4]    >         at java.util.concurrent.LinkedBlockingQueue.take(LinkedBlockingQueue.java:442)
   [junit4]    >         at java.util.concurrent.ThreadPoolExecutor.getTask(ThreadPoolExecutor.java:1067)
   [junit4]    >         at java.util.concurrent.ThreadPoolExecutor.runWorker(ThreadPoolExecutor.java:1127)
   [junit4]    >         at java.util.concurrent.ThreadPoolExecutor$Worker.run(ThreadPoolExecutor.java:617)
   [junit4]    >         at java.lang.Thread.run(Thread.java:745)
   [junit4]    > 	at __randomizedtesting.SeedInfo.seed([9D99B84DF18D5652]:0)
   [junit4] Completed [466/659 (1!)] on J0 in 180.26s, 8 tests, 1 failure, 2 errors <<< FAILURES!

[...truncated 62955 lines...]


Mime
View raw message