lucene-dev mailing list archives

Site index · List index
Message view « Date » · « Thread »
Top « Date » · « Thread »
From Policeman Jenkins Server <jenk...@thetaphi.de>
Subject [JENKINS-EA] Lucene-Solr-master-Linux (32bit/jdk-9-ea+147) - Build # 18573 - Still Unstable!
Date Tue, 20 Dec 2016 11:45:53 GMT
Build: https://jenkins.thetaphi.de/job/Lucene-Solr-master-Linux/18573/
Java: 32bit/jdk-9-ea+147 -server -XX:+UseG1GC

3 tests failed.
FAILED:  junit.framework.TestSuite.org.apache.solr.security.hadoop.TestSolrCloudWithHadoopAuthPlugin

Error Message:
FIXME: SOLR-8182: This test fails under Java 9

Stack Trace:
com.carrotsearch.randomizedtesting.InternalAssumptionViolatedException: FIXME: SOLR-8182:
This test fails under Java 9
	at __randomizedtesting.SeedInfo.seed([74448FB1070B62E2]:0)
	at com.carrotsearch.randomizedtesting.RandomizedTest.assumeTrue(RandomizedTest.java:667)
	at com.carrotsearch.randomizedtesting.RandomizedTest.assumeFalse(RandomizedTest.java:675)
	at org.apache.lucene.util.LuceneTestCase.assumeFalse(LuceneTestCase.java:850)
	at org.apache.solr.security.hadoop.TestSolrCloudWithHadoopAuthPlugin.setupClass(TestSolrCloudWithHadoopAuthPlugin.java:45)
	at java.base/jdk.internal.reflect.NativeMethodAccessorImpl.invoke0(Native Method)
	at java.base/jdk.internal.reflect.NativeMethodAccessorImpl.invoke(NativeMethodAccessorImpl.java:62)
	at java.base/jdk.internal.reflect.DelegatingMethodAccessorImpl.invoke(DelegatingMethodAccessorImpl.java:43)
	at java.base/java.lang.reflect.Method.invoke(Method.java:538)
	at com.carrotsearch.randomizedtesting.RandomizedRunner.invoke(RandomizedRunner.java:1713)
	at com.carrotsearch.randomizedtesting.RandomizedRunner$6.evaluate(RandomizedRunner.java:847)
	at com.carrotsearch.randomizedtesting.RandomizedRunner$7.evaluate(RandomizedRunner.java:863)
	at com.carrotsearch.randomizedtesting.rules.StatementAdapter.evaluate(StatementAdapter.java:36)
	at com.carrotsearch.randomizedtesting.rules.SystemPropertiesRestoreRule$1.evaluate(SystemPropertiesRestoreRule.java:57)
	at org.apache.lucene.util.AbstractBeforeAfterRule$1.evaluate(AbstractBeforeAfterRule.java:45)
	at com.carrotsearch.randomizedtesting.rules.StatementAdapter.evaluate(StatementAdapter.java:36)
	at org.apache.lucene.util.TestRuleStoreClassName$1.evaluate(TestRuleStoreClassName.java:41)
	at com.carrotsearch.randomizedtesting.rules.NoShadowingOrOverridesOnMethodsRule$1.evaluate(NoShadowingOrOverridesOnMethodsRule.java:40)
	at com.carrotsearch.randomizedtesting.rules.NoShadowingOrOverridesOnMethodsRule$1.evaluate(NoShadowingOrOverridesOnMethodsRule.java:40)
	at com.carrotsearch.randomizedtesting.rules.StatementAdapter.evaluate(StatementAdapter.java:36)
	at com.carrotsearch.randomizedtesting.rules.StatementAdapter.evaluate(StatementAdapter.java:36)
	at com.carrotsearch.randomizedtesting.rules.StatementAdapter.evaluate(StatementAdapter.java:36)
	at org.apache.lucene.util.TestRuleAssertionsRequired$1.evaluate(TestRuleAssertionsRequired.java:53)
	at org.apache.lucene.util.TestRuleMarkFailure$1.evaluate(TestRuleMarkFailure.java:47)
	at org.apache.lucene.util.TestRuleIgnoreAfterMaxFailures$1.evaluate(TestRuleIgnoreAfterMaxFailures.java:64)
	at org.apache.lucene.util.TestRuleIgnoreTestSuites$1.evaluate(TestRuleIgnoreTestSuites.java:54)
	at com.carrotsearch.randomizedtesting.rules.StatementAdapter.evaluate(StatementAdapter.java:36)
	at com.carrotsearch.randomizedtesting.ThreadLeakControl$StatementRunner.run(ThreadLeakControl.java:367)
	at java.base/java.lang.Thread.run(Thread.java:844)


FAILED:  junit.framework.TestSuite.org.apache.solr.security.hadoop.TestSolrCloudWithHadoopAuthPlugin

Error Message:


Stack Trace:
java.lang.NullPointerException
	at __randomizedtesting.SeedInfo.seed([74448FB1070B62E2]:0)
	at org.apache.solr.security.hadoop.TestSolrCloudWithHadoopAuthPlugin.tearDownClass(TestSolrCloudWithHadoopAuthPlugin.java:62)
	at java.base/jdk.internal.reflect.NativeMethodAccessorImpl.invoke0(Native Method)
	at java.base/jdk.internal.reflect.NativeMethodAccessorImpl.invoke(NativeMethodAccessorImpl.java:62)
	at java.base/jdk.internal.reflect.DelegatingMethodAccessorImpl.invoke(DelegatingMethodAccessorImpl.java:43)
	at java.base/java.lang.reflect.Method.invoke(Method.java:538)
	at com.carrotsearch.randomizedtesting.RandomizedRunner.invoke(RandomizedRunner.java:1713)
	at com.carrotsearch.randomizedtesting.RandomizedRunner$7.evaluate(RandomizedRunner.java:870)
	at com.carrotsearch.randomizedtesting.rules.StatementAdapter.evaluate(StatementAdapter.java:36)
	at com.carrotsearch.randomizedtesting.rules.SystemPropertiesRestoreRule$1.evaluate(SystemPropertiesRestoreRule.java:57)
	at org.apache.lucene.util.AbstractBeforeAfterRule$1.evaluate(AbstractBeforeAfterRule.java:45)
	at com.carrotsearch.randomizedtesting.rules.StatementAdapter.evaluate(StatementAdapter.java:36)
	at org.apache.lucene.util.TestRuleStoreClassName$1.evaluate(TestRuleStoreClassName.java:41)
	at com.carrotsearch.randomizedtesting.rules.NoShadowingOrOverridesOnMethodsRule$1.evaluate(NoShadowingOrOverridesOnMethodsRule.java:40)
	at com.carrotsearch.randomizedtesting.rules.NoShadowingOrOverridesOnMethodsRule$1.evaluate(NoShadowingOrOverridesOnMethodsRule.java:40)
	at com.carrotsearch.randomizedtesting.rules.StatementAdapter.evaluate(StatementAdapter.java:36)
	at com.carrotsearch.randomizedtesting.rules.StatementAdapter.evaluate(StatementAdapter.java:36)
	at com.carrotsearch.randomizedtesting.rules.StatementAdapter.evaluate(StatementAdapter.java:36)
	at org.apache.lucene.util.TestRuleAssertionsRequired$1.evaluate(TestRuleAssertionsRequired.java:53)
	at org.apache.lucene.util.TestRuleMarkFailure$1.evaluate(TestRuleMarkFailure.java:47)
	at org.apache.lucene.util.TestRuleIgnoreAfterMaxFailures$1.evaluate(TestRuleIgnoreAfterMaxFailures.java:64)
	at org.apache.lucene.util.TestRuleIgnoreTestSuites$1.evaluate(TestRuleIgnoreTestSuites.java:54)
	at com.carrotsearch.randomizedtesting.rules.StatementAdapter.evaluate(StatementAdapter.java:36)
	at com.carrotsearch.randomizedtesting.ThreadLeakControl$StatementRunner.run(ThreadLeakControl.java:367)
	at java.base/java.lang.Thread.run(Thread.java:844)


FAILED:  org.apache.solr.handler.admin.MetricsHandlerTest.test

Error Message:
Unable to make member of class com.sun.management.internal.OperatingSystemImpl accessible:
 module jdk.management does not export com.sun.management.internal to unnamed module @d3a4b3

Stack Trace:
java.lang.reflect.InaccessibleObjectException: Unable to make member of class com.sun.management.internal.OperatingSystemImpl
accessible:  module jdk.management does not export com.sun.management.internal to unnamed
module @d3a4b3
	at __randomizedtesting.SeedInfo.seed([74448FB1070B62E2:FC10B06BA9F70F1A]:0)
	at java.base/jdk.internal.reflect.Reflection.throwInaccessibleObjectException(Reflection.java:424)
	at java.base/java.lang.reflect.AccessibleObject.checkCanSetAccessible(AccessibleObject.java:174)
	at java.base/java.lang.reflect.Method.checkCanSetAccessible(Method.java:192)
	at java.base/java.lang.reflect.Method.setAccessible(Method.java:186)
	at com.codahale.metrics.jvm.FileDescriptorRatioGauge.invoke(FileDescriptorRatioGauge.java:48)
	at com.codahale.metrics.jvm.FileDescriptorRatioGauge.getRatio(FileDescriptorRatioGauge.java:35)
	at com.codahale.metrics.RatioGauge.getValue(RatioGauge.java:64)
	at com.codahale.metrics.RatioGauge.getValue(RatioGauge.java:11)
	at org.apache.solr.util.stats.MetricUtils.gaugeToNamedList(MetricUtils.java:135)
	at org.apache.solr.util.stats.MetricUtils.lambda$toNamedList$2(MetricUtils.java:87)
	at java.base/java.util.stream.ForEachOps$ForEachOp$OfRef.accept(ForEachOps.java:184)
	at java.base/java.util.stream.ReferencePipeline$2$1.accept(ReferencePipeline.java:177)
	at java.base/java.util.TreeMap$KeySpliterator.forEachRemaining(TreeMap.java:2739)
	at java.base/java.util.stream.AbstractPipeline.copyInto(AbstractPipeline.java:484)
	at java.base/java.util.stream.AbstractPipeline.wrapAndCopyInto(AbstractPipeline.java:474)
	at java.base/java.util.stream.ForEachOps$ForEachOp.evaluateSequential(ForEachOps.java:151)
	at java.base/java.util.stream.ForEachOps$ForEachOp$OfRef.evaluateSequential(ForEachOps.java:174)
	at java.base/java.util.stream.AbstractPipeline.evaluate(AbstractPipeline.java:234)
	at java.base/java.util.stream.ReferencePipeline.forEach(ReferencePipeline.java:430)
	at org.apache.solr.util.stats.MetricUtils.toNamedList(MetricUtils.java:80)
	at org.apache.solr.handler.admin.MetricsHandler.handleRequestBody(MetricsHandler.java:93)
	at org.apache.solr.handler.admin.MetricsHandlerTest.test(MetricsHandlerTest.java:41)
	at java.base/jdk.internal.reflect.NativeMethodAccessorImpl.invoke0(Native Method)
	at java.base/jdk.internal.reflect.NativeMethodAccessorImpl.invoke(NativeMethodAccessorImpl.java:62)
	at java.base/jdk.internal.reflect.DelegatingMethodAccessorImpl.invoke(DelegatingMethodAccessorImpl.java:43)
	at java.base/java.lang.reflect.Method.invoke(Method.java:538)
	at com.carrotsearch.randomizedtesting.RandomizedRunner.invoke(RandomizedRunner.java:1713)
	at com.carrotsearch.randomizedtesting.RandomizedRunner$8.evaluate(RandomizedRunner.java:907)
	at com.carrotsearch.randomizedtesting.RandomizedRunner$9.evaluate(RandomizedRunner.java:943)
	at com.carrotsearch.randomizedtesting.RandomizedRunner$10.evaluate(RandomizedRunner.java:957)
	at com.carrotsearch.randomizedtesting.rules.SystemPropertiesRestoreRule$1.evaluate(SystemPropertiesRestoreRule.java:57)
	at org.apache.lucene.util.TestRuleSetupTeardownChained$1.evaluate(TestRuleSetupTeardownChained.java:49)
	at org.apache.lucene.util.AbstractBeforeAfterRule$1.evaluate(AbstractBeforeAfterRule.java:45)
	at org.apache.lucene.util.TestRuleThreadAndTestName$1.evaluate(TestRuleThreadAndTestName.java:48)
	at org.apache.lucene.util.TestRuleIgnoreAfterMaxFailures$1.evaluate(TestRuleIgnoreAfterMaxFailures.java:64)
	at org.apache.lucene.util.TestRuleMarkFailure$1.evaluate(TestRuleMarkFailure.java:47)
	at com.carrotsearch.randomizedtesting.rules.StatementAdapter.evaluate(StatementAdapter.java:36)
	at com.carrotsearch.randomizedtesting.ThreadLeakControl$StatementRunner.run(ThreadLeakControl.java:367)
	at com.carrotsearch.randomizedtesting.ThreadLeakControl.forkTimeoutingTask(ThreadLeakControl.java:811)
	at com.carrotsearch.randomizedtesting.ThreadLeakControl$3.evaluate(ThreadLeakControl.java:462)
	at com.carrotsearch.randomizedtesting.RandomizedRunner.runSingleTest(RandomizedRunner.java:916)
	at com.carrotsearch.randomizedtesting.RandomizedRunner$5.evaluate(RandomizedRunner.java:802)
	at com.carrotsearch.randomizedtesting.RandomizedRunner$6.evaluate(RandomizedRunner.java:852)
	at com.carrotsearch.randomizedtesting.RandomizedRunner$7.evaluate(RandomizedRunner.java:863)
	at com.carrotsearch.randomizedtesting.rules.StatementAdapter.evaluate(StatementAdapter.java:36)
	at com.carrotsearch.randomizedtesting.rules.SystemPropertiesRestoreRule$1.evaluate(SystemPropertiesRestoreRule.java:57)
	at org.apache.lucene.util.AbstractBeforeAfterRule$1.evaluate(AbstractBeforeAfterRule.java:45)
	at com.carrotsearch.randomizedtesting.rules.StatementAdapter.evaluate(StatementAdapter.java:36)
	at org.apache.lucene.util.TestRuleStoreClassName$1.evaluate(TestRuleStoreClassName.java:41)
	at com.carrotsearch.randomizedtesting.rules.NoShadowingOrOverridesOnMethodsRule$1.evaluate(NoShadowingOrOverridesOnMethodsRule.java:40)
	at com.carrotsearch.randomizedtesting.rules.NoShadowingOrOverridesOnMethodsRule$1.evaluate(NoShadowingOrOverridesOnMethodsRule.java:40)
	at com.carrotsearch.randomizedtesting.rules.StatementAdapter.evaluate(StatementAdapter.java:36)
	at com.carrotsearch.randomizedtesting.rules.StatementAdapter.evaluate(StatementAdapter.java:36)
	at com.carrotsearch.randomizedtesting.rules.StatementAdapter.evaluate(StatementAdapter.java:36)
	at org.apache.lucene.util.TestRuleAssertionsRequired$1.evaluate(TestRuleAssertionsRequired.java:53)
	at org.apache.lucene.util.TestRuleMarkFailure$1.evaluate(TestRuleMarkFailure.java:47)
	at org.apache.lucene.util.TestRuleIgnoreAfterMaxFailures$1.evaluate(TestRuleIgnoreAfterMaxFailures.java:64)
	at org.apache.lucene.util.TestRuleIgnoreTestSuites$1.evaluate(TestRuleIgnoreTestSuites.java:54)
	at com.carrotsearch.randomizedtesting.rules.StatementAdapter.evaluate(StatementAdapter.java:36)
	at com.carrotsearch.randomizedtesting.ThreadLeakControl$StatementRunner.run(ThreadLeakControl.java:367)
	at java.base/java.lang.Thread.run(Thread.java:844)




Build Log:
[...truncated 10785 lines...]
   [junit4] Suite: org.apache.solr.security.hadoop.TestSolrCloudWithHadoopAuthPlugin
   [junit4]   2> Creating dataDir: /home/jenkins/workspace/Lucene-Solr-master-Linux/solr/build/solr-core/test/J2/temp/solr.security.hadoop.TestSolrCloudWithHadoopAuthPlugin_74448FB1070B62E2-001/init-core-data-001
   [junit4]   2> 128984 INFO  (SUITE-TestSolrCloudWithHadoopAuthPlugin-seed#[74448FB1070B62E2]-worker)
[    ] o.a.s.SolrTestCaseJ4 Randomized ssl (false) and clientAuth (false) via: @org.apache.solr.util.RandomizeSSL(reason="",
ssl=0.0/0.0, value=0.0/0.0, clientAuth=0.0/0.0)
   [junit4]   2> 128985 INFO  (SUITE-TestSolrCloudWithHadoopAuthPlugin-seed#[74448FB1070B62E2]-worker)
[    ] o.a.s.SolrTestCaseJ4 ###deleteCore
   [junit4]   2> NOTE: test params are: codec=Asserting(Lucene70), sim=RandomSimilarity(queryNorm=false):
{}, locale=pt, timezone=America/Montreal
   [junit4]   2> NOTE: Linux 4.4.0-53-generic i386/Oracle Corporation 9-ea (32-bit)/cpus=12,threads=1,free=91342912,total=253755392
   [junit4]   2> NOTE: All tests run in this JVM: [TestManagedStopFilterFactory, TestIBSimilarityFactory,
CoreAdminHandlerTest, TestCloudManagedSchema, TestCloudPseudoReturnFields, SolrCoreCheckLockOnStartupTest,
PreAnalyzedFieldManagedSchemaCloudTest, TestClusterStateMutator, DateFieldTest, TestSubQueryTransformer,
SharedFSAutoReplicaFailoverUtilsTest, TestComponentsName, AnalysisErrorHandlingTest, TestManagedResource,
TestCollectionAPI, DeleteReplicaTest, TestFieldCacheWithThreads, CloudMLTQParserTest, TestMacroExpander,
DirectUpdateHandlerTest, TestSolrCloudWithHadoopAuthPlugin]
   [junit4]   2> NOTE: reproduce with: ant test  -Dtestcase=TestSolrCloudWithHadoopAuthPlugin
-Dtests.seed=74448FB1070B62E2 -Dtests.multiplier=3 -Dtests.slow=true -Dtests.locale=pt -Dtests.timezone=America/Montreal
-Dtests.asserts=true -Dtests.file.encoding=ISO-8859-1
   [junit4] ERROR   0.00s J2 | TestSolrCloudWithHadoopAuthPlugin (suite) <<<
   [junit4]    > Assumption #1: FIXME: SOLR-8182: This test fails under Java 9Throwable
#2: java.lang.NullPointerException
   [junit4]    > 	at __randomizedtesting.SeedInfo.seed([74448FB1070B62E2]:0)
   [junit4]    > 	at org.apache.solr.security.hadoop.TestSolrCloudWithHadoopAuthPlugin.tearDownClass(TestSolrCloudWithHadoopAuthPlugin.java:62)
   [junit4]    > 	at java.base/jdk.internal.reflect.NativeMethodAccessorImpl.invoke0(Native
Method)
   [junit4]    > 	at java.base/jdk.internal.reflect.NativeMethodAccessorImpl.invoke(NativeMethodAccessorImpl.java:62)
   [junit4]    > 	at java.base/jdk.internal.reflect.DelegatingMethodAccessorImpl.invoke(DelegatingMethodAccessorImpl.java:43)
   [junit4]    > 	at java.base/java.lang.reflect.Method.invoke(Method.java:538)
   [junit4]    > 	at java.base/java.lang.Thread.run(Thread.java:844)
   [junit4] Completed [41/669 (1!)] on J2 in 0.02s, 0 tests, 1 error <<< FAILURES!

[...truncated 1633 lines...]
   [junit4] Suite: org.apache.solr.handler.admin.MetricsHandlerTest
   [junit4]   2> Creating dataDir: /home/jenkins/workspace/Lucene-Solr-master-Linux/solr/build/solr-core/test/J0/temp/solr.handler.admin.MetricsHandlerTest_74448FB1070B62E2-001/init-core-data-001
   [junit4]   2> 1785677 INFO  (SUITE-MetricsHandlerTest-seed#[74448FB1070B62E2]-worker)
[    ] o.a.s.SolrTestCaseJ4 Randomized ssl (false) and clientAuth (true) via: @org.apache.solr.util.RandomizeSSL(reason="",
ssl=0.0/0.0, value=0.0/0.0, clientAuth=0.0/0.0)
   [junit4]   2> 1785678 INFO  (SUITE-MetricsHandlerTest-seed#[74448FB1070B62E2]-worker)
[    ] o.a.s.SolrTestCaseJ4 ####initCore
   [junit4]   2> 1785679 INFO  (SUITE-MetricsHandlerTest-seed#[74448FB1070B62E2]-worker)
[    ] o.a.s.c.SolrResourceLoader [null] Added 2 libs to classloader, from paths: [/home/jenkins/workspace/Lucene-Solr-master-Linux/solr/core/src/test-files/solr/collection1/lib,
/home/jenkins/workspace/Lucene-Solr-master-Linux/solr/core/src/test-files/solr/collection1/lib/classes]
   [junit4]   2> 1785755 WARN  (SUITE-MetricsHandlerTest-seed#[74448FB1070B62E2]-worker)
[    ] o.a.s.c.Config Beginning with Solr 5.5, <mergePolicy> is deprecated, use <mergePolicyFactory>
instead.
   [junit4]   2> 1785757 INFO  (SUITE-MetricsHandlerTest-seed#[74448FB1070B62E2]-worker)
[    ] o.a.s.c.SolrConfig Using Lucene MatchVersion: 7.0.0
   [junit4]   2> 1785776 INFO  (SUITE-MetricsHandlerTest-seed#[74448FB1070B62E2]-worker)
[    ] o.a.s.s.IndexSchema [null] Schema name=test
   [junit4]   2> 1785854 WARN  (SUITE-MetricsHandlerTest-seed#[74448FB1070B62E2]-worker)
[    ] o.a.s.s.IndexSchema [null] default search field in schema is text. WARNING: Deprecated,
please use 'df' on request instead.
   [junit4]   2> 1785855 INFO  (SUITE-MetricsHandlerTest-seed#[74448FB1070B62E2]-worker)
[    ] o.a.s.s.IndexSchema Loaded schema test/1.0 with uniqueid field id
   [junit4]   2> 1785878 WARN  (SUITE-MetricsHandlerTest-seed#[74448FB1070B62E2]-worker)
[    ] o.a.s.m.r.SolrJmxReporter No serviceUrl or agentId was configured, using first MBeanServer.
   [junit4]   2> 1785880 INFO  (SUITE-MetricsHandlerTest-seed#[74448FB1070B62E2]-worker)
[    ] o.a.s.m.r.SolrJmxReporter JMX monitoring enabled at server: com.sun.jmx.mbeanserver.JmxMBeanServer@1d69be3
   [junit4]   2> 1785880 WARN  (SUITE-MetricsHandlerTest-seed#[74448FB1070B62E2]-worker)
[    ] o.a.s.m.r.SolrJmxReporter No serviceUrl or agentId was configured, using first MBeanServer.
   [junit4]   2> 1785884 INFO  (SUITE-MetricsHandlerTest-seed#[74448FB1070B62E2]-worker)
[    ] o.a.s.m.r.SolrJmxReporter JMX monitoring enabled at server: com.sun.jmx.mbeanserver.JmxMBeanServer@1d69be3
   [junit4]   2> 1785884 WARN  (SUITE-MetricsHandlerTest-seed#[74448FB1070B62E2]-worker)
[    ] o.a.s.m.r.SolrJmxReporter No serviceUrl or agentId was configured, using first MBeanServer.
   [junit4]   2> 1785884 INFO  (SUITE-MetricsHandlerTest-seed#[74448FB1070B62E2]-worker)
[    ] o.a.s.m.r.SolrJmxReporter JMX monitoring enabled at server: com.sun.jmx.mbeanserver.JmxMBeanServer@1d69be3
   [junit4]   2> 1785884 WARN  (SUITE-MetricsHandlerTest-seed#[74448FB1070B62E2]-worker)
[    ] o.a.s.m.r.SolrJmxReporter No serviceUrl or agentId was configured, using first MBeanServer.
   [junit4]   2> 1785884 INFO  (SUITE-MetricsHandlerTest-seed#[74448FB1070B62E2]-worker)
[    ] o.a.s.m.r.SolrJmxReporter JMX monitoring enabled at server: com.sun.jmx.mbeanserver.JmxMBeanServer@1d69be3
   [junit4]   2> 1785886 INFO  (coreLoadExecutor-9541-thread-1) [    ] o.a.s.c.SolrResourceLoader
[null] Added 2 libs to classloader, from paths: [/home/jenkins/workspace/Lucene-Solr-master-Linux/solr/core/src/test-files/solr/collection1/lib,
/home/jenkins/workspace/Lucene-Solr-master-Linux/solr/core/src/test-files/solr/collection1/lib/classes]
   [junit4]   2> 1785957 WARN  (coreLoadExecutor-9541-thread-1) [    ] o.a.s.c.Config Beginning
with Solr 5.5, <mergePolicy> is deprecated, use <mergePolicyFactory> instead.
   [junit4]   2> 1785958 INFO  (coreLoadExecutor-9541-thread-1) [    ] o.a.s.c.SolrConfig
Using Lucene MatchVersion: 7.0.0
   [junit4]   2> 1785977 INFO  (coreLoadExecutor-9541-thread-1) [    ] o.a.s.s.IndexSchema
[collection1] Schema name=test
   [junit4]   2> 1786033 WARN  (coreLoadExecutor-9541-thread-1) [    ] o.a.s.s.IndexSchema
[collection1] default search field in schema is text. WARNING: Deprecated, please use 'df'
on request instead.
   [junit4]   2> 1786035 INFO  (coreLoadExecutor-9541-thread-1) [    ] o.a.s.s.IndexSchema
Loaded schema test/1.0 with uniqueid field id
   [junit4]   2> 1786053 INFO  (coreLoadExecutor-9541-thread-1) [    ] o.a.s.c.CoreContainer
Creating SolrCore 'collection1' using configuration from instancedir /home/jenkins/workspace/Lucene-Solr-master-Linux/solr/core/src/test-files/solr/collection1
   [junit4]   2> 1786053 INFO  (coreLoadExecutor-9541-thread-1) [    ] o.a.s.c.SolrCore
[[collection1] ] Opening new SolrCore at [/home/jenkins/workspace/Lucene-Solr-master-Linux/solr/core/src/test-files/solr/collection1],
dataDir=[/home/jenkins/workspace/Lucene-Solr-master-Linux/solr/build/solr-core/test/J0/temp/solr.handler.admin.MetricsHandlerTest_74448FB1070B62E2-001/init-core-data-001/]
   [junit4]   2> 1786053 WARN  (coreLoadExecutor-9541-thread-1) [    ] o.a.s.m.r.SolrJmxReporter
No serviceUrl or agentId was configured, using first MBeanServer.
   [junit4]   2> 1786054 INFO  (coreLoadExecutor-9541-thread-1) [    ] o.a.s.m.r.SolrJmxReporter
JMX monitoring enabled at server: com.sun.jmx.mbeanserver.JmxMBeanServer@1d69be3
   [junit4]   2> 1786054 INFO  (coreLoadExecutor-9541-thread-1) [    ] o.a.s.c.JmxMonitoredMap
JMX monitoring is enabled. Adding Solr mbeans to JMX Server: com.sun.jmx.mbeanserver.JmxMBeanServer@1d69be3
   [junit4]   2> 1786055 INFO  (coreLoadExecutor-9541-thread-1) [    ] o.a.s.u.RandomMergePolicy
RandomMergePolicy wrapping class org.apache.lucene.index.TieredMergePolicy: [TieredMergePolicy:
maxMergeAtOnce=18, maxMergeAtOnceExplicit=22, maxMergedSegmentMB=3.5849609375, floorSegmentMB=1.2109375,
forceMergeDeletesPctAllowed=10.655983736224142, segmentsPerTier=17.0, maxCFSSegmentSizeMB=8.796093022207999E12,
noCFSRatio=0.0
   [junit4]   2> 1786071 INFO  (coreLoadExecutor-9541-thread-1) [    ] o.a.s.u.UpdateHandler
Using UpdateLog implementation: org.apache.solr.update.UpdateLog
   [junit4]   2> 1786071 INFO  (coreLoadExecutor-9541-thread-1) [    ] o.a.s.u.UpdateLog
Initializing UpdateLog: dataDir= defaultSyncLevel=FLUSH numRecordsToKeep=100 maxNumLogsToKeep=10
numVersionBuckets=65536
   [junit4]   2> 1786071 INFO  (coreLoadExecutor-9541-thread-1) [    ] o.a.s.u.CommitTracker
Hard AutoCommit: disabled
   [junit4]   2> 1786071 INFO  (coreLoadExecutor-9541-thread-1) [    ] o.a.s.u.CommitTracker
Soft AutoCommit: disabled
   [junit4]   2> 1786072 INFO  (coreLoadExecutor-9541-thread-1) [    ] o.a.s.u.RandomMergePolicy
RandomMergePolicy wrapping class org.apache.lucene.index.LogByteSizeMergePolicy: [LogByteSizeMergePolicy:
minMergeSize=1677721, mergeFactor=10, maxMergeSize=2147483648, maxMergeSizeForForcedMerge=9223372036854775807,
calibrateSizeByDeletes=true, maxMergeDocs=2147483647, maxCFSSegmentSizeMB=8.796093022207999E12,
noCFSRatio=0.0]
   [junit4]   2> 1786072 INFO  (coreLoadExecutor-9541-thread-1) [    ] o.a.s.s.SolrIndexSearcher
Opening [Searcher@1c3e9fa[collection1] main]
   [junit4]   2> 1786072 INFO  (coreLoadExecutor-9541-thread-1) [    ] o.a.s.h.c.SpellCheckComponent
Initializing spell checkers
   [junit4]   2> 1786107 INFO  (coreLoadExecutor-9541-thread-1) [    ] o.a.s.s.DirectSolrSpellChecker
init: {name=direct,classname=DirectSolrSpellChecker,field=lowerfilt,minQueryLength=3}
   [junit4]   2> 1786263 INFO  (coreLoadExecutor-9541-thread-1) [    ] o.a.s.h.ReplicationHandler
Commits will be reserved for  10000
   [junit4]   2> 1786264 INFO  (searcherExecutor-9542-thread-1) [    ] o.a.s.h.c.SpellCheckComponent
Loading spell index for spellchecker: default
   [junit4]   2> 1786264 INFO  (searcherExecutor-9542-thread-1) [    ] o.a.s.h.c.SpellCheckComponent
Loading spell index for spellchecker: direct
   [junit4]   2> 1786264 INFO  (searcherExecutor-9542-thread-1) [    ] o.a.s.h.c.SpellCheckComponent
Loading spell index for spellchecker: wordbreak
   [junit4]   2> 1786264 INFO  (searcherExecutor-9542-thread-1) [    ] o.a.s.h.c.SpellCheckComponent
Loading spell index for spellchecker: multipleFields
   [junit4]   2> 1786264 INFO  (coreLoadExecutor-9541-thread-1) [    ] o.a.s.u.UpdateLog
Could not find max version in index or recent updates, using new clock 1554234631788691456
   [junit4]   2> 1786264 INFO  (searcherExecutor-9542-thread-1) [    ] o.a.s.h.c.SpellCheckComponent
Loading spell index for spellchecker: jarowinkler
   [junit4]   2> 1786265 INFO  (searcherExecutor-9542-thread-1) [    ] o.a.s.h.c.SpellCheckComponent
Loading spell index for spellchecker: external
   [junit4]   2> 1786265 INFO  (searcherExecutor-9542-thread-1) [    ] o.a.s.h.c.SpellCheckComponent
Loading spell index for spellchecker: freq
   [junit4]   2> 1786265 INFO  (searcherExecutor-9542-thread-1) [    ] o.a.s.h.c.SpellCheckComponent
Loading spell index for spellchecker: fqcn
   [junit4]   2> 1786265 INFO  (searcherExecutor-9542-thread-1) [    ] o.a.s.h.c.SpellCheckComponent
Loading spell index for spellchecker: perDict
   [junit4]   2> 1786266 INFO  (searcherExecutor-9542-thread-1) [    ] o.a.s.c.SolrCore
[collection1] Registered new searcher Searcher@1c3e9fa[collection1] main{ExitableDirectoryReader(UninvertingDirectoryReader())}
   [junit4]   2> 1786267 INFO  (SUITE-MetricsHandlerTest-seed#[74448FB1070B62E2]-worker)
[    ] o.a.s.SolrTestCaseJ4 ####initCore end
   [junit4]   2> 1786269 INFO  (TEST-MetricsHandlerTest.test-seed#[74448FB1070B62E2]) [
   ] o.a.s.SolrTestCaseJ4 ###Starting test
   [junit4]   2> 1786280 INFO  (TEST-MetricsHandlerTest.test-seed#[74448FB1070B62E2]) [
   ] o.a.s.SolrTestCaseJ4 ###Ending test
   [junit4]   2> NOTE: reproduce with: ant test  -Dtestcase=MetricsHandlerTest -Dtests.method=test
-Dtests.seed=74448FB1070B62E2 -Dtests.multiplier=3 -Dtests.slow=true -Dtests.locale=ar-001
-Dtests.timezone=SystemV/AST4 -Dtests.asserts=true -Dtests.file.encoding=ISO-8859-1
   [junit4] ERROR   0.02s J0 | MetricsHandlerTest.test <<<
   [junit4]    > Throwable #1: java.lang.reflect.InaccessibleObjectException: Unable to
make member of class com.sun.management.internal.OperatingSystemImpl accessible:  module jdk.management
does not export com.sun.management.internal to unnamed module @d3a4b3
   [junit4]    > 	at __randomizedtesting.SeedInfo.seed([74448FB1070B62E2:FC10B06BA9F70F1A]:0)
   [junit4]    > 	at java.base/jdk.internal.reflect.Reflection.throwInaccessibleObjectException(Reflection.java:424)
   [junit4]    > 	at java.base/java.lang.reflect.AccessibleObject.checkCanSetAccessible(AccessibleObject.java:174)
   [junit4]    > 	at java.base/java.lang.reflect.Method.checkCanSetAccessible(Method.java:192)
   [junit4]    > 	at java.base/java.lang.reflect.Method.setAccessible(Method.java:186)
   [junit4]    > 	at com.codahale.metrics.jvm.FileDescriptorRatioGauge.invoke(FileDescriptorRatioGauge.java:48)
   [junit4]    > 	at com.codahale.metrics.jvm.FileDescriptorRatioGauge.getRatio(FileDescriptorRatioGauge.java:35)
   [junit4]    > 	at com.codahale.metrics.RatioGauge.getValue(RatioGauge.java:64)
   [junit4]    > 	at com.codahale.metrics.RatioGauge.getValue(RatioGauge.java:11)
   [junit4]    > 	at org.apache.solr.util.stats.MetricUtils.gaugeToNamedList(MetricUtils.java:135)
   [junit4]    > 	at org.apache.solr.util.stats.MetricUtils.lambda$toNamedList$2(MetricUtils.java:87)
   [junit4]    > 	at java.base/java.util.stream.ForEachOps$ForEachOp$OfRef.accept(ForEachOps.java:184)
   [junit4]    > 	at java.base/java.util.stream.ReferencePipeline$2$1.accept(ReferencePipeline.java:177)
   [junit4]    > 	at java.base/java.util.TreeMap$KeySpliterator.forEachRemaining(TreeMap.java:2739)
   [junit4]    > 	at java.base/java.util.stream.AbstractPipeline.copyInto(AbstractPipeline.java:484)
   [junit4]    > 	at java.base/java.util.stream.AbstractPipeline.wrapAndCopyInto(AbstractPipeline.java:474)
   [junit4]    > 	at java.base/java.util.stream.ForEachOps$ForEachOp.evaluateSequential(ForEachOps.java:151)
   [junit4]    > 	at java.base/java.util.stream.ForEachOps$ForEachOp$OfRef.evaluateSequential(ForEachOps.java:174)
   [junit4]    > 	at java.base/java.util.stream.AbstractPipeline.evaluate(AbstractPipeline.java:234)
   [junit4]    > 	at java.base/java.util.stream.ReferencePipeline.forEach(ReferencePipeline.java:430)
   [junit4]    > 	at org.apache.solr.util.stats.MetricUtils.toNamedList(MetricUtils.java:80)
   [junit4]    > 	at org.apache.solr.handler.admin.MetricsHandler.handleRequestBody(MetricsHandler.java:93)
   [junit4]    > 	at org.apache.solr.handler.admin.MetricsHandlerTest.test(MetricsHandlerTest.java:41)
   [junit4]    > 	at java.base/jdk.internal.reflect.NativeMethodAccessorImpl.invoke0(Native
Method)
   [junit4]    > 	at java.base/jdk.internal.reflect.NativeMethodAccessorImpl.invoke(NativeMethodAccessorImpl.java:62)
   [junit4]    > 	at java.base/jdk.internal.reflect.DelegatingMethodAccessorImpl.invoke(DelegatingMethodAccessorImpl.java:43)
   [junit4]    > 	at java.base/java.lang.reflect.Method.invoke(Method.java:538)
   [junit4]    > 	at java.base/java.lang.Thread.run(Thread.java:844)
   [junit4]   2> 1786282 INFO  (SUITE-MetricsHandlerTest-seed#[74448FB1070B62E2]-worker)
[    ] o.a.s.SolrTestCaseJ4 ###deleteCore
   [junit4]   2> 1786282 INFO  (SUITE-MetricsHandlerTest-seed#[74448FB1070B62E2]-worker)
[    ] o.a.s.c.CoreContainer Shutting down CoreContainer instance=4547387
   [junit4]   2> 1786282 INFO  (coreCloseExecutor-9547-thread-1) [    ] o.a.s.c.SolrCore
[collection1]  CLOSING SolrCore org.apache.solr.core.SolrCore@e7801e
   [junit4]   2> 1786290 INFO  (coreCloseExecutor-9547-thread-1) [    ] o.a.s.m.SolrMetricManager
Closing metric reporters for: solr.core.collection1
   [junit4]   2> 1786292 INFO  (SUITE-MetricsHandlerTest-seed#[74448FB1070B62E2]-worker)
[    ] o.a.s.m.SolrMetricManager Closing metric reporters for: solr.node
   [junit4]   2> NOTE: leaving temporary files on disk at: /home/jenkins/workspace/Lucene-Solr-master-Linux/solr/build/solr-core/test/J0/temp/solr.handler.admin.MetricsHandlerTest_74448FB1070B62E2-001
   [junit4]   2> NOTE: test params are: codec=FastDecompressionCompressingStoredFields(storedFieldsFormat=CompressingStoredFieldsFormat(compressionMode=FAST_DECOMPRESSION,
chunkSize=18394, maxDocsPerChunk=799, blockSize=5), termVectorsFormat=CompressingTermVectorsFormat(compressionMode=FAST_DECOMPRESSION,
chunkSize=18394, blockSize=5)), sim=RandomSimilarity(queryNorm=true): {}, locale=ar-001, timezone=SystemV/AST4
   [junit4]   2> NOTE: Linux 4.4.0-53-generic i386/Oracle Corporation 9-ea (32-bit)/cpus=12,threads=1,free=152983080,total=536870912
   [junit4]   2> NOTE: All tests run in this JVM: [TestDynamicFieldCollectionResource,
TestMinMaxOnMultiValuedField, TestCSVLoader, RequiredFieldsTest, SimpleCollectionCreateDeleteTest,
QueryResultKeyTest, EnumFieldTest, HdfsRecoveryZkTest, TestManagedSynonymFilterFactory, TestMacros,
PeerSyncReplicationTest, MergeStrategyTest, TestFreeTextSuggestions, TestBinaryResponseWriter,
SolrXmlInZkTest, CdcrVersionReplicationTest, TestAnalyzeInfixSuggestions, TestXmlQParserPlugin,
TestFieldCacheReopen, TestNonDefinedSimilarityFactory, TestComplexPhraseQParserPlugin, PingRequestHandlerTest,
HttpSolrCallGetCoreTest, LeaderFailureAfterFreshStartTest, DistributedDebugComponentTest,
TestFoldingMultitermQuery, TestCryptoKeys, PathHierarchyTokenizerFactoryTest, TestQueryWrapperFilter,
DistanceUnitsTest, TestRealTimeGet, TestSchemaNameResource, DistributedFacetPivotSmallTest,
TestValueSourceCache, ZkNodePropsTest, CopyFieldTest, TestSolrQueryResponse, CoreMergeIndexesAdminHandlerTest,
BasicZkTest, TestOmitPositions, StandardRequestHandlerTest, TestStressUserVersions, MigrateRouteKeyTest,
TestBlobHandler, SyncSliceTest, TriLevelCompositeIdRoutingTest, SolrRequestParserTest, TestSolrCloudWithSecureImpersonation,
TestFieldCacheSortRandom, TestAtomicUpdateErrorCases, OverriddenZkACLAndCredentialsProvidersTest,
ReturnFieldsTest, TestConfigSetImmutable, RegexBoostProcessorTest, HdfsThreadLeakTest, HdfsBasicDistributedZkTest,
DistributedQueryComponentOptimizationTest, DefaultValueUpdateProcessorTest, ReplicaListTransformerTest,
TestQuerySenderListener, TestSearcherReuse, SecurityConfHandlerTest, CurrencyFieldOpenExchangeTest,
TestReplicationHandlerBackup, TestCloudInspectUtil, TestAddFieldRealTimeGet, CacheHeaderTest,
TestSSLRandomization, SimpleMLTQParserTest, TestSolr4Spatial2, TestDefaultStatsCache, BigEndianAscendingWordDeserializerTest,
XsltUpdateRequestHandlerTest, TestRangeQuery, TestLeaderElectionWithEmptyReplica, TestJmxMonitoredMap,
TestRandomDVFaceting, TestReplicationHandler, CollectionTooManyReplicasTest, TestCorePropertiesReload,
BlockJoinFacetSimpleTest, BlockDirectoryTest, RollingRestartTest, TestUninvertingReader, TestSchemaVersionResource,
NumericFieldsTest, SpatialRPTFieldTypeTest, TestPseudoReturnFields, TestScoreJoinQPScore,
TestSizeLimitedDistributedMap, TestCrossCoreJoin, AnalysisAfterCoreReloadTest, ActionThrottleTest,
TestNRTOpen, TestCloudRecovery, CursorPagingTest, BasicAuthStandaloneTest, PluginInfoTest,
DistributedVersionInfoTest, MinimalSchemaTest, TestTolerantUpdateProcessorCloud, TestRTGBase,
MultiTermTest, TestInitQParser, TestJmxIntegration, TestSolrCLIRunExample, SignatureUpdateProcessorFactoryTest,
TestPKIAuthenticationPlugin, BasicDistributedZkTest, BasicDistributedZk2Test, OverseerTest,
LeaderElectionIntegrationTest, TestRandomFaceting, TestFaceting, TestRecovery, TestHashPartitioner,
TermVectorComponentDistributedTest, DistributedTermsComponentTest, StatsComponentTest, QueryElevationComponentTest,
PeerSyncTest, TestFunctionQuery, TestBadConfig, TestIndexSearcher, HighlighterTest, CurrencyFieldXmlFileTest,
SolrIndexSplitterTest, SimplePostToolTest, SpellCheckCollatorTest, TestStressLucene, TestTrie,
PolyFieldTest, TestUpdate, QueryEqualityTest, TestRemoteStreaming, DocumentAnalysisRequestHandlerTest,
PrimitiveFieldTypeTest, RequestHandlersTest, TestIndexingPerformance, IndexSchemaRuntimeFieldTest,
TestCSVResponseWriter, TestAnalyzedSuggestions, TestPHPSerializedResponseWriter, HighlighterConfigTest,
AlternateDirectoryTest, TestSolrIndexConfig, ResponseLogComponentTest, TestSolrDeletionPolicy2,
TestDocSet, TestBinaryField, TestSearchPerf, TestElisionMultitermQuery, TestConfig, TestFuzzyAnalyzedSuggestions,
TestSolrCoreProperties, TestPostingsSolrHighlighter, TestLuceneMatchVersion, TestCharFilters,
TestXIncludeConfig, TestDFRSimilarityFactory, TestLMDirichletSimilarityFactory, TestFastOutputStream,
DateMathParserTest, TestSuggestSpellingConverter, ClusterStateTest, TestLRUCache, TestDocumentBuilder,
SystemInfoHandlerTest, UUIDFieldTest, DistributedIntervalFacetingTest, CollectionStateFormat2Test,
ConcurrentDeleteAndCreateCollectionTest, ConfigSetsAPITest, CreateCollectionCleanupTest, DeleteInactiveReplicaTest,
DeleteLastCustomShardedReplicaTest, DeleteShardTest, DocValuesNotIndexedTest, HttpPartitionTest,
TestLeaderInitiatedRecoveryThread, TestOnReconnectListenerSupport, TestRandomFlRTGCloud, TestSolrCloudWithKerberosAlt,
TestStressLiveNodes, CoreSorterTest, DirectoryFactoryTest, ExitableDirectoryReaderTest, HdfsDirectoryFactoryTest,
TestBackupRepositoryFactory, TestConfigOverlay, TestConfigSets, TestCustomStream, TestSolrCoreSnapshots,
RequestLoggingTest, TestHdfsBackupRestoreCore, TestSQLHandler, CoreAdminCreateDiscoverTest,
InfoHandlerTest, MetricsHandlerTest]
   [junit4] Completed [544/669 (2!)] on J0 in 0.63s, 1 test, 1 error <<< FAILURES!

[...truncated 51866 lines...]


Mime
View raw message