lucene-dev mailing list archives

Site index · List index
Message view « Date » · « Thread »
Top « Date » · « Thread »
From Policeman Jenkins Server <jenk...@thetaphi.de>
Subject [JENKINS-EA] Lucene-Solr-master-Linux (64bit/jdk-9-ea+140) - Build # 18479 - Unstable!
Date Fri, 09 Dec 2016 06:33:34 GMT
Build: https://jenkins.thetaphi.de/job/Lucene-Solr-master-Linux/18479/
Java: 64bit/jdk-9-ea+140 -XX:-UseCompressedOops -XX:+UseSerialGC

1 tests failed.
FAILED:  org.apache.solr.cloud.TestSolrCloudWithDelegationTokens.testDelegationTokenCancelFail

Error Message:
expected:<200> but was:<404>

Stack Trace:
java.lang.AssertionError: expected:<200> but was:<404>
	at __randomizedtesting.SeedInfo.seed([E7F611551FECF6A2:8F49247FCF76E44E]:0)
	at org.junit.Assert.fail(Assert.java:93)
	at org.junit.Assert.failNotEquals(Assert.java:647)
	at org.junit.Assert.assertEquals(Assert.java:128)
	at org.junit.Assert.assertEquals(Assert.java:472)
	at org.junit.Assert.assertEquals(Assert.java:456)
	at org.apache.solr.cloud.TestSolrCloudWithDelegationTokens.cancelDelegationToken(TestSolrCloudWithDelegationTokens.java:140)
	at org.apache.solr.cloud.TestSolrCloudWithDelegationTokens.testDelegationTokenCancelFail(TestSolrCloudWithDelegationTokens.java:304)
	at jdk.internal.reflect.NativeMethodAccessorImpl.invoke0(java.base@9-ea/Native Method)
	at jdk.internal.reflect.NativeMethodAccessorImpl.invoke(java.base@9-ea/NativeMethodAccessorImpl.java:62)
	at jdk.internal.reflect.DelegatingMethodAccessorImpl.invoke(java.base@9-ea/DelegatingMethodAccessorImpl.java:43)
	at java.lang.reflect.Method.invoke(java.base@9-ea/Method.java:535)
	at com.carrotsearch.randomizedtesting.RandomizedRunner.invoke(RandomizedRunner.java:1713)
	at com.carrotsearch.randomizedtesting.RandomizedRunner$8.evaluate(RandomizedRunner.java:907)
	at com.carrotsearch.randomizedtesting.RandomizedRunner$9.evaluate(RandomizedRunner.java:943)
	at com.carrotsearch.randomizedtesting.RandomizedRunner$10.evaluate(RandomizedRunner.java:957)
	at com.carrotsearch.randomizedtesting.rules.SystemPropertiesRestoreRule$1.evaluate(SystemPropertiesRestoreRule.java:57)
	at org.apache.lucene.util.TestRuleSetupTeardownChained$1.evaluate(TestRuleSetupTeardownChained.java:49)
	at org.apache.lucene.util.AbstractBeforeAfterRule$1.evaluate(AbstractBeforeAfterRule.java:45)
	at org.apache.lucene.util.TestRuleThreadAndTestName$1.evaluate(TestRuleThreadAndTestName.java:48)
	at org.apache.lucene.util.TestRuleIgnoreAfterMaxFailures$1.evaluate(TestRuleIgnoreAfterMaxFailures.java:64)
	at org.apache.lucene.util.TestRuleMarkFailure$1.evaluate(TestRuleMarkFailure.java:47)
	at com.carrotsearch.randomizedtesting.rules.StatementAdapter.evaluate(StatementAdapter.java:36)
	at com.carrotsearch.randomizedtesting.ThreadLeakControl$StatementRunner.run(ThreadLeakControl.java:367)
	at com.carrotsearch.randomizedtesting.ThreadLeakControl.forkTimeoutingTask(ThreadLeakControl.java:811)
	at com.carrotsearch.randomizedtesting.ThreadLeakControl$3.evaluate(ThreadLeakControl.java:462)
	at com.carrotsearch.randomizedtesting.RandomizedRunner.runSingleTest(RandomizedRunner.java:916)
	at com.carrotsearch.randomizedtesting.RandomizedRunner$5.evaluate(RandomizedRunner.java:802)
	at com.carrotsearch.randomizedtesting.RandomizedRunner$6.evaluate(RandomizedRunner.java:852)
	at com.carrotsearch.randomizedtesting.RandomizedRunner$7.evaluate(RandomizedRunner.java:863)
	at com.carrotsearch.randomizedtesting.rules.StatementAdapter.evaluate(StatementAdapter.java:36)
	at com.carrotsearch.randomizedtesting.rules.SystemPropertiesRestoreRule$1.evaluate(SystemPropertiesRestoreRule.java:57)
	at org.apache.lucene.util.AbstractBeforeAfterRule$1.evaluate(AbstractBeforeAfterRule.java:45)
	at com.carrotsearch.randomizedtesting.rules.StatementAdapter.evaluate(StatementAdapter.java:36)
	at org.apache.lucene.util.TestRuleStoreClassName$1.evaluate(TestRuleStoreClassName.java:41)
	at com.carrotsearch.randomizedtesting.rules.NoShadowingOrOverridesOnMethodsRule$1.evaluate(NoShadowingOrOverridesOnMethodsRule.java:40)
	at com.carrotsearch.randomizedtesting.rules.NoShadowingOrOverridesOnMethodsRule$1.evaluate(NoShadowingOrOverridesOnMethodsRule.java:40)
	at com.carrotsearch.randomizedtesting.rules.StatementAdapter.evaluate(StatementAdapter.java:36)
	at com.carrotsearch.randomizedtesting.rules.StatementAdapter.evaluate(StatementAdapter.java:36)
	at com.carrotsearch.randomizedtesting.rules.StatementAdapter.evaluate(StatementAdapter.java:36)
	at org.apache.lucene.util.TestRuleAssertionsRequired$1.evaluate(TestRuleAssertionsRequired.java:53)
	at org.apache.lucene.util.TestRuleMarkFailure$1.evaluate(TestRuleMarkFailure.java:47)
	at org.apache.lucene.util.TestRuleIgnoreAfterMaxFailures$1.evaluate(TestRuleIgnoreAfterMaxFailures.java:64)
	at org.apache.lucene.util.TestRuleIgnoreTestSuites$1.evaluate(TestRuleIgnoreTestSuites.java:54)
	at com.carrotsearch.randomizedtesting.rules.StatementAdapter.evaluate(StatementAdapter.java:36)
	at com.carrotsearch.randomizedtesting.ThreadLeakControl$StatementRunner.run(ThreadLeakControl.java:367)
	at java.lang.Thread.run(java.base@9-ea/Thread.java:843)




Build Log:
[...truncated 12286 lines...]
   [junit4] Suite: org.apache.solr.cloud.TestSolrCloudWithDelegationTokens
   [junit4]   2> Creating dataDir: /home/jenkins/workspace/Lucene-Solr-master-Linux/solr/build/solr-core/test/J1/temp/solr.cloud.TestSolrCloudWithDelegationTokens_E7F611551FECF6A2-001/init-core-data-001
   [junit4]   2> 1518860 INFO  (SUITE-TestSolrCloudWithDelegationTokens-seed#[E7F611551FECF6A2]-worker) [    ] o.a.s.SolrTestCaseJ4 Randomized ssl (true) and clientAuth (true) via: @org.apache.solr.util.RandomizeSSL(reason="", ssl=0.0/0.0, value=0.0/0.0, clientAuth=0.0/0.0)
   [junit4]   2> 1518863 INFO  (SUITE-TestSolrCloudWithDelegationTokens-seed#[E7F611551FECF6A2]-worker) [    ] o.a.s.c.MiniSolrCloudCluster Starting cluster of 2 servers in /home/jenkins/workspace/Lucene-Solr-master-Linux/solr/build/solr-core/test/J1/temp/solr.cloud.TestSolrCloudWithDelegationTokens_E7F611551FECF6A2-001/tempDir-001
   [junit4]   2> 1518863 INFO  (SUITE-TestSolrCloudWithDelegationTokens-seed#[E7F611551FECF6A2]-worker) [    ] o.a.s.c.ZkTestServer STARTING ZK TEST SERVER
   [junit4]   2> 1518863 INFO  (Thread-3348) [    ] o.a.s.c.ZkTestServer client port:0.0.0.0/0.0.0.0:0
   [junit4]   2> 1518863 INFO  (Thread-3348) [    ] o.a.s.c.ZkTestServer Starting server
   [junit4]   2> 1518963 INFO  (SUITE-TestSolrCloudWithDelegationTokens-seed#[E7F611551FECF6A2]-worker) [    ] o.a.s.c.ZkTestServer start zk server on port:44220
   [junit4]   2> 1518969 INFO  (jetty-launcher-2181-thread-1) [    ] o.e.j.s.Server jetty-9.3.14.v20161028
   [junit4]   2> 1518969 INFO  (jetty-launcher-2181-thread-1) [    ] o.e.j.s.h.ContextHandler Started o.e.j.s.ServletContextHandler@12a98668{/solr,null,AVAILABLE}
   [junit4]   2> 1518971 INFO  (jetty-launcher-2181-thread-1) [    ] o.e.j.s.AbstractConnector Started ServerConnector@4b009754{SSL,[ssl, http/1.1]}{127.0.0.1:33406}
   [junit4]   2> 1518971 INFO  (jetty-launcher-2181-thread-1) [    ] o.e.j.s.Server Started @1520674ms
   [junit4]   2> 1518971 INFO  (jetty-launcher-2181-thread-1) [    ] o.a.s.c.s.e.JettySolrRunner Jetty properties: {hostContext=/solr, hostPort=33406}
   [junit4]   2> 1518971 ERROR (jetty-launcher-2181-thread-1) [    ] o.a.s.s.StartupLoggingUtils Missing Java Option solr.log.dir. Logging may be missing or incomplete.
   [junit4]   2> 1518971 INFO  (jetty-launcher-2181-thread-1) [    ] o.a.s.s.SolrDispatchFilter  ___      _       Welcome to Apache Solr? version 7.0.0
   [junit4]   2> 1518971 INFO  (jetty-launcher-2181-thread-1) [    ] o.a.s.s.SolrDispatchFilter / __| ___| |_ _   Starting in cloud mode on port null
   [junit4]   2> 1518971 INFO  (jetty-launcher-2181-thread-1) [    ] o.a.s.s.SolrDispatchFilter \__ \/ _ \ | '_|  Install dir: null
   [junit4]   2> 1518971 INFO  (jetty-launcher-2181-thread-1) [    ] o.a.s.s.SolrDispatchFilter |___/\___/_|_|    Start time: 2016-12-09T06:19:36.659965Z
   [junit4]   2> 1518973 INFO  (jetty-launcher-2181-thread-2) [    ] o.e.j.s.Server jetty-9.3.14.v20161028
   [junit4]   2> 1518973 INFO  (jetty-launcher-2181-thread-1) [    ] o.a.s.s.SolrDispatchFilter solr.xml found in ZooKeeper. Loading...
   [junit4]   2> 1518973 INFO  (jetty-launcher-2181-thread-2) [    ] o.e.j.s.h.ContextHandler Started o.e.j.s.ServletContextHandler@4eec320d{/solr,null,AVAILABLE}
   [junit4]   2> 1518974 INFO  (jetty-launcher-2181-thread-2) [    ] o.e.j.s.AbstractConnector Started ServerConnector@552c641e{SSL,[ssl, http/1.1]}{127.0.0.1:37618}
   [junit4]   2> 1518974 INFO  (jetty-launcher-2181-thread-2) [    ] o.e.j.s.Server Started @1520677ms
   [junit4]   2> 1518974 INFO  (jetty-launcher-2181-thread-2) [    ] o.a.s.c.s.e.JettySolrRunner Jetty properties: {hostContext=/solr, hostPort=37618}
   [junit4]   2> 1518974 ERROR (jetty-launcher-2181-thread-2) [    ] o.a.s.s.StartupLoggingUtils Missing Java Option solr.log.dir. Logging may be missing or incomplete.
   [junit4]   2> 1518974 INFO  (jetty-launcher-2181-thread-2) [    ] o.a.s.s.SolrDispatchFilter  ___      _       Welcome to Apache Solr? version 7.0.0
   [junit4]   2> 1518974 INFO  (jetty-launcher-2181-thread-2) [    ] o.a.s.s.SolrDispatchFilter / __| ___| |_ _   Starting in cloud mode on port null
   [junit4]   2> 1518974 INFO  (jetty-launcher-2181-thread-2) [    ] o.a.s.s.SolrDispatchFilter \__ \/ _ \ | '_|  Install dir: null
   [junit4]   2> 1518975 INFO  (jetty-launcher-2181-thread-2) [    ] o.a.s.s.SolrDispatchFilter |___/\___/_|_|    Start time: 2016-12-09T06:19:36.662998Z
   [junit4]   2> 1518976 INFO  (jetty-launcher-2181-thread-2) [    ] o.a.s.s.SolrDispatchFilter solr.xml found in ZooKeeper. Loading...
   [junit4]   2> 1518980 INFO  (jetty-launcher-2181-thread-1) [    ] o.a.s.c.ZkContainer Zookeeper client=127.0.0.1:44220/solr
   [junit4]   2> 1518986 INFO  (jetty-launcher-2181-thread-2) [    ] o.a.s.c.ZkContainer Zookeeper client=127.0.0.1:44220/solr
   [junit4]   2> 1518988 INFO  (jetty-launcher-2181-thread-1) [    ] o.a.s.c.OverseerElectionContext I am going to be the leader 127.0.0.1:33406_solr
   [junit4]   2> 1518988 INFO  (jetty-launcher-2181-thread-1) [    ] o.a.s.c.Overseer Overseer (id=97076142181842948-127.0.0.1:33406_solr-n_0000000000) starting
   [junit4]   2> 1518992 INFO  (jetty-launcher-2181-thread-2) [    ] o.a.s.c.ZkController Register node as live in ZooKeeper:/live_nodes/127.0.0.1:37618_solr
   [junit4]   2> 1518992 INFO  (zkCallback-2193-thread-1) [    ] o.a.s.c.c.ZkStateReader Updated live nodes from ZooKeeper... (0) -> (1)
   [junit4]   2> 1518993 INFO  (OverseerStateUpdate-97076142181842948-127.0.0.1:33406_solr-n_0000000000) [    ] o.a.s.c.c.ZkStateReader Updated live nodes from ZooKeeper... (0) -> (1)
   [junit4]   2> 1518993 INFO  (jetty-launcher-2181-thread-1) [    ] o.a.s.c.ZkController Register node as live in ZooKeeper:/live_nodes/127.0.0.1:33406_solr
   [junit4]   2> 1518993 INFO  (zkCallback-2188-thread-1) [    ] o.a.s.c.c.ZkStateReader Updated live nodes from ZooKeeper... (1) -> (2)
   [junit4]   2> 1518993 INFO  (zkCallback-2193-thread-1) [    ] o.a.s.c.c.ZkStateReader Updated live nodes from ZooKeeper... (1) -> (2)
   [junit4]   2> 1519011 INFO  (jetty-launcher-2181-thread-1) [    ] o.a.s.c.CoreContainer Initializing authentication plugin: org.apache.solr.security.HttpParamDelegationTokenPlugin
   [junit4]   2> 1519024 INFO  (jetty-launcher-2181-thread-1) [    ] o.a.s.s.KerberosPlugin Params: {token.valid=30, delegation-token.token-kind=solr-dt, cookie.domain=127.0.0.1, cookie.path=/, zk-dt-secret-manager.znodeWorkingPath=solr/security/zkdtsm, token.validity=36000, signer.secret.provider.zookeeper.path=/token, type=kerberos, zk-dt-secret-manager.enable=true, kerberos.name.rules=DEFAULT, signer.secret.provider=zookeeper}
   [junit4]   2> 1519060 INFO  (jetty-launcher-2181-thread-2) [    ] o.a.s.c.CoreContainer Initializing authentication plugin: org.apache.solr.security.HttpParamDelegationTokenPlugin
   [junit4]   2> 1519061 INFO  (jetty-launcher-2181-thread-2) [    ] o.a.s.s.KerberosPlugin Params: {token.valid=30, delegation-token.token-kind=solr-dt, cookie.domain=127.0.0.1, cookie.path=/, zk-dt-secret-manager.znodeWorkingPath=solr/security/zkdtsm, token.validity=36000, signer.secret.provider.zookeeper.path=/token, type=kerberos, zk-dt-secret-manager.enable=true, kerberos.name.rules=DEFAULT, signer.secret.provider=zookeeper}
   [junit4]   2> 1519062 INFO  (jetty-launcher-2181-thread-1) [    ] o.a.c.f.i.CuratorFrameworkImpl Starting
   [junit4]   2> 1519062 INFO  (jetty-launcher-2181-thread-2) [    ] o.a.c.f.i.CuratorFrameworkImpl Starting
   [junit4]   2> 1519070 INFO  (jetty-launcher-2181-thread-2-EventThread) [    ] o.a.c.f.s.ConnectionStateManager State change: CONNECTED
   [junit4]   2> 1519070 INFO  (jetty-launcher-2181-thread-1-EventThread) [    ] o.a.c.f.s.ConnectionStateManager State change: CONNECTED
   [junit4]   2> 1519162 INFO  (jetty-launcher-2181-thread-1) [    ] o.a.s.c.CorePropertiesLocator Found 0 core definitions underneath /home/jenkins/workspace/Lucene-Solr-master-Linux/solr/build/solr-core/test/J1/temp/solr.cloud.TestSolrCloudWithDelegationTokens_E7F611551FECF6A2-001/tempDir-001/node1/.
   [junit4]   2> 1519162 INFO  (jetty-launcher-2181-thread-2) [    ] o.a.s.c.CorePropertiesLocator Found 0 core definitions underneath /home/jenkins/workspace/Lucene-Solr-master-Linux/solr/build/solr-core/test/J1/temp/solr.cloud.TestSolrCloudWithDelegationTokens_E7F611551FECF6A2-001/tempDir-001/node2/.
   [junit4]   2> 1519179 INFO  (TEST-TestSolrCloudWithDelegationTokens.testDelegationTokenSolrClient-seed#[E7F611551FECF6A2]) [    ] o.a.s.SolrTestCaseJ4 ###Starting testDelegationTokenSolrClient
   [junit4]   2> 1519390 WARN  (TEST-TestSolrCloudWithDelegationTokens.testDelegationTokenSolrClient-seed#[E7F611551FECF6A2]) [    ] o.a.h.c.p.ResponseProcessCookies Invalid cookie header: "Set-Cookie: hadoop.auth=; Path=/; Domain=127.0.0.1; Expires=kin, 01-Jan-1970 00:00:00 GMT; Secure; HttpOnly". Invalid 'expires' attribute: kin, 01-Jan-1970 00:00:00 GMT
   [junit4]   2> 1519398 INFO  (qtp486005164-13913) [    ] o.a.s.h.a.CollectionsHandler Invoked Collection Action :list with params action=LIST&delegation=GgADYmFyA2JhcgCKAVjiPKxeigFZBkkwXgEEFKnJZDvXkhP-knBO1jWl9MyOG5KMB3NvbHItZHQA&wt=javabin&version=2 and sendToOCPQueue=true
   [junit4]   2> 1519398 INFO  (qtp486005164-13913) [    ] o.a.s.s.HttpSolrCall [admin] webapp=null path=/admin/collections params={action=LIST&delegation=GgADYmFyA2JhcgCKAVjiPKxeigFZBkkwXgEEFKnJZDvXkhP-knBO1jWl9MyOG5KMB3NvbHItZHQA&wt=javabin&version=2} status=0 QTime=0
   [junit4]   2> 1519399 INFO  (TEST-TestSolrCloudWithDelegationTokens.testDelegationTokenSolrClient-seed#[E7F611551FECF6A2]) [    ] o.a.s.SolrTestCaseJ4 ###Ending testDelegationTokenSolrClient
   [junit4]   2> 1519407 INFO  (TEST-TestSolrCloudWithDelegationTokens.testDelegationTokenVerify-seed#[E7F611551FECF6A2]) [    ] o.a.s.SolrTestCaseJ4 ###Starting testDelegationTokenVerify
   [junit4]   2> 1519416 INFO  (qtp486005164-13911) [    ] o.a.s.h.a.CollectionsHandler Invoked Collection Action :list with params action=LIST&delegation=GgADYmFyA2JhcgCKAVjiPK0IigFZBkkxCAIEFI9SUJ9dqUdRxvodZNAa-DgvkeBZB3NvbHItZHQA&wt=javabin&version=2 and sendToOCPQueue=true
   [junit4]   2> 1519416 INFO  (qtp486005164-13911) [    ] o.a.s.s.HttpSolrCall [admin] webapp=null path=/admin/collections params={action=LIST&delegation=GgADYmFyA2JhcgCKAVjiPK0IigFZBkkxCAIEFI9SUJ9dqUdRxvodZNAa-DgvkeBZB3NvbHItZHQA&wt=javabin&version=2} status=0 QTime=0
   [junit4]   2> 1519420 INFO  (TEST-TestSolrCloudWithDelegationTokens.testDelegationTokenVerify-seed#[E7F611551FECF6A2]) [    ] o.a.s.c.c.ZkStateReader Updated live nodes from ZooKeeper... (0) -> (2)
   [junit4]   2> 1519422 INFO  (TEST-TestSolrCloudWithDelegationTokens.testDelegationTokenVerify-seed#[E7F611551FECF6A2]) [    ] o.a.s.c.s.i.ZkClientClusterStateProvider Cluster at 127.0.0.1:44220/solr ready
   [junit4]   2> 1519438 WARN  (TEST-TestSolrCloudWithDelegationTokens.testDelegationTokenVerify-seed#[E7F611551FECF6A2]) [    ] o.a.h.c.p.ResponseProcessCookies Invalid cookie header: "Set-Cookie: hadoop.auth=; Path=/; Domain=127.0.0.1; Expires=kin, 01-Jan-1970 00:00:00 GMT; Secure; HttpOnly". Invalid 'expires' attribute: kin, 01-Jan-1970 00:00:00 GMT
   [junit4]   2> 1519443 INFO  (TEST-TestSolrCloudWithDelegationTokens.testDelegationTokenVerify-seed#[E7F611551FECF6A2]) [    ] o.a.s.c.c.ZkStateReader Updated live nodes from ZooKeeper... (0) -> (2)
   [junit4]   2> 1519444 INFO  (TEST-TestSolrCloudWithDelegationTokens.testDelegationTokenVerify-seed#[E7F611551FECF6A2]) [    ] o.a.s.c.s.i.ZkClientClusterStateProvider Cluster at 127.0.0.1:44220/solr ready
   [junit4]   2> 1519448 INFO  (qtp237865907-13925) [    ] o.a.s.h.a.CollectionsHandler Invoked Collection Action :list with params action=LIST&delegation=GgADYmFyA2JhcgCKAVjiPK0IigFZBkkxCAIEFI9SUJ9dqUdRxvodZNAa-DgvkeBZB3NvbHItZHQA&wt=javabin&version=2 and sendToOCPQueue=true
   [junit4]   2> 1519449 INFO  (qtp237865907-13925) [    ] o.a.s.s.HttpSolrCall [admin] webapp=null path=/admin/collections params={action=LIST&delegation=GgADYmFyA2JhcgCKAVjiPK0IigFZBkkxCAIEFI9SUJ9dqUdRxvodZNAa-DgvkeBZB3NvbHItZHQA&wt=javabin&version=2} status=0 QTime=0
   [junit4]   2> 1519454 INFO  (TEST-TestSolrCloudWithDelegationTokens.testDelegationTokenVerify-seed#[E7F611551FECF6A2]) [    ] o.a.s.c.c.ZkStateReader Updated live nodes from ZooKeeper... (0) -> (2)
   [junit4]   2> 1519454 INFO  (TEST-TestSolrCloudWithDelegationTokens.testDelegationTokenVerify-seed#[E7F611551FECF6A2]) [    ] o.a.s.c.s.i.ZkClientClusterStateProvider Cluster at 127.0.0.1:44220/solr ready
   [junit4]   2> 1519458 WARN  (TEST-TestSolrCloudWithDelegationTokens.testDelegationTokenVerify-seed#[E7F611551FECF6A2]) [    ] o.a.h.c.p.ResponseProcessCookies Invalid cookie header: "Set-Cookie: hadoop.auth=; Path=/; Domain=127.0.0.1; Expires=kin, 01-Jan-1970 00:00:00 GMT; Secure; HttpOnly". Invalid 'expires' attribute: kin, 01-Jan-1970 00:00:00 GMT
   [junit4]   2> 1519459 INFO  (TEST-TestSolrCloudWithDelegationTokens.testDelegationTokenVerify-seed#[E7F611551FECF6A2]) [    ] o.a.s.SolrTestCaseJ4 ###Ending testDelegationTokenVerify
   [junit4]   2> 1519470 INFO  (TEST-TestSolrCloudWithDelegationTokens.testDelegationTokenCancelFail-seed#[E7F611551FECF6A2]) [    ] o.a.s.SolrTestCaseJ4 ###Starting testDelegationTokenCancelFail
   [junit4]   2> 1519482 ERROR (qtp237865907-13923) [    ] o.a.h.s.t.d.ZKDelegationTokenSecretManager No node in path [/ZKDTSMTokensRoot/DT_3]
   [junit4]   2> 1519483 ERROR (qtp486005164-13908) [    ] o.a.h.s.t.d.ZKDelegationTokenSecretManager No node in path [/ZKDTSMTokensRoot/DT_3]
   [junit4]   2> 1519491 ERROR (qtp237865907-13918) [    ] o.a.h.s.t.d.ZKDelegationTokenSecretManager No node in path [/ZKDTSMTokensRoot/DT_4]
   [junit4]   2> 1519494 INFO  (TEST-TestSolrCloudWithDelegationTokens.testDelegationTokenCancelFail-seed#[E7F611551FECF6A2]) [    ] o.a.s.SolrTestCaseJ4 ###Ending testDelegationTokenCancelFail
   [junit4]   2> NOTE: reproduce with: ant test  -Dtestcase=TestSolrCloudWithDelegationTokens -Dtests.method=testDelegationTokenCancelFail -Dtests.seed=E7F611551FECF6A2 -Dtests.multiplier=3 -Dtests.slow=true -Dtests.locale=kea-CV -Dtests.timezone=CST -Dtests.asserts=true -Dtests.file.encoding=ISO-8859-1
   [junit4] FAILURE 0.04s J1 | TestSolrCloudWithDelegationTokens.testDelegationTokenCancelFail <<<
   [junit4]    > Throwable #1: java.lang.AssertionError: expected:<200> but was:<404>
   [junit4]    > 	at __randomizedtesting.SeedInfo.seed([E7F611551FECF6A2:8F49247FCF76E44E]:0)
   [junit4]    > 	at org.apache.solr.cloud.TestSolrCloudWithDelegationTokens.cancelDelegationToken(TestSolrCloudWithDelegationTokens.java:140)
   [junit4]    > 	at org.apache.solr.cloud.TestSolrCloudWithDelegationTokens.testDelegationTokenCancelFail(TestSolrCloudWithDelegationTokens.java:304)
   [junit4]    > 	at jdk.internal.reflect.NativeMethodAccessorImpl.invoke0(java.base@9-ea/Native Method)
   [junit4]    > 	at jdk.internal.reflect.NativeMethodAccessorImpl.invoke(java.base@9-ea/NativeMethodAccessorImpl.java:62)
   [junit4]    > 	at jdk.internal.reflect.DelegatingMethodAccessorImpl.invoke(java.base@9-ea/DelegatingMethodAccessorImpl.java:43)
   [junit4]    > 	at java.lang.Thread.run(java.base@9-ea/Thread.java:843)
   [junit4]   2> 1519507 INFO  (TEST-TestSolrCloudWithDelegationTokens.testDelegationTokenRenewFail-seed#[E7F611551FECF6A2]) [    ] o.a.s.SolrTestCaseJ4 ###Starting testDelegationTokenRenewFail
   [junit4]   2> 1519513 WARN  (qtp486005164-13908) [    ] o.a.h.s.a.s.AuthenticationFilter Authentication exception: org.apache.hadoop.security.AccessControlException: foo tries to renew a token with renewer bar
   [junit4]   2> 1519513 WARN  (qtp486005164-13908) [    ] o.a.s.s.KerberosPlugin Could not find org.apache.solr.security.kerberosplugin.requestcontinues
   [junit4]   2> 1519513 WARN  (TEST-TestSolrCloudWithDelegationTokens.testDelegationTokenRenewFail-seed#[E7F611551FECF6A2]) [    ] o.a.h.c.p.ResponseProcessCookies Invalid cookie header: "Set-Cookie: hadoop.auth=; Path=/; Domain=127.0.0.1; Expires=kin, 01-Jan-1970 00:00:00 GMT; Secure; HttpOnly". Invalid 'expires' attribute: kin, 01-Jan-1970 00:00:00 GMT
   [junit4]   2> 1519514 WARN  (qtp237865907-13925) [    ] o.a.h.s.a.s.AuthenticationFilter Authentication exception: org.apache.hadoop.security.AccessControlException: foo tries to renew a token with renewer bar
   [junit4]   2> 1519514 WARN  (qtp237865907-13925) [    ] o.a.s.s.KerberosPlugin Could not find org.apache.solr.security.kerberosplugin.requestcontinues
   [junit4]   2> 1519514 WARN  (TEST-TestSolrCloudWithDelegationTokens.testDelegationTokenRenewFail-seed#[E7F611551FECF6A2]) [    ] o.a.h.c.p.ResponseProcessCookies Invalid cookie header: "Set-Cookie: hadoop.auth=; Path=/; Domain=127.0.0.1; Expires=kin, 01-Jan-1970 00:00:00 GMT; Secure; HttpOnly". Invalid 'expires' attribute: kin, 01-Jan-1970 00:00:00 GMT
   [junit4]   2> 1519520 WARN  (qtp486005164-13911) [    ] o.a.h.s.a.s.AuthenticationFilter Authentication exception: org.apache.hadoop.security.AccessControlException: notRenewUser tries to renew a token with renewer renewUser
   [junit4]   2> 1519520 WARN  (qtp486005164-13911) [    ] o.a.s.s.KerberosPlugin Could not find org.apache.solr.security.kerberosplugin.requestcontinues
   [junit4]   2> 1519520 WARN  (TEST-TestSolrCloudWithDelegationTokens.testDelegationTokenRenewFail-seed#[E7F611551FECF6A2]) [    ] o.a.h.c.p.ResponseProcessCookies Invalid cookie header: "Set-Cookie: hadoop.auth=; Path=/; Domain=127.0.0.1; Expires=kin, 01-Jan-1970 00:00:00 GMT; Secure; HttpOnly". Invalid 'expires' attribute: kin, 01-Jan-1970 00:00:00 GMT
   [junit4]   2> 1519521 WARN  (qtp237865907-13923) [    ] o.a.h.s.a.s.AuthenticationFilter Authentication exception: org.apache.hadoop.security.AccessControlException: notRenewUser tries to renew a token with renewer renewUser
   [junit4]   2> 1519522 WARN  (qtp237865907-13923) [    ] o.a.s.s.KerberosPlugin Could not find org.apache.solr.security.kerberosplugin.requestcontinues
   [junit4]   2> 1519522 WARN  (TEST-TestSolrCloudWithDelegationTokens.testDelegationTokenRenewFail-seed#[E7F611551FECF6A2]) [    ] o.a.h.c.p.ResponseProcessCookies Invalid cookie header: "Set-Cookie: hadoop.auth=; Path=/; Domain=127.0.0.1; Expires=kin, 01-Jan-1970 00:00:00 GMT; Secure; HttpOnly". Invalid 'expires' attribute: kin, 01-Jan-1970 00:00:00 GMT
   [junit4]   2> 1519522 INFO  (TEST-TestSolrCloudWithDelegationTokens.testDelegationTokenRenewFail-seed#[E7F611551FECF6A2]) [    ] o.a.s.SolrTestCaseJ4 ###Ending testDelegationTokenRenewFail
   [junit4]   2> 1519534 INFO  (TEST-TestSolrCloudWithDelegationTokens.testDelegationTokenRenew-seed#[E7F611551FECF6A2]) [    ] o.a.s.SolrTestCaseJ4 ###Starting testDelegationTokenRenew
   [junit4]   2> 1519554 INFO  (qtp486005164-13907) [    ] o.a.s.h.a.CollectionsHandler Invoked Collection Action :list with params action=LIST&delegation=GgADYmFyA2JhcgCKAVjiPK2GigFZBkkxhgcEFE9Ap9ES-ptwa9MHBlzzJVJ0vw_qB3NvbHItZHQA&wt=javabin&version=2 and sendToOCPQueue=true
   [junit4]   2> 1519555 INFO  (qtp486005164-13907) [    ] o.a.s.s.HttpSolrCall [admin] webapp=null path=/admin/collections params={action=LIST&delegation=GgADYmFyA2JhcgCKAVjiPK2GigFZBkkxhgcEFE9Ap9ES-ptwa9MHBlzzJVJ0vw_qB3NvbHItZHQA&wt=javabin&version=2} status=0 QTime=0
   [junit4]   2> 1519559 WARN  (TEST-TestSolrCloudWithDelegationTokens.testDelegationTokenRenew-seed#[E7F611551FECF6A2]) [    ] o.a.h.c.p.ResponseProcessCookies Invalid cookie header: "Set-Cookie: hadoop.auth=; Path=/; Domain=127.0.0.1; Expires=kin, 01-Jan-1970 00:00:00 GMT; Secure; HttpOnly". Invalid 'expires' attribute: kin, 01-Jan-1970 00:00:00 GMT
   [junit4]   2> 1519562 INFO  (TEST-TestSolrCloudWithDelegationTokens.testDelegationTokenRenew-seed#[E7F611551FECF6A2]) [    ] o.a.s.c.c.ZkStateReader Updated live nodes from ZooKeeper... (0) -> (2)
   [junit4]   2> 1519563 INFO  (TEST-TestSolrCloudWithDelegationTokens.testDelegationTokenRenew-seed#[E7F611551FECF6A2]) [    ] o.a.s.c.s.i.ZkClientClusterStateProvider Cluster at 127.0.0.1:44220/solr ready
   [junit4]   2> 1519566 INFO  (qtp237865907-13925) [    ] o.a.s.h.a.CollectionsHandler Invoked Collection Action :list with params action=LIST&delegation=GgADYmFyA2JhcgCKAVjiPK2GigFZBkkxhgcEFE9Ap9ES-ptwa9MHBlzzJVJ0vw_qB3NvbHItZHQA&wt=javabin&version=2 and sendToOCPQueue=true
   [junit4]   2> 1519566 INFO  (qtp237865907-13925) [    ] o.a.s.s.HttpSolrCall [admin] webapp=null path=/admin/collections params={action=LIST&delegation=GgADYmFyA2JhcgCKAVjiPK2GigFZBkkxhgcEFE9Ap9ES-ptwa9MHBlzzJVJ0vw_qB3NvbHItZHQA&wt=javabin&version=2} status=0 QTime=0
   [junit4]   2> 1519570 INFO  (TEST-TestSolrCloudWithDelegationTokens.testDelegationTokenRenew-seed#[E7F611551FECF6A2]) [    ] o.a.s.c.c.ZkStateReader Updated live nodes from ZooKeeper... (0) -> (2)
   [junit4]   2> 1519570 INFO  (TEST-TestSolrCloudWithDelegationTokens.testDelegationTokenRenew-seed#[E7F611551FECF6A2]) [    ] o.a.s.c.s.i.ZkClientClusterStateProvider Cluster at 127.0.0.1:44220/solr ready
   [junit4]   2> 1519572 WARN  (TEST-TestSolrCloudWithDelegationTokens.testDelegationTokenRenew-seed#[E7F611551FECF6A2]) [    ] o.a.h.c.p.ResponseProcessCookies Invalid cookie header: "Set-Cookie: hadoop.auth=; Path=/; Domain=127.0.0.1; Expires=kin, 01-Jan-1970 00:00:00 GMT; Secure; HttpOnly". Invalid 'expires' attribute: kin, 01-Jan-1970 00:00:00 GMT
   [junit4]   2> 1519585 INFO  (qtp486005164-13913) [    ] o.a.s.h.a.CollectionsHandler Invoked Collection Action :list with params action=LIST&delegation=GgADYmFyA2JhcgCKAVjiPK2uigFZBkkxrggEFA4NxazFL-RftjZjPXvlSN00RdPYB3NvbHItZHQA&wt=javabin&version=2 and sendToOCPQueue=true
   [junit4]   2> 1519585 INFO  (qtp486005164-13913) [    ] o.a.s.s.HttpSolrCall [admin] webapp=null path=/admin/collections params={action=LIST&delegation=GgADYmFyA2JhcgCKAVjiPK2uigFZBkkxrggEFA4NxazFL-RftjZjPXvlSN00RdPYB3NvbHItZHQA&wt=javabin&version=2} status=0 QTime=0
   [junit4]   2> 1519589 INFO  (TEST-TestSolrCloudWithDelegationTokens.testDelegationTokenRenew-seed#[E7F611551FECF6A2]) [    ] o.a.s.c.c.ZkStateReader Updated live nodes from ZooKeeper... (0) -> (2)
   [junit4]   2> 1519590 INFO  (TEST-TestSolrCloudWithDelegationTokens.testDelegationTokenRenew-seed#[E7F611551FECF6A2]) [    ] o.a.s.c.s.i.ZkClientClusterStateProvider Cluster at 127.0.0.1:44220/solr ready
   [junit4]   2> 1519592 WARN  (TEST-TestSolrCloudWithDelegationTokens.testDelegationTokenRenew-seed#[E7F611551FECF6A2]) [    ] o.a.h.c.p.ResponseProcessCookies Invalid cookie header: "Set-Cookie: hadoop.auth=; Path=/; Domain=127.0.0.1; Expires=kin, 01-Jan-1970 00:00:00 GMT; Secure; HttpOnly". Invalid 'expires' attribute: kin, 01-Jan-1970 00:00:00 GMT
   [junit4]   2> 1519596 INFO  (TEST-TestSolrCloudWithDelegationTokens.testDelegationTokenRenew-seed#[E7F611551FECF6A2]) [    ] o.a.s.c.c.ZkStateReader Updated live nodes from ZooKeeper... (0) -> (2)
   [junit4]   2> 1519596 INFO  (TEST-TestSolrCloudWithDelegationTokens.testDelegationTokenRenew-seed#[E7F611551FECF6A2]) [    ] o.a.s.c.s.i.ZkClientClusterStateProvider Cluster at 127.0.0.1:44220/solr ready
   [junit4]   2> 1519598 INFO  (qtp237865907-13925) [    ] o.a.s.h.a.CollectionsHandler Invoked Collection Action :list with params action=LIST&delegation=GgADYmFyA2JhcgCKAVjiPK2uigFZBkkxrggEFA4NxazFL-RftjZjPXvlSN00RdPYB3NvbHItZHQA&wt=javabin&version=2 and sendToOCPQueue=true
   [junit4]   2> 1519598 INFO  (qtp237865907-13925) [    ] o.a.s.s.HttpSolrCall [admin] webapp=null path=/admin/collections params={action=LIST&delegation=GgADYmFyA2JhcgCKAVjiPK2uigFZBkkxrggEFA4NxazFL-RftjZjPXvlSN00RdPYB3NvbHItZHQA&wt=javabin&version=2} status=0 QTime=0
   [junit4]   2> 1519604 WARN  (TEST-TestSolrCloudWithDelegationTokens.testDelegationTokenRenew-seed#[E7F611551FECF6A2]) [    ] o.a.h.c.p.ResponseProcessCookies Invalid cookie header: "Set-Cookie: hadoop.auth=; Path=/; Domain=127.0.0.1; Expires=kin, 01-Jan-1970 00:00:00 GMT; Secure; HttpOnly". Invalid 'expires' attribute: kin, 01-Jan-1970 00:00:00 GMT
   [junit4]   2> 1519624 INFO  (qtp486005164-13913) [    ] o.a.s.h.a.CollectionsHandler Invoked Collection Action :list with params action=LIST&delegation=GgADYmFyA2JhcgCKAVjiPK3MigFZBkkxzAkEFMW9IZkugw540oOePN6b4lgfbp52B3NvbHItZHQA&wt=javabin&version=2 and sendToOCPQueue=true
   [junit4]   2> 1519626 INFO  (qtp486005164-13913) [    ] o.a.s.s.HttpSolrCall [admin] webapp=null path=/admin/collections params={action=LIST&delegation=GgADYmFyA2JhcgCKAVjiPK3MigFZBkkxzAkEFMW9IZkugw540oOePN6b4lgfbp52B3NvbHItZHQA&wt=javabin&version=2} status=0 QTime=0
   [junit4]   2> 1519629 INFO  (TEST-TestSolrCloudWithDelegationTokens.testDelegationTokenRenew-seed#[E7F611551FECF6A2]) [    ] o.a.s.c.c.ZkStateReader Updated live nodes from ZooKeeper... (0) -> (2)
   [junit4]   2> 1519629 INFO  (TEST-TestSolrCloudWithDelegationTokens.testDelegationTokenRenew-seed#[E7F611551FECF6A2]) [    ] o.a.s.c.s.i.ZkClientClusterStateProvider Cluster at 127.0.0.1:44220/solr ready
   [junit4]   2> 1519631 WARN  (TEST-TestSolrCloudWithDelegationTokens.testDelegationTokenRenew-seed#[E7F611551FECF6A2]) [    ] o.a.h.c.p.ResponseProcessCookies Invalid cookie header: "Set-Cookie: hadoop.auth=; Path=/; Domain=127.0.0.1; Expires=kin, 01-Jan-1970 00:00:00 GMT; Secure; HttpOnly". Invalid 'expires' attribute: kin, 01-Jan-1970 00:00:00 GMT
   [junit4]   2> 1519634 INFO  (TEST-TestSolrCloudWithDelegationTokens.testDelegationTokenRenew-seed#[E7F611551FECF6A2]) [    ] o.a.s.c.c.ZkStateReader Updated live nodes from ZooKeeper... (0) -> (2)
   [junit4]   2> 1519635 INFO  (TEST-TestSolrCloudWithDelegationTokens.testDelegationTokenRenew-seed#[E7F611551FECF6A2]) [    ] o.a.s.c.s.i.ZkClientClusterStateProvider Cluster at 127.0.0.1:44220/solr ready
   [junit4]   2> 1519636 INFO  (qtp237865907-13921) [    ] o.a.s.h.a.CollectionsHandler Invoked Collection Action :list with params action=LIST&delegation=GgADYmFyA2JhcgCKAVjiPK3MigFZBkkxzAkEFMW9IZkugw540oOePN6b4lgfbp52B3NvbHItZHQA&wt=javabin&version=2 and sendToOCPQueue=true
   [junit4]   2> 1519638 INFO  (qtp237865907-13921) [    ] o.a.s.s.HttpSolrCall [admin] webapp=null path=/admin/collections params={action=LIST&delegation=GgADYmFyA2JhcgCKAVjiPK3MigFZBkkxzAkEFMW9IZkugw540oOePN6b4lgfbp52B3NvbHItZHQA&wt=javabin&version=2} status=0 QTime=1
   [junit4]   2> 1519641 INFO  (TEST-TestSolrCloudWithDelegationTokens.testDelegationTokenRenew-seed#[E7F611551FECF6A2]) [    ] o.a.s.c.c.ZkStateReader Updated live nodes from ZooKeeper... (0) -> (2)
   [junit4]   2> 1519641 INFO  (TEST-TestSolrCloudWithDelegationTokens.testDelegationTokenRenew-seed#[E7F611551FECF6A2]) [    ] o.a.s.c.s.i.ZkClientClusterStateProvider Cluster at 127.0.0.1:44220/solr ready
   [junit4]   2> 1519643 WARN  (TEST-TestSolrCloudWithDelegationTokens.testDelegationTokenRenew-seed#[E7F611551FECF6A2]) [    ] o.a.h.c.p.ResponseProcessCookies Invalid cookie header: "Set-Cookie: hadoop.auth=; Path=/; Domain=127.0.0.1; Expires=kin, 01-Jan-1970 00:00:00 GMT; Secure; HttpOnly". Invalid 'expires' attribute: kin, 01-Jan-1970 00:00:00 GMT
   [junit4]   2> 1519652 INFO  (TEST-TestSolrCloudWithDelegationTokens.testDelegationTokenRenew-seed#[E7F611551FECF6A2]) [    ] o.a.s.c.c.ZkStateReader Updated live nodes from ZooKeeper... (0) -> (2)
   [junit4]   2> 1519653 INFO  (TEST-TestSolrCloudWithDelegationTokens.testDelegationTokenRenew-seed#[E7F611551FECF6A2]) [    ] o.a.s.c.s.i.ZkClientClusterStateProvider Cluster at 127.0.0.1:44220/solr ready
   [junit4]   2> 1519654 INFO  (qtp237865907-13918) [    ] o.a.s.h.a.CollectionsHandler Invoked Collection Action :list with params action=LIST&delegation=GgADYmFyA2JhcgCKAVjiPK30igFZBkkx9AoEFH0b536PiijffHPccpxP4udx9wFTB3NvbHItZHQA&wt=javabin&version=2 and sendToOCPQueue=true
   [junit4]   2> 1519654 INFO  (qtp237865907-13918) [    ] o.a.s.s.HttpSolrCall [admin] webapp=null path=/admin/collections params={action=LIST&delegation=GgADYmFyA2JhcgCKAVjiPK30igFZBkkx9AoEFH0b536PiijffHPccpxP4udx9wFTB3NvbHItZHQA&wt=javabin&version=2} status=0 QTime=0
   [junit4]   2> 1519657 INFO  (TEST-TestSolrCloudWithDelegationTokens.testDelegationTokenRenew-seed#[E7F611551FECF6A2]) [    ] o.a.s.c.c.ZkStateReader Updated live nodes from ZooKeeper... (0) -> (2)
   [junit4]   2> 1519657 INFO  (TEST-TestSolrCloudWithDelegationTokens.testDelegationTokenRenew-seed#[E7F611551FECF6A2]) [    ] o.a.s.c.s.i.ZkClientClusterStateProvider Cluster at 127.0.0.1:44220/solr ready
   [junit4]   2> 1519659 WARN  (TEST-TestSolrCloudWithDelegationTokens.testDelegationTokenRenew-seed#[E7F611551FECF6A2]) [    ] o.a.h.c.p.ResponseProcessCookies Invalid cookie header: "Set-Cookie: hadoop.auth=; Path=/; Domain=127.0.0.1; Expires=kin, 01-Jan-1970 00:00:00 GMT; Secure; HttpOnly". Invalid 'expires' attribute: kin, 01-Jan-1970 00:00:00 GMT
   [junit4]   2> 1519663 INFO  (qtp237865907-13921) [    ] o.a.s.h.a.CollectionsHandler Invoked Collection Action :list with params action=LIST&delegation=GgADYmFyA2JhcgCKAVjiPK30igFZBkkx9AoEFH0b536PiijffHPccpxP4udx9wFTB3NvbHItZHQA&wt=javabin&version=2 and sendToOCPQueue=true
   [junit4]   2> 1519663 INFO  (qtp237865907-13921) [    ] o.a.s.s.HttpSolrCall [admin] webapp=null path=/admin/collections params={action=LIST&delegation=GgADYmFyA2JhcgCKAVjiPK30igFZBkkx9AoEFH0b536PiijffHPccpxP4udx9wFTB3NvbHItZHQA&wt=javabin&version=2} status=0 QTime=0
   [junit4]   2> 1519667 WARN  (TEST-TestSolrCloudWithDelegationTokens.testDelegationTokenRenew-seed#[E7F611551FECF6A2]) [    ] o.a.h.c.p.ResponseProcessCookies Invalid cookie header: "Set-Cookie: hadoop.auth=; Path=/; Domain=127.0.0.1; Expires=kin, 01-Jan-1970 00:00:00 GMT; Secure; HttpOnly". Invalid 'expires' attribute: kin, 01-Jan-1970 00:00:00 GMT
   [junit4]   2> 1519667 INFO  (TEST-TestSolrCloudWithDelegationTokens.testDelegationTokenRenew-seed#[E7F611551FECF6A2]) [    ] o.a.s.SolrTestCaseJ4 ###Ending testDelegationTokenRenew
   [junit4]   2> 1519678 INFO  (TEST-TestSolrCloudWithDelegationTokens.testZNodePaths-seed#[E7F611551FECF6A2]) [    ] o.a.s.SolrTestCaseJ4 ###Starting testZNodePaths
   [junit4]   2> 1519681 INFO  (TEST-TestSolrCloudWithDelegationTokens.testZNodePaths-seed#[E7F611551FECF6A2]) [    ] o.a.s.SolrTestCaseJ4 ###Ending testZNodePaths
   [junit4]   2> 1519693 INFO  (TEST-TestSolrCloudWithDelegationTokens.testDelegationOtherOp-seed#[E7F611551FECF6A2]) [    ] o.a.s.SolrTestCaseJ4 ###Starting testDelegationOtherOp
   [junit4]   2> 1519696 INFO  (TEST-TestSolrCloudWithDelegationTokens.testDelegationOtherOp-seed#[E7F611551FECF6A2]) [    ] o.a.s.c.c.ZkStateReader Updated live nodes from ZooKeeper... (0) -> (2)
   [junit4]   2> 1519696 INFO  (TEST-TestSolrCloudWithDelegationTokens.testDelegationOtherOp-seed#[E7F611551FECF6A2]) [    ] o.a.s.c.s.i.ZkClientClusterStateProvider Cluster at 127.0.0.1:44220/solr ready
   [junit4]   2> 1519699 INFO  (qtp237865907-13919) [    ] o.a.s.h.a.CollectionsHandler Invoked Collection Action :list with params op=someSolrOperation&action=LIST&wt=javabin&version=2 and sendToOCPQueue=true
   [junit4]   2> 1519699 INFO  (qtp237865907-13919) [    ] o.a.s.s.HttpSolrCall [admin] webapp=null path=/admin/collections params={op=someSolrOperation&action=LIST&wt=javabin&version=2} status=0 QTime=0
   [junit4]   2> 1519700 WARN  (TEST-TestSolrCloudWithDelegationTokens.testDelegationOtherOp-seed#[E7F611551FECF6A2]) [    ] o.a.h.c.p.ResponseProcessCookies Invalid cookie header: "Set-Cookie: hadoop.auth="u=bar&p=bar&t=test&e=1481300377387&s=ksnhVbzvoQ+5vmi6Hzp467cXAkw="; Path=/; Domain=127.0.0.1; Expires=ses, 09-Diz-2016 16:19:37 GMT; Secure; HttpOnly". Invalid 'expires' attribute: ses, 09-Diz-2016 16:19:37 GMT
   [junit4]   2> 1519700 INFO  (TEST-TestSolrCloudWithDelegationTokens.testDelegationOtherOp-seed#[E7F611551FECF6A2]) [    ] o.a.s.SolrTestCaseJ4 ###Ending testDelegationOtherOp
   [junit4]   2> 1519711 INFO  (TEST-TestSolrCloudWithDelegationTokens.testDelegationTokenCancel-seed#[E7F611551FECF6A2]) [    ] o.a.s.SolrTestCaseJ4 ###Starting testDelegationTokenCancel
   [junit4]   2> 1519718 INFO  (TEST-TestSolrCloudWithDelegationTokens.testDelegationTokenCancel-seed#[E7F611551FECF6A2]) [    ] o.a.s.c.c.ZkStateReader Updated live nodes from ZooKeeper... (0) -> (2)
   [junit4]   2> 1519718 INFO  (TEST-TestSolrCloudWithDelegationTokens.testDelegationTokenCancel-seed#[E7F611551FECF6A2]) [    ] o.a.s.c.s.i.ZkClientClusterStateProvider Cluster at 127.0.0.1:44220/solr ready
   [junit4]   2> 1519720 ERROR (qtp237865907-13918) [    ] o.a.h.s.t.d.ZKDelegationTokenSecretManager No node in path [/ZKDTSMTokensRoot/DT_12]
   [junit4]   2> 1519731 WARN  (TEST-TestSolrCloudWithDelegationTokens.testDelegationTokenCancel-seed#[E7F611551FECF6A2]) [    ] o.a.h.c.p.ResponseProcessCookies Invalid cookie header: "Set-Cookie: hadoop.auth=; Path=/; Domain=127.0.0.1; Expires=kin, 01-Jan-1970 00:00:00 GMT; Secure; HttpOnly". Invalid 'expires' attribute: kin, 01-Jan-1970 00:00:00 GMT
   [junit4]   2> 1519735 WARN  (TEST-TestSolrCloudWithDelegationTokens.testDelegationTokenCancel-seed#[E7F611551FECF6A2]) [    ] o.a.h.c.p.ResponseProcessCookies Invalid cookie header: "Set-Cookie: hadoop.auth=; Path=/; Domain=127.0.0.1; Expires=kin, 01-Jan-1970 00:00:00 GMT; Secure; HttpOnly". Invalid 'expires' attribute: kin, 01-Jan-1970 00:00:00 GMT
   [junit4]   2> 1519742 INFO  (TEST-TestSolrCloudWithDelegationTokens.testDelegationTokenCancel-seed#[E7F611551FECF6A2]) [    ] o.a.s.c.c.ZkStateReader Updated live nodes from ZooKeeper... (0) -> (2)
   [junit4]   2> 1519742 INFO  (TEST-TestSolrCloudWithDelegationTokens.testDelegationTokenCancel-seed#[E7F611551FECF6A2]) [    ] o.a.s.c.s.i.ZkClientClusterStateProvider Cluster at 127.0.0.1:44220/solr ready
   [junit4]   2> 1519744 ERROR (qtp237865907-13924) [    ] o.a.h.s.t.d.ZKDelegationTokenSecretManager No node in path [/ZKDTSMTokensRoot/DT_13]
   [junit4]   2> 1519750 INFO  (TEST-TestSolrCloudWithDelegationTokens.testDelegationTokenCancel-seed#[E7F611551FECF6A2]) [    ] o.a.s.c.c.ZkStateReader Updated live nodes from ZooKeeper... (0) -> (2)
   [junit4]   2> 1519750 INFO  (TEST-TestSolrCloudWithDelegationTokens.testDelegationTokenCancel-seed#[E7F611551FECF6A2]) [    ] o.a.s.c.s.i.ZkClientClusterStateProvider Cluster at 127.0.0.1:44220/solr ready
   [junit4]   2> 1519752 WARN  (TEST-TestSolrCloudWithDelegationTokens.testDelegationTokenCancel-seed#[E7F611551FECF6A2]) [    ] o.a.h.c.p.ResponseProcessCookies Invalid cookie header: "Set-Cookie: hadoop.auth=; Path=/; Domain=127.0.0.1; Expires=kin, 01-Jan-1970 00:00:00 GMT; Secure; HttpOnly". Invalid 'expires' attribute: kin, 01-Jan-1970 00:00:00 GMT
   [junit4]   2> 1519756 WARN  (TEST-TestSolrCloudWithDelegationTokens.testDelegationTokenCancel-seed#[E7F611551FECF6A2]) [    ] o.a.h.c.p.ResponseProcessCookies Invalid cookie header: "Set-Cookie: hadoop.auth=; Path=/; Domain=127.0.0.1; Expires=kin, 01-Jan-1970 00:00:00 GMT; Secure; HttpOnly". Invalid 'expires' attribute: kin, 01-Jan-1970 00:00:00 GMT
   [junit4]   2> 1519756 INFO  (TEST-TestSolrCloudWithDelegationTokens.testDelegationTokenCancel-seed#[E7F611551FECF6A2]) [    ] o.a.s.SolrTestCaseJ4 ###Ending testDelegationTokenCancel
   [junit4]   2> 1519758 INFO  (jetty-launcher-2181-thread-1) [    ] o.e.j.s.AbstractConnector Stopped ServerConnector@552c641e{SSL,[ssl, http/1.1]}{127.0.0.1:0}
   [junit4]   2> 1519758 INFO  (jetty-launcher-2181-thread-2) [    ] o.e.j.s.AbstractConnector Stopped ServerConnector@4b009754{SSL,[ssl, http/1.1]}{127.0.0.1:0}
   [junit4]   2> 1519758 INFO  (jetty-launcher-2181-thread-1) [    ] o.a.s.c.CoreContainer Shutting down CoreContainer instance=770672174
   [junit4]   2> 1519758 INFO  (jetty-launcher-2181-thread-2) [    ] o.a.s.c.CoreContainer Shutting down CoreContainer instance=452044489
   [junit4]   2> 1519759 INFO  (jetty-launcher-2181-thread-2) [    ] o.a.s.c.Overseer Overseer (id=97076142181842948-127.0.0.1:33406_solr-n_0000000000) closing
   [junit4]   2> 1519759 INFO  (OverseerStateUpdate-97076142181842948-127.0.0.1:33406_solr-n_0000000000) [    ] o.a.s.c.Overseer Overseer Loop exiting : 127.0.0.1:33406_solr
   [junit4]   2> 1519760 WARN  (zkCallback-2193-thread-1) [    ] o.a.s.c.c.ZkStateReader ZooKeeper watch triggered, but Solr cannot talk to ZK: [KeeperErrorCode = Session expired for /live_nodes]
   [junit4]   2> 1519760 WARN  (NIOServerCxn.Factory:0.0.0.0/0.0.0.0:0) [    ] o.a.z.s.NIOServerCnxn caught end of stream exception
   [junit4]   2> EndOfStreamException: Unable to read additional data from client sessionid 0x158e23caaea0004, likely client has closed socket
   [junit4]   2> 	at org.apache.zookeeper.server.NIOServerCnxn.doIO(NIOServerCnxn.java:228)
   [junit4]   2> 	at org.apache.zookeeper.server.NIOServerCnxnFactory.run(NIOServerCnxnFactory.java:208)
   [junit4]   2> 	at java.lang.Thread.run(java.base@9-ea/Thread.java:843)
   [junit4]   2> 1519760 ERROR (Thread[Thread-3367,5,TGRP-TestSolrCloudWithDelegationTokens]) [    ] o.a.h.s.t.d.AbstractDelegationTokenSecretManager ExpiredTokenRemover received java.lang.InterruptedException: sleep interrupted
   [junit4]   2> 1519763 INFO  (jetty-launcher-2181-thread-1) [    ] o.e.j.s.h.ContextHandler Stopped o.e.j.s.ServletContextHandler@4eec320d{/solr,null,UNAVAILABLE}
   [junit4]   2> 1521260 WARN  (zkCallback-2188-thread-2) [    ] o.a.s.c.c.ZkStateReader ZooKeeper watch triggered, but Solr cannot talk to ZK: [KeeperErrorCode = Session expired for /live_nodes]
   [junit4]   2> 1521260 ERROR (Thread[Thread-3366,5,TGRP-TestSolrCloudWithDelegationTokens]) [    ] o.a.h.s.t.d.AbstractDelegationTokenSecretManager ExpiredTokenRemover received java.lang.InterruptedException: sleep interrupted
   [junit4]   2> 1521261 INFO  (jetty-launcher-2181-thread-2) [    ] o.e.j.s.h.ContextHandler Stopped o.e.j.s.ServletContextHandler@12a98668{/solr,null,UNAVAILABLE}
   [junit4]   2> 1521262 INFO  (SUITE-TestSolrCloudWithDelegationTokens-seed#[E7F611551FECF6A2]-worker) [    ] o.a.s.c.ZkTestServer connecting to 127.0.0.1:44220 44220
   [junit4]   2> 1521380 INFO  (Thread-3348) [    ] o.a.s.c.ZkTestServer connecting to 127.0.0.1:44220 44220
   [junit4]   2> 1521380 WARN  (Thread-3348) [    ] o.a.s.c.ZkTestServer Watch limit violations: 
   [junit4]   2> Maximum concurrent create/delete watches above limit:
   [junit4]   2> 
   [junit4]   2> 	18	/solr/aliases.json
   [junit4]   2> 	2	/solr/security.json
   [junit4]   2> 
   [junit4]   2> Maximum concurrent data watches above limit:
   [junit4]   2> 
   [junit4]   2> 	18	/solr/clusterprops.json
   [junit4]   2> 	18	/solr/clusterstate.json
   [junit4]   2> 	4	/solr/security/zkdtsm/ZKDTSMRoot/ZKDTSMKeyIdRoot
   [junit4]   2> 	2	/solr/security/zkdtsm/ZKDTSMRoot/ZKDTSMTokensRoot/DT_7
   [junit4]   2> 	2	/solr/security/zkdtsm/ZKDTSMRoot/ZKDTSMTokensRoot/DT_6
   [junit4]   2> 	2	/solr/security/zkdtsm/ZKDTSMRoot/ZKDTSMTokensRoot/DT_9
   [junit4]   2> 	2	/solr/security/zkdtsm/ZKDTSMRoot/ZKDTSMTokensRoot/DT_8
   [junit4]   2> 	2	/solr/security/zkdtsm/ZKDTSMRoot/ZKDTSMMasterKeyRoot/DK_1
   [junit4]   2> 	2	/solr/security/zkdtsm/ZKDTSMRoot/ZKDTSMTokensRoot/DT_1
   [junit4]   2> 	2	/solr/security/zkdtsm/ZKDTSMRoot/ZKDTSMMasterKeyRoot/DK_3
   [junit4]   2> 	2	/solr/security/zkdtsm/ZKDTSMRoot/ZKDTSMTokensRoot/DT_3
   [junit4]   2> 	2	/solr/security/zkdtsm/ZKDTSMRoot/ZKDTSMMasterKeyRoot/DK_2
   [junit4]   2> 	2	/solr/security/zkdtsm/ZKDTSMRoot/ZKDTSMTokensRoot/DT_2
   [junit4]   2> 	2	/solr/security/zkdtsm/ZKDTSMRoot/ZKDTSMTokensRoot/DT_5
   [junit4]   2> 	2	/solr/security/zkdtsm/ZKDTSMRoot/ZKDTSMMasterKeyRoot/DK_4
   [junit4]   2> 	2	/solr/security/zkdtsm/ZKDTSMRoot/ZKDTSMTokensRoot/DT_4
   [junit4]   2> 	2	/solr/security/zkdtsm/ZKDTSMRoot/ZKDTSMTokensRoot/DT_13
   [junit4]   2> 	2	/solr/security/zkdtsm/ZKDTSMRoot/ZKDTSMTokensRoot/DT_12
   [junit4]   2> 	2	/solr/security/zkdtsm/ZKDTSMRoot/ZKDTSMSeqNumRoot
   [junit4]   2> 	2	/solr/security/zkdtsm/ZKDTSMRoot/ZKDTSMTokensRoot/DT_11
   [junit4]   2> 	2	/solr/security/zkdtsm/ZKDTSMRoot/ZKDTSMTokensRoot/DT_10
   [junit4]   2> 
   [junit4]   2> Maximum concurrent children watches above limit:
   [junit4]   2> 
   [junit4]   2> 	18	/solr/live_nodes
   [junit4]   2> 	18	/solr/collections
   [junit4]   2> 	2	/solr/overseer/queue
   [junit4]   2> 	2	/solr/security/zkdtsm/ZKDTSMRoot/ZKDTSMMasterKeyRoot
   [junit4]   2> 	2	/solr/overseer/queue-work
   [junit4]   2> 	2	/solr/security/zkdtsm/ZKDTSMRoot/ZKDTSMTokensRoot
   [junit4]   2> 
   [junit4]   2> 1521381 INFO  (SUITE-TestSolrCloudWithDelegationTokens-seed#[E7F611551FECF6A2]-worker) [    ] o.a.s.SolrTestCaseJ4 ###deleteCore
   [junit4]   2> NOTE: leaving temporary files on disk at: /home/jenkins/workspace/Lucene-Solr-master-Linux/solr/build/solr-core/test/J1/temp/solr.cloud.TestSolrCloudWithDelegationTokens_E7F611551FECF6A2-001
   [junit4]   2> NOTE: test params are: codec=Lucene70, sim=RandomSimilarity(queryNorm=false): {}, locale=kea-CV, timezone=CST
   [junit4]   2> NOTE: Linux 4.4.0-47-generic amd64/Oracle Corporation 9-ea (64-bit)/cpus=12,threads=1,free=115102256,total=518979584
   [junit4]   2> NOTE: All tests run in this JVM: [IndexSchemaTest, TestCollationFieldDocValues, CdcrReplicationHandlerTest, TestFastLRUCache, TestFieldSortValues, SpatialFilterTest, UUIDUpdateProcessorFallbackTest, AliasIntegrationTest, TestJsonFacets, BlobRepositoryCloudTest, TestShardHandlerFactory, TestSlowCompositeReaderWrapper, QueryParsingTest, ZkCLITest, MultiThreadedOCPTest, TestCursorMarkWithoutUniqueKey, CollectionsAPIDistributedZkTest, TestQueryTypes, TestLockTree, OverseerStatusTest, ClusterStateUpdateTest, TestFieldCacheWithThreads, RecoveryAfterSoftCommitTest, TestXIncludeConfig, SortByFunctionTest, SSLMigrationTest, TestAuthenticationFramework, AlternateDirectoryTest, ReplicaListTransformerTest, HighlighterTest, DocumentBuilderTest, TestDeleteCollectionOnDownNodes, DOMUtilTest, HdfsDirectoryFactoryTest, DistanceFunctionTest, DeleteStatusTest, DistributedTermsComponentTest, TestStressVersions, TestPerFieldSimilarity, UtilsToolTest, ZkControllerTest, TimeZoneUtilsTest, CustomCollectionTest, ConfigSetsAPITest, TestCharFilters, CSVRequestHandlerTest, ConvertedLegacyTest, HdfsRecoverLeaseTest, CollectionsAPIAsyncDistributedZkTest, SimplePostToolTest, PeerSyncWithIndexFingerprintCachingTest, CursorMarkTest, SoftAutoCommitTest, TestManagedStopFilterFactory, CoreAdminRequestStatusTest, DirectSolrSpellCheckerTest, TestSolrXml, SmileWriterTest, TestQueryUtils, TestSubQueryTransformer, DistributedIntervalFacetingTest, TestTrie, RequestLoggingTest, ClassificationUpdateProcessorTest, TermsComponentTest, TestWordDelimiterFilterFactory, DistributedFacetPivotLargeTest, SOLR749Test, TestManagedResource, TestFieldCacheSort, BadComponentTest, WordBreakSolrSpellCheckerTest, TestExclusionRuleCollectionAccess, TestReloadDeadlock, TestHdfsBackupRestoreCore, DistributedDebugComponentTest, DistributedFacetPivotSmallTest, BlockJoinFacetRandomTest, TestSolrQueryParserDefaultOperatorResource, TestFieldCache, ChaosMonkeyNothingIsSafeTest, BaseCdcrDistributedZkTest, TestStressRecovery, SampleTest, TestSimpleTrackingShardHandler, TestFiltering, TestOverriddenPrefixQueryForCustomFieldType, SpellCheckComponentTest, BitVectorTest, TestClusterProperties, DocValuesNotIndexedTest, LeaderElectionContextKeyTest, TestBulkSchemaAPI, TestSortByMinMaxFunction, TestSha256AuthenticationProvider, TestXmlQParser, FileUtilsTest, TestJettySolrRunner, UpdateRequestProcessorFactoryTest, TestRestoreCore, TestDefaultSearchFieldResource, HdfsSyncSliceTest, DistributedQueryComponentOptimizationTest, CloudMLTQParserTest, ChaosMonkeySafeLeaderTest, SyncSliceTest, ShardRoutingTest, FullSolrCloudDistribCmdsTest, ShardRoutingCustomTest, TestDistributedGrouping, TestHashPartitioner, TestReload, HardAutoCommitTest, TestCoreContainer, StatsComponentTest, QueryElevationComponentTest, PeerSyncTest, TestLazyCores, CurrencyFieldXmlFileTest, TestCoreDiscovery, TestExtendedDismaxParser, SuggesterFSTTest, CoreAdminHandlerTest, SuggesterTSTTest, SuggesterWFSTTest, PolyFieldTest, SchemaVersionSpecificBehaviorTest, TestPseudoReturnFields, FieldMutatingUpdateProcessorTest, DirectUpdateHandlerOptimizeTest, DefaultValueUpdateProcessorTest, TestRemoteStreaming, DocValuesMultiTest, XsltUpdateRequestHandlerTest, IndexBasedSpellCheckerTest, StandardRequestHandlerTest, TestWriterPerf, FileBasedSpellCheckerTest, TermVectorComponentTest, TestSolrQueryParser, IndexSchemaRuntimeFieldTest, TestJmxIntegration, TestCSVResponseWriter, JsonLoaderTest, TestPartialUpdateDeduplication, TestPHPSerializedResponseWriter, HighlighterConfigTest, TestQuerySenderListener, UpdateParamsTest, TestSolrIndexConfig, TestQuerySenderNoQuery, CopyFieldTest, ResponseLogComponentTest, TestMergePolicyConfig, TestSolrDeletionPolicy2, MultiTermTest, TestBinaryField, TestSearchPerf, TestElisionMultitermQuery, OutputWriterTest, TestFuzzyAnalyzedSuggestions, ExternalFileFieldSortTest, TestPostingsSolrHighlighter, DirectSolrConnectionTest, NotRequiredUniqueKeyTest, SynonymTokenizerTest, TestDFRSimilarityFactory, TestJmxMonitoredMap, URLClassifyProcessorTest, DateMathParserTest, TestSuggestSpellingConverter, SpellingQueryConverterTest, ClusterStateTest, TestUtils, ZkNodePropsTest, UUIDFieldTest, TestCrossCoreJoin, TestDistributedMissingSort, CdcrReplicationDistributedZkTest, CdcrRequestHandlerTest, CdcrVersionReplicationTest, CleanupOldIndexTest, CollectionReloadTest, CollectionStateFormat2Test, ConnectionManagerTest, DeleteInactiveReplicaTest, DeleteNodeTest, DeleteShardTest, DistributedQueueTest, DistributedVersionInfoTest, LeaderFailureAfterFreshStartTest, OverseerCollectionConfigSetProcessorTest, OverseerTaskQueueTest, ReplaceNodeTest, SharedFSAutoReplicaFailoverTest, SimpleCollectionCreateDeleteTest, SolrCLIZkUtilsTest, SolrXmlInZkTest, TestCloudDeleteByQuery, TestCloudPivotFacet, TestCloudRecovery, TestHdfsCloudBackupRestore, TestLeaderElectionZkExpiry, TestMiniSolrCloudClusterSSL, TestRebalanceLeaders, TestReplicaProperties, TestSolrCloudWithDelegationTokens]
   [junit4] Completed [507/659 (1!)] on J1 in 2.53s, 8 tests, 1 failure <<< FAILURES!

[...truncated 51884 lines...]


Mime
View raw message