lucene-dev mailing list archives

Site index · List index
Message view « Date » · « Thread »
Top « Date » · « Thread »
From Policeman Jenkins Server <jenk...@thetaphi.de>
Subject [JENKINS-EA] Lucene-Solr-6.x-Linux (32bit/jdk-9-ea+148) - Build # 2379 - Failure!
Date Fri, 09 Dec 2016 15:47:28 GMT
Build: https://jenkins.thetaphi.de/job/Lucene-Solr-6.x-Linux/2379/
Java: 32bit/jdk-9-ea+148 -client -XX:+UseConcMarkSweepGC

959 tests failed.
FAILED:  junit.framework.TestSuite.org.apache.lucene.index.TestCodecs

Error Message:
Clean up static fields (in @AfterClass?) and null them, your test still has references to classes of which the sizes cannot be measured due to security restrictions or Java 9 module encapsulation:   - private static java.lang.String[] org.apache.lucene.index.TestCodecs.fieldNames

Stack Trace:
junit.framework.AssertionFailedError: Clean up static fields (in @AfterClass?) and null them, your test still has references to classes of which the sizes cannot be measured due to security restrictions or Java 9 module encapsulation:
  - private static java.lang.String[] org.apache.lucene.index.TestCodecs.fieldNames
	at __randomizedtesting.SeedInfo.seed([69F8ACEB4E10CEB5]:0)
	at com.carrotsearch.randomizedtesting.rules.StaticFieldsInvariantRule$1.afterAlways(StaticFieldsInvariantRule.java:146)
	at com.carrotsearch.randomizedtesting.rules.StatementAdapter.evaluate(StatementAdapter.java:43)
	at com.carrotsearch.randomizedtesting.rules.StatementAdapter.evaluate(StatementAdapter.java:36)
	at com.carrotsearch.randomizedtesting.rules.StatementAdapter.evaluate(StatementAdapter.java:36)
	at org.apache.lucene.util.TestRuleAssertionsRequired$1.evaluate(TestRuleAssertionsRequired.java:53)
	at org.apache.lucene.util.TestRuleMarkFailure$1.evaluate(TestRuleMarkFailure.java:47)
	at org.apache.lucene.util.TestRuleIgnoreAfterMaxFailures$1.evaluate(TestRuleIgnoreAfterMaxFailures.java:64)
	at org.apache.lucene.util.TestRuleIgnoreTestSuites$1.evaluate(TestRuleIgnoreTestSuites.java:54)
	at com.carrotsearch.randomizedtesting.rules.StatementAdapter.evaluate(StatementAdapter.java:36)
	at com.carrotsearch.randomizedtesting.ThreadLeakControl$StatementRunner.run(ThreadLeakControl.java:367)
	at java.base/java.lang.Thread.run(Thread.java:844)
Caused by: java.lang.IllegalStateException: Unable to access 'private final byte[] java.lang.String.value' to estimate memory usage
	at com.carrotsearch.randomizedtesting.rules.RamUsageEstimator.createCacheEntry(RamUsageEstimator.java:602)
	at com.carrotsearch.randomizedtesting.rules.RamUsageEstimator.measureSizeOf(RamUsageEstimator.java:545)
	at com.carrotsearch.randomizedtesting.rules.RamUsageEstimator.sizeOfAll(RamUsageEstimator.java:387)
	at com.carrotsearch.randomizedtesting.rules.StaticFieldsInvariantRule$1.afterAlways(StaticFieldsInvariantRule.java:129)
	... 10 more
Caused by: java.lang.reflect.InaccessibleObjectException: Unable to make field private final byte[] java.lang.String.value accessible: module java.base does not "opens java.lang" to unnamed module @101cbf3
	at java.base/jdk.internal.reflect.Reflection.throwInaccessibleObjectException(Reflection.java:427)
	at java.base/java.lang.reflect.AccessibleObject.checkCanSetAccessible(AccessibleObject.java:201)
	at java.base/java.lang.reflect.Field.checkCanSetAccessible(Field.java:171)
	at java.base/java.lang.reflect.Field.setAccessible(Field.java:165)
	at com.carrotsearch.randomizedtesting.rules.RamUsageEstimator$3.run(RamUsageEstimator.java:597)
	at com.carrotsearch.randomizedtesting.rules.RamUsageEstimator$3.run(RamUsageEstimator.java:594)
	at java.base/java.security.AccessController.doPrivileged(Native Method)
	at com.carrotsearch.randomizedtesting.rules.RamUsageEstimator.createCacheEntry(RamUsageEstimator.java:594)
	... 13 more


FAILED:  junit.framework.TestSuite.org.apache.lucene.index.TestIndexWriterExceptions

Error Message:
Clean up static fields (in @AfterClass?) and null them, your test still has references to classes of which the sizes cannot be measured due to security restrictions or Java 9 module encapsulation:   - private static java.lang.String org.apache.lucene.index.TestIndexWriterExceptions.CRASH_FAIL_MESSAGE

Stack Trace:
junit.framework.AssertionFailedError: Clean up static fields (in @AfterClass?) and null them, your test still has references to classes of which the sizes cannot be measured due to security restrictions or Java 9 module encapsulation:
  - private static java.lang.String org.apache.lucene.index.TestIndexWriterExceptions.CRASH_FAIL_MESSAGE
	at __randomizedtesting.SeedInfo.seed([69F8ACEB4E10CEB5]:0)
	at com.carrotsearch.randomizedtesting.rules.StaticFieldsInvariantRule$1.afterAlways(StaticFieldsInvariantRule.java:146)
	at com.carrotsearch.randomizedtesting.rules.StatementAdapter.evaluate(StatementAdapter.java:43)
	at com.carrotsearch.randomizedtesting.rules.StatementAdapter.evaluate(StatementAdapter.java:36)
	at com.carrotsearch.randomizedtesting.rules.StatementAdapter.evaluate(StatementAdapter.java:36)
	at org.apache.lucene.util.TestRuleAssertionsRequired$1.evaluate(TestRuleAssertionsRequired.java:53)
	at org.apache.lucene.util.TestRuleMarkFailure$1.evaluate(TestRuleMarkFailure.java:47)
	at org.apache.lucene.util.TestRuleIgnoreAfterMaxFailures$1.evaluate(TestRuleIgnoreAfterMaxFailures.java:64)
	at org.apache.lucene.util.TestRuleIgnoreTestSuites$1.evaluate(TestRuleIgnoreTestSuites.java:54)
	at com.carrotsearch.randomizedtesting.rules.StatementAdapter.evaluate(StatementAdapter.java:36)
	at com.carrotsearch.randomizedtesting.ThreadLeakControl$StatementRunner.run(ThreadLeakControl.java:367)
	at java.base/java.lang.Thread.run(Thread.java:844)
Caused by: java.lang.IllegalStateException: Unable to access 'private final byte[] java.lang.String.value' to estimate memory usage
	at com.carrotsearch.randomizedtesting.rules.RamUsageEstimator.createCacheEntry(RamUsageEstimator.java:602)
	at com.carrotsearch.randomizedtesting.rules.RamUsageEstimator.measureSizeOf(RamUsageEstimator.java:545)
	at com.carrotsearch.randomizedtesting.rules.RamUsageEstimator.sizeOfAll(RamUsageEstimator.java:387)
	at com.carrotsearch.randomizedtesting.rules.StaticFieldsInvariantRule$1.afterAlways(StaticFieldsInvariantRule.java:129)
	... 10 more
Caused by: java.lang.reflect.InaccessibleObjectException: Unable to make field private final byte[] java.lang.String.value accessible: module java.base does not "opens java.lang" to unnamed module @10b73cf
	at java.base/jdk.internal.reflect.Reflection.throwInaccessibleObjectException(Reflection.java:427)
	at java.base/java.lang.reflect.AccessibleObject.checkCanSetAccessible(AccessibleObject.java:201)
	at java.base/java.lang.reflect.Field.checkCanSetAccessible(Field.java:171)
	at java.base/java.lang.reflect.Field.setAccessible(Field.java:165)
	at com.carrotsearch.randomizedtesting.rules.RamUsageEstimator$3.run(RamUsageEstimator.java:597)
	at com.carrotsearch.randomizedtesting.rules.RamUsageEstimator$3.run(RamUsageEstimator.java:594)
	at java.base/java.security.AccessController.doPrivileged(Native Method)
	at com.carrotsearch.randomizedtesting.rules.RamUsageEstimator.createCacheEntry(RamUsageEstimator.java:594)
	... 13 more


FAILED:  junit.framework.TestSuite.org.apache.lucene.index.TestReadOnlyIndex

Error Message:
Could not initialize class org.apache.lucene.store.MMapDirectory

Stack Trace:
java.lang.NoClassDefFoundError: Could not initialize class org.apache.lucene.store.MMapDirectory
	at __randomizedtesting.SeedInfo.seed([69F8ACEB4E10CEB5]:0)
	at org.apache.lucene.index.IndexWriter.messageState(IndexWriter.java:1104)
	at org.apache.lucene.index.IndexWriter.<init>(IndexWriter.java:1019)
	at org.apache.lucene.index.RandomIndexWriter.mockIndexWriter(RandomIndexWriter.java:80)
	at org.apache.lucene.index.RandomIndexWriter.mockIndexWriter(RandomIndexWriter.java:56)
	at org.apache.lucene.index.RandomIndexWriter.<init>(RandomIndexWriter.java:113)
	at org.apache.lucene.index.RandomIndexWriter.<init>(RandomIndexWriter.java:107)
	at org.apache.lucene.index.RandomIndexWriter.<init>(RandomIndexWriter.java:102)
	at org.apache.lucene.index.TestReadOnlyIndex.buildIndex(TestReadOnlyIndex.java:54)
	at java.base/jdk.internal.reflect.NativeMethodAccessorImpl.invoke0(Native Method)
	at java.base/jdk.internal.reflect.NativeMethodAccessorImpl.invoke(NativeMethodAccessorImpl.java:62)
	at java.base/jdk.internal.reflect.DelegatingMethodAccessorImpl.invoke(DelegatingMethodAccessorImpl.java:43)
	at java.base/java.lang.reflect.Method.invoke(Method.java:538)
	at com.carrotsearch.randomizedtesting.RandomizedRunner.invoke(RandomizedRunner.java:1713)
	at com.carrotsearch.randomizedtesting.RandomizedRunner$6.evaluate(RandomizedRunner.java:847)
	at com.carrotsearch.randomizedtesting.RandomizedRunner$7.evaluate(RandomizedRunner.java:863)
	at org.apache.lucene.util.AbstractBeforeAfterRule$1.evaluate(AbstractBeforeAfterRule.java:45)
	at com.carrotsearch.randomizedtesting.rules.StatementAdapter.evaluate(StatementAdapter.java:36)
	at org.apache.lucene.util.TestRuleStoreClassName$1.evaluate(TestRuleStoreClassName.java:41)
	at com.carrotsearch.randomizedtesting.rules.NoShadowingOrOverridesOnMethodsRule$1.evaluate(NoShadowingOrOverridesOnMethodsRule.java:40)
	at com.carrotsearch.randomizedtesting.rules.NoShadowingOrOverridesOnMethodsRule$1.evaluate(NoShadowingOrOverridesOnMethodsRule.java:40)
	at com.carrotsearch.randomizedtesting.rules.StatementAdapter.evaluate(StatementAdapter.java:36)
	at com.carrotsearch.randomizedtesting.rules.StatementAdapter.evaluate(StatementAdapter.java:36)
	at com.carrotsearch.randomizedtesting.rules.StatementAdapter.evaluate(StatementAdapter.java:36)
	at org.apache.lucene.util.TestRuleAssertionsRequired$1.evaluate(TestRuleAssertionsRequired.java:53)
	at org.apache.lucene.util.TestRuleMarkFailure$1.evaluate(TestRuleMarkFailure.java:47)
	at org.apache.lucene.util.TestRuleIgnoreAfterMaxFailures$1.evaluate(TestRuleIgnoreAfterMaxFailures.java:64)
	at org.apache.lucene.util.TestRuleIgnoreTestSuites$1.evaluate(TestRuleIgnoreTestSuites.java:54)
	at com.carrotsearch.randomizedtesting.rules.StatementAdapter.evaluate(StatementAdapter.java:36)
	at com.carrotsearch.randomizedtesting.ThreadLeakControl$StatementRunner.run(ThreadLeakControl.java:367)
	at java.base/java.lang.Thread.run(Thread.java:844)


FAILED:  junit.framework.TestSuite.org.apache.lucene.index.TestStressIndexing2

Error Message:
Clean up static fields (in @AfterClass?) and null them, your test still has references to classes of which the sizes cannot be measured due to security restrictions or Java 9 module encapsulation:   - static org.apache.lucene.index.Term org.apache.lucene.index.TestStressIndexing2.idTerm

Stack Trace:
junit.framework.AssertionFailedError: Clean up static fields (in @AfterClass?) and null them, your test still has references to classes of which the sizes cannot be measured due to security restrictions or Java 9 module encapsulation:
  - static org.apache.lucene.index.Term org.apache.lucene.index.TestStressIndexing2.idTerm
	at __randomizedtesting.SeedInfo.seed([69F8ACEB4E10CEB5]:0)
	at com.carrotsearch.randomizedtesting.rules.StaticFieldsInvariantRule$1.afterAlways(StaticFieldsInvariantRule.java:146)
	at com.carrotsearch.randomizedtesting.rules.StatementAdapter.evaluate(StatementAdapter.java:43)
	at com.carrotsearch.randomizedtesting.rules.StatementAdapter.evaluate(StatementAdapter.java:36)
	at com.carrotsearch.randomizedtesting.rules.StatementAdapter.evaluate(StatementAdapter.java:36)
	at org.apache.lucene.util.TestRuleAssertionsRequired$1.evaluate(TestRuleAssertionsRequired.java:53)
	at org.apache.lucene.util.TestRuleMarkFailure$1.evaluate(TestRuleMarkFailure.java:47)
	at org.apache.lucene.util.TestRuleIgnoreAfterMaxFailures$1.evaluate(TestRuleIgnoreAfterMaxFailures.java:64)
	at org.apache.lucene.util.TestRuleIgnoreTestSuites$1.evaluate(TestRuleIgnoreTestSuites.java:54)
	at com.carrotsearch.randomizedtesting.rules.StatementAdapter.evaluate(StatementAdapter.java:36)
	at com.carrotsearch.randomizedtesting.ThreadLeakControl$StatementRunner.run(ThreadLeakControl.java:367)
	at java.base/java.lang.Thread.run(Thread.java:844)
Caused by: java.lang.IllegalStateException: Unable to access 'private final byte[] java.lang.String.value' to estimate memory usage
	at com.carrotsearch.randomizedtesting.rules.RamUsageEstimator.createCacheEntry(RamUsageEstimator.java:602)
	at com.carrotsearch.randomizedtesting.rules.RamUsageEstimator.measureSizeOf(RamUsageEstimator.java:545)
	at com.carrotsearch.randomizedtesting.rules.RamUsageEstimator.sizeOfAll(RamUsageEstimator.java:387)
	at com.carrotsearch.randomizedtesting.rules.StaticFieldsInvariantRule$1.afterAlways(StaticFieldsInvariantRule.java:129)
	... 10 more
Caused by: java.lang.reflect.InaccessibleObjectException: Unable to make field private final byte[] java.lang.String.value accessible: module java.base does not "opens java.lang" to unnamed module @10b73cf
	at java.base/jdk.internal.reflect.Reflection.throwInaccessibleObjectException(Reflection.java:427)
	at java.base/java.lang.reflect.AccessibleObject.checkCanSetAccessible(AccessibleObject.java:201)
	at java.base/java.lang.reflect.Field.checkCanSetAccessible(Field.java:171)
	at java.base/java.lang.reflect.Field.setAccessible(Field.java:165)
	at com.carrotsearch.randomizedtesting.rules.RamUsageEstimator$3.run(RamUsageEstimator.java:597)
	at com.carrotsearch.randomizedtesting.rules.RamUsageEstimator$3.run(RamUsageEstimator.java:594)
	at java.base/java.security.AccessController.doPrivileged(Native Method)
	at com.carrotsearch.randomizedtesting.rules.RamUsageEstimator.createCacheEntry(RamUsageEstimator.java:594)
	... 13 more


FAILED:  junit.framework.TestSuite.org.apache.lucene.index.TestTermVectors

Error Message:
Could not initialize class org.apache.lucene.store.MMapDirectory

Stack Trace:
java.lang.NoClassDefFoundError: Could not initialize class org.apache.lucene.store.MMapDirectory
	at __randomizedtesting.SeedInfo.seed([69F8ACEB4E10CEB5]:0)
	at org.apache.lucene.index.IndexWriter.messageState(IndexWriter.java:1104)
	at org.apache.lucene.index.IndexWriter.<init>(IndexWriter.java:1019)
	at org.apache.lucene.index.RandomIndexWriter.mockIndexWriter(RandomIndexWriter.java:80)
	at org.apache.lucene.index.RandomIndexWriter.mockIndexWriter(RandomIndexWriter.java:56)
	at org.apache.lucene.index.RandomIndexWriter.<init>(RandomIndexWriter.java:113)
	at org.apache.lucene.index.RandomIndexWriter.<init>(RandomIndexWriter.java:107)
	at org.apache.lucene.index.TestTermVectors.beforeClass(TestTermVectors.java:47)
	at java.base/jdk.internal.reflect.NativeMethodAccessorImpl.invoke0(Native Method)
	at java.base/jdk.internal.reflect.NativeMethodAccessorImpl.invoke(NativeMethodAccessorImpl.java:62)
	at java.base/jdk.internal.reflect.DelegatingMethodAccessorImpl.invoke(DelegatingMethodAccessorImpl.java:43)
	at java.base/java.lang.reflect.Method.invoke(Method.java:538)
	at com.carrotsearch.randomizedtesting.RandomizedRunner.invoke(RandomizedRunner.java:1713)
	at com.carrotsearch.randomizedtesting.RandomizedRunner$6.evaluate(RandomizedRunner.java:847)
	at com.carrotsearch.randomizedtesting.RandomizedRunner$7.evaluate(RandomizedRunner.java:863)
	at org.apache.lucene.util.AbstractBeforeAfterRule$1.evaluate(AbstractBeforeAfterRule.java:45)
	at com.carrotsearch.randomizedtesting.rules.StatementAdapter.evaluate(StatementAdapter.java:36)
	at org.apache.lucene.util.TestRuleStoreClassName$1.evaluate(TestRuleStoreClassName.java:41)
	at com.carrotsearch.randomizedtesting.rules.NoShadowingOrOverridesOnMethodsRule$1.evaluate(NoShadowingOrOverridesOnMethodsRule.java:40)
	at com.carrotsearch.randomizedtesting.rules.NoShadowingOrOverridesOnMethodsRule$1.evaluate(NoShadowingOrOverridesOnMethodsRule.java:40)
	at com.carrotsearch.randomizedtesting.rules.StatementAdapter.evaluate(StatementAdapter.java:36)
	at com.carrotsearch.randomizedtesting.rules.StatementAdapter.evaluate(StatementAdapter.java:36)
	at com.carrotsearch.randomizedtesting.rules.StatementAdapter.evaluate(StatementAdapter.java:36)
	at org.apache.lucene.util.TestRuleAssertionsRequired$1.evaluate(TestRuleAssertionsRequired.java:53)
	at org.apache.lucene.util.TestRuleMarkFailure$1.evaluate(TestRuleMarkFailure.java:47)
	at org.apache.lucene.util.TestRuleIgnoreAfterMaxFailures$1.evaluate(TestRuleIgnoreAfterMaxFailures.java:64)
	at org.apache.lucene.util.TestRuleIgnoreTestSuites$1.evaluate(TestRuleIgnoreTestSuites.java:54)
	at com.carrotsearch.randomizedtesting.rules.StatementAdapter.evaluate(StatementAdapter.java:36)
	at com.carrotsearch.randomizedtesting.ThreadLeakControl$StatementRunner.run(ThreadLeakControl.java:367)
	at java.base/java.lang.Thread.run(Thread.java:844)


FAILED:  junit.framework.TestSuite.org.apache.lucene.index.TestTermVectors

Error Message:


Stack Trace:
java.lang.NullPointerException
	at __randomizedtesting.SeedInfo.seed([69F8ACEB4E10CEB5]:0)
	at org.apache.lucene.index.TestTermVectors.afterClass(TestTermVectors.java:79)
	at java.base/jdk.internal.reflect.NativeMethodAccessorImpl.invoke0(Native Method)
	at java.base/jdk.internal.reflect.NativeMethodAccessorImpl.invoke(NativeMethodAccessorImpl.java:62)
	at java.base/jdk.internal.reflect.DelegatingMethodAccessorImpl.invoke(DelegatingMethodAccessorImpl.java:43)
	at java.base/java.lang.reflect.Method.invoke(Method.java:538)
	at com.carrotsearch.randomizedtesting.RandomizedRunner.invoke(RandomizedRunner.java:1713)
	at com.carrotsearch.randomizedtesting.RandomizedRunner$7.evaluate(RandomizedRunner.java:870)
	at org.apache.lucene.util.AbstractBeforeAfterRule$1.evaluate(AbstractBeforeAfterRule.java:45)
	at com.carrotsearch.randomizedtesting.rules.StatementAdapter.evaluate(StatementAdapter.java:36)
	at org.apache.lucene.util.TestRuleStoreClassName$1.evaluate(TestRuleStoreClassName.java:41)
	at com.carrotsearch.randomizedtesting.rules.NoShadowingOrOverridesOnMethodsRule$1.evaluate(NoShadowingOrOverridesOnMethodsRule.java:40)
	at com.carrotsearch.randomizedtesting.rules.NoShadowingOrOverridesOnMethodsRule$1.evaluate(NoShadowingOrOverridesOnMethodsRule.java:40)
	at com.carrotsearch.randomizedtesting.rules.StatementAdapter.evaluate(StatementAdapter.java:36)
	at com.carrotsearch.randomizedtesting.rules.StatementAdapter.evaluate(StatementAdapter.java:36)
	at com.carrotsearch.randomizedtesting.rules.StatementAdapter.evaluate(StatementAdapter.java:36)
	at org.apache.lucene.util.TestRuleAssertionsRequired$1.evaluate(TestRuleAssertionsRequired.java:53)
	at org.apache.lucene.util.TestRuleMarkFailure$1.evaluate(TestRuleMarkFailure.java:47)
	at org.apache.lucene.util.TestRuleIgnoreAfterMaxFailures$1.evaluate(TestRuleIgnoreAfterMaxFailures.java:64)
	at org.apache.lucene.util.TestRuleIgnoreTestSuites$1.evaluate(TestRuleIgnoreTestSuites.java:54)
	at com.carrotsearch.randomizedtesting.rules.StatementAdapter.evaluate(StatementAdapter.java:36)
	at com.carrotsearch.randomizedtesting.ThreadLeakControl$StatementRunner.run(ThreadLeakControl.java:367)
	at java.base/java.lang.Thread.run(Thread.java:844)


FAILED:  junit.framework.TestSuite.org.apache.lucene.index.TestTermVectors

Error Message:
Clean up static fields (in @AfterClass?) and null them, your test still has references to classes of which the sizes cannot be measured due to security restrictions or Java 9 module encapsulation:   - private static org.apache.lucene.store.Directory org.apache.lucene.index.TestTermVectors.directory

Stack Trace:
junit.framework.AssertionFailedError: Clean up static fields (in @AfterClass?) and null them, your test still has references to classes of which the sizes cannot be measured due to security restrictions or Java 9 module encapsulation:
  - private static org.apache.lucene.store.Directory org.apache.lucene.index.TestTermVectors.directory
	at com.carrotsearch.randomizedtesting.rules.StaticFieldsInvariantRule$1.afterAlways(StaticFieldsInvariantRule.java:146)
	at com.carrotsearch.randomizedtesting.rules.StatementAdapter.evaluate(StatementAdapter.java:43)
	at com.carrotsearch.randomizedtesting.rules.StatementAdapter.evaluate(StatementAdapter.java:36)
	at com.carrotsearch.randomizedtesting.rules.StatementAdapter.evaluate(StatementAdapter.java:36)
	at org.apache.lucene.util.TestRuleAssertionsRequired$1.evaluate(TestRuleAssertionsRequired.java:53)
	at org.apache.lucene.util.TestRuleMarkFailure$1.evaluate(TestRuleMarkFailure.java:47)
	at org.apache.lucene.util.TestRuleIgnoreAfterMaxFailures$1.evaluate(TestRuleIgnoreAfterMaxFailures.java:64)
	at org.apache.lucene.util.TestRuleIgnoreTestSuites$1.evaluate(TestRuleIgnoreTestSuites.java:54)
	at com.carrotsearch.randomizedtesting.rules.StatementAdapter.evaluate(StatementAdapter.java:36)
	at com.carrotsearch.randomizedtesting.ThreadLeakControl$StatementRunner.run(ThreadLeakControl.java:367)
	at java.base/java.lang.Thread.run(Thread.java:844)
Caused by: java.lang.IllegalStateException: Unable to access 'private transient java.util.HashMap java.util.HashSet.map' to estimate memory usage
	at com.carrotsearch.randomizedtesting.rules.RamUsageEstimator.createCacheEntry(RamUsageEstimator.java:602)
	at com.carrotsearch.randomizedtesting.rules.RamUsageEstimator.measureSizeOf(RamUsageEstimator.java:545)
	at com.carrotsearch.randomizedtesting.rules.RamUsageEstimator.sizeOfAll(RamUsageEstimator.java:387)
	at com.carrotsearch.randomizedtesting.rules.StaticFieldsInvariantRule$1.afterAlways(StaticFieldsInvariantRule.java:129)
	... 10 more
Caused by: java.lang.reflect.InaccessibleObjectException: Unable to make field private transient java.util.HashMap java.util.HashSet.map accessible: module java.base does not "opens java.util" to unnamed module @10b73cf
	at java.base/jdk.internal.reflect.Reflection.throwInaccessibleObjectException(Reflection.java:427)
	at java.base/java.lang.reflect.AccessibleObject.checkCanSetAccessible(AccessibleObject.java:201)
	at java.base/java.lang.reflect.Field.checkCanSetAccessible(Field.java:171)
	at java.base/java.lang.reflect.Field.setAccessible(Field.java:165)
	at com.carrotsearch.randomizedtesting.rules.RamUsageEstimator$3.run(RamUsageEstimator.java:597)
	at com.carrotsearch.randomizedtesting.rules.RamUsageEstimator$3.run(RamUsageEstimator.java:594)
	at java.base/java.security.AccessController.doPrivileged(Native Method)
	at com.carrotsearch.randomizedtesting.rules.RamUsageEstimator.createCacheEntry(RamUsageEstimator.java:594)
	... 13 more


FAILED:  junit.framework.TestSuite.org.apache.lucene.index.TestThreadedForceMerge

Error Message:
Clean up static fields (in @AfterClass?) and null them, your test still has references to classes of which the sizes cannot be measured due to security restrictions or Java 9 module encapsulation:   - private static org.apache.lucene.analysis.Analyzer org.apache.lucene.index.TestThreadedForceMerge.ANALYZER

Stack Trace:
junit.framework.AssertionFailedError: Clean up static fields (in @AfterClass?) and null them, your test still has references to classes of which the sizes cannot be measured due to security restrictions or Java 9 module encapsulation:
  - private static org.apache.lucene.analysis.Analyzer org.apache.lucene.index.TestThreadedForceMerge.ANALYZER
	at __randomizedtesting.SeedInfo.seed([69F8ACEB4E10CEB5]:0)
	at com.carrotsearch.randomizedtesting.rules.StaticFieldsInvariantRule$1.afterAlways(StaticFieldsInvariantRule.java:146)
	at com.carrotsearch.randomizedtesting.rules.StatementAdapter.evaluate(StatementAdapter.java:43)
	at com.carrotsearch.randomizedtesting.rules.StatementAdapter.evaluate(StatementAdapter.java:36)
	at com.carrotsearch.randomizedtesting.rules.StatementAdapter.evaluate(StatementAdapter.java:36)
	at org.apache.lucene.util.TestRuleAssertionsRequired$1.evaluate(TestRuleAssertionsRequired.java:53)
	at org.apache.lucene.util.TestRuleMarkFailure$1.evaluate(TestRuleMarkFailure.java:47)
	at org.apache.lucene.util.TestRuleIgnoreAfterMaxFailures$1.evaluate(TestRuleIgnoreAfterMaxFailures.java:64)
	at org.apache.lucene.util.TestRuleIgnoreTestSuites$1.evaluate(TestRuleIgnoreTestSuites.java:54)
	at com.carrotsearch.randomizedtesting.rules.StatementAdapter.evaluate(StatementAdapter.java:36)
	at com.carrotsearch.randomizedtesting.ThreadLeakControl$StatementRunner.run(ThreadLeakControl.java:367)
	at java.base/java.lang.Thread.run(Thread.java:844)
Caused by: java.lang.IllegalStateException: Unable to access 'transient java.util.HashMap$Node[] java.util.HashMap.table' to estimate memory usage
	at com.carrotsearch.randomizedtesting.rules.RamUsageEstimator.createCacheEntry(RamUsageEstimator.java:602)
	at com.carrotsearch.randomizedtesting.rules.RamUsageEstimator.measureSizeOf(RamUsageEstimator.java:545)
	at com.carrotsearch.randomizedtesting.rules.RamUsageEstimator.sizeOfAll(RamUsageEstimator.java:387)
	at com.carrotsearch.randomizedtesting.rules.StaticFieldsInvariantRule$1.afterAlways(StaticFieldsInvariantRule.java:129)
	... 10 more
Caused by: java.lang.reflect.InaccessibleObjectException: Unable to make field transient java.util.HashMap$Node[] java.util.HashMap.table accessible: module java.base does not "opens java.util" to unnamed module @10b73cf
	at java.base/jdk.internal.reflect.Reflection.throwInaccessibleObjectException(Reflection.java:427)
	at java.base/java.lang.reflect.AccessibleObject.checkCanSetAccessible(AccessibleObject.java:201)
	at java.base/java.lang.reflect.Field.checkCanSetAccessible(Field.java:171)
	at java.base/java.lang.reflect.Field.setAccessible(Field.java:165)
	at com.carrotsearch.randomizedtesting.rules.RamUsageEstimator$3.run(RamUsageEstimator.java:597)
	at com.carrotsearch.randomizedtesting.rules.RamUsageEstimator$3.run(RamUsageEstimator.java:594)
	at java.base/java.security.AccessController.doPrivileged(Native Method)
	at com.carrotsearch.randomizedtesting.rules.RamUsageEstimator.createCacheEntry(RamUsageEstimator.java:594)
	... 13 more


FAILED:  junit.framework.TestSuite.org.apache.lucene.search.TestApproximationSearchEquivalence

Error Message:
Could not initialize class org.apache.lucene.store.MMapDirectory

Stack Trace:
java.lang.NoClassDefFoundError: Could not initialize class org.apache.lucene.store.MMapDirectory
	at __randomizedtesting.SeedInfo.seed([69F8ACEB4E10CEB5]:0)
	at org.apache.lucene.index.IndexWriter.messageState(IndexWriter.java:1104)
	at org.apache.lucene.index.IndexWriter.<init>(IndexWriter.java:1019)
	at org.apache.lucene.index.RandomIndexWriter.mockIndexWriter(RandomIndexWriter.java:80)
	at org.apache.lucene.index.RandomIndexWriter.mockIndexWriter(RandomIndexWriter.java:56)
	at org.apache.lucene.index.RandomIndexWriter.<init>(RandomIndexWriter.java:113)
	at org.apache.lucene.index.RandomIndexWriter.<init>(RandomIndexWriter.java:107)
	at org.apache.lucene.index.RandomIndexWriter.<init>(RandomIndexWriter.java:102)
	at org.apache.lucene.search.SearchEquivalenceTestBase.beforeClass(SearchEquivalenceTestBase.java:64)
	at java.base/jdk.internal.reflect.NativeMethodAccessorImpl.invoke0(Native Method)
	at java.base/jdk.internal.reflect.NativeMethodAccessorImpl.invoke(NativeMethodAccessorImpl.java:62)
	at java.base/jdk.internal.reflect.DelegatingMethodAccessorImpl.invoke(DelegatingMethodAccessorImpl.java:43)
	at java.base/java.lang.reflect.Method.invoke(Method.java:538)
	at com.carrotsearch.randomizedtesting.RandomizedRunner.invoke(RandomizedRunner.java:1713)
	at com.carrotsearch.randomizedtesting.RandomizedRunner$6.evaluate(RandomizedRunner.java:847)
	at com.carrotsearch.randomizedtesting.RandomizedRunner$7.evaluate(RandomizedRunner.java:863)
	at org.apache.lucene.util.AbstractBeforeAfterRule$1.evaluate(AbstractBeforeAfterRule.java:45)
	at com.carrotsearch.randomizedtesting.rules.StatementAdapter.evaluate(StatementAdapter.java:36)
	at org.apache.lucene.util.TestRuleStoreClassName$1.evaluate(TestRuleStoreClassName.java:41)
	at com.carrotsearch.randomizedtesting.rules.NoShadowingOrOverridesOnMethodsRule$1.evaluate(NoShadowingOrOverridesOnMethodsRule.java:40)
	at com.carrotsearch.randomizedtesting.rules.NoShadowingOrOverridesOnMethodsRule$1.evaluate(NoShadowingOrOverridesOnMethodsRule.java:40)
	at com.carrotsearch.randomizedtesting.rules.StatementAdapter.evaluate(StatementAdapter.java:36)
	at com.carrotsearch.randomizedtesting.rules.StatementAdapter.evaluate(StatementAdapter.java:36)
	at com.carrotsearch.randomizedtesting.rules.StatementAdapter.evaluate(StatementAdapter.java:36)
	at org.apache.lucene.util.TestRuleAssertionsRequired$1.evaluate(TestRuleAssertionsRequired.java:53)
	at org.apache.lucene.util.TestRuleMarkFailure$1.evaluate(TestRuleMarkFailure.java:47)
	at org.apache.lucene.util.TestRuleIgnoreAfterMaxFailures$1.evaluate(TestRuleIgnoreAfterMaxFailures.java:64)
	at org.apache.lucene.util.TestRuleIgnoreTestSuites$1.evaluate(TestRuleIgnoreTestSuites.java:54)
	at com.carrotsearch.randomizedtesting.rules.StatementAdapter.evaluate(StatementAdapter.java:36)
	at com.carrotsearch.randomizedtesting.ThreadLeakControl$StatementRunner.run(ThreadLeakControl.java:367)
	at java.base/java.lang.Thread.run(Thread.java:844)


FAILED:  junit.framework.TestSuite.org.apache.lucene.search.TestApproximationSearchEquivalence

Error Message:


Stack Trace:
java.lang.NullPointerException
	at __randomizedtesting.SeedInfo.seed([69F8ACEB4E10CEB5]:0)
	at org.apache.lucene.search.SearchEquivalenceTestBase.afterClass(SearchEquivalenceTestBase.java:98)
	at java.base/jdk.internal.reflect.NativeMethodAccessorImpl.invoke0(Native Method)
	at java.base/jdk.internal.reflect.NativeMethodAccessorImpl.invoke(NativeMethodAccessorImpl.java:62)
	at java.base/jdk.internal.reflect.DelegatingMethodAccessorImpl.invoke(DelegatingMethodAccessorImpl.java:43)
	at java.base/java.lang.reflect.Method.invoke(Method.java:538)
	at com.carrotsearch.randomizedtesting.RandomizedRunner.invoke(RandomizedRunner.java:1713)
	at com.carrotsearch.randomizedtesting.RandomizedRunner$7.evaluate(RandomizedRunner.java:870)
	at org.apache.lucene.util.AbstractBeforeAfterRule$1.evaluate(AbstractBeforeAfterRule.java:45)
	at com.carrotsearch.randomizedtesting.rules.StatementAdapter.evaluate(StatementAdapter.java:36)
	at org.apache.lucene.util.TestRuleStoreClassName$1.evaluate(TestRuleStoreClassName.java:41)
	at com.carrotsearch.randomizedtesting.rules.NoShadowingOrOverridesOnMethodsRule$1.evaluate(NoShadowingOrOverridesOnMethodsRule.java:40)
	at com.carrotsearch.randomizedtesting.rules.NoShadowingOrOverridesOnMethodsRule$1.evaluate(NoShadowingOrOverridesOnMethodsRule.java:40)
	at com.carrotsearch.randomizedtesting.rules.StatementAdapter.evaluate(StatementAdapter.java:36)
	at com.carrotsearch.randomizedtesting.rules.StatementAdapter.evaluate(StatementAdapter.java:36)
	at com.carrotsearch.randomizedtesting.rules.StatementAdapter.evaluate(StatementAdapter.java:36)
	at org.apache.lucene.util.TestRuleAssertionsRequired$1.evaluate(TestRuleAssertionsRequired.java:53)
	at org.apache.lucene.util.TestRuleMarkFailure$1.evaluate(TestRuleMarkFailure.java:47)
	at org.apache.lucene.util.TestRuleIgnoreAfterMaxFailures$1.evaluate(TestRuleIgnoreAfterMaxFailures.java:64)
	at org.apache.lucene.util.TestRuleIgnoreTestSuites$1.evaluate(TestRuleIgnoreTestSuites.java:54)
	at com.carrotsearch.randomizedtesting.rules.StatementAdapter.evaluate(StatementAdapter.java:36)
	at com.carrotsearch.randomizedtesting.ThreadLeakControl$StatementRunner.run(ThreadLeakControl.java:367)
	at java.base/java.lang.Thread.run(Thread.java:844)


FAILED:  junit.framework.TestSuite.org.apache.lucene.search.TestApproximationSearchEquivalence

Error Message:
Clean up static fields (in @AfterClass?) and null them, your test still has references to classes of which the sizes cannot be measured due to security restrictions or Java 9 module encapsulation:   - protected static org.apache.lucene.store.Directory org.apache.lucene.search.SearchEquivalenceTestBase.directory   - protected static org.apache.lucene.analysis.Analyzer org.apache.lucene.search.SearchEquivalenceTestBase.analyzer   - protected static java.lang.String org.apache.lucene.search.SearchEquivalenceTestBase.stopword

Stack Trace:
junit.framework.AssertionFailedError: Clean up static fields (in @AfterClass?) and null them, your test still has references to classes of which the sizes cannot be measured due to security restrictions or Java 9 module encapsulation:
  - protected static org.apache.lucene.store.Directory org.apache.lucene.search.SearchEquivalenceTestBase.directory
  - protected static org.apache.lucene.analysis.Analyzer org.apache.lucene.search.SearchEquivalenceTestBase.analyzer
  - protected static java.lang.String org.apache.lucene.search.SearchEquivalenceTestBase.stopword
	at com.carrotsearch.randomizedtesting.rules.StaticFieldsInvariantRule$1.afterAlways(StaticFieldsInvariantRule.java:146)
	at com.carrotsearch.randomizedtesting.rules.StatementAdapter.evaluate(StatementAdapter.java:43)
	at com.carrotsearch.randomizedtesting.rules.StatementAdapter.evaluate(StatementAdapter.java:36)
	at com.carrotsearch.randomizedtesting.rules.StatementAdapter.evaluate(StatementAdapter.java:36)
	at org.apache.lucene.util.TestRuleAssertionsRequired$1.evaluate(TestRuleAssertionsRequired.java:53)
	at org.apache.lucene.util.TestRuleMarkFailure$1.evaluate(TestRuleMarkFailure.java:47)
	at org.apache.lucene.util.TestRuleIgnoreAfterMaxFailures$1.evaluate(TestRuleIgnoreAfterMaxFailures.java:64)
	at org.apache.lucene.util.TestRuleIgnoreTestSuites$1.evaluate(TestRuleIgnoreTestSuites.java:54)
	at com.carrotsearch.randomizedtesting.rules.StatementAdapter.evaluate(StatementAdapter.java:36)
	at com.carrotsearch.randomizedtesting.ThreadLeakControl$StatementRunner.run(ThreadLeakControl.java:367)
	at java.base/java.lang.Thread.run(Thread.java:844)
Caused by: java.lang.IllegalStateException: Unable to access 'private final byte[] java.lang.String.value' to estimate memory usage
	at com.carrotsearch.randomizedtesting.rules.RamUsageEstimator.createCacheEntry(RamUsageEstimator.java:602)
	at com.carrotsearch.randomizedtesting.rules.RamUsageEstimator.measureSizeOf(RamUsageEstimator.java:545)
	at com.carrotsearch.randomizedtesting.rules.RamUsageEstimator.sizeOfAll(RamUsageEstimator.java:387)
	at com.carrotsearch.randomizedtesting.rules.StaticFieldsInvariantRule$1.afterAlways(StaticFieldsInvariantRule.java:129)
	... 10 more
Caused by: java.lang.reflect.InaccessibleObjectException: Unable to make field private final byte[] java.lang.String.value accessible: module java.base does not "opens java.lang" to unnamed module @10b73cf
	at java.base/jdk.internal.reflect.Reflection.throwInaccessibleObjectException(Reflection.java:427)
	at java.base/java.lang.reflect.AccessibleObject.checkCanSetAccessible(AccessibleObject.java:201)
	at java.base/java.lang.reflect.Field.checkCanSetAccessible(Field.java:171)
	at java.base/java.lang.reflect.Field.setAccessible(Field.java:165)
	at com.carrotsearch.randomizedtesting.rules.RamUsageEstimator$3.run(RamUsageEstimator.java:597)
	at com.carrotsearch.randomizedtesting.rules.RamUsageEstimator$3.run(RamUsageEstimator.java:594)
	at java.base/java.security.AccessController.doPrivileged(Native Method)
	at com.carrotsearch.randomizedtesting.rules.RamUsageEstimator.createCacheEntry(RamUsageEstimator.java:594)
	... 13 more


FAILED:  junit.framework.TestSuite.org.apache.lucene.search.TestBoolean2

Error Message:
Clean up static fields (in @AfterClass?) and null them, your test still has references to classes of which the sizes cannot be measured due to security restrictions or Java 9 module encapsulation:   - private static java.lang.String[] org.apache.lucene.search.TestBoolean2.docFields

Stack Trace:
junit.framework.AssertionFailedError: Clean up static fields (in @AfterClass?) and null them, your test still has references to classes of which the sizes cannot be measured due to security restrictions or Java 9 module encapsulation:
  - private static java.lang.String[] org.apache.lucene.search.TestBoolean2.docFields
	at __randomizedtesting.SeedInfo.seed([69F8ACEB4E10CEB5]:0)
	at com.carrotsearch.randomizedtesting.rules.StaticFieldsInvariantRule$1.afterAlways(StaticFieldsInvariantRule.java:146)
	at com.carrotsearch.randomizedtesting.rules.StatementAdapter.evaluate(StatementAdapter.java:43)
	at com.carrotsearch.randomizedtesting.rules.StatementAdapter.evaluate(StatementAdapter.java:36)
	at com.carrotsearch.randomizedtesting.rules.StatementAdapter.evaluate(StatementAdapter.java:36)
	at org.apache.lucene.util.TestRuleAssertionsRequired$1.evaluate(TestRuleAssertionsRequired.java:53)
	at org.apache.lucene.util.TestRuleMarkFailure$1.evaluate(TestRuleMarkFailure.java:47)
	at org.apache.lucene.util.TestRuleIgnoreAfterMaxFailures$1.evaluate(TestRuleIgnoreAfterMaxFailures.java:64)
	at org.apache.lucene.util.TestRuleIgnoreTestSuites$1.evaluate(TestRuleIgnoreTestSuites.java:54)
	at com.carrotsearch.randomizedtesting.rules.StatementAdapter.evaluate(StatementAdapter.java:36)
	at com.carrotsearch.randomizedtesting.ThreadLeakControl$StatementRunner.run(ThreadLeakControl.java:367)
	at java.base/java.lang.Thread.run(Thread.java:844)
Caused by: java.lang.IllegalStateException: Unable to access 'private final byte[] java.lang.String.value' to estimate memory usage
	at com.carrotsearch.randomizedtesting.rules.RamUsageEstimator.createCacheEntry(RamUsageEstimator.java:602)
	at com.carrotsearch.randomizedtesting.rules.RamUsageEstimator.measureSizeOf(RamUsageEstimator.java:545)
	at com.carrotsearch.randomizedtesting.rules.RamUsageEstimator.sizeOfAll(RamUsageEstimator.java:387)
	at com.carrotsearch.randomizedtesting.rules.StaticFieldsInvariantRule$1.afterAlways(StaticFieldsInvariantRule.java:129)
	... 10 more
Caused by: java.lang.reflect.InaccessibleObjectException: Unable to make field private final byte[] java.lang.String.value accessible: module java.base does not "opens java.lang" to unnamed module @10b73cf
	at java.base/jdk.internal.reflect.Reflection.throwInaccessibleObjectException(Reflection.java:427)
	at java.base/java.lang.reflect.AccessibleObject.checkCanSetAccessible(AccessibleObject.java:201)
	at java.base/java.lang.reflect.Field.checkCanSetAccessible(Field.java:171)
	at java.base/java.lang.reflect.Field.setAccessible(Field.java:165)
	at com.carrotsearch.randomizedtesting.rules.RamUsageEstimator$3.run(RamUsageEstimator.java:597)
	at com.carrotsearch.randomizedtesting.rules.RamUsageEstimator$3.run(RamUsageEstimator.java:594)
	at java.base/java.security.AccessController.doPrivileged(Native Method)
	at com.carrotsearch.randomizedtesting.rules.RamUsageEstimator.createCacheEntry(RamUsageEstimator.java:594)
	... 13 more


FAILED:  junit.framework.TestSuite.org.apache.lucene.search.TestBooleanCoord

Error Message:
Could not initialize class org.apache.lucene.store.MMapDirectory

Stack Trace:
java.lang.NoClassDefFoundError: Could not initialize class org.apache.lucene.store.MMapDirectory
	at __randomizedtesting.SeedInfo.seed([69F8ACEB4E10CEB5]:0)
	at org.apache.lucene.index.IndexWriter.messageState(IndexWriter.java:1104)
	at org.apache.lucene.index.IndexWriter.<init>(IndexWriter.java:1019)
	at org.apache.lucene.search.TestBooleanCoord.beforeClass(TestBooleanCoord.java:50)
	at java.base/jdk.internal.reflect.NativeMethodAccessorImpl.invoke0(Native Method)
	at java.base/jdk.internal.reflect.NativeMethodAccessorImpl.invoke(NativeMethodAccessorImpl.java:62)
	at java.base/jdk.internal.reflect.DelegatingMethodAccessorImpl.invoke(DelegatingMethodAccessorImpl.java:43)
	at java.base/java.lang.reflect.Method.invoke(Method.java:538)
	at com.carrotsearch.randomizedtesting.RandomizedRunner.invoke(RandomizedRunner.java:1713)
	at com.carrotsearch.randomizedtesting.RandomizedRunner$6.evaluate(RandomizedRunner.java:847)
	at com.carrotsearch.randomizedtesting.RandomizedRunner$7.evaluate(RandomizedRunner.java:863)
	at org.apache.lucene.util.AbstractBeforeAfterRule$1.evaluate(AbstractBeforeAfterRule.java:45)
	at com.carrotsearch.randomizedtesting.rules.StatementAdapter.evaluate(StatementAdapter.java:36)
	at org.apache.lucene.util.TestRuleStoreClassName$1.evaluate(TestRuleStoreClassName.java:41)
	at com.carrotsearch.randomizedtesting.rules.NoShadowingOrOverridesOnMethodsRule$1.evaluate(NoShadowingOrOverridesOnMethodsRule.java:40)
	at com.carrotsearch.randomizedtesting.rules.NoShadowingOrOverridesOnMethodsRule$1.evaluate(NoShadowingOrOverridesOnMethodsRule.java:40)
	at com.carrotsearch.randomizedtesting.rules.StatementAdapter.evaluate(StatementAdapter.java:36)
	at com.carrotsearch.randomizedtesting.rules.StatementAdapter.evaluate(StatementAdapter.java:36)
	at com.carrotsearch.randomizedtesting.rules.StatementAdapter.evaluate(StatementAdapter.java:36)
	at org.apache.lucene.util.TestRuleAssertionsRequired$1.evaluate(TestRuleAssertionsRequired.java:53)
	at org.apache.lucene.util.TestRuleMarkFailure$1.evaluate(TestRuleMarkFailure.java:47)
	at org.apache.lucene.util.TestRuleIgnoreAfterMaxFailures$1.evaluate(TestRuleIgnoreAfterMaxFailures.java:64)
	at org.apache.lucene.util.TestRuleIgnoreTestSuites$1.evaluate(TestRuleIgnoreTestSuites.java:54)
	at com.carrotsearch.randomizedtesting.rules.StatementAdapter.evaluate(StatementAdapter.java:36)
	at com.carrotsearch.randomizedtesting.ThreadLeakControl$StatementRunner.run(ThreadLeakControl.java:367)
	at java.base/java.lang.Thread.run(Thread.java:844)


FAILED:  junit.framework.TestSuite.org.apache.lucene.search.TestBooleanCoord

Error Message:


Stack Trace:
java.lang.NullPointerException
	at __randomizedtesting.SeedInfo.seed([69F8ACEB4E10CEB5]:0)
	at org.apache.lucene.search.TestBooleanCoord.afterClass(TestBooleanCoord.java:123)
	at java.base/jdk.internal.reflect.NativeMethodAccessorImpl.invoke0(Native Method)
	at java.base/jdk.internal.reflect.NativeMethodAccessorImpl.invoke(NativeMethodAccessorImpl.java:62)
	at java.base/jdk.internal.reflect.DelegatingMethodAccessorImpl.invoke(DelegatingMethodAccessorImpl.java:43)
	at java.base/java.lang.reflect.Method.invoke(Method.java:538)
	at com.carrotsearch.randomizedtesting.RandomizedRunner.invoke(RandomizedRunner.java:1713)
	at com.carrotsearch.randomizedtesting.RandomizedRunner$7.evaluate(RandomizedRunner.java:870)
	at org.apache.lucene.util.AbstractBeforeAfterRule$1.evaluate(AbstractBeforeAfterRule.java:45)
	at com.carrotsearch.randomizedtesting.rules.StatementAdapter.evaluate(StatementAdapter.java:36)
	at org.apache.lucene.util.TestRuleStoreClassName$1.evaluate(TestRuleStoreClassName.java:41)
	at com.carrotsearch.randomizedtesting.rules.NoShadowingOrOverridesOnMethodsRule$1.evaluate(NoShadowingOrOverridesOnMethodsRule.java:40)
	at com.carrotsearch.randomizedtesting.rules.NoShadowingOrOverridesOnMethodsRule$1.evaluate(NoShadowingOrOverridesOnMethodsRule.java:40)
	at com.carrotsearch.randomizedtesting.rules.StatementAdapter.evaluate(StatementAdapter.java:36)
	at com.carrotsearch.randomizedtesting.rules.StatementAdapter.evaluate(StatementAdapter.java:36)
	at com.carrotsearch.randomizedtesting.rules.StatementAdapter.evaluate(StatementAdapter.java:36)
	at org.apache.lucene.util.TestRuleAssertionsRequired$1.evaluate(TestRuleAssertionsRequired.java:53)
	at org.apache.lucene.util.TestRuleMarkFailure$1.evaluate(TestRuleMarkFailure.java:47)
	at org.apache.lucene.util.TestRuleIgnoreAfterMaxFailures$1.evaluate(TestRuleIgnoreAfterMaxFailures.java:64)
	at org.apache.lucene.util.TestRuleIgnoreTestSuites$1.evaluate(TestRuleIgnoreTestSuites.java:54)
	at com.carrotsearch.randomizedtesting.rules.StatementAdapter.evaluate(StatementAdapter.java:36)
	at com.carrotsearch.randomizedtesting.ThreadLeakControl$StatementRunner.run(ThreadLeakControl.java:367)
	at java.base/java.lang.Thread.run(Thread.java:844)


FAILED:  junit.framework.TestSuite.org.apache.lucene.search.TestBooleanCoord

Error Message:
Clean up static fields (in @AfterClass?) and null them, your test still has references to classes of which the sizes cannot be measured due to security restrictions or Java 9 module encapsulation:   - static org.apache.lucene.store.Directory org.apache.lucene.search.TestBooleanCoord.dir

Stack Trace:
junit.framework.AssertionFailedError: Clean up static fields (in @AfterClass?) and null them, your test still has references to classes of which the sizes cannot be measured due to security restrictions or Java 9 module encapsulation:
  - static org.apache.lucene.store.Directory org.apache.lucene.search.TestBooleanCoord.dir
	at com.carrotsearch.randomizedtesting.rules.StaticFieldsInvariantRule$1.afterAlways(StaticFieldsInvariantRule.java:146)
	at com.carrotsearch.randomizedtesting.rules.StatementAdapter.evaluate(StatementAdapter.java:43)
	at com.carrotsearch.randomizedtesting.rules.StatementAdapter.evaluate(StatementAdapter.java:36)
	at com.carrotsearch.randomizedtesting.rules.StatementAdapter.evaluate(StatementAdapter.java:36)
	at org.apache.lucene.util.TestRuleAssertionsRequired$1.evaluate(TestRuleAssertionsRequired.java:53)
	at org.apache.lucene.util.TestRuleMarkFailure$1.evaluate(TestRuleMarkFailure.java:47)
	at org.apache.lucene.util.TestRuleIgnoreAfterMaxFailures$1.evaluate(TestRuleIgnoreAfterMaxFailures.java:64)
	at org.apache.lucene.util.TestRuleIgnoreTestSuites$1.evaluate(TestRuleIgnoreTestSuites.java:54)
	at com.carrotsearch.randomizedtesting.rules.StatementAdapter.evaluate(StatementAdapter.java:36)
	at com.carrotsearch.randomizedtesting.ThreadLeakControl$StatementRunner.run(ThreadLeakControl.java:367)
	at java.base/java.lang.Thread.run(Thread.java:844)
Caused by: java.lang.IllegalStateException: Unable to access 'private transient java.util.HashMap java.util.HashSet.map' to estimate memory usage
	at com.carrotsearch.randomizedtesting.rules.RamUsageEstimator.createCacheEntry(RamUsageEstimator.java:602)
	at com.carrotsearch.randomizedtesting.rules.RamUsageEstimator.measureSizeOf(RamUsageEstimator.java:545)
	at com.carrotsearch.randomizedtesting.rules.RamUsageEstimator.sizeOfAll(RamUsageEstimator.java:387)
	at com.carrotsearch.randomizedtesting.rules.StaticFieldsInvariantRule$1.afterAlways(StaticFieldsInvariantRule.java:129)
	... 10 more
Caused by: java.lang.reflect.InaccessibleObjectException: Unable to make field private transient java.util.HashMap java.util.HashSet.map accessible: module java.base does not "opens java.util" to unnamed module @101cbf3
	at java.base/jdk.internal.reflect.Reflection.throwInaccessibleObjectException(Reflection.java:427)
	at java.base/java.lang.reflect.AccessibleObject.checkCanSetAccessible(AccessibleObject.java:201)
	at java.base/java.lang.reflect.Field.checkCanSetAccessible(Field.java:171)
	at java.base/java.lang.reflect.Field.setAccessible(Field.java:165)
	at com.carrotsearch.randomizedtesting.rules.RamUsageEstimator$3.run(RamUsageEstimator.java:597)
	at com.carrotsearch.randomizedtesting.rules.RamUsageEstimator$3.run(RamUsageEstimator.java:594)
	at java.base/java.security.AccessController.doPrivileged(Native Method)
	at com.carrotsearch.randomizedtesting.rules.RamUsageEstimator.createCacheEntry(RamUsageEstimator.java:594)
	... 13 more


FAILED:  junit.framework.TestSuite.org.apache.lucene.search.TestBooleanOr

Error Message:
Clean up static fields (in @AfterClass?) and null them, your test still has references to classes of which the sizes cannot be measured due to security restrictions or Java 9 module encapsulation:   - private static java.lang.String org.apache.lucene.search.TestBooleanOr.FIELD_T   - private static java.lang.String org.apache.lucene.search.TestBooleanOr.FIELD_C

Stack Trace:
junit.framework.AssertionFailedError: Clean up static fields (in @AfterClass?) and null them, your test still has references to classes of which the sizes cannot be measured due to security restrictions or Java 9 module encapsulation:
  - private static java.lang.String org.apache.lucene.search.TestBooleanOr.FIELD_T
  - private static java.lang.String org.apache.lucene.search.TestBooleanOr.FIELD_C
	at __randomizedtesting.SeedInfo.seed([69F8ACEB4E10CEB5]:0)
	at com.carrotsearch.randomizedtesting.rules.StaticFieldsInvariantRule$1.afterAlways(StaticFieldsInvariantRule.java:146)
	at com.carrotsearch.randomizedtesting.rules.StatementAdapter.evaluate(StatementAdapter.java:43)
	at com.carrotsearch.randomizedtesting.rules.StatementAdapter.evaluate(StatementAdapter.java:36)
	at com.carrotsearch.randomizedtesting.rules.StatementAdapter.evaluate(StatementAdapter.java:36)
	at org.apache.lucene.util.TestRuleAssertionsRequired$1.evaluate(TestRuleAssertionsRequired.java:53)
	at org.apache.lucene.util.TestRuleMarkFailure$1.evaluate(TestRuleMarkFailure.java:47)
	at org.apache.lucene.util.TestRuleIgnoreAfterMaxFailures$1.evaluate(TestRuleIgnoreAfterMaxFailures.java:64)
	at org.apache.lucene.util.TestRuleIgnoreTestSuites$1.evaluate(TestRuleIgnoreTestSuites.java:54)
	at com.carrotsearch.randomizedtesting.rules.StatementAdapter.evaluate(StatementAdapter.java:36)
	at com.carrotsearch.randomizedtesting.ThreadLeakControl$StatementRunner.run(ThreadLeakControl.java:367)
	at java.base/java.lang.Thread.run(Thread.java:844)
Caused by: java.lang.IllegalStateException: Unable to access 'private final byte[] java.lang.String.value' to estimate memory usage
	at com.carrotsearch.randomizedtesting.rules.RamUsageEstimator.createCacheEntry(RamUsageEstimator.java:602)
	at com.carrotsearch.randomizedtesting.rules.RamUsageEstimator.measureSizeOf(RamUsageEstimator.java:545)
	at com.carrotsearch.randomizedtesting.rules.RamUsageEstimator.sizeOfAll(RamUsageEstimator.java:387)
	at com.carrotsearch.randomizedtesting.rules.StaticFieldsInvariantRule$1.afterAlways(StaticFieldsInvariantRule.java:129)
	... 10 more
Caused by: java.lang.reflect.InaccessibleObjectException: Unable to make field private final byte[] java.lang.String.value accessible: module java.base does not "opens java.lang" to unnamed module @1b5eba2
	at java.base/jdk.internal.reflect.Reflection.throwInaccessibleObjectException(Reflection.java:427)
	at java.base/java.lang.reflect.AccessibleObject.checkCanSetAccessible(AccessibleObject.java:201)
	at java.base/java.lang.reflect.Field.checkCanSetAccessible(Field.java:171)
	at java.base/java.lang.reflect.Field.setAccessible(Field.java:165)
	at com.carrotsearch.randomizedtesting.rules.RamUsageEstimator$3.run(RamUsageEstimator.java:597)
	at com.carrotsearch.randomizedtesting.rules.RamUsageEstimator$3.run(RamUsageEstimator.java:594)
	at java.base/java.security.AccessController.doPrivileged(Native Method)
	at com.carrotsearch.randomizedtesting.rules.RamUsageEstimator.createCacheEntry(RamUsageEstimator.java:594)
	... 13 more


FAILED:  junit.framework.TestSuite.org.apache.lucene.search.TestComplexExplanations

Error Message:
Could not initialize class org.apache.lucene.store.MMapDirectory

Stack Trace:
java.lang.NoClassDefFoundError: Could not initialize class org.apache.lucene.store.MMapDirectory
	at __randomizedtesting.SeedInfo.seed([69F8ACEB4E10CEB5]:0)
	at org.apache.lucene.index.IndexWriter.messageState(IndexWriter.java:1104)
	at org.apache.lucene.index.IndexWriter.<init>(IndexWriter.java:1019)
	at org.apache.lucene.index.RandomIndexWriter.mockIndexWriter(RandomIndexWriter.java:80)
	at org.apache.lucene.index.RandomIndexWriter.mockIndexWriter(RandomIndexWriter.java:56)
	at org.apache.lucene.index.RandomIndexWriter.<init>(RandomIndexWriter.java:113)
	at org.apache.lucene.index.RandomIndexWriter.<init>(RandomIndexWriter.java:107)
	at org.apache.lucene.search.BaseExplanationTestCase.beforeClassTestExplanations(BaseExplanationTestCase.java:74)
	at java.base/jdk.internal.reflect.NativeMethodAccessorImpl.invoke0(Native Method)
	at java.base/jdk.internal.reflect.NativeMethodAccessorImpl.invoke(NativeMethodAccessorImpl.java:62)
	at java.base/jdk.internal.reflect.DelegatingMethodAccessorImpl.invoke(DelegatingMethodAccessorImpl.java:43)
	at java.base/java.lang.reflect.Method.invoke(Method.java:538)
	at com.carrotsearch.randomizedtesting.RandomizedRunner.invoke(RandomizedRunner.java:1713)
	at com.carrotsearch.randomizedtesting.RandomizedRunner$6.evaluate(RandomizedRunner.java:847)
	at com.carrotsearch.randomizedtesting.RandomizedRunner$7.evaluate(RandomizedRunner.java:863)
	at org.apache.lucene.util.AbstractBeforeAfterRule$1.evaluate(AbstractBeforeAfterRule.java:45)
	at com.carrotsearch.randomizedtesting.rules.StatementAdapter.evaluate(StatementAdapter.java:36)
	at org.apache.lucene.util.TestRuleStoreClassName$1.evaluate(TestRuleStoreClassName.java:41)
	at com.carrotsearch.randomizedtesting.rules.NoShadowingOrOverridesOnMethodsRule$1.evaluate(NoShadowingOrOverridesOnMethodsRule.java:40)
	at com.carrotsearch.randomizedtesting.rules.NoShadowingOrOverridesOnMethodsRule$1.evaluate(NoShadowingOrOverridesOnMethodsRule.java:40)
	at com.carrotsearch.randomizedtesting.rules.StatementAdapter.evaluate(StatementAdapter.java:36)
	at com.carrotsearch.randomizedtesting.rules.StatementAdapter.evaluate(StatementAdapter.java:36)
	at com.carrotsearch.randomizedtesting.rules.StatementAdapter.evaluate(StatementAdapter.java:36)
	at org.apache.lucene.util.TestRuleAssertionsRequired$1.evaluate(TestRuleAssertionsRequired.java:53)
	at org.apache.lucene.util.TestRuleMarkFailure$1.evaluate(TestRuleMarkFailure.java:47)
	at org.apache.lucene.util.TestRuleIgnoreAfterMaxFailures$1.evaluate(TestRuleIgnoreAfterMaxFailures.java:64)
	at org.apache.lucene.util.TestRuleIgnoreTestSuites$1.evaluate(TestRuleIgnoreTestSuites.java:54)
	at com.carrotsearch.randomizedtesting.rules.StatementAdapter.evaluate(StatementAdapter.java:36)
	at com.carrotsearch.randomizedtesting.ThreadLeakControl$StatementRunner.run(ThreadLeakControl.java:367)
	at java.base/java.lang.Thread.run(Thread.java:844)


FAILED:  junit.framework.TestSuite.org.apache.lucene.search.TestComplexExplanations

Error Message:


Stack Trace:
java.lang.NullPointerException
	at __randomizedtesting.SeedInfo.seed([69F8ACEB4E10CEB5]:0)
	at org.apache.lucene.search.BaseExplanationTestCase.afterClassTestExplanations(BaseExplanationTestCase.java:62)
	at java.base/jdk.internal.reflect.NativeMethodAccessorImpl.invoke0(Native Method)
	at java.base/jdk.internal.reflect.NativeMethodAccessorImpl.invoke(NativeMethodAccessorImpl.java:62)
	at java.base/jdk.internal.reflect.DelegatingMethodAccessorImpl.invoke(DelegatingMethodAccessorImpl.java:43)
	at java.base/java.lang.reflect.Method.invoke(Method.java:538)
	at com.carrotsearch.randomizedtesting.RandomizedRunner.invoke(RandomizedRunner.java:1713)
	at com.carrotsearch.randomizedtesting.RandomizedRunner$7.evaluate(RandomizedRunner.java:870)
	at org.apache.lucene.util.AbstractBeforeAfterRule$1.evaluate(AbstractBeforeAfterRule.java:45)
	at com.carrotsearch.randomizedtesting.rules.StatementAdapter.evaluate(StatementAdapter.java:36)
	at org.apache.lucene.util.TestRuleStoreClassName$1.evaluate(TestRuleStoreClassName.java:41)
	at com.carrotsearch.randomizedtesting.rules.NoShadowingOrOverridesOnMethodsRule$1.evaluate(NoShadowingOrOverridesOnMethodsRule.java:40)
	at com.carrotsearch.randomizedtesting.rules.NoShadowingOrOverridesOnMethodsRule$1.evaluate(NoShadowingOrOverridesOnMethodsRule.java:40)
	at com.carrotsearch.randomizedtesting.rules.StatementAdapter.evaluate(StatementAdapter.java:36)
	at com.carrotsearch.randomizedtesting.rules.StatementAdapter.evaluate(StatementAdapter.java:36)
	at com.carrotsearch.randomizedtesting.rules.StatementAdapter.evaluate(StatementAdapter.java:36)
	at org.apache.lucene.util.TestRuleAssertionsRequired$1.evaluate(TestRuleAssertionsRequired.java:53)
	at org.apache.lucene.util.TestRuleMarkFailure$1.evaluate(TestRuleMarkFailure.java:47)
	at org.apache.lucene.util.TestRuleIgnoreAfterMaxFailures$1.evaluate(TestRuleIgnoreAfterMaxFailures.java:64)
	at org.apache.lucene.util.TestRuleIgnoreTestSuites$1.evaluate(TestRuleIgnoreTestSuites.java:54)
	at com.carrotsearch.randomizedtesting.rules.StatementAdapter.evaluate(StatementAdapter.java:36)
	at com.carrotsearch.randomizedtesting.ThreadLeakControl$StatementRunner.run(ThreadLeakControl.java:367)
	at java.base/java.lang.Thread.run(Thread.java:844)


FAILED:  junit.framework.TestSuite.org.apache.lucene.search.TestComplexExplanations

Error Message:
Clean up static fields (in @AfterClass?) and null them, your test still has references to classes of which the sizes cannot be measured due to security restrictions or Java 9 module encapsulation:   - protected static org.apache.lucene.store.Directory org.apache.lucene.search.BaseExplanationTestCase.directory   - protected static org.apache.lucene.analysis.Analyzer org.apache.lucene.search.BaseExplanationTestCase.analyzer

Stack Trace:
junit.framework.AssertionFailedError: Clean up static fields (in @AfterClass?) and null them, your test still has references to classes of which the sizes cannot be measured due to security restrictions or Java 9 module encapsulation:
  - protected static org.apache.lucene.store.Directory org.apache.lucene.search.BaseExplanationTestCase.directory
  - protected static org.apache.lucene.analysis.Analyzer org.apache.lucene.search.BaseExplanationTestCase.analyzer
	at com.carrotsearch.randomizedtesting.rules.StaticFieldsInvariantRule$1.afterAlways(StaticFieldsInvariantRule.java:146)
	at com.carrotsearch.randomizedtesting.rules.StatementAdapter.evaluate(StatementAdapter.java:43)
	at com.carrotsearch.randomizedtesting.rules.StatementAdapter.evaluate(StatementAdapter.java:36)
	at com.carrotsearch.randomizedtesting.rules.StatementAdapter.evaluate(StatementAdapter.java:36)
	at org.apache.lucene.util.TestRuleAssertionsRequired$1.evaluate(TestRuleAssertionsRequired.java:53)
	at org.apache.lucene.util.TestRuleMarkFailure$1.evaluate(TestRuleMarkFailure.java:47)
	at org.apache.lucene.util.TestRuleIgnoreAfterMaxFailures$1.evaluate(TestRuleIgnoreAfterMaxFailures.java:64)
	at org.apache.lucene.util.TestRuleIgnoreTestSuites$1.evaluate(TestRuleIgnoreTestSuites.java:54)
	at com.carrotsearch.randomizedtesting.rules.StatementAdapter.evaluate(StatementAdapter.java:36)
	at com.carrotsearch.randomizedtesting.ThreadLeakControl$StatementRunner.run(ThreadLeakControl.java:367)
	at java.base/java.lang.Thread.run(Thread.java:844)
Caused by: java.lang.IllegalStateException: Unable to access 'transient java.util.HashMap$Node[] java.util.HashMap.table' to estimate memory usage
	at com.carrotsearch.randomizedtesting.rules.RamUsageEstimator.createCacheEntry(RamUsageEstimator.java:602)
	at com.carrotsearch.randomizedtesting.rules.RamUsageEstimator.measureSizeOf(RamUsageEstimator.java:545)
	at com.carrotsearch.randomizedtesting.rules.RamUsageEstimator.sizeOfAll(RamUsageEstimator.java:387)
	at com.carrotsearch.randomizedtesting.rules.StaticFieldsInvariantRule$1.afterAlways(StaticFieldsInvariantRule.java:129)
	... 10 more
Caused by: java.lang.reflect.InaccessibleObjectException: Unable to make field transient java.util.HashMap$Node[] java.util.HashMap.table accessible: module java.base does not "opens java.util" to unnamed module @1b5eba2
	at java.base/jdk.internal.reflect.Reflection.throwInaccessibleObjectException(Reflection.java:427)
	at java.base/java.lang.reflect.AccessibleObject.checkCanSetAccessible(AccessibleObject.java:201)
	at java.base/java.lang.reflect.Field.checkCanSetAccessible(Field.java:171)
	at java.base/java.lang.reflect.Field.setAccessible(Field.java:165)
	at com.carrotsearch.randomizedtesting.rules.RamUsageEstimator$3.run(RamUsageEstimator.java:597)
	at com.carrotsearch.randomizedtesting.rules.RamUsageEstimator$3.run(RamUsageEstimator.java:594)
	at java.base/java.security.AccessController.doPrivileged(Native Method)
	at com.carrotsearch.randomizedtesting.rules.RamUsageEstimator.createCacheEntry(RamUsageEstimator.java:594)
	... 13 more


FAILED:  junit.framework.TestSuite.org.apache.lucene.search.TestComplexExplanationsOfNonMatches

Error Message:
Could not initialize class org.apache.lucene.store.MMapDirectory

Stack Trace:
java.lang.NoClassDefFoundError: Could not initialize class org.apache.lucene.store.MMapDirectory
	at __randomizedtesting.SeedInfo.seed([69F8ACEB4E10CEB5]:0)
	at org.apache.lucene.index.IndexWriter.messageState(IndexWriter.java:1104)
	at org.apache.lucene.index.IndexWriter.<init>(IndexWriter.java:1019)
	at org.apache.lucene.index.RandomIndexWriter.mockIndexWriter(RandomIndexWriter.java:80)
	at org.apache.lucene.index.RandomIndexWriter.mockIndexWriter(RandomIndexWriter.java:56)
	at org.apache.lucene.index.RandomIndexWriter.<init>(RandomIndexWriter.java:113)
	at org.apache.lucene.index.RandomIndexWriter.<init>(RandomIndexWriter.java:107)
	at org.apache.lucene.search.BaseExplanationTestCase.beforeClassTestExplanations(BaseExplanationTestCase.java:74)
	at java.base/jdk.internal.reflect.NativeMethodAccessorImpl.invoke0(Native Method)
	at java.base/jdk.internal.reflect.NativeMethodAccessorImpl.invoke(NativeMethodAccessorImpl.java:62)
	at java.base/jdk.internal.reflect.DelegatingMethodAccessorImpl.invoke(DelegatingMethodAccessorImpl.java:43)
	at java.base/java.lang.reflect.Method.invoke(Method.java:538)
	at com.carrotsearch.randomizedtesting.RandomizedRunner.invoke(RandomizedRunner.java:1713)
	at com.carrotsearch.randomizedtesting.RandomizedRunner$6.evaluate(RandomizedRunner.java:847)
	at com.carrotsearch.randomizedtesting.RandomizedRunner$7.evaluate(RandomizedRunner.java:863)
	at org.apache.lucene.util.AbstractBeforeAfterRule$1.evaluate(AbstractBeforeAfterRule.java:45)
	at com.carrotsearch.randomizedtesting.rules.StatementAdapter.evaluate(StatementAdapter.java:36)
	at org.apache.lucene.util.TestRuleStoreClassName$1.evaluate(TestRuleStoreClassName.java:41)
	at com.carrotsearch.randomizedtesting.rules.NoShadowingOrOverridesOnMethodsRule$1.evaluate(NoShadowingOrOverridesOnMethodsRule.java:40)
	at com.carrotsearch.randomizedtesting.rules.NoShadowingOrOverridesOnMethodsRule$1.evaluate(NoShadowingOrOverridesOnMethodsRule.java:40)
	at com.carrotsearch.randomizedtesting.rules.StatementAdapter.evaluate(StatementAdapter.java:36)
	at com.carrotsearch.randomizedtesting.rules.StatementAdapter.evaluate(StatementAdapter.java:36)
	at com.carrotsearch.randomizedtesting.rules.StatementAdapter.evaluate(StatementAdapter.java:36)
	at org.apache.lucene.util.TestRuleAssertionsRequired$1.evaluate(TestRuleAssertionsRequired.java:53)
	at org.apache.lucene.util.TestRuleMarkFailure$1.evaluate(TestRuleMarkFailure.java:47)
	at org.apache.lucene.util.TestRuleIgnoreAfterMaxFailures$1.evaluate(TestRuleIgnoreAfterMaxFailures.java:64)
	at org.apache.lucene.util.TestRuleIgnoreTestSuites$1.evaluate(TestRuleIgnoreTestSuites.java:54)
	at com.carrotsearch.randomizedtesting.rules.StatementAdapter.evaluate(StatementAdapter.java:36)
	at com.carrotsearch.randomizedtesting.ThreadLeakControl$StatementRunner.run(ThreadLeakControl.java:367)
	at java.base/java.lang.Thread.run(Thread.java:844)


FAILED:  junit.framework.TestSuite.org.apache.lucene.search.TestComplexExplanationsOfNonMatches

Error Message:


Stack Trace:
java.lang.NullPointerException
	at __randomizedtesting.SeedInfo.seed([69F8ACEB4E10CEB5]:0)
	at org.apache.lucene.search.BaseExplanationTestCase.afterClassTestExplanations(BaseExplanationTestCase.java:62)
	at java.base/jdk.internal.reflect.NativeMethodAccessorImpl.invoke0(Native Method)
	at java.base/jdk.internal.reflect.NativeMethodAccessorImpl.invoke(NativeMethodAccessorImpl.java:62)
	at java.base/jdk.internal.reflect.DelegatingMethodAccessorImpl.invoke(DelegatingMethodAccessorImpl.java:43)
	at java.base/java.lang.reflect.Method.invoke(Method.java:538)
	at com.carrotsearch.randomizedtesting.RandomizedRunner.invoke(RandomizedRunner.java:1713)
	at com.carrotsearch.randomizedtesting.RandomizedRunner$7.evaluate(RandomizedRunner.java:870)
	at org.apache.lucene.util.AbstractBeforeAfterRule$1.evaluate(AbstractBeforeAfterRule.java:45)
	at com.carrotsearch.randomizedtesting.rules.StatementAdapter.evaluate(StatementAdapter.java:36)
	at org.apache.lucene.util.TestRuleStoreClassName$1.evaluate(TestRuleStoreClassName.java:41)
	at com.carrotsearch.randomizedtesting.rules.NoShadowingOrOverridesOnMethodsRule$1.evaluate(NoShadowingOrOverridesOnMethodsRule.java:40)
	at com.carrotsearch.randomizedtesting.rules.NoShadowingOrOverridesOnMethodsRule$1.evaluate(NoShadowingOrOverridesOnMethodsRule.java:40)
	at com.carrotsearch.randomizedtesting.rules.StatementAdapter.evaluate(StatementAdapter.java:36)
	at com.carrotsearch.randomizedtesting.rules.StatementAdapter.evaluate(StatementAdapter.java:36)
	at com.carrotsearch.randomizedtesting.rules.StatementAdapter.evaluate(StatementAdapter.java:36)
	at org.apache.lucene.util.TestRuleAssertionsRequired$1.evaluate(TestRuleAssertionsRequired.java:53)
	at org.apache.lucene.util.TestRuleMarkFailure$1.evaluate(TestRuleMarkFailure.java:47)
	at org.apache.lucene.util.TestRuleIgnoreAfterMaxFailures$1.evaluate(TestRuleIgnoreAfterMaxFailures.java:64)
	at org.apache.lucene.util.TestRuleIgnoreTestSuites$1.evaluate(TestRuleIgnoreTestSuites.java:54)
	at com.carrotsearch.randomizedtesting.rules.StatementAdapter.evaluate(StatementAdapter.java:36)
	at com.carrotsearch.randomizedtesting.ThreadLeakControl$StatementRunner.run(ThreadLeakControl.java:367)
	at java.base/java.lang.Thread.run(Thread.java:844)


FAILED:  junit.framework.TestSuite.org.apache.lucene.search.TestComplexExplanationsOfNonMatches

Error Message:
Clean up static fields (in @AfterClass?) and null them, your test still has references to classes of which the sizes cannot be measured due to security restrictions or Java 9 module encapsulation:   - protected static org.apache.lucene.store.Directory org.apache.lucene.search.BaseExplanationTestCase.directory   - protected static org.apache.lucene.analysis.Analyzer org.apache.lucene.search.BaseExplanationTestCase.analyzer

Stack Trace:
junit.framework.AssertionFailedError: Clean up static fields (in @AfterClass?) and null them, your test still has references to classes of which the sizes cannot be measured due to security restrictions or Java 9 module encapsulation:
  - protected static org.apache.lucene.store.Directory org.apache.lucene.search.BaseExplanationTestCase.directory
  - protected static org.apache.lucene.analysis.Analyzer org.apache.lucene.search.BaseExplanationTestCase.analyzer
	at com.carrotsearch.randomizedtesting.rules.StaticFieldsInvariantRule$1.afterAlways(StaticFieldsInvariantRule.java:146)
	at com.carrotsearch.randomizedtesting.rules.StatementAdapter.evaluate(StatementAdapter.java:43)
	at com.carrotsearch.randomizedtesting.rules.StatementAdapter.evaluate(StatementAdapter.java:36)
	at com.carrotsearch.randomizedtesting.rules.StatementAdapter.evaluate(StatementAdapter.java:36)
	at org.apache.lucene.util.TestRuleAssertionsRequired$1.evaluate(TestRuleAssertionsRequired.java:53)
	at org.apache.lucene.util.TestRuleMarkFailure$1.evaluate(TestRuleMarkFailure.java:47)
	at org.apache.lucene.util.TestRuleIgnoreAfterMaxFailures$1.evaluate(TestRuleIgnoreAfterMaxFailures.java:64)
	at org.apache.lucene.util.TestRuleIgnoreTestSuites$1.evaluate(TestRuleIgnoreTestSuites.java:54)
	at com.carrotsearch.randomizedtesting.rules.StatementAdapter.evaluate(StatementAdapter.java:36)
	at com.carrotsearch.randomizedtesting.ThreadLeakControl$StatementRunner.run(ThreadLeakControl.java:367)
	at java.base/java.lang.Thread.run(Thread.java:844)
Caused by: java.lang.IllegalStateException: Unable to access 'transient java.util.HashMap$Node[] java.util.HashMap.table' to estimate memory usage
	at com.carrotsearch.randomizedtesting.rules.RamUsageEstimator.createCacheEntry(RamUsageEstimator.java:602)
	at com.carrotsearch.randomizedtesting.rules.RamUsageEstimator.measureSizeOf(RamUsageEstimator.java:545)
	at com.carrotsearch.randomizedtesting.rules.RamUsageEstimator.sizeOfAll(RamUsageEstimator.java:387)
	at com.carrotsearch.randomizedtesting.rules.StaticFieldsInvariantRule$1.afterAlways(StaticFieldsInvariantRule.java:129)
	... 10 more
Caused by: java.lang.reflect.InaccessibleObjectException: Unable to make field transient java.util.HashMap$Node[] java.util.HashMap.table accessible: module java.base does not "opens java.util" to unnamed module @10b73cf
	at java.base/jdk.internal.reflect.Reflection.throwInaccessibleObjectException(Reflection.java:427)
	at java.base/java.lang.reflect.AccessibleObject.checkCanSetAccessible(AccessibleObject.java:201)
	at java.base/java.lang.reflect.Field.checkCanSetAccessible(Field.java:171)
	at java.base/java.lang.reflect.Field.setAccessible(Field.java:165)
	at com.carrotsearch.randomizedtesting.rules.RamUsageEstimator$3.run(RamUsageEstimator.java:597)
	at com.carrotsearch.randomizedtesting.rules.RamUsageEstimator$3.run(RamUsageEstimator.java:594)
	at java.base/java.security.AccessController.doPrivileged(Native Method)
	at com.carrotsearch.randomizedtesting.rules.RamUsageEstimator.createCacheEntry(RamUsageEstimator.java:594)
	... 13 more


FAILED:  junit.framework.TestSuite.org.apache.lucene.search.TestMinShouldMatch2

Error Message:
Could not initialize class org.apache.lucene.store.MMapDirectory

Stack Trace:
java.lang.NoClassDefFoundError: Could not initialize class org.apache.lucene.store.MMapDirectory
	at __randomizedtesting.SeedInfo.seed([69F8ACEB4E10CEB5]:0)
	at org.apache.lucene.index.IndexWriter.messageState(IndexWriter.java:1104)
	at org.apache.lucene.index.IndexWriter.<init>(IndexWriter.java:1019)
	at org.apache.lucene.index.RandomIndexWriter.mockIndexWriter(RandomIndexWriter.java:80)
	at org.apache.lucene.index.RandomIndexWriter.mockIndexWriter(RandomIndexWriter.java:56)
	at org.apache.lucene.index.RandomIndexWriter.<init>(RandomIndexWriter.java:113)
	at org.apache.lucene.index.RandomIndexWriter.<init>(RandomIndexWriter.java:97)
	at org.apache.lucene.search.TestMinShouldMatch2.beforeClass(TestMinShouldMatch2.java:69)
	at java.base/jdk.internal.reflect.NativeMethodAccessorImpl.invoke0(Native Method)
	at java.base/jdk.internal.reflect.NativeMethodAccessorImpl.invoke(NativeMethodAccessorImpl.java:62)
	at java.base/jdk.internal.reflect.DelegatingMethodAccessorImpl.invoke(DelegatingMethodAccessorImpl.java:43)
	at java.base/java.lang.reflect.Method.invoke(Method.java:538)
	at com.carrotsearch.randomizedtesting.RandomizedRunner.invoke(RandomizedRunner.java:1713)
	at com.carrotsearch.randomizedtesting.RandomizedRunner$6.evaluate(RandomizedRunner.java:847)
	at com.carrotsearch.randomizedtesting.RandomizedRunner$7.evaluate(RandomizedRunner.java:863)
	at org.apache.lucene.util.AbstractBeforeAfterRule$1.evaluate(AbstractBeforeAfterRule.java:45)
	at com.carrotsearch.randomizedtesting.rules.StatementAdapter.evaluate(StatementAdapter.java:36)
	at org.apache.lucene.util.TestRuleStoreClassName$1.evaluate(TestRuleStoreClassName.java:41)
	at com.carrotsearch.randomizedtesting.rules.NoShadowingOrOverridesOnMethodsRule$1.evaluate(NoShadowingOrOverridesOnMethodsRule.java:40)
	at com.carrotsearch.randomizedtesting.rules.NoShadowingOrOverridesOnMethodsRule$1.evaluate(NoShadowingOrOverridesOnMethodsRule.java:40)
	at com.carrotsearch.randomizedtesting.rules.StatementAdapter.evaluate(StatementAdapter.java:36)
	at com.carrotsearch.randomizedtesting.rules.StatementAdapter.evaluate(StatementAdapter.java:36)
	at com.carrotsearch.randomizedtesting.rules.StatementAdapter.evaluate(StatementAdapter.java:36)
	at org.apache.lucene.util.TestRuleAssertionsRequired$1.evaluate(TestRuleAssertionsRequired.java:53)
	at org.apache.lucene.util.TestRuleMarkFailure$1.evaluate(TestRuleMarkFailure.java:47)
	at org.apache.lucene.util.TestRuleIgnoreAfterMaxFailures$1.evaluate(TestRuleIgnoreAfterMaxFailures.java:64)
	at org.apache.lucene.util.TestRuleIgnoreTestSuites$1.evaluate(TestRuleIgnoreTestSuites.java:54)
	at com.carrotsearch.randomizedtesting.rules.StatementAdapter.evaluate(StatementAdapter.java:36)
	at com.carrotsearch.randomizedtesting.ThreadLeakControl$StatementRunner.run(ThreadLeakControl.java:367)
	at java.base/java.lang.Thread.run(Thread.java:844)


FAILED:  junit.framework.TestSuite.org.apache.lucene.search.TestMinShouldMatch2

Error Message:


Stack Trace:
java.lang.NullPointerException
	at __randomizedtesting.SeedInfo.seed([69F8ACEB4E10CEB5]:0)
	at org.apache.lucene.search.TestMinShouldMatch2.afterClass(TestMinShouldMatch2.java:102)
	at java.base/jdk.internal.reflect.NativeMethodAccessorImpl.invoke0(Native Method)
	at java.base/jdk.internal.reflect.NativeMethodAccessorImpl.invoke(NativeMethodAccessorImpl.java:62)
	at java.base/jdk.internal.reflect.DelegatingMethodAccessorImpl.invoke(DelegatingMethodAccessorImpl.java:43)
	at java.base/java.lang.reflect.Method.invoke(Method.java:538)
	at com.carrotsearch.randomizedtesting.RandomizedRunner.invoke(RandomizedRunner.java:1713)
	at com.carrotsearch.randomizedtesting.RandomizedRunner$7.evaluate(RandomizedRunner.java:870)
	at org.apache.lucene.util.AbstractBeforeAfterRule$1.evaluate(AbstractBeforeAfterRule.java:45)
	at com.carrotsearch.randomizedtesting.rules.StatementAdapter.evaluate(StatementAdapter.java:36)
	at org.apache.lucene.util.TestRuleStoreClassName$1.evaluate(TestRuleStoreClassName.java:41)
	at com.carrotsearch.randomizedtesting.rules.NoShadowingOrOverridesOnMethodsRule$1.evaluate(NoShadowingOrOverridesOnMethodsRule.java:40)
	at com.carrotsearch.randomizedtesting.rules.NoShadowingOrOverridesOnMethodsRule$1.evaluate(NoShadowingOrOverridesOnMethodsRule.java:40)
	at com.carrotsearch.randomizedtesting.rules.StatementAdapter.evaluate(StatementAdapter.java:36)
	at com.carrotsearch.randomizedtesting.rules.StatementAdapter.evaluate(StatementAdapter.java:36)
	at com.carrotsearch.randomizedtesting.rules.StatementAdapter.evaluate(StatementAdapter.java:36)
	at org.apache.lucene.util.TestRuleAssertionsRequired$1.evaluate(TestRuleAssertionsRequired.java:53)
	at org.apache.lucene.util.TestRuleMarkFailure$1.evaluate(TestRuleMarkFailure.java:47)
	at org.apache.lucene.util.TestRuleIgnoreAfterMaxFailures$1.evaluate(TestRuleIgnoreAfterMaxFailures.java:64)
	at org.apache.lucene.util.TestRuleIgnoreTestSuites$1.evaluate(TestRuleIgnoreTestSuites.java:54)
	at com.carrotsearch.randomizedtesting.rules.StatementAdapter.evaluate(StatementAdapter.java:36)
	at com.carrotsearch.randomizedtesting.ThreadLeakControl$StatementRunner.run(ThreadLeakControl.java:367)
	at java.base/java.lang.Thread.run(Thread.java:844)


FAILED:  junit.framework.TestSuite.org.apache.lucene.search.TestMinShouldMatch2

Error Message:
Clean up static fields (in @AfterClass?) and null them, your test still has references to classes of which the sizes cannot be measured due to security restrictions or Java 9 module encapsulation:   - static org.apache.lucene.store.Directory org.apache.lucene.search.TestMinShouldMatch2.dir

Stack Trace:
junit.framework.AssertionFailedError: Clean up static fields (in @AfterClass?) and null them, your test still has references to classes of which the sizes cannot be measured due to security restrictions or Java 9 module encapsulation:
  - static org.apache.lucene.store.Directory org.apache.lucene.search.TestMinShouldMatch2.dir
	at com.carrotsearch.randomizedtesting.rules.StaticFieldsInvariantRule$1.afterAlways(StaticFieldsInvariantRule.java:146)
	at com.carrotsearch.randomizedtesting.rules.StatementAdapter.evaluate(StatementAdapter.java:43)
	at com.carrotsearch.randomizedtesting.rules.StatementAdapter.evaluate(StatementAdapter.java:36)
	at com.carrotsearch.randomizedtesting.rules.StatementAdapter.evaluate(StatementAdapter.java:36)
	at org.apache.lucene.util.TestRuleAssertionsRequired$1.evaluate(TestRuleAssertionsRequired.java:53)
	at org.apache.lucene.util.TestRuleMarkFailure$1.evaluate(TestRuleMarkFailure.java:47)
	at org.apache.lucene.util.TestRuleIgnoreAfterMaxFailures$1.evaluate(TestRuleIgnoreAfterMaxFailures.java:64)
	at org.apache.lucene.util.TestRuleIgnoreTestSuites$1.evaluate(TestRuleIgnoreTestSuites.java:54)
	at com.carrotsearch.randomizedtesting.rules.StatementAdapter.evaluate(StatementAdapter.java:36)
	at com.carrotsearch.randomizedtesting.ThreadLeakControl$StatementRunner.run(ThreadLeakControl.java:367)
	at java.base/java.lang.Thread.run(Thread.java:844)
Caused by: java.lang.IllegalStateException: Unable to access 'private transient java.util.HashMap java.util.HashSet.map' to estimate memory usage
	at com.carrotsearch.randomizedtesting.rules.RamUsageEstimator.createCacheEntry(RamUsageEstimator.java:602)
	at com.carrotsearch.randomizedtesting.rules.RamUsageEstimator.measureSizeOf(RamUsageEstimator.java:545)
	at com.carrotsearch.randomizedtesting.rules.RamUsageEstimator.sizeOfAll(RamUsageEstimator.java:387)
	at com.carrotsearch.randomizedtesting.rules.StaticFieldsInvariantRule$1.afterAlways(StaticFieldsInvariantRule.java:129)
	... 10 more
Caused by: java.lang.reflect.InaccessibleObjectException: Unable to make field private transient java.util.HashMap java.util.HashSet.map accessible: module java.base does not "opens java.util" to unnamed module @10b73cf
	at java.base/jdk.internal.reflect.Reflection.throwInaccessibleObjectException(Reflection.java:427)
	at java.base/java.lang.reflect.AccessibleObject.checkCanSetAccessible(AccessibleObject.java:201)
	at java.base/java.lang.reflect.Field.checkCanSetAccessible(Field.java:171)
	at java.base/java.lang.reflect.Field.setAccessible(Field.java:165)
	at com.carrotsearch.randomizedtesting.rules.RamUsageEstimator$3.run(RamUsageEstimator.java:597)
	at com.carrotsearch.randomizedtesting.rules.RamUsageEstimator$3.run(RamUsageEstimator.java:594)
	at java.base/java.security.AccessController.doPrivileged(Native Method)
	at com.carrotsearch.randomizedtesting.rules.RamUsageEstimator.createCacheEntry(RamUsageEstimator.java:594)
	... 13 more


FAILED:  junit.framework.TestSuite.org.apache.lucene.search.TestMultiTermConstantScore

Error Message:
Could not initialize class org.apache.lucene.store.MMapDirectory

Stack Trace:
java.lang.NoClassDefFoundError: Could not initialize class org.apache.lucene.store.MMapDirectory
	at __randomizedtesting.SeedInfo.seed([69F8ACEB4E10CEB5]:0)
	at org.apache.lucene.index.IndexWriter.messageState(IndexWriter.java:1104)
	at org.apache.lucene.index.IndexWriter.<init>(IndexWriter.java:1019)
	at org.apache.lucene.index.RandomIndexWriter.mockIndexWriter(RandomIndexWriter.java:80)
	at org.apache.lucene.index.RandomIndexWriter.mockIndexWriter(RandomIndexWriter.java:56)
	at org.apache.lucene.index.RandomIndexWriter.<init>(RandomIndexWriter.java:113)
	at org.apache.lucene.index.RandomIndexWriter.<init>(RandomIndexWriter.java:107)
	at org.apache.lucene.search.BaseTestRangeFilter.build(BaseTestRangeFilter.java:155)
	at org.apache.lucene.search.BaseTestRangeFilter.beforeClassBaseTestRangeFilter(BaseTestRangeFilter.java:104)
	at java.base/jdk.internal.reflect.NativeMethodAccessorImpl.invoke0(Native Method)
	at java.base/jdk.internal.reflect.NativeMethodAccessorImpl.invoke(NativeMethodAccessorImpl.java:62)
	at java.base/jdk.internal.reflect.DelegatingMethodAccessorImpl.invoke(DelegatingMethodAccessorImpl.java:43)
	at java.base/java.lang.reflect.Method.invoke(Method.java:538)
	at com.carrotsearch.randomizedtesting.RandomizedRunner.invoke(RandomizedRunner.java:1713)
	at com.carrotsearch.randomizedtesting.RandomizedRunner$6.evaluate(RandomizedRunner.java:847)
	at com.carrotsearch.randomizedtesting.RandomizedRunner$7.evaluate(RandomizedRunner.java:863)
	at org.apache.lucene.util.AbstractBeforeAfterRule$1.evaluate(AbstractBeforeAfterRule.java:45)
	at com.carrotsearch.randomizedtesting.rules.StatementAdapter.evaluate(StatementAdapter.java:36)
	at org.apache.lucene.util.TestRuleStoreClassName$1.evaluate(TestRuleStoreClassName.java:41)
	at com.carrotsearch.randomizedtesting.rules.NoShadowingOrOverridesOnMethodsRule$1.evaluate(NoShadowingOrOverridesOnMethodsRule.java:40)
	at com.carrotsearch.randomizedtesting.rules.NoShadowingOrOverridesOnMethodsRule$1.evaluate(NoShadowingOrOverridesOnMethodsRule.java:40)
	at com.carrotsearch.randomizedtesting.rules.StatementAdapter.evaluate(StatementAdapter.java:36)
	at com.carrotsearch.randomizedtesting.rules.StatementAdapter.evaluate(StatementAdapter.java:36)
	at com.carrotsearch.randomizedtesting.rules.StatementAdapter.evaluate(StatementAdapter.java:36)
	at org.apache.lucene.util.TestRuleAssertionsRequired$1.evaluate(TestRuleAssertionsRequired.java:53)
	at org.apache.lucene.util.TestRuleMarkFailure$1.evaluate(TestRuleMarkFailure.java:47)
	at org.apache.lucene.util.TestRuleIgnoreAfterMaxFailures$1.evaluate(TestRuleIgnoreAfterMaxFailures.java:64)
	at org.apache.lucene.util.TestRuleIgnoreTestSuites$1.evaluate(TestRuleIgnoreTestSuites.java:54)
	at com.carrotsearch.randomizedtesting.rules.StatementAdapter.evaluate(StatementAdapter.java:36)
	at com.carrotsearch.randomizedtesting.ThreadLeakControl$StatementRunner.run(ThreadLeakControl.java:367)
	at java.base/java.lang.Thread.run(Thread.java:844)


FAILED:  junit.framework.TestSuite.org.apache.lucene.search.TestMultiTermConstantScore

Error Message:


Stack Trace:
java.lang.NullPointerException
	at __randomizedtesting.SeedInfo.seed([69F8ACEB4E10CEB5]:0)
	at org.apache.lucene.search.TestMultiTermConstantScore.afterClass(TestMultiTermConstantScore.java:81)
	at java.base/jdk.internal.reflect.NativeMethodAccessorImpl.invoke0(Native Method)
	at java.base/jdk.internal.reflect.NativeMethodAccessorImpl.invoke(NativeMethodAccessorImpl.java:62)
	at java.base/jdk.internal.reflect.DelegatingMethodAccessorImpl.invoke(DelegatingMethodAccessorImpl.java:43)
	at java.base/java.lang.reflect.Method.invoke(Method.java:538)
	at com.carrotsearch.randomizedtesting.RandomizedRunner.invoke(RandomizedRunner.java:1713)
	at com.carrotsearch.randomizedtesting.RandomizedRunner$7.evaluate(RandomizedRunner.java:870)
	at org.apache.lucene.util.AbstractBeforeAfterRule$1.evaluate(AbstractBeforeAfterRule.java:45)
	at com.carrotsearch.randomizedtesting.rules.StatementAdapter.evaluate(StatementAdapter.java:36)
	at org.apache.lucene.util.TestRuleStoreClassName$1.evaluate(TestRuleStoreClassName.java:41)
	at com.carrotsearch.randomizedtesting.rules.NoShadowingOrOverridesOnMethodsRule$1.evaluate(NoShadowingOrOverridesOnMethodsRule.java:40)
	at com.carrotsearch.randomizedtesting.rules.NoShadowingOrOverridesOnMethodsRule$1.evaluate(NoShadowingOrOverridesOnMethodsRule.java:40)
	at com.carrotsearch.randomizedtesting.rules.StatementAdapter.evaluate(StatementAdapter.java:36)
	at com.carrotsearch.randomizedtesting.rules.StatementAdapter.evaluate(StatementAdapter.java:36)
	at com.carrotsearch.randomizedtesting.rules.StatementAdapter.evaluate(StatementAdapter.java:36)
	at org.apache.lucene.util.TestRuleAssertionsRequired$1.evaluate(TestRuleAssertionsRequired.java:53)
	at org.apache.lucene.util.TestRuleMarkFailure$1.evaluate(TestRuleMarkFailure.java:47)
	at org.apache.lucene.util.TestRuleIgnoreAfterMaxFailures$1.evaluate(TestRuleIgnoreAfterMaxFailures.java:64)
	at org.apache.lucene.util.TestRuleIgnoreTestSuites$1.evaluate(TestRuleIgnoreTestSuites.java:54)
	at com.carrotsearch.randomizedtesting.rules.StatementAdapter.evaluate(StatementAdapter.java:36)
	at com.carrotsearch.randomizedtesting.ThreadLeakControl$StatementRunner.run(ThreadLeakControl.java:367)
	at java.base/java.lang.Thread.run(Thread.java:844)


FAILED:  junit.framework.TestSuite.org.apache.lucene.search.TestMultiTermConstantScore

Error Message:


Stack Trace:
java.lang.NullPointerException
	at __randomizedtesting.SeedInfo.seed([69F8ACEB4E10CEB5]:0)
	at org.apache.lucene.search.BaseTestRangeFilter.afterClassBaseTestRangeFilter(BaseTestRangeFilter.java:110)
	at java.base/jdk.internal.reflect.NativeMethodAccessorImpl.invoke0(Native Method)
	at java.base/jdk.internal.reflect.NativeMethodAccessorImpl.invoke(NativeMethodAccessorImpl.java:62)
	at java.base/jdk.internal.reflect.DelegatingMethodAccessorImpl.invoke(DelegatingMethodAccessorImpl.java:43)
	at java.base/java.lang.reflect.Method.invoke(Method.java:538)
	at com.carrotsearch.randomizedtesting.RandomizedRunner.invoke(RandomizedRunner.java:1713)
	at com.carrotsearch.randomizedtesting.RandomizedRunner$7.evaluate(RandomizedRunner.java:870)
	at org.apache.lucene.util.AbstractBeforeAfterRule$1.evaluate(AbstractBeforeAfterRule.java:45)
	at com.carrotsearch.randomizedtesting.rules.StatementAdapter.evaluate(StatementAdapter.java:36)
	at org.apache.lucene.util.TestRuleStoreClassName$1.evaluate(TestRuleStoreClassName.java:41)
	at com.carrotsearch.randomizedtesting.rules.NoShadowingOrOverridesOnMethodsRule$1.evaluate(NoShadowingOrOverridesOnMethodsRule.java:40)
	at com.carrotsearch.randomizedtesting.rules.NoShadowingOrOverridesOnMethodsRule$1.evaluate(NoShadowingOrOverridesOnMethodsRule.java:40)
	at com.carrotsearch.randomizedtesting.rules.StatementAdapter.evaluate(StatementAdapter.java:36)
	at com.carrotsearch.randomizedtesting.rules.StatementAdapter.evaluate(StatementAdapter.java:36)
	at com.carrotsearch.randomizedtesting.rules.StatementAdapter.evaluate(StatementAdapter.java:36)
	at org.apache.lucene.util.TestRuleAssertionsRequired$1.evaluate(TestRuleAssertionsRequired.java:53)
	at org.apache.lucene.util.TestRuleMarkFailure$1.evaluate(TestRuleMarkFailure.java:47)
	at org.apache.lucene.util.TestRuleIgnoreAfterMaxFailures$1.evaluate(TestRuleIgnoreAfterMaxFailures.java:64)
	at org.apache.lucene.util.TestRuleIgnoreTestSuites$1.evaluate(TestRuleIgnoreTestSuites.java:54)
	at com.carrotsearch.randomizedtesting.rules.StatementAdapter.evaluate(StatementAdapter.java:36)
	at com.carrotsearch.randomizedtesting.ThreadLeakControl$StatementRunner.run(ThreadLeakControl.java:367)
	at java.base/java.lang.Thread.run(Thread.java:844)


FAILED:  junit.framework.TestSuite.org.apache.lucene.search.TestMultiTermConstantScore

Error Message:
Clean up static fields (in @AfterClass?) and null them, your test still has references to classes of which the sizes cannot be measured due to security restrictions or Java 9 module encapsulation:   - static org.apache.lucene.search.BaseTestRangeFilter$TestIndex org.apache.lucene.search.BaseTestRangeFilter.signedIndexDir   - static org.apache.lucene.search.BaseTestRangeFilter$TestIndex org.apache.lucene.search.BaseTestRangeFilter.unsignedIndexDir

Stack Trace:
junit.framework.AssertionFailedError: Clean up static fields (in @AfterClass?) and null them, your test still has references to classes of which the sizes cannot be measured due to security restrictions or Java 9 module encapsulation:
  - static org.apache.lucene.search.BaseTestRangeFilter$TestIndex org.apache.lucene.search.BaseTestRangeFilter.signedIndexDir
  - static org.apache.lucene.search.BaseTestRangeFilter$TestIndex org.apache.lucene.search.BaseTestRangeFilter.unsignedIndexDir
	at com.carrotsearch.randomizedtesting.rules.StaticFieldsInvariantRule$1.afterAlways(StaticFieldsInvariantRule.java:146)
	at com.carrotsearch.randomizedtesting.rules.StatementAdapter.evaluate(StatementAdapter.java:43)
	at com.carrotsearch.randomizedtesting.rules.StatementAdapter.evaluate(StatementAdapter.java:36)
	at com.carrotsearch.randomizedtesting.rules.StatementAdapter.evaluate(StatementAdapter.java:36)
	at org.apache.lucene.util.TestRuleAssertionsRequired$1.evaluate(TestRuleAssertionsRequired.java:53)
	at org.apache.lucene.util.TestRuleMarkFailure$1.evaluate(TestRuleMarkFailure.java:47)
	at org.apache.lucene.util.TestRuleIgnoreAfterMaxFailures$1.evaluate(TestRuleIgnoreAfterMaxFailures.java:64)
	at org.apache.lucene.util.TestRuleIgnoreTestSuites$1.evaluate(TestRuleIgnoreTestSuites.java:54)
	at com.carrotsearch.randomizedtesting.rules.StatementAdapter.evaluate(StatementAdapter.java:36)
	at com.carrotsearch.randomizedtesting.ThreadLeakControl$StatementRunner.run(ThreadLeakControl.java:367)
	at java.base/java.lang.Thread.run(Thread.java:844)
Caused by: java.lang.IllegalStateException: Unable to access 'private transient java.util.HashMap java.util.HashSet.map' to estimate memory usage
	at com.carrotsearch.randomizedtesting.rules.RamUsageEstimator.createCacheEntry(RamUsageEstimator.java:602)
	at com.carrotsearch.randomizedtesting.rules.RamUsageEstimator.measureSizeOf(RamUsageEstimator.java:545)
	at com.carrotsearch.randomizedtesting.rules.RamUsageEstimator.sizeOfAll(RamUsageEstimator.java:387)
	at com.carrotsearch.randomizedtesting.rules.StaticFieldsInvariantRule$1.afterAlways(StaticFieldsInvariantRule.java:129)
	... 10 more
Caused by: java.lang.reflect.InaccessibleObjectException: Unable to make field private transient java.util.HashMap java.util.HashSet.map accessible: module java.base does not "opens java.util" to unnamed module @1b5eba2
	at java.base/jdk.internal.reflect.Reflection.throwInaccessibleObjectException(Reflection.java:427)
	at java.base/java.lang.reflect.AccessibleObject.checkCanSetAccessible(AccessibleObject.java:201)
	at java.base/java.lang.reflect.Field.checkCanSetAccessible(Field.java:171)
	at java.base/java.lang.reflect.Field.setAccessible(Field.java:165)
	at com.carrotsearch.randomizedtesting.rules.RamUsageEstimator$3.run(RamUsageEstimator.java:597)
	at com.carrotsearch.randomizedtesting.rules.RamUsageEstimator$3.run(RamUsageEstimator.java:594)
	at java.base/java.security.AccessController.doPrivileged(Native Method)
	at com.carrotsearch.randomizedtesting.rules.RamUsageEstimator.createCacheEntry(RamUsageEstimator.java:594)
	... 13 more


FAILED:  junit.framework.TestSuite.org.apache.lucene.search.TestMultiTermQueryRewrites

Error Message:
Could not initialize class org.apache.lucene.store.MMapDirectory

Stack Trace:
java.lang.NoClassDefFoundError: Could not initialize class org.apache.lucene.store.MMapDirectory
	at __randomizedtesting.SeedInfo.seed([69F8ACEB4E10CEB5]:0)
	at org.apache.lucene.index.IndexWriter.messageState(IndexWriter.java:1104)
	at org.apache.lucene.index.IndexWriter.<init>(IndexWriter.java:1019)
	at org.apache.lucene.index.RandomIndexWriter.mockIndexWriter(RandomIndexWriter.java:80)
	at org.apache.lucene.index.RandomIndexWriter.mockIndexWriter(RandomIndexWriter.java:56)
	at org.apache.lucene.index.RandomIndexWriter.<init>(RandomIndexWriter.java:113)
	at org.apache.lucene.index.RandomIndexWriter.<init>(RandomIndexWriter.java:107)
	at org.apache.lucene.index.RandomIndexWriter.<init>(RandomIndexWriter.java:102)
	at org.apache.lucene.search.TestMultiTermQueryRewrites.beforeClass(TestMultiTermQueryRewrites.java:51)
	at java.base/jdk.internal.reflect.NativeMethodAccessorImpl.invoke0(Native Method)
	at java.base/jdk.internal.reflect.NativeMethodAccessorImpl.invoke(NativeMethodAccessorImpl.java:62)
	at java.base/jdk.internal.reflect.DelegatingMethodAccessorImpl.invoke(DelegatingMethodAccessorImpl.java:43)
	at java.base/java.lang.reflect.Method.invoke(Method.java:538)
	at com.carrotsearch.randomizedtesting.RandomizedRunner.invoke(RandomizedRunner.java:1713)
	at com.carrotsearch.randomizedtesting.RandomizedRunner$6.evaluate(RandomizedRunner.java:847)
	at com.carrotsearch.randomizedtesting.RandomizedRunner$7.evaluate(RandomizedRunner.java:863)
	at 

[...truncated too long message...]

SLockFactory, FiniteStringsIteratorTest, TestSpansEnum, TestIndexWriterThreadsToSegments, TestClassicSimilarity, TestNorms, TestBlendedTermQuery, TestSpanNotQuery, TestSpanExplanations, TestBlockPostingsFormat, Test2BPostings, TestMultiValuedNumericRangeQuery, TestAtomicUpdate, TestByteBlockPool, TestCodecHoldsOpenFiles, TestFieldValueQuery, TestConcurrentMergeScheduler, TestOfflineSorter, TestCustomSearcherSort, TestReqExclBulkScorer, TestIndexFileDeleter, TestPayloadsOnVectors, TestParallelTermEnum, TestTermVectorsWriter, TestStressDeletes, TestFileSwitchDirectory, TestLongBitSet, TestMultiCollector, TestMultiTermConstantScore, TestAxiomaticSimilarity, TestMultiLevelSkipList, Test2BPagedBytes, TestAttributeSource, TestFrequencyTrackingRingBuffer, TestNRTCachingDirectory, TestRamUsageEstimator, TestNeedsScores, TestSpanSearchEquivalence, TestForUtil, TestGeoUtils, TestBooleanOr, TestSloppyPhraseQuery, TestIndexWriterMergePolicy, TestStressAdvance, TestTimeLimitingCollector, TestSearchWithThreads, TestSearchAfter, TestHighCompressionMode, TestTopDocsMerge, TestStressIndexing, TestMinimize, TestNRTReaderWithThreads, TestTieredMergePolicy, TestLevenshteinAutomata, TestBufferedIndexInput, TestConsistentFieldNumbers, TestLockFactory, TestPhraseQuery, TestComplexExplanations, TestRegexpRandom2, TestPagedBytes, TestTransactions, TestPerFieldPostingsFormat2, Test2BDocs, TestSpans, TestMixedCodecs, TestLazyProxSkipping, TestDeterminism, TestMergeSchedulerExternal, TestCharTermAttributeImpl, TestStressNRT, TestSloppyPhraseQuery2, TestForceMergeForever, TestDocumentsWriterDeleteQueue, TestDocumentWriter, TestWildcard, TestExternalCodecs, TestTopDocsCollector, TestUnicodeUtil, TestDirectory, TestBooleanQueryVisitSubscorers, TestConstantScoreQuery, TestElevationComparator, TestRecyclingIntBlockAllocator, TestSimilarityProvider, TestFilterLeafReader, TestFilterIterator, TestCharsRef, TestCachingCollector, TestSpanFirstQuery, TestPhrasePrefixQuery, TestCharFilter, TestNot, TestDocBoost, TestIntsRef, TestIOUtils, TestReusableStringReader, TestPackedTokenAttributeImpl, TestBlockPostingsFormat2, TestAllFilesHaveChecksumFooter, TestBinaryDocValuesUpdates, TestDocValues, TestExceedMaxTermLength, TestFieldReuse, TestIndexReaderClose, TestIndexingSequenceNumbers, TestSpanNearQuery, TestBufferedChecksum, TestGrowableByteArrayDataOutput, TestRadixSelector, TestSloppyMath, TestOperations, TestRegExp, TestBKD]
   [junit4] Completed [442/442 (174!)] on J2 in 14.27s, 17 tests, 1 error, 1 skipped <<< FAILURES!

[...truncated 1 lines...]
   [junit4] JVM J2: stderr was not empty, see: /home/jenkins/workspace/Lucene-Solr-6.x-Linux/lucene/build/core/test/temp/junit4-J2-20161209_154155_641.syserr
   [junit4] >>> JVM J2 emitted unexpected output (verbatim) ----
   [junit4] Java HotSpot(TM) Server VM warning: Option UseConcMarkSweepGC was deprecated in version 9.0 and will likely be removed in a future release.
   [junit4] <<< JVM J2: EOF ----

[...truncated 31 lines...]
BUILD FAILED
/home/jenkins/workspace/Lucene-Solr-6.x-Linux/build.xml:765: The following error occurred while executing this line:
/home/jenkins/workspace/Lucene-Solr-6.x-Linux/build.xml:709: The following error occurred while executing this line:
/home/jenkins/workspace/Lucene-Solr-6.x-Linux/build.xml:59: The following error occurred while executing this line:
/home/jenkins/workspace/Lucene-Solr-6.x-Linux/lucene/build.xml:50: The following error occurred while executing this line:
/home/jenkins/workspace/Lucene-Solr-6.x-Linux/lucene/core/build.xml:201: groovy.lang.MissingMethodException: No signature of method: static java.lang.System.clearProperty() is applicable for argument types: (java.lang.String) values: [lockverifyserver.port]
Possible solutions: hasProperty(java.lang.String)
	at groovy.lang.MetaClassImpl.invokeStaticMissingMethod(MetaClassImpl.java:1500)
	at groovy.lang.MetaClassImpl.invokeStaticMethod(MetaClassImpl.java:1486)
	at org.codehaus.groovy.runtime.callsite.StaticMetaClassSite.call(StaticMetaClassSite.java:53)
	at org.codehaus.groovy.runtime.callsite.CallSiteArray.defaultCall(CallSiteArray.java:48)
	at org.codehaus.groovy.runtime.callsite.AbstractCallSite.call(AbstractCallSite.java:113)
	at org.codehaus.groovy.runtime.callsite.AbstractCallSite.call(AbstractCallSite.java:125)
	at embedded_script_in__home_jenkins_workspace_Lucene_Solr_6_dot_x_Linux_lucene_core_build_dot_xml.run(embedded_script_in__home_jenkins_workspace_Lucene_Solr_6_dot_x_Linux_lucene_core_build_dot_xml:1)
	at groovy.lang.GroovyShell.runScriptOrMainOrTestOrRunnable(GroovyShell.java:263)
	at groovy.lang.GroovyShell.run(GroovyShell.java:518)
	at groovy.lang.GroovyShell.run(GroovyShell.java:497)
	at org.codehaus.groovy.ant.Groovy.parseAndRunScript(Groovy.java:512)
	at org.codehaus.groovy.ant.Groovy.execGroovy(Groovy.java:448)
	at org.codehaus.groovy.ant.Groovy.execute(Groovy.java:313)
	at org.apache.tools.ant.UnknownElement.execute(UnknownElement.java:291)
	at jdk.internal.reflect.GeneratedMethodAccessor4.invoke(Unknown Source)
	at java.base/jdk.internal.reflect.DelegatingMethodAccessorImpl.invoke(DelegatingMethodAccessorImpl.java:43)
	at java.base/java.lang.reflect.Method.invoke(Method.java:538)
	at org.apache.tools.ant.dispatch.DispatchUtils.execute(DispatchUtils.java:106)
	at org.apache.tools.ant.Task.perform(Task.java:348)
	at org.apache.tools.ant.Target.execute(Target.java:390)
	at org.apache.tools.ant.Target.performTasks(Target.java:411)
	at org.apache.tools.ant.Project.executeSortedTargets(Project.java:1399)
	at org.apache.tools.ant.helper.SingleCheckExecutor.executeTargets(SingleCheckExecutor.java:38)
	at org.apache.tools.ant.Project.executeTargets(Project.java:1251)
	at org.apache.tools.ant.taskdefs.Ant.execute(Ant.java:442)
	at org.apache.tools.ant.UnknownElement.execute(UnknownElement.java:291)
	at jdk.internal.reflect.GeneratedMethodAccessor4.invoke(Unknown Source)
	at java.base/jdk.internal.reflect.DelegatingMethodAccessorImpl.invoke(DelegatingMethodAccessorImpl.java:43)
	at java.base/java.lang.reflect.Method.invoke(Method.java:538)
	at org.apache.tools.ant.dispatch.DispatchUtils.execute(DispatchUtils.java:106)
	at org.apache.tools.ant.Task.perform(Task.java:348)
	at org.apache.tools.ant.Target.execute(Target.java:390)
	at org.apache.tools.ant.Target.performTasks(Target.java:411)
	at org.apache.tools.ant.Project.executeSortedTargets(Project.java:1399)
	at org.apache.tools.ant.helper.SingleCheckExecutor.executeTargets(SingleCheckExecutor.java:38)
	at org.apache.tools.ant.Project.executeTargets(Project.java:1251)
	at org.apache.tools.ant.taskdefs.Ant.execute(Ant.java:442)
	at org.apache.tools.ant.taskdefs.SubAnt.execute(SubAnt.java:302)
	at org.apache.tools.ant.taskdefs.SubAnt.execute(SubAnt.java:221)
	at org.apache.tools.ant.UnknownElement.execute(UnknownElement.java:291)
	at jdk.internal.reflect.GeneratedMethodAccessor4.invoke(Unknown Source)
	at java.base/jdk.internal.reflect.DelegatingMethodAccessorImpl.invoke(DelegatingMethodAccessorImpl.java:43)
	at java.base/java.lang.reflect.Method.invoke(Method.java:538)
	at org.apache.tools.ant.dispatch.DispatchUtils.execute(DispatchUtils.java:106)
	at org.apache.tools.ant.Task.perform(Task.java:348)
	at org.apache.tools.ant.Target.execute(Target.java:390)
	at org.apache.tools.ant.Target.performTasks(Target.java:411)
	at org.apache.tools.ant.Project.executeSortedTargets(Project.java:1399)
	at org.apache.tools.ant.helper.SingleCheckExecutor.executeTargets(SingleCheckExecutor.java:38)
	at org.apache.tools.ant.Project.executeTargets(Project.java:1251)
	at org.apache.tools.ant.taskdefs.Ant.execute(Ant.java:442)
	at org.apache.tools.ant.taskdefs.CallTarget.execute(CallTarget.java:105)
	at org.apache.tools.ant.UnknownElement.execute(UnknownElement.java:291)
	at jdk.internal.reflect.GeneratedMethodAccessor4.invoke(Unknown Source)
	at java.base/jdk.internal.reflect.DelegatingMethodAccessorImpl.invoke(DelegatingMethodAccessorImpl.java:43)
	at java.base/java.lang.reflect.Method.invoke(Method.java:538)
	at org.apache.tools.ant.dispatch.DispatchUtils.execute(DispatchUtils.java:106)
	at org.apache.tools.ant.Task.perform(Task.java:348)
	at org.apache.tools.ant.Target.execute(Target.java:390)
	at org.apache.tools.ant.Target.performTasks(Target.java:411)
	at org.apache.tools.ant.Project.executeSortedTargets(Project.java:1399)
	at org.apache.tools.ant.helper.SingleCheckExecutor.executeTargets(SingleCheckExecutor.java:38)
	at org.apache.tools.ant.Project.executeTargets(Project.java:1251)
	at org.apache.tools.ant.taskdefs.Ant.execute(Ant.java:442)
	at org.apache.tools.ant.taskdefs.CallTarget.execute(CallTarget.java:105)
	at org.apache.tools.ant.UnknownElement.execute(UnknownElement.java:291)
	at jdk.internal.reflect.GeneratedMethodAccessor4.invoke(Unknown Source)
	at java.base/jdk.internal.reflect.DelegatingMethodAccessorImpl.invoke(DelegatingMethodAccessorImpl.java:43)
	at java.base/java.lang.reflect.Method.invoke(Method.java:538)
	at org.apache.tools.ant.dispatch.DispatchUtils.execute(DispatchUtils.java:106)
	at org.apache.tools.ant.Task.perform(Task.java:348)
	at org.apache.tools.ant.Target.execute(Target.java:390)
	at org.apache.tools.ant.Target.performTasks(Target.java:411)
	at org.apache.tools.ant.Project.executeSortedTargets(Project.java:1399)
	at org.apache.tools.ant.Project.executeTarget(Project.java:1368)
	at org.apache.tools.ant.helper.DefaultExecutor.executeTargets(DefaultExecutor.java:41)
	at org.apache.tools.ant.Project.executeTargets(Project.java:1251)
	at org.apache.tools.ant.Main.runBuild(Main.java:809)
	at org.apache.tools.ant.Main.startAnt(Main.java:217)
	at org.apache.tools.ant.launch.Launcher.run(Launcher.java:280)
	at org.apache.tools.ant.launch.Launcher.main(Launcher.java:109)

Total time: 5 minutes 43 seconds
Build step 'Invoke Ant' marked build as failure
Archiving artifacts
[WARNINGS] Skipping publisher since build result is FAILURE
Recording test results
Email was triggered for: Failure - Any
Sending email for trigger: Failure - Any



Mime
View raw message