lucene-dev mailing list archives

Site index · List index
Message view « Date » · « Thread »
Top « Date » · « Thread »
From Policeman Jenkins Server <jenk...@thetaphi.de>
Subject [JENKINS] Lucene-Solr-master-MacOSX (64bit/jdk1.8.0) - Build # 3754 - Still Unstable!
Date Wed, 04 Jan 2017 06:16:32 GMT
Build: https://jenkins.thetaphi.de/job/Lucene-Solr-master-MacOSX/3754/
Java: 64bit/jdk1.8.0 -XX:-UseCompressedOops -XX:+UseConcMarkSweepGC

1 tests failed.
FAILED:  org.apache.solr.cloud.PeerSyncReplicationTest.test

Error Message:
timeout waiting to see all nodes active

Stack Trace:
java.lang.AssertionError: timeout waiting to see all nodes active
	at __randomizedtesting.SeedInfo.seed([279F1AA02F8A725C:AFCB257A81761FA4]:0)
	at org.junit.Assert.fail(Assert.java:93)
	at org.apache.solr.cloud.PeerSyncReplicationTest.waitTillNodesActive(PeerSyncReplicationTest.java:311)
	at org.apache.solr.cloud.PeerSyncReplicationTest.bringUpDeadNodeAndEnsureNoReplication(PeerSyncReplicationTest.java:262)
	at org.apache.solr.cloud.PeerSyncReplicationTest.forceNodeFailureAndDoPeerSync(PeerSyncReplicationTest.java:244)
	at org.apache.solr.cloud.PeerSyncReplicationTest.test(PeerSyncReplicationTest.java:133)
	at sun.reflect.NativeMethodAccessorImpl.invoke0(Native Method)
	at sun.reflect.NativeMethodAccessorImpl.invoke(NativeMethodAccessorImpl.java:62)
	at sun.reflect.DelegatingMethodAccessorImpl.invoke(DelegatingMethodAccessorImpl.java:43)
	at java.lang.reflect.Method.invoke(Method.java:498)
	at com.carrotsearch.randomizedtesting.RandomizedRunner.invoke(RandomizedRunner.java:1713)
	at com.carrotsearch.randomizedtesting.RandomizedRunner$8.evaluate(RandomizedRunner.java:907)
	at com.carrotsearch.randomizedtesting.RandomizedRunner$9.evaluate(RandomizedRunner.java:943)
	at com.carrotsearch.randomizedtesting.RandomizedRunner$10.evaluate(RandomizedRunner.java:957)
	at org.apache.solr.BaseDistributedSearchTestCase$ShardsRepeatRule$ShardsFixedStatement.callStatement(BaseDistributedSearchTestCase.java:985)
	at org.apache.solr.BaseDistributedSearchTestCase$ShardsRepeatRule$ShardsStatement.evaluate(BaseDistributedSearchTestCase.java:960)
	at com.carrotsearch.randomizedtesting.rules.SystemPropertiesRestoreRule$1.evaluate(SystemPropertiesRestoreRule.java:57)
	at org.apache.lucene.util.TestRuleSetupTeardownChained$1.evaluate(TestRuleSetupTeardownChained.java:49)
	at org.apache.lucene.util.AbstractBeforeAfterRule$1.evaluate(AbstractBeforeAfterRule.java:45)
	at org.apache.lucene.util.TestRuleThreadAndTestName$1.evaluate(TestRuleThreadAndTestName.java:48)
	at org.apache.lucene.util.TestRuleIgnoreAfterMaxFailures$1.evaluate(TestRuleIgnoreAfterMaxFailures.java:64)
	at org.apache.lucene.util.TestRuleMarkFailure$1.evaluate(TestRuleMarkFailure.java:47)
	at com.carrotsearch.randomizedtesting.rules.StatementAdapter.evaluate(StatementAdapter.java:36)
	at com.carrotsearch.randomizedtesting.ThreadLeakControl$StatementRunner.run(ThreadLeakControl.java:367)
	at com.carrotsearch.randomizedtesting.ThreadLeakControl.forkTimeoutingTask(ThreadLeakControl.java:811)
	at com.carrotsearch.randomizedtesting.ThreadLeakControl$3.evaluate(ThreadLeakControl.java:462)
	at com.carrotsearch.randomizedtesting.RandomizedRunner.runSingleTest(RandomizedRunner.java:916)
	at com.carrotsearch.randomizedtesting.RandomizedRunner$5.evaluate(RandomizedRunner.java:802)
	at com.carrotsearch.randomizedtesting.RandomizedRunner$6.evaluate(RandomizedRunner.java:852)
	at com.carrotsearch.randomizedtesting.RandomizedRunner$7.evaluate(RandomizedRunner.java:863)
	at com.carrotsearch.randomizedtesting.rules.StatementAdapter.evaluate(StatementAdapter.java:36)
	at com.carrotsearch.randomizedtesting.rules.SystemPropertiesRestoreRule$1.evaluate(SystemPropertiesRestoreRule.java:57)
	at org.apache.lucene.util.AbstractBeforeAfterRule$1.evaluate(AbstractBeforeAfterRule.java:45)
	at com.carrotsearch.randomizedtesting.rules.StatementAdapter.evaluate(StatementAdapter.java:36)
	at org.apache.lucene.util.TestRuleStoreClassName$1.evaluate(TestRuleStoreClassName.java:41)
	at com.carrotsearch.randomizedtesting.rules.NoShadowingOrOverridesOnMethodsRule$1.evaluate(NoShadowingOrOverridesOnMethodsRule.java:40)
	at com.carrotsearch.randomizedtesting.rules.NoShadowingOrOverridesOnMethodsRule$1.evaluate(NoShadowingOrOverridesOnMethodsRule.java:40)
	at com.carrotsearch.randomizedtesting.rules.StatementAdapter.evaluate(StatementAdapter.java:36)
	at com.carrotsearch.randomizedtesting.rules.StatementAdapter.evaluate(StatementAdapter.java:36)
	at com.carrotsearch.randomizedtesting.rules.StatementAdapter.evaluate(StatementAdapter.java:36)
	at org.apache.lucene.util.TestRuleAssertionsRequired$1.evaluate(TestRuleAssertionsRequired.java:53)
	at org.apache.lucene.util.TestRuleMarkFailure$1.evaluate(TestRuleMarkFailure.java:47)
	at org.apache.lucene.util.TestRuleIgnoreAfterMaxFailures$1.evaluate(TestRuleIgnoreAfterMaxFailures.java:64)
	at org.apache.lucene.util.TestRuleIgnoreTestSuites$1.evaluate(TestRuleIgnoreTestSuites.java:54)
	at com.carrotsearch.randomizedtesting.rules.StatementAdapter.evaluate(StatementAdapter.java:36)
	at com.carrotsearch.randomizedtesting.ThreadLeakControl$StatementRunner.run(ThreadLeakControl.java:367)
	at java.lang.Thread.run(Thread.java:745)




Build Log:
[...truncated 12264 lines...]
   [junit4] Suite: org.apache.solr.cloud.PeerSyncReplicationTest
   [junit4]   2> Creating dataDir: /Users/jenkins/workspace/Lucene-Solr-master-MacOSX/solr/build/solr-core/test/J1/temp/solr.cloud.PeerSyncReplicationTest_279F1AA02F8A725C-001/init-core-data-001
   [junit4]   2> 2195285 INFO  (SUITE-PeerSyncReplicationTest-seed#[279F1AA02F8A725C]-worker) [    ] o.a.s.SolrTestCaseJ4 Randomized ssl (false) and clientAuth (false) via: @org.apache.solr.util.RandomizeSSL(reason=, value=NaN, ssl=NaN, clientAuth=NaN) w/ MAC_OS_X supressed clientAuth
   [junit4]   2> 2195285 INFO  (SUITE-PeerSyncReplicationTest-seed#[279F1AA02F8A725C]-worker) [    ] o.a.s.BaseDistributedSearchTestCase Setting hostContext system property: /
   [junit4]   2> 2195287 INFO  (TEST-PeerSyncReplicationTest.test-seed#[279F1AA02F8A725C]) [    ] o.a.s.c.ZkTestServer STARTING ZK TEST SERVER
   [junit4]   2> 2195288 INFO  (Thread-3341) [    ] o.a.s.c.ZkTestServer client port:0.0.0.0/0.0.0.0:0
   [junit4]   2> 2195288 INFO  (Thread-3341) [    ] o.a.s.c.ZkTestServer Starting server
   [junit4]   2> 2195388 INFO  (TEST-PeerSyncReplicationTest.test-seed#[279F1AA02F8A725C]) [    ] o.a.s.c.ZkTestServer start zk server on port:64669
   [junit4]   2> 2195423 INFO  (TEST-PeerSyncReplicationTest.test-seed#[279F1AA02F8A725C]) [    ] o.a.s.c.AbstractZkTestCase put /Users/jenkins/workspace/Lucene-Solr-master-MacOSX/solr/core/src/test-files/solr/collection1/conf/solrconfig-tlog.xml to /configs/conf1/solrconfig.xml
   [junit4]   2> 2195444 INFO  (TEST-PeerSyncReplicationTest.test-seed#[279F1AA02F8A725C]) [    ] o.a.s.c.AbstractZkTestCase put /Users/jenkins/workspace/Lucene-Solr-master-MacOSX/solr/core/src/test-files/solr/collection1/conf/schema.xml to /configs/conf1/schema.xml
   [junit4]   2> 2195505 INFO  (TEST-PeerSyncReplicationTest.test-seed#[279F1AA02F8A725C]) [    ] o.a.s.c.AbstractZkTestCase put /Users/jenkins/workspace/Lucene-Solr-master-MacOSX/solr/core/src/test-files/solr/collection1/conf/solrconfig.snippet.randomindexconfig.xml to /configs/conf1/solrconfig.snippet.randomindexconfig.xml
   [junit4]   2> 2195529 INFO  (TEST-PeerSyncReplicationTest.test-seed#[279F1AA02F8A725C]) [    ] o.a.s.c.AbstractZkTestCase put /Users/jenkins/workspace/Lucene-Solr-master-MacOSX/solr/core/src/test-files/solr/collection1/conf/stopwords.txt to /configs/conf1/stopwords.txt
   [junit4]   2> 2195542 INFO  (TEST-PeerSyncReplicationTest.test-seed#[279F1AA02F8A725C]) [    ] o.a.s.c.AbstractZkTestCase put /Users/jenkins/workspace/Lucene-Solr-master-MacOSX/solr/core/src/test-files/solr/collection1/conf/protwords.txt to /configs/conf1/protwords.txt
   [junit4]   2> 2195554 INFO  (TEST-PeerSyncReplicationTest.test-seed#[279F1AA02F8A725C]) [    ] o.a.s.c.AbstractZkTestCase put /Users/jenkins/workspace/Lucene-Solr-master-MacOSX/solr/core/src/test-files/solr/collection1/conf/currency.xml to /configs/conf1/currency.xml
   [junit4]   2> 2195559 INFO  (TEST-PeerSyncReplicationTest.test-seed#[279F1AA02F8A725C]) [    ] o.a.s.c.AbstractZkTestCase put /Users/jenkins/workspace/Lucene-Solr-master-MacOSX/solr/core/src/test-files/solr/collection1/conf/enumsConfig.xml to /configs/conf1/enumsConfig.xml
   [junit4]   2> 2195568 INFO  (TEST-PeerSyncReplicationTest.test-seed#[279F1AA02F8A725C]) [    ] o.a.s.c.AbstractZkTestCase put /Users/jenkins/workspace/Lucene-Solr-master-MacOSX/solr/core/src/test-files/solr/collection1/conf/open-exchange-rates.json to /configs/conf1/open-exchange-rates.json
   [junit4]   2> 2195580 INFO  (TEST-PeerSyncReplicationTest.test-seed#[279F1AA02F8A725C]) [    ] o.a.s.c.AbstractZkTestCase put /Users/jenkins/workspace/Lucene-Solr-master-MacOSX/solr/core/src/test-files/solr/collection1/conf/mapping-ISOLatin1Accent.txt to /configs/conf1/mapping-ISOLatin1Accent.txt
   [junit4]   2> 2195595 INFO  (TEST-PeerSyncReplicationTest.test-seed#[279F1AA02F8A725C]) [    ] o.a.s.c.AbstractZkTestCase put /Users/jenkins/workspace/Lucene-Solr-master-MacOSX/solr/core/src/test-files/solr/collection1/conf/old_synonyms.txt to /configs/conf1/old_synonyms.txt
   [junit4]   2> 2195606 INFO  (TEST-PeerSyncReplicationTest.test-seed#[279F1AA02F8A725C]) [    ] o.a.s.c.AbstractZkTestCase put /Users/jenkins/workspace/Lucene-Solr-master-MacOSX/solr/core/src/test-files/solr/collection1/conf/synonyms.txt to /configs/conf1/synonyms.txt
   [junit4]   2> 2199594 INFO  (TEST-PeerSyncReplicationTest.test-seed#[279F1AA02F8A725C]) [    ] o.a.s.SolrTestCaseJ4 Writing core.properties file to /Users/jenkins/workspace/Lucene-Solr-master-MacOSX/solr/build/solr-core/test/J1/temp/solr.cloud.PeerSyncReplicationTest_279F1AA02F8A725C-001/control-001/cores/collection1
   [junit4]   2> 2199654 INFO  (TEST-PeerSyncReplicationTest.test-seed#[279F1AA02F8A725C]) [    ] o.e.j.s.Server jetty-9.3.14.v20161028
   [junit4]   2> 2199656 INFO  (TEST-PeerSyncReplicationTest.test-seed#[279F1AA02F8A725C]) [    ] o.e.j.s.h.ContextHandler Started o.e.j.s.ServletContextHandler@55670cf0{/,null,AVAILABLE}
   [junit4]   2> 2199657 INFO  (TEST-PeerSyncReplicationTest.test-seed#[279F1AA02F8A725C]) [    ] o.e.j.s.AbstractConnector Started ServerConnector@6356766{HTTP/1.1,[http/1.1]}{127.0.0.1:64672}
   [junit4]   2> 2199658 INFO  (TEST-PeerSyncReplicationTest.test-seed#[279F1AA02F8A725C]) [    ] o.e.j.s.Server Started @2205217ms
   [junit4]   2> 2199658 INFO  (TEST-PeerSyncReplicationTest.test-seed#[279F1AA02F8A725C]) [    ] o.a.s.c.s.e.JettySolrRunner Jetty properties: {solr.data.dir=/Users/jenkins/workspace/Lucene-Solr-master-MacOSX/solr/build/solr-core/test/J1/temp/solr.cloud.PeerSyncReplicationTest_279F1AA02F8A725C-001/tempDir-001/control/data, hostContext=/, hostPort=64672, coreRootDirectory=/Users/jenkins/workspace/Lucene-Solr-master-MacOSX/solr/build/solr-core/test/J1/temp/solr.cloud.PeerSyncReplicationTest_279F1AA02F8A725C-001/control-001/cores}
   [junit4]   2> 2199659 ERROR (TEST-PeerSyncReplicationTest.test-seed#[279F1AA02F8A725C]) [    ] o.a.s.s.StartupLoggingUtils Missing Java Option solr.log.dir. Logging may be missing or incomplete.
   [junit4]   2> 2199659 INFO  (TEST-PeerSyncReplicationTest.test-seed#[279F1AA02F8A725C]) [    ] o.a.s.s.SolrDispatchFilter  ___      _       Welcome to Apache Solr™ version 7.0.0
   [junit4]   2> 2199659 INFO  (TEST-PeerSyncReplicationTest.test-seed#[279F1AA02F8A725C]) [    ] o.a.s.s.SolrDispatchFilter / __| ___| |_ _   Starting in cloud mode on port null
   [junit4]   2> 2199659 INFO  (TEST-PeerSyncReplicationTest.test-seed#[279F1AA02F8A725C]) [    ] o.a.s.s.SolrDispatchFilter \__ \/ _ \ | '_|  Install dir: null
   [junit4]   2> 2199659 INFO  (TEST-PeerSyncReplicationTest.test-seed#[279F1AA02F8A725C]) [    ] o.a.s.s.SolrDispatchFilter |___/\___/_|_|    Start time: 2017-01-04T05:32:31.144Z
   [junit4]   2> 2199664 INFO  (TEST-PeerSyncReplicationTest.test-seed#[279F1AA02F8A725C]) [    ] o.a.s.s.SolrDispatchFilter Loading solr.xml from SolrHome (not found in ZooKeeper)
   [junit4]   2> 2199664 INFO  (TEST-PeerSyncReplicationTest.test-seed#[279F1AA02F8A725C]) [    ] o.a.s.c.SolrXmlConfig Loading container configuration from /Users/jenkins/workspace/Lucene-Solr-master-MacOSX/solr/build/solr-core/test/J1/temp/solr.cloud.PeerSyncReplicationTest_279F1AA02F8A725C-001/control-001/solr.xml
   [junit4]   2> 2199690 INFO  (TEST-PeerSyncReplicationTest.test-seed#[279F1AA02F8A725C]) [    ] o.a.s.c.ZkContainer Zookeeper client=127.0.0.1:64669/solr
   [junit4]   2> 2199753 INFO  (TEST-PeerSyncReplicationTest.test-seed#[279F1AA02F8A725C]) [n:127.0.0.1:64672_    ] o.a.s.c.OverseerElectionContext I am going to be the leader 127.0.0.1:64672_
   [junit4]   2> 2199756 INFO  (TEST-PeerSyncReplicationTest.test-seed#[279F1AA02F8A725C]) [n:127.0.0.1:64672_    ] o.a.s.c.Overseer Overseer (id=97223176799911940-127.0.0.1:64672_-n_0000000000) starting
   [junit4]   2> 2199778 INFO  (TEST-PeerSyncReplicationTest.test-seed#[279F1AA02F8A725C]) [n:127.0.0.1:64672_    ] o.a.s.c.ZkController Register node as live in ZooKeeper:/live_nodes/127.0.0.1:64672_
   [junit4]   2> 2199782 INFO  (zkCallback-3507-thread-1-processing-n:127.0.0.1:64672_) [n:127.0.0.1:64672_    ] o.a.s.c.c.ZkStateReader Updated live nodes from ZooKeeper... (0) -> (1)
   [junit4]   2> 2199865 INFO  (TEST-PeerSyncReplicationTest.test-seed#[279F1AA02F8A725C]) [n:127.0.0.1:64672_    ] o.a.s.c.CorePropertiesLocator Found 1 core definitions underneath /Users/jenkins/workspace/Lucene-Solr-master-MacOSX/solr/build/solr-core/test/J1/temp/solr.cloud.PeerSyncReplicationTest_279F1AA02F8A725C-001/control-001/cores
   [junit4]   2> 2199865 INFO  (TEST-PeerSyncReplicationTest.test-seed#[279F1AA02F8A725C]) [n:127.0.0.1:64672_    ] o.a.s.c.CorePropertiesLocator Cores are: [collection1]
   [junit4]   2> 2199873 INFO  (OverseerStateUpdate-97223176799911940-127.0.0.1:64672_-n_0000000000) [n:127.0.0.1:64672_    ] o.a.s.c.o.ReplicaMutator Assigning new node to shard shard=shard1
   [junit4]   2> 2200907 WARN  (coreLoadExecutor-7659-thread-1-processing-n:127.0.0.1:64672_) [n:127.0.0.1:64672_ c:control_collection   x:collection1] o.a.s.c.Config Beginning with Solr 5.5, <mergePolicy> is deprecated, use <mergePolicyFactory> instead.
   [junit4]   2> 2200908 INFO  (coreLoadExecutor-7659-thread-1-processing-n:127.0.0.1:64672_) [n:127.0.0.1:64672_ c:control_collection   x:collection1] o.a.s.c.SolrConfig Using Lucene MatchVersion: 7.0.0
   [junit4]   2> 2200940 INFO  (coreLoadExecutor-7659-thread-1-processing-n:127.0.0.1:64672_) [n:127.0.0.1:64672_ c:control_collection   x:collection1] o.a.s.s.IndexSchema [collection1] Schema name=test
   [junit4]   2> 2201039 WARN  (coreLoadExecutor-7659-thread-1-processing-n:127.0.0.1:64672_) [n:127.0.0.1:64672_ c:control_collection   x:collection1] o.a.s.s.IndexSchema [collection1] default search field in schema is text. WARNING: Deprecated, please use 'df' on request instead.
   [junit4]   2> 2201041 INFO  (coreLoadExecutor-7659-thread-1-processing-n:127.0.0.1:64672_) [n:127.0.0.1:64672_ c:control_collection   x:collection1] o.a.s.s.IndexSchema Loaded schema test/1.0 with uniqueid field id
   [junit4]   2> 2201069 INFO  (coreLoadExecutor-7659-thread-1-processing-n:127.0.0.1:64672_) [n:127.0.0.1:64672_ c:control_collection   x:collection1] o.a.s.c.CoreContainer Creating SolrCore 'collection1' using configuration from collection control_collection
   [junit4]   2> 2201070 INFO  (coreLoadExecutor-7659-thread-1-processing-n:127.0.0.1:64672_) [n:127.0.0.1:64672_ c:control_collection   x:collection1] o.a.s.c.SolrCore [[collection1] ] Opening new SolrCore at [/Users/jenkins/workspace/Lucene-Solr-master-MacOSX/solr/build/solr-core/test/J1/temp/solr.cloud.PeerSyncReplicationTest_279F1AA02F8A725C-001/control-001/cores/collection1], dataDir=[/Users/jenkins/workspace/Lucene-Solr-master-MacOSX/solr/build/solr-core/test/J1/temp/solr.cloud.PeerSyncReplicationTest_279F1AA02F8A725C-001/control-001/cores/collection1/data/]
   [junit4]   2> 2201070 INFO  (coreLoadExecutor-7659-thread-1-processing-n:127.0.0.1:64672_) [n:127.0.0.1:64672_ c:control_collection   x:collection1] o.a.s.c.JmxMonitoredMap JMX monitoring is enabled. Adding Solr mbeans to JMX Server: com.sun.jmx.mbeanserver.JmxMBeanServer@37e8379c
   [junit4]   2> 2201073 INFO  (coreLoadExecutor-7659-thread-1-processing-n:127.0.0.1:64672_) [n:127.0.0.1:64672_ c:control_collection   x:collection1] o.a.s.u.RandomMergePolicy RandomMergePolicy wrapping class org.apache.lucene.index.LogByteSizeMergePolicy: [LogByteSizeMergePolicy: minMergeSize=1677721, mergeFactor=43, maxMergeSize=2147483648, maxMergeSizeForForcedMerge=9223372036854775807, calibrateSizeByDeletes=true, maxMergeDocs=2147483647, maxCFSSegmentSizeMB=8.796093022207999E12, noCFSRatio=1.0]
   [junit4]   2> 2201092 WARN  (coreLoadExecutor-7659-thread-1-processing-n:127.0.0.1:64672_) [n:127.0.0.1:64672_ c:control_collection   x:collection1] o.a.s.c.RequestHandlers INVALID paramSet a in requestHandler {type = requestHandler,name = /dump,class = DumpRequestHandler,attributes = {initParams=a, name=/dump, class=DumpRequestHandler},args = {defaults={a=A,b=B}}}
   [junit4]   2> 2201106 INFO  (coreLoadExecutor-7659-thread-1-processing-n:127.0.0.1:64672_) [n:127.0.0.1:64672_ c:control_collection   x:collection1] o.a.s.u.UpdateHandler Using UpdateLog implementation: org.apache.solr.update.UpdateLog
   [junit4]   2> 2201106 INFO  (coreLoadExecutor-7659-thread-1-processing-n:127.0.0.1:64672_) [n:127.0.0.1:64672_ c:control_collection   x:collection1] o.a.s.u.UpdateLog Initializing UpdateLog: dataDir= defaultSyncLevel=FLUSH numRecordsToKeep=1000 maxNumLogsToKeep=10 numVersionBuckets=65536
   [junit4]   2> 2201107 INFO  (coreLoadExecutor-7659-thread-1-processing-n:127.0.0.1:64672_) [n:127.0.0.1:64672_ c:control_collection   x:collection1] o.a.s.u.CommitTracker Hard AutoCommit: disabled
   [junit4]   2> 2201107 INFO  (coreLoadExecutor-7659-thread-1-processing-n:127.0.0.1:64672_) [n:127.0.0.1:64672_ c:control_collection   x:collection1] o.a.s.u.CommitTracker Soft AutoCommit: disabled
   [junit4]   2> 2201107 INFO  (coreLoadExecutor-7659-thread-1-processing-n:127.0.0.1:64672_) [n:127.0.0.1:64672_ c:control_collection   x:collection1] o.a.s.u.RandomMergePolicy RandomMergePolicy wrapping class org.apache.lucene.index.LogDocMergePolicy: [LogDocMergePolicy: minMergeSize=1000, mergeFactor=34, maxMergeSize=9223372036854775807, maxMergeSizeForForcedMerge=9223372036854775807, calibrateSizeByDeletes=true, maxMergeDocs=2147483647, maxCFSSegmentSizeMB=8.796093022207999E12, noCFSRatio=0.0]
   [junit4]   2> 2201109 INFO  (coreLoadExecutor-7659-thread-1-processing-n:127.0.0.1:64672_) [n:127.0.0.1:64672_ c:control_collection   x:collection1] o.a.s.s.SolrIndexSearcher Opening [Searcher@290ee84d[collection1] main]
   [junit4]   2> 2201112 INFO  (coreLoadExecutor-7659-thread-1-processing-n:127.0.0.1:64672_) [n:127.0.0.1:64672_ c:control_collection   x:collection1] o.a.s.r.ManagedResourceStorage Configured ZooKeeperStorageIO with znodeBase: /configs/conf1
   [junit4]   2> 2201112 INFO  (coreLoadExecutor-7659-thread-1-processing-n:127.0.0.1:64672_) [n:127.0.0.1:64672_ c:control_collection   x:collection1] o.a.s.r.ManagedResourceStorage Loaded null at path _rest_managed.json using ZooKeeperStorageIO:path=/configs/conf1
   [junit4]   2> 2201112 INFO  (coreLoadExecutor-7659-thread-1-processing-n:127.0.0.1:64672_) [n:127.0.0.1:64672_ c:control_collection   x:collection1] o.a.s.h.ReplicationHandler Commits will be reserved for  10000
   [junit4]   2> 2201113 INFO  (searcherExecutor-7660-thread-1-processing-n:127.0.0.1:64672_ x:collection1 c:control_collection) [n:127.0.0.1:64672_ c:control_collection   x:collection1] o.a.s.c.SolrCore [collection1] Registered new searcher Searcher@290ee84d[collection1] main{ExitableDirectoryReader(UninvertingDirectoryReader())}
   [junit4]   2> 2201113 INFO  (coreLoadExecutor-7659-thread-1-processing-n:127.0.0.1:64672_) [n:127.0.0.1:64672_ c:control_collection   x:collection1] o.a.s.u.UpdateLog Could not find max version in index or recent updates, using new clock 1555570834903400448
   [junit4]   2> 2201125 INFO  (coreZkRegister-7652-thread-1-processing-n:127.0.0.1:64672_ x:collection1 c:control_collection) [n:127.0.0.1:64672_ c:control_collection s:shard1 r:core_node1 x:collection1] o.a.s.c.ShardLeaderElectionContext Enough replicas found to continue.
   [junit4]   2> 2201125 INFO  (coreZkRegister-7652-thread-1-processing-n:127.0.0.1:64672_ x:collection1 c:control_collection) [n:127.0.0.1:64672_ c:control_collection s:shard1 r:core_node1 x:collection1] o.a.s.c.ShardLeaderElectionContext I may be the new leader - try and sync
   [junit4]   2> 2201125 INFO  (coreZkRegister-7652-thread-1-processing-n:127.0.0.1:64672_ x:collection1 c:control_collection) [n:127.0.0.1:64672_ c:control_collection s:shard1 r:core_node1 x:collection1] o.a.s.c.SyncStrategy Sync replicas to http://127.0.0.1:64672/collection1/
   [junit4]   2> 2201125 INFO  (coreZkRegister-7652-thread-1-processing-n:127.0.0.1:64672_ x:collection1 c:control_collection) [n:127.0.0.1:64672_ c:control_collection s:shard1 r:core_node1 x:collection1] o.a.s.c.SyncStrategy Sync Success - now sync replicas to me
   [junit4]   2> 2201125 INFO  (coreZkRegister-7652-thread-1-processing-n:127.0.0.1:64672_ x:collection1 c:control_collection) [n:127.0.0.1:64672_ c:control_collection s:shard1 r:core_node1 x:collection1] o.a.s.c.SyncStrategy http://127.0.0.1:64672/collection1/ has no replicas
   [junit4]   2> 2201132 INFO  (coreZkRegister-7652-thread-1-processing-n:127.0.0.1:64672_ x:collection1 c:control_collection) [n:127.0.0.1:64672_ c:control_collection s:shard1 r:core_node1 x:collection1] o.a.s.c.ShardLeaderElectionContext I am the new leader: http://127.0.0.1:64672/collection1/ shard1
   [junit4]   2> 2201163 INFO  (TEST-PeerSyncReplicationTest.test-seed#[279F1AA02F8A725C]) [    ] o.a.s.c.c.ZkStateReader Updated live nodes from ZooKeeper... (0) -> (1)
   [junit4]   2> 2201165 INFO  (TEST-PeerSyncReplicationTest.test-seed#[279F1AA02F8A725C]) [    ] o.a.s.c.s.i.ZkClientClusterStateProvider Cluster at 127.0.0.1:64669/solr ready
   [junit4]   2> 2201165 INFO  (TEST-PeerSyncReplicationTest.test-seed#[279F1AA02F8A725C]) [    ] o.a.s.c.ChaosMonkey monkey: init - expire sessions:false cause connection loss:false
   [junit4]   2> 2201165 INFO  (TEST-PeerSyncReplicationTest.test-seed#[279F1AA02F8A725C]) [    ] o.a.s.c.AbstractFullDistribZkTestBase Creating collection1 with stateFormat=2
   [junit4]   2> 2201189 INFO  (coreZkRegister-7652-thread-1-processing-n:127.0.0.1:64672_ x:collection1 c:control_collection) [n:127.0.0.1:64672_ c:control_collection s:shard1 r:core_node1 x:collection1] o.a.s.c.ZkController I am the leader, no recovery necessary
   [junit4]   2> 2201479 INFO  (TEST-PeerSyncReplicationTest.test-seed#[279F1AA02F8A725C]) [    ] o.a.s.SolrTestCaseJ4 Writing core.properties file to /Users/jenkins/workspace/Lucene-Solr-master-MacOSX/solr/build/solr-core/test/J1/temp/solr.cloud.PeerSyncReplicationTest_279F1AA02F8A725C-001/shard-1-001/cores/collection1
   [junit4]   2> 2201480 INFO  (TEST-PeerSyncReplicationTest.test-seed#[279F1AA02F8A725C]) [    ] o.a.s.c.AbstractFullDistribZkTestBase create jetty 1 in directory /Users/jenkins/workspace/Lucene-Solr-master-MacOSX/solr/build/solr-core/test/J1/temp/solr.cloud.PeerSyncReplicationTest_279F1AA02F8A725C-001/shard-1-001
   [junit4]   2> 2201481 INFO  (TEST-PeerSyncReplicationTest.test-seed#[279F1AA02F8A725C]) [    ] o.e.j.s.Server jetty-9.3.14.v20161028
   [junit4]   2> 2201483 INFO  (TEST-PeerSyncReplicationTest.test-seed#[279F1AA02F8A725C]) [    ] o.e.j.s.h.ContextHandler Started o.e.j.s.ServletContextHandler@136f57f2{/,null,AVAILABLE}
   [junit4]   2> 2201484 INFO  (TEST-PeerSyncReplicationTest.test-seed#[279F1AA02F8A725C]) [    ] o.e.j.s.AbstractConnector Started ServerConnector@7e12f851{HTTP/1.1,[http/1.1]}{127.0.0.1:64686}
   [junit4]   2> 2201484 INFO  (TEST-PeerSyncReplicationTest.test-seed#[279F1AA02F8A725C]) [    ] o.e.j.s.Server Started @2207043ms
   [junit4]   2> 2201484 INFO  (TEST-PeerSyncReplicationTest.test-seed#[279F1AA02F8A725C]) [    ] o.a.s.c.s.e.JettySolrRunner Jetty properties: {solr.data.dir=/Users/jenkins/workspace/Lucene-Solr-master-MacOSX/solr/build/solr-core/test/J1/temp/solr.cloud.PeerSyncReplicationTest_279F1AA02F8A725C-001/tempDir-001/jetty1, solrconfig=solrconfig.xml, hostContext=/, hostPort=64686, coreRootDirectory=/Users/jenkins/workspace/Lucene-Solr-master-MacOSX/solr/build/solr-core/test/J1/temp/solr.cloud.PeerSyncReplicationTest_279F1AA02F8A725C-001/shard-1-001/cores}
   [junit4]   2> 2201485 ERROR (TEST-PeerSyncReplicationTest.test-seed#[279F1AA02F8A725C]) [    ] o.a.s.s.StartupLoggingUtils Missing Java Option solr.log.dir. Logging may be missing or incomplete.
   [junit4]   2> 2201485 INFO  (TEST-PeerSyncReplicationTest.test-seed#[279F1AA02F8A725C]) [    ] o.a.s.s.SolrDispatchFilter  ___      _       Welcome to Apache Solr™ version 7.0.0
   [junit4]   2> 2201486 INFO  (TEST-PeerSyncReplicationTest.test-seed#[279F1AA02F8A725C]) [    ] o.a.s.s.SolrDispatchFilter / __| ___| |_ _   Starting in cloud mode on port null
   [junit4]   2> 2201486 INFO  (TEST-PeerSyncReplicationTest.test-seed#[279F1AA02F8A725C]) [    ] o.a.s.s.SolrDispatchFilter \__ \/ _ \ | '_|  Install dir: null
   [junit4]   2> 2201486 INFO  (TEST-PeerSyncReplicationTest.test-seed#[279F1AA02F8A725C]) [    ] o.a.s.s.SolrDispatchFilter |___/\___/_|_|    Start time: 2017-01-04T05:32:32.971Z
   [junit4]   2> 2201490 INFO  (TEST-PeerSyncReplicationTest.test-seed#[279F1AA02F8A725C]) [    ] o.a.s.s.SolrDispatchFilter Loading solr.xml from SolrHome (not found in ZooKeeper)
   [junit4]   2> 2201490 INFO  (TEST-PeerSyncReplicationTest.test-seed#[279F1AA02F8A725C]) [    ] o.a.s.c.SolrXmlConfig Loading container configuration from /Users/jenkins/workspace/Lucene-Solr-master-MacOSX/solr/build/solr-core/test/J1/temp/solr.cloud.PeerSyncReplicationTest_279F1AA02F8A725C-001/shard-1-001/solr.xml
   [junit4]   2> 2201501 INFO  (TEST-PeerSyncReplicationTest.test-seed#[279F1AA02F8A725C]) [    ] o.a.s.c.ZkContainer Zookeeper client=127.0.0.1:64669/solr
   [junit4]   2> 2201522 INFO  (TEST-PeerSyncReplicationTest.test-seed#[279F1AA02F8A725C]) [n:127.0.0.1:64686_    ] o.a.s.c.c.ZkStateReader Updated live nodes from ZooKeeper... (0) -> (1)
   [junit4]   2> 2201532 INFO  (TEST-PeerSyncReplicationTest.test-seed#[279F1AA02F8A725C]) [n:127.0.0.1:64686_    ] o.a.s.c.ZkController Register node as live in ZooKeeper:/live_nodes/127.0.0.1:64686_
   [junit4]   2> 2201535 INFO  (zkCallback-3507-thread-3-processing-n:127.0.0.1:64672_) [n:127.0.0.1:64672_    ] o.a.s.c.c.ZkStateReader Updated live nodes from ZooKeeper... (1) -> (2)
   [junit4]   2> 2201535 INFO  (zkCallback-3511-thread-1) [    ] o.a.s.c.c.ZkStateReader Updated live nodes from ZooKeeper... (1) -> (2)
   [junit4]   2> 2201537 INFO  (zkCallback-3517-thread-1-processing-n:127.0.0.1:64686_) [n:127.0.0.1:64686_    ] o.a.s.c.c.ZkStateReader Updated live nodes from ZooKeeper... (1) -> (2)
   [junit4]   2> 2201614 INFO  (TEST-PeerSyncReplicationTest.test-seed#[279F1AA02F8A725C]) [n:127.0.0.1:64686_    ] o.a.s.c.CorePropertiesLocator Found 1 core definitions underneath /Users/jenkins/workspace/Lucene-Solr-master-MacOSX/solr/build/solr-core/test/J1/temp/solr.cloud.PeerSyncReplicationTest_279F1AA02F8A725C-001/shard-1-001/cores
   [junit4]   2> 2201614 INFO  (TEST-PeerSyncReplicationTest.test-seed#[279F1AA02F8A725C]) [n:127.0.0.1:64686_    ] o.a.s.c.CorePropertiesLocator Cores are: [collection1]
   [junit4]   2> 2201618 INFO  (OverseerStateUpdate-97223176799911940-127.0.0.1:64672_-n_0000000000) [n:127.0.0.1:64672_    ] o.a.s.c.o.ReplicaMutator Assigning new node to shard shard=shard1
   [junit4]   2> 2201730 INFO  (zkCallback-3517-thread-2-processing-n:127.0.0.1:64686_) [n:127.0.0.1:64686_    ] o.a.s.c.c.ZkStateReader A cluster state change: [WatchedEvent state:SyncConnected type:NodeDataChanged path:/collections/collection1/state.json] for collection [collection1] has occurred - updating... (live nodes size: [2])
   [junit4]   2> 2202642 WARN  (coreLoadExecutor-7670-thread-1-processing-n:127.0.0.1:64686_) [n:127.0.0.1:64686_ c:collection1   x:collection1] o.a.s.c.Config Beginning with Solr 5.5, <mergePolicy> is deprecated, use <mergePolicyFactory> instead.
   [junit4]   2> 2202654 INFO  (coreLoadExecutor-7670-thread-1-processing-n:127.0.0.1:64686_) [n:127.0.0.1:64686_ c:collection1   x:collection1] o.a.s.c.SolrConfig Using Lucene MatchVersion: 7.0.0
   [junit4]   2> 2202675 INFO  (coreLoadExecutor-7670-thread-1-processing-n:127.0.0.1:64686_) [n:127.0.0.1:64686_ c:collection1   x:collection1] o.a.s.s.IndexSchema [collection1] Schema name=test
   [junit4]   2> 2202820 WARN  (coreLoadExecutor-7670-thread-1-processing-n:127.0.0.1:64686_) [n:127.0.0.1:64686_ c:collection1   x:collection1] o.a.s.s.IndexSchema [collection1] default search field in schema is text. WARNING: Deprecated, please use 'df' on request instead.
   [junit4]   2> 2202824 INFO  (coreLoadExecutor-7670-thread-1-processing-n:127.0.0.1:64686_) [n:127.0.0.1:64686_ c:collection1   x:collection1] o.a.s.s.IndexSchema Loaded schema test/1.0 with uniqueid field id
   [junit4]   2> 2202850 INFO  (coreLoadExecutor-7670-thread-1-processing-n:127.0.0.1:64686_) [n:127.0.0.1:64686_ c:collection1   x:collection1] o.a.s.c.CoreContainer Creating SolrCore 'collection1' using configuration from collection collection1
   [junit4]   2> 2202850 INFO  (coreLoadExecutor-7670-thread-1-processing-n:127.0.0.1:64686_) [n:127.0.0.1:64686_ c:collection1   x:collection1] o.a.s.c.SolrCore [[collection1] ] Opening new SolrCore at [/Users/jenkins/workspace/Lucene-Solr-master-MacOSX/solr/build/solr-core/test/J1/temp/solr.cloud.PeerSyncReplicationTest_279F1AA02F8A725C-001/shard-1-001/cores/collection1], dataDir=[/Users/jenkins/workspace/Lucene-Solr-master-MacOSX/solr/build/solr-core/test/J1/temp/solr.cloud.PeerSyncReplicationTest_279F1AA02F8A725C-001/shard-1-001/cores/collection1/data/]
   [junit4]   2> 2202851 INFO  (coreLoadExecutor-7670-thread-1-processing-n:127.0.0.1:64686_) [n:127.0.0.1:64686_ c:collection1   x:collection1] o.a.s.c.JmxMonitoredMap JMX monitoring is enabled. Adding Solr mbeans to JMX Server: com.sun.jmx.mbeanserver.JmxMBeanServer@37e8379c
   [junit4]   2> 2202855 INFO  (coreLoadExecutor-7670-thread-1-processing-n:127.0.0.1:64686_) [n:127.0.0.1:64686_ c:collection1   x:collection1] o.a.s.u.RandomMergePolicy RandomMergePolicy wrapping class org.apache.lucene.index.LogByteSizeMergePolicy: [LogByteSizeMergePolicy: minMergeSize=1677721, mergeFactor=43, maxMergeSize=2147483648, maxMergeSizeForForcedMerge=9223372036854775807, calibrateSizeByDeletes=true, maxMergeDocs=2147483647, maxCFSSegmentSizeMB=8.796093022207999E12, noCFSRatio=1.0]
   [junit4]   2> 2202878 WARN  (coreLoadExecutor-7670-thread-1-processing-n:127.0.0.1:64686_) [n:127.0.0.1:64686_ c:collection1   x:collection1] o.a.s.c.RequestHandlers INVALID paramSet a in requestHandler {type = requestHandler,name = /dump,class = DumpRequestHandler,attributes = {initParams=a, name=/dump, class=DumpRequestHandler},args = {defaults={a=A,b=B}}}
   [junit4]   2> 2202908 INFO  (coreLoadExecutor-7670-thread-1-processing-n:127.0.0.1:64686_) [n:127.0.0.1:64686_ c:collection1   x:collection1] o.a.s.u.UpdateHandler Using UpdateLog implementation: org.apache.solr.update.UpdateLog
   [junit4]   2> 2202908 INFO  (coreLoadExecutor-7670-thread-1-processing-n:127.0.0.1:64686_) [n:127.0.0.1:64686_ c:collection1   x:collection1] o.a.s.u.UpdateLog Initializing UpdateLog: dataDir= defaultSyncLevel=FLUSH numRecordsToKeep=1000 maxNumLogsToKeep=10 numVersionBuckets=65536
   [junit4]   2> 2202909 INFO  (coreLoadExecutor-7670-thread-1-processing-n:127.0.0.1:64686_) [n:127.0.0.1:64686_ c:collection1   x:collection1] o.a.s.u.CommitTracker Hard AutoCommit: disabled
   [junit4]   2> 2202909 INFO  (coreLoadExecutor-7670-thread-1-processing-n:127.0.0.1:64686_) [n:127.0.0.1:64686_ c:collection1   x:collection1] o.a.s.u.CommitTracker Soft AutoCommit: disabled
   [junit4]   2> 2202910 INFO  (coreLoadExecutor-7670-thread-1-processing-n:127.0.0.1:64686_) [n:127.0.0.1:64686_ c:collection1   x:collection1] o.a.s.u.RandomMergePolicy RandomMergePolicy wrapping class org.apache.lucene.index.LogDocMergePolicy: [LogDocMergePolicy: minMergeSize=1000, mergeFactor=34, maxMergeSize=9223372036854775807, maxMergeSizeForForcedMerge=9223372036854775807, calibrateSizeByDeletes=true, maxMergeDocs=2147483647, maxCFSSegmentSizeMB=8.796093022207999E12, noCFSRatio=0.0]
   [junit4]   2> 2202911 INFO  (coreLoadExecutor-7670-thread-1-processing-n:127.0.0.1:64686_) [n:127.0.0.1:64686_ c:collection1   x:collection1] o.a.s.s.SolrIndexSearcher Opening [Searcher@67352454[collection1] main]
   [junit4]   2> 2202914 INFO  (coreLoadExecutor-7670-thread-1-processing-n:127.0.0.1:64686_) [n:127.0.0.1:64686_ c:collection1   x:collection1] o.a.s.r.ManagedResourceStorage Configured ZooKeeperStorageIO with znodeBase: /configs/conf1
   [junit4]   2> 2202915 INFO  (coreLoadExecutor-7670-thread-1-processing-n:127.0.0.1:64686_) [n:127.0.0.1:64686_ c:collection1   x:collection1] o.a.s.r.ManagedResourceStorage Loaded null at path _rest_managed.json using ZooKeeperStorageIO:path=/configs/conf1
   [junit4]   2> 2202915 INFO  (coreLoadExecutor-7670-thread-1-processing-n:127.0.0.1:64686_) [n:127.0.0.1:64686_ c:collection1   x:collection1] o.a.s.h.ReplicationHandler Commits will be reserved for  10000
   [junit4]   2> 2202916 INFO  (searcherExecutor-7671-thread-1-processing-n:127.0.0.1:64686_ x:collection1 c:collection1) [n:127.0.0.1:64686_ c:collection1   x:collection1] o.a.s.c.SolrCore [collection1] Registered new searcher Searcher@67352454[collection1] main{ExitableDirectoryReader(UninvertingDirectoryReader())}
   [junit4]   2> 2202917 INFO  (coreLoadExecutor-7670-thread-1-processing-n:127.0.0.1:64686_) [n:127.0.0.1:64686_ c:collection1   x:collection1] o.a.s.u.UpdateLog Could not find max version in index or recent updates, using new clock 1555570836795031552
   [junit4]   2> 2202930 INFO  (coreZkRegister-7665-thread-1-processing-n:127.0.0.1:64686_ x:collection1 c:collection1) [n:127.0.0.1:64686_ c:collection1 s:shard1 r:core_node1 x:collection1] o.a.s.c.ShardLeaderElectionContext Enough replicas found to continue.
   [junit4]   2> 2202931 INFO  (coreZkRegister-7665-thread-1-processing-n:127.0.0.1:64686_ x:collection1 c:collection1) [n:127.0.0.1:64686_ c:collection1 s:shard1 r:core_node1 x:collection1] o.a.s.c.ShardLeaderElectionContext I may be the new leader - try and sync
   [junit4]   2> 2202931 INFO  (coreZkRegister-7665-thread-1-processing-n:127.0.0.1:64686_ x:collection1 c:collection1) [n:127.0.0.1:64686_ c:collection1 s:shard1 r:core_node1 x:collection1] o.a.s.c.SyncStrategy Sync replicas to http://127.0.0.1:64686/collection1/
   [junit4]   2> 2202931 INFO  (coreZkRegister-7665-thread-1-processing-n:127.0.0.1:64686_ x:collection1 c:collection1) [n:127.0.0.1:64686_ c:collection1 s:shard1 r:core_node1 x:collection1] o.a.s.c.SyncStrategy Sync Success - now sync replicas to me
   [junit4]   2> 2202931 INFO  (coreZkRegister-7665-thread-1-processing-n:127.0.0.1:64686_ x:collection1 c:collection1) [n:127.0.0.1:64686_ c:collection1 s:shard1 r:core_node1 x:collection1] o.a.s.c.SyncStrategy http://127.0.0.1:64686/collection1/ has no replicas
   [junit4]   2> 2202940 INFO  (coreZkRegister-7665-thread-1-processing-n:127.0.0.1:64686_ x:collection1 c:collection1) [n:127.0.0.1:64686_ c:collection1 s:shard1 r:core_node1 x:collection1] o.a.s.c.ShardLeaderElectionContext I am the new leader: http://127.0.0.1:64686/collection1/ shard1
   [junit4]   2> 2203048 INFO  (zkCallback-3517-thread-2-processing-n:127.0.0.1:64686_) [n:127.0.0.1:64686_    ] o.a.s.c.c.ZkStateReader A cluster state change: [WatchedEvent state:SyncConnected type:NodeDataChanged path:/collections/collection1/state.json] for collection [collection1] has occurred - updating... (live nodes size: [2])
   [junit4]   2> 2203101 INFO  (coreZkRegister-7665-thread-1-processing-n:127.0.0.1:64686_ x:collection1 c:collection1) [n:127.0.0.1:64686_ c:collection1 s:shard1 r:core_node1 x:collection1] o.a.s.c.ZkController I am the leader, no recovery necessary
   [junit4]   2> 2203217 INFO  (zkCallback-3517-thread-2-processing-n:127.0.0.1:64686_) [n:127.0.0.1:64686_    ] o.a.s.c.c.ZkStateReader A cluster state change: [WatchedEvent state:SyncConnected type:NodeDataChanged path:/collections/collection1/state.json] for collection [collection1] has occurred - updating... (live nodes size: [2])
   [junit4]   2> 2203337 INFO  (TEST-PeerSyncReplicationTest.test-seed#[279F1AA02F8A725C]) [    ] o.a.s.SolrTestCaseJ4 Writing core.properties file to /Users/jenkins/workspace/Lucene-Solr-master-MacOSX/solr/build/solr-core/test/J1/temp/solr.cloud.PeerSyncReplicationTest_279F1AA02F8A725C-001/shard-2-001/cores/collection1
   [junit4]   2> 2203339 INFO  (TEST-PeerSyncReplicationTest.test-seed#[279F1AA02F8A725C]) [    ] o.a.s.c.AbstractFullDistribZkTestBase create jetty 2 in directory /Users/jenkins/workspace/Lucene-Solr-master-MacOSX/solr/build/solr-core/test/J1/temp/solr.cloud.PeerSyncReplicationTest_279F1AA02F8A725C-001/shard-2-001
   [junit4]   2> 2203340 INFO  (TEST-PeerSyncReplicationTest.test-seed#[279F1AA02F8A725C]) [    ] o.e.j.s.Server jetty-9.3.14.v20161028
   [junit4]   2> 2203342 INFO  (TEST-PeerSyncReplicationTest.test-seed#[279F1AA02F8A725C]) [    ] o.e.j.s.h.ContextHandler Started o.e.j.s.ServletContextHandler@15ad1305{/,null,AVAILABLE}
   [junit4]   2> 2203342 INFO  (TEST-PeerSyncReplicationTest.test-seed#[279F1AA02F8A725C]) [    ] o.e.j.s.AbstractConnector Started ServerConnector@27442814{HTTP/1.1,[http/1.1]}{127.0.0.1:64697}
   [junit4]   2> 2203342 INFO  (TEST-PeerSyncReplicationTest.test-seed#[279F1AA02F8A725C]) [    ] o.e.j.s.Server Started @2208901ms
   [junit4]   2> 2203342 INFO  (TEST-PeerSyncReplicationTest.test-seed#[279F1AA02F8A725C]) [    ] o.a.s.c.s.e.JettySolrRunner Jetty properties: {solr.data.dir=/Users/jenkins/workspace/Lucene-Solr-master-MacOSX/solr/build/solr-core/test/J1/temp/solr.cloud.PeerSyncReplicationTest_279F1AA02F8A725C-001/tempDir-001/jetty2, solrconfig=solrconfig.xml, hostContext=/, hostPort=64697, coreRootDirectory=/Users/jenkins/workspace/Lucene-Solr-master-MacOSX/solr/build/solr-core/test/J1/../../../../../../../../../Users/jenkins/workspace/Lucene-Solr-master-MacOSX/solr/build/solr-core/test/J1/temp/solr.cloud.PeerSyncReplicationTest_279F1AA02F8A725C-001/shard-2-001/cores}
   [junit4]   2> 2203344 ERROR (TEST-PeerSyncReplicationTest.test-seed#[279F1AA02F8A725C]) [    ] o.a.s.s.StartupLoggingUtils Missing Java Option solr.log.dir. Logging may be missing or incomplete.
   [junit4]   2> 2203344 INFO  (TEST-PeerSyncReplicationTest.test-seed#[279F1AA02F8A725C]) [    ] o.a.s.s.SolrDispatchFilter  ___      _       Welcome to Apache Solr™ version 7.0.0
   [junit4]   2> 2203345 INFO  (TEST-PeerSyncReplicationTest.test-seed#[279F1AA02F8A725C]) [    ] o.a.s.s.SolrDispatchFilter / __| ___| |_ _   Starting in cloud mode on port null
   [junit4]   2> 2203345 INFO  (TEST-PeerSyncReplicationTest.test-seed#[279F1AA02F8A725C]) [    ] o.a.s.s.SolrDispatchFilter \__ \/ _ \ | '_|  Install dir: null
   [junit4]   2> 2203345 INFO  (TEST-PeerSyncReplicationTest.test-seed#[279F1AA02F8A725C]) [    ] o.a.s.s.SolrDispatchFilter |___/\___/_|_|    Start time: 2017-01-04T05:32:34.830Z
   [junit4]   2> 2203351 INFO  (TEST-PeerSyncReplicationTest.test-seed#[279F1AA02F8A725C]) [    ] o.a.s.s.SolrDispatchFilter Loading solr.xml from SolrHome (not found in ZooKeeper)
   [junit4]   2> 2203351 INFO  (TEST-PeerSyncReplicationTest.test-seed#[279F1AA02F8A725C]) [    ] o.a.s.c.SolrXmlConfig Loading container configuration from /Users/jenkins/workspace/Lucene-Solr-master-MacOSX/solr/build/solr-core/test/J1/temp/solr.cloud.PeerSyncReplicationTest_279F1AA02F8A725C-001/shard-2-001/solr.xml
   [junit4]   2> 2203373 INFO  (TEST-PeerSyncReplicationTest.test-seed#[279F1AA02F8A725C]) [    ] o.a.s.c.ZkContainer Zookeeper client=127.0.0.1:64669/solr
   [junit4]   2> 2203395 INFO  (TEST-PeerSyncReplicationTest.test-seed#[279F1AA02F8A725C]) [n:127.0.0.1:64697_    ] o.a.s.c.c.ZkStateReader Updated live nodes from ZooKeeper... (0) -> (2)
   [junit4]   2> 2203416 INFO  (TEST-PeerSyncReplicationTest.test-seed#[279F1AA02F8A725C]) [n:127.0.0.1:64697_    ] o.a.s.c.ZkController Register node as live in ZooKeeper:/live_nodes/127.0.0.1:64697_
   [junit4]   2> 2203421 INFO  (zkCallback-3507-thread-2-processing-n:127.0.0.1:64672_) [n:127.0.0.1:64672_    ] o.a.s.c.c.ZkStateReader Updated live nodes from ZooKeeper... (2) -> (3)
   [junit4]   2> 2203421 INFO  (zkCallback-3523-thread-1-processing-n:127.0.0.1:64697_) [n:127.0.0.1:64697_    ] o.a.s.c.c.ZkStateReader Updated live nodes from ZooKeeper... (2) -> (3)
   [junit4]   2> 2203422 INFO  (zkCallback-3511-thread-1) [    ] o.a.s.c.c.ZkStateReader Updated live nodes from ZooKeeper... (2) -> (3)
   [junit4]   2> 2203423 INFO  (zkCallback-3517-thread-2-processing-n:127.0.0.1:64686_) [n:127.0.0.1:64686_    ] o.a.s.c.c.ZkStateReader Updated live nodes from ZooKeeper... (2) -> (3)
   [junit4]   2> 2203536 INFO  (zkCallback-3517-thread-2-processing-n:127.0.0.1:64686_) [n:127.0.0.1:64686_    ] o.a.s.c.c.ZkStateReader A cluster state change: [WatchedEvent state:SyncConnected type:NodeDataChanged path:/collections/collection1/state.json] for collection [collection1] has occurred - updating... (live nodes size: [3])
   [junit4]   2> 2203667 INFO  (TEST-PeerSyncReplicationTest.test-seed#[279F1AA02F8A725C]) [n:127.0.0.1:64697_    ] o.a.s.c.CorePropertiesLocator Found 1 core definitions underneath /Users/jenkins/workspace/Lucene-Solr-master-MacOSX/solr/build/solr-core/test/J1/../../../../../../../../../Users/jenkins/workspace/Lucene-Solr-master-MacOSX/solr/build/solr-core/test/J1/temp/solr.cloud.PeerSyncReplicationTest_279F1AA02F8A725C-001/shard-2-001/cores
   [junit4]   2> 2203668 INFO  (TEST-PeerSyncReplicationTest.test-seed#[279F1AA02F8A725C]) [n:127.0.0.1:64697_    ] o.a.s.c.CorePropertiesLocator Cores are: [collection1]
   [junit4]   2> 2203677 INFO  (OverseerStateUpdate-97223176799911940-127.0.0.1:64672_-n_0000000000) [n:127.0.0.1:64672_    ] o.a.s.c.o.ReplicaMutator Assigning new node to shard shard=shard1
   [junit4]   2> 2203788 INFO  (zkCallback-3523-thread-1-processing-n:127.0.0.1:64697_) [n:127.0.0.1:64697_    ] o.a.s.c.c.ZkStateReader A cluster state change: [WatchedEvent state:SyncConnected type:NodeDataChanged path:/collections/collection1/state.json] for collection [collection1] has occurred - updating... (live nodes size: [3])
   [junit4]   2> 2203788 INFO  (zkCallback-3517-thread-2-processing-n:127.0.0.1:64686_) [n:127.0.0.1:64686_    ] o.a.s.c.c.ZkStateReader A cluster state change: [WatchedEvent state:SyncConnected type:NodeDataChanged path:/collections/collection1/state.json] for collection [collection1] has occurred - updating... (live nodes size: [3])
   [junit4]   2> 2204723 WARN  (coreLoadExecutor-7681-thread-1-processing-n:127.0.0.1:64697_) [n:127.0.0.1:64697_ c:collection1   x:collection1] o.a.s.c.Config Beginning with Solr 5.5, <mergePolicy> is deprecated, use <mergePolicyFactory> instead.
   [junit4]   2> 2204724 INFO  (coreLoadExecutor-7681-thread-1-processing-n:127.0.0.1:64697_) [n:127.0.0.1:64697_ c:collection1   x:collection1] o.a.s.c.SolrConfig Using Lucene MatchVersion: 7.0.0
   [junit4]   2> 2204743 INFO  (coreLoadExecutor-7681-thread-1-processing-n:127.0.0.1:64697_) [n:127.0.0.1:64697_ c:collection1   x:collection1] o.a.s.s.IndexSchema [collection1] Schema name=test
   [junit4]   2> 2204924 WARN  (coreLoadExecutor-7681-thread-1-processing-n:127.0.0.1:64697_) [n:127.0.0.1:64697_ c:collection1   x:collection1] o.a.s.s.IndexSchema [collection1] default search field in schema is text. WARNING: Deprecated, please use 'df' on request instead.
   [junit4]   2> 2204929 INFO  (coreLoadExecutor-7681-thread-1-processing-n:127.0.0.1:64697_) [n:127.0.0.1:64697_ c:collection1   x:collection1] o.a.s.s.IndexSchema Loaded schema test/1.0 with uniqueid field id
   [junit4]   2> 2204953 INFO  (coreLoadExecutor-7681-thread-1-processing-n:127.0.0.1:64697_) [n:127.0.0.1:64697_ c:collection1   x:collection1] o.a.s.c.CoreContainer Creating SolrCore 'collection1' using configuration from collection collection1
   [junit4]   2> 2204953 INFO  (coreLoadExecutor-7681-thread-1-processing-n:127.0.0.1:64697_) [n:127.0.0.1:64697_ c:collection1   x:collection1] o.a.s.c.SolrCore [[collection1] ] Opening new SolrCore at [/Users/jenkins/workspace/Lucene-Solr-master-MacOSX/solr/build/solr-core/test/J1/temp/solr.cloud.PeerSyncReplicationTest_279F1AA02F8A725C-001/shard-2-001/cores/collection1], dataDir=[/Users/jenkins/workspace/Lucene-Solr-master-MacOSX/solr/build/solr-core/test/J1/../../../../../../../../../Users/jenkins/workspace/Lucene-Solr-master-MacOSX/solr/build/solr-core/test/J1/temp/solr.cloud.PeerSyncReplicationTest_279F1AA02F8A725C-001/shard-2-001/cores/collection1/data/]
   [junit4]   2> 2204954 INFO  (coreLoadExecutor-7681-thread-1-processing-n:127.0.0.1:64697_) [n:127.0.0.1:64697_ c:collection1   x:collection1] o.a.s.c.JmxMonitoredMap JMX monitoring is enabled. Adding Solr mbeans to JMX Server: com.sun.jmx.mbeanserver.JmxMBeanServer@37e8379c
   [junit4]   2> 2204959 INFO  (coreLoadExecutor-7681-thread-1-processing-n:127.0.0.1:64697_) [n:127.0.0.1:64697_ c:collection1   x:collection1] o.a.s.u.RandomMergePolicy RandomMergePolicy wrapping class org.apache.lucene.index.LogByteSizeMergePolicy: [LogByteSizeMergePolicy: minMergeSize=1677721, mergeFactor=43, maxMergeSize=2147483648, maxMergeSizeForForcedMerge=9223372036854775807, calibrateSizeByDeletes=true, maxMergeDocs=2147483647, maxCFSSegmentSizeMB=8.796093022207999E12, noCFSRatio=1.0]
   [junit4]   2> 2204980 WARN  (coreLoadExecutor-7681-thread-1-processing-n:127.0.0.1:64697_) [n:127.0.0.1:64697_ c:collection1   x:collection1] o.a.s.c.RequestHandlers INVALID paramSet a in requestHandler {type = requestHandler,name = /dump,class = DumpRequestHandler,attributes = {initParams=a, name=/dump, class=DumpRequestHandler},args = {defaults={a=A,b=B}}}
   [junit4]   2> 2205021 INFO  (coreLoadExecutor-7681-thread-1-processing-n:127.0.0.1:64697_) [n:127.0.0.1:64697_ c:collection1   x:collection1] o.a.s.u.UpdateHandler Using UpdateLog implementation: org.apache.solr.update.UpdateLog
   [junit4]   2> 2205021 INFO  (coreLoadExecutor-7681-thread-1-processing-n:127.0.0.1:64697_) [n:127.0.0.1:64697_ c:collection1   x:collection1] o.a.s.u.UpdateLog Initializing UpdateLog: dataDir= defaultSyncLevel=FLUSH numRecordsToKeep=1000 maxNumLogsToKeep=10 numVersionBuckets=65536
   [junit4]   2> 2205022 INFO  (coreLoadExecutor-7681-thread-1-processing-n:127.0.0.1:64697_) [n:127.0.0.1:64697_ c:collection1   x:collection1] o.a.s.u.CommitTracker Hard AutoCommit: disabled
   [junit4]   2> 2205022 INFO  (coreLoadExecutor-7681-thread-1-processing-n:127.0.0.1:64697_) [n:127.0.0.1:64697_ c:collection1   x:collection1] o.a.s.u.CommitTracker Soft AutoCommit: disabled
   [junit4]   2> 2205023 INFO  (coreLoadExecutor-7681-thread-1-processing-n:127.0.0.1:64697_) [n:127.0.0.1:64697_ c:collection1   x:collection1] o.a.s.u.RandomMergePolicy RandomMergePolicy wrapping class org.apache.lucene.index.LogDocMergePolicy: [LogDocMergePolicy: minMergeSize=1000, mergeFactor=34, maxMergeSize=9223372036854775807, maxMergeSizeForForcedMerge=9223372036854775807, calibrateSizeByDeletes=true, maxMergeDocs=2147483647, maxCFSSegmentSizeMB=8.796093022207999E12, noCFSRatio=0.0]
   [junit4]   2> 2205038 INFO  (coreLoadExecutor-7681-thread-1-processing-n:127.0.0.1:64697_) [n:127.0.0.1:64697_ c:collection1   x:collection1] o.a.s.s.SolrIndexSearcher Opening [Searcher@717f7e57[collection1] main]
   [junit4]   2> 2205041 INFO  (coreLoadExecutor-7681-thread-1-processing-n:127.0.0.1:64697_) [n:127.0.0.1:64697_ c:collection1   x:collection1] o.a.s.r.ManagedResourceStorage Configured ZooKeeperStorageIO with znodeBase: /configs/conf1
   [junit4]   2> 2205041 INFO  (coreLoadExecutor-7681-thread-1-processing-n:127.0.0.1:64697_) [n:127.0.0.1:64697_ c:collection1   x:collection1] o.a.s.r.ManagedResourceStorage Loaded null at path _rest_managed.json using ZooKeeperStorageIO:path=/configs/conf1
   [junit4]   2> 2205041 INFO  (coreLoadExecutor-7681-thread-1-processing-n:127.0.0.1:64697_) [n:127.0.0.1:64697_ c:collection1   x:collection1] o.a.s.h.ReplicationHandler Commits will be reserved for  10000
   [junit4]   2> 2205043 INFO  (searcherExecutor-7682-thread-1-processing-n:127.0.0.1:64697_ x:collection1 c:collection1) [n:127.0.0.1:64697_ c:collection1   x:collection1] o.a.s.c.SolrCore [collection1] Registered new searcher Searcher@717f7e57[collection1] main{ExitableDirectoryReader(UninvertingDirectoryReader())}
   [junit4]   2> 2205043 INFO  (coreLoadExecutor-7681-thread-1-processing-n:127.0.0.1:64697_) [n:127.0.0.1:64697_ c:collection1   x:collection1] o.a.s.u.UpdateLog Could not find max version in index or recent updates, using new clock 1555570839024304128
   [junit4]   2> 2205051 INFO  (coreZkRegister-7676-thread-1-processing-n:127.0.0.1:64697_ x:collection1 c:collection1) [n:127.0.0.1:64697_ c:collection1 s:shard1 r:core_node2 x:collection1] o.a.s.c.ZkController Core needs to recover:collection1
   [junit4]   2> 2205052 INFO  (updateExecutor-3520-thread-1-processing-n:127.0.0.1:64697_ x:collection1 s:shard1 c:collection1 r:core_node2) [n:127.0.0.1:64697_ c:collection1 s:shard1 r:core_node2 x:collection1] o.a.s.u.DefaultSolrCoreState Running recovery
   [junit4]   2> 2205052 INFO  (recoveryExecutor-3521-thread-1-processing-n:127.0.0.1:64697_ x:collection1 s:shard1 c:collection1 r:core_node2) [n:127.0.0.1:64697_ c:collection1 s:shard1 r:core_node2 x:collection1] o.a.s.c.RecoveryStrategy Starting recovery process. recoveringAfterStartup=true
   [junit4]   2> 2205052 INFO  (recoveryExecutor-3521-thread-1-processing-n:127.0.0.1:64697_ x:collection1 s:shard1 c:collection1 r:core_node2) [n:127.0.0.1:64697_ c:collection1 s:shard1 r:core_node2 x:collection1] o.a.s.c.RecoveryStrategy ###### startupVersions=[[]]
   [junit4]   2> 2205052 INFO  (recoveryExecutor-3521-thread-1-processing-n:127.0.0.1:64697_ x:collection1 s:shard1 c:collection1 r:core_node2) [n:127.0.0.1:64697_ c:collection1 s:shard1 r:core_node2 x:collection1] o.a.s.c.RecoveryStrategy Begin buffering updates. core=[collection1]
   [junit4]   2> 2205053 INFO  (recoveryExecutor-3521-thread-1-processing-n:127.0.0.1:64697_ x:collection1 s:shard1 c:collection1 r:core_node2) [n:127.0.0.1:64697_ c:collection1 s:shard1 r:core_node2 x:collection1] o.a.s.u.UpdateLog Starting to buffer updates. FSUpdateLog{state=ACTIVE, tlog=null}
   [junit4]   2> 2205053 INFO  (recoveryExecutor-3521-thread-1-processing-n:127.0.0.1:64697_ x:collection1 s:shard1 c:collection1 r:core_node2) [n:127.0.0.1:64697_ c:collection1 s:shard1 r:core_node2 x:collection1] o.a.s.c.RecoveryStrategy Publishing state of core [collection1] as recovering, leader is [http://127.0.0.1:64686/collection1/] and I am [http://127.0.0.1:64697/collection1/]
   [junit4]   2> 2205056 INFO  (recoveryExecutor-3521-thread-1-processing-n:127.0.0.1:64697_ x:collection1 s:shard1 c:collection1 r:core_node2) [n:127.0.0.1:64697_ c:collection1 s:shard1 r:core_node2 x:collection1] o.a.s.c.RecoveryStrategy Sending prep recovery command to [http://127.0.0.1:64686]; [WaitForState: action=PREPRECOVERY&core=collection1&nodeName=127.0.0.1:64697_&coreNodeName=core_node2&state=recovering&checkLive=true&onlyIfLeader=true&onlyIfLeaderActive=true]
   [junit4]   2> 2205059 INFO  (qtp1268827372-18647) [n:127.0.0.1:64686_    ] o.a.s.h.a.PrepRecoveryOp Going to wait for coreNodeName: core_node2, state: recovering, checkLive: true, onlyIfLeader: true, onlyIfLeaderActive: true
   [junit4]   2> 2205060 INFO  (qtp1268827372-18647) [n:127.0.0.1:64686_    ] o.a.s.h.a.PrepRecoveryOp Will wait a max of 183 seconds to see collection1 (shard1 of collection1) have state: recovering
   [junit4]   2> 2205060 INFO  (qtp1268827372-18647) [n:127.0.0.1:64686_    ] o.a.s.h.a.PrepRecoveryOp In WaitForState(recovering): collection=collection1, shard=shard1, thisCore=collection1, leaderDoesNotNeedRecovery=false, isLeader? true, live=true, checkLive=true, currentState=down, localState=active, nodeName=127.0.0.1:64697_, coreNodeName=core_node2, onlyIfActiveCheckResult=false, nodeProps: core_node2:{"core":"collection1","base_url":"http://127.0.0.1:64697","node_name":"127.0.0.1:64697_","state":"down"}
   [junit4]   2> 2205163 INFO  (zkCallback-3523-thread-1-processing-n:127.0.0.1:64697_) [n:127.0.0.1:64697_    ] o.a.s.c.c.ZkStateReader A cluster state change: [WatchedEvent state:SyncConnected type:NodeDataChanged path:/collections/collection1/state.json] for collection [collection1] has occurred - updating... (live nodes size: [3])
   [junit4]   2> 2205163 INFO  (zkCallback-3517-thread-2-processing-n:127.0.0.1:64686_) [n:127.0.0.1:64686_    ] o.a.s.c.c.ZkStateReader A cluster state change: [WatchedEvent state:SyncConnected type:NodeDataChanged path:/collections/collection1/state.json] for collection [collection1] has occurred - updating... (live nodes size: [3])
   [junit4]   2> 2205919 INFO  (TEST-PeerSyncReplicationTest.test-seed#[279F1AA02F8A725C]) [    ] o.a.s.SolrTestCaseJ4 Writing core.properties file to /Users/jenkins/workspace/Lucene-Solr-master-MacOSX/solr/build/solr-core/test/J1/temp/solr.cloud.PeerSyncReplicationTest_279F1AA02F8A725C-001/shard-3-001/cores/collection1
   [junit4]   2> 2205920 INFO  (TEST-PeerSyncReplicationTest.test-seed#[279F1AA02F8A725C]) [    ] o.a.s.c.AbstractFullDistribZkTestBase create jetty 3 in directory /Users/jenkins/workspace/Lucene-Solr-master-MacOSX/solr/build/solr-core/test/J1/temp/solr.cloud.PeerSyncReplicationTest_279F1AA02F8A725C-001/shard-3-001
   [junit4]   2> 2205921 INFO  (TEST-PeerSyncReplicationTest.test-seed#[279F1AA02F8A725C]) [    ] o.e.j.s.Server jetty-9.3.14.v20161028
   [junit4]   2> 2205923 INFO  (TEST-PeerSyncReplicationTest.test-seed#[279F1AA02F8A725C]) [    ] o.e.j.s.h.ContextHandler Started o.e.j.s.ServletContextHandler@37bf1371{/,null,AVAILABLE}
   [junit4]   2> 2205924 INFO  (TEST-PeerSyncReplicationTest.test-seed#[279F1AA02F8A725C]) [    ] o.e.j.s.AbstractConnector Started ServerConnector@23821ba1{HTTP/1.1,[http/1.1]}{127.0.0.1:64707}
   [junit4]   2> 2205925 INFO  (TEST-PeerSyncReplicationTest.test-seed#[279F1AA02F8A725C]) [    ] o.e.j.s.Server Started @2211484ms
   [junit4]   2> 2205925 INFO  (TEST-PeerSyncReplicationTest.test-seed#[279F1AA02F8A725C]) [    ] o.a.s.c.s.e.JettySolrRunner Jetty properties: {solr.data.dir=/Users/jenkins/workspace/Lucene-Solr-master-MacOSX/solr/build/solr-core/test/J1/temp/solr.cloud.PeerSyncReplicationTest_279F1AA02F8A725C-001/tempDir-001/jetty3, solrconfig=solrconfig.xml, hostContext=/, hostPort=64707, coreRootDirectory=/Users/jenkins/workspace/Lucene-Solr-master-MacOSX/solr/build/solr-core/test/J1/temp/solr.cloud.PeerSyncReplicationTest_279F1AA02F8A725C-001/shard-3-001/cores}
   [junit4]   2> 2205925 ERROR (TEST-PeerSyncReplicationTest.test-seed#[279F1AA02F8A725C]) [    ] o.a.s.s.StartupLoggingUtils Missing Java Option solr.log.dir. Logging may be missing or incomplete.
   [junit4]   2> 2205926 INFO  (TEST-PeerSyncReplicationTest.test-seed#[279F1AA02F8A725C]) [    ] o.a.s.s.SolrDispatchFilter  ___      _       Welcome to Apache Solr™ version 7.0.0
   [junit4]   2> 2205926 INFO  (TEST-PeerSyncReplicationTest.test-seed#[279F1AA02F8A725C]) [    ] o.a.s.s.SolrDispatchFilter / __| ___| |_ _   Starting in cloud mode on port null
   [junit4]   2> 2205926 INFO  (TEST-PeerSyncReplicationTest.test-seed#[279F1AA02F8A725C]) [    ] o.a.s.s.SolrDispatchFilter \__ \/ _ \ | '_|  Install dir: null
   [junit4]   2> 2205926 INFO  (TEST-PeerSyncReplicationTest.test-seed#[279F1AA02F8A725C]) [    ] o.a.s.s.SolrDispatchFilter |___/\___/_|_|    Start time: 2017-01-04T05:32:37.411Z
   [junit4]   2> 2205932 INFO  (TEST-PeerSyncReplicationTest.test-seed#[279F1AA02F8A725C]) [    ] o.a.s.s.SolrDispatchFilter Loading solr.xml from SolrHome (not found in ZooKeeper)
   [junit4]   2> 2205932 INFO  (TEST-PeerSyncReplicationTest.test-seed#[279F1AA02F8A725C]) [    ] o.a.s.c.SolrXmlConfig Loading container configuration from /Users/jenkins/workspace/Lucene-Solr-master-MacOSX/solr/build/solr-core/test/J1/temp/solr.cloud.PeerSyncReplicationTest_279F1AA02F8A725C-001/shard-3-001/solr.xml
   [junit4]   2> 2205966 INFO  (TEST-PeerSyncReplicationTest.test-seed#[279F1AA02F8A725C]) [    ] o.a.s.c.ZkContainer Zookeeper client=127.0.0.1:64669/solr
   [junit4]   2> 2205985 INFO  (TEST-PeerSyncReplicationTest.test-seed#[279F1AA02F8A725C]) [n:127.0.0.1:64707_    ] o.a.s.c.c.ZkStateReader Updated live nodes from ZooKeeper... (0) -> (3)
   [junit4]   2> 2206000 INFO  (TEST-PeerSyncReplicationTest.test-seed#[279F1AA02F8A725C]) [n:127.0.0.1:64707_    ] o.a.s.c.ZkController Register node as live in ZooKeeper:/live_nodes/127.0.0.1:64707_
   [junit4]   2> 2206003 INFO  (zkCallback-3523-thread-1-processing-n:127.0.0.1:64697_) [n:127.0.0.1:64697_    ] o.a.s.c.c.ZkStateReader Updated live nodes from ZooKeeper... (3) -> (4)
   [junit4]   2> 2206005 INFO  (zkCallback-3530-thread-1-processing-n:127.0.0.1:64707_) [n:127.0.0.1:64707_    ] o.a.s.c.c.ZkStateReader Updated live nodes from ZooKeeper... (3) -> (4)
   [junit4]   2> 2206004 INFO  (zkCallback-3507-thread-2-processing-n:127.0.0.1:64672_) [n:127.0.0.1:64672_    ] o.a.s.c.c.ZkStateReader Updated live nodes from ZooKeeper... (3) -> (4)
   [junit4]   2> 2206004 INFO  (zkCallback-3517-thread-2-processing-n:127.0.0.1:64686_) [n:127.0.0.1:64686_    ] o.a.s.c.c.ZkStateReader Updated live nodes from ZooKeeper... (3) -> (4)
   [junit4]   2> 2206006 INFO  (zkCallback-3511-thread-1) [    ] o.a.s.c.c.ZkStateReader Updated live nodes from ZooKeeper... (3) -> (4)
   [junit4]   2> 2206065 INFO  (qtp1268827372-18647) [n:127.0.0.1:64686_    ] o.a.s.h.a.PrepRecoveryOp In WaitForState(recovering): collection=collection1, shard=shard1, thisCore=collection1, leaderDoesNotNeedRecovery=false, isLeader? true, live=true, checkLive=true, currentState=recovering, localState=active, nodeName=127.0.0.1:64697_, coreNodeName=core_node2, onlyIfActiveCheckResult=false, nodeProps: core_node2:{"core":"collection1","base_url":"http://127.0.0.1:64697","node_name":"127.0.0.1:64697_","state":"recovering"}
   [junit4]   2> 2206065 INFO  (qtp1268827372-18647) [n:127.0.0.1:64686_    ] o.a.s.h.a.PrepRecoveryOp Waited coreNodeName: core_node2, state: recovering, checkLive: true, onlyIfLeader: true for: 1 seconds.
   [junit4]   2> 2206066 INFO  (qtp1268827372-18647) [n:127.0.0.1:64686_    ] o.a.s.s.HttpSolrCall [admin] webapp=null path=/admin/cores params={nodeName=127.0.0.1:64697_&onlyIfLeaderActive=true&core=collection1&coreNodeName=core_node2&action=PREPRECOVERY&checkLive=true&state=recovering&onlyIfLeader=true&wt=javabin&version=2} status=0 QTime=1006
   [junit4]   2> 2206123 INFO  (zkCallback-3523-thread-1-processing-n:127.0.0.1:64697_) [n:127.0.0.1:64697_    ] o.a.s.c.c.ZkStateReader A cluster state change: [WatchedEvent state:SyncConnected type:NodeDataChanged path:/collections/collection1/state.json] for collection [collection1] has occurred - updating... (live nodes size: [4])
   [junit4]   2> 2206123 INFO  (zkCallback-3517-thread-2-processing-n:127.0.0.1:64686_) [n:127.0.0.1:64686_    ] o.a.s.c.c.ZkStateReader A cluster state change: [WatchedEvent state:SyncConnected type:NodeDataChanged path:/collections/collection1/state.json] for collection [collection1] has occurred - updating... (live nodes size: [4])
   [junit4]   2> 2206130 INFO  (TEST-PeerSyncReplicationTest.test-seed#[279F1AA02F8A725C]) [n:127.0.0.1:64707_    ] o.a.s.c.CorePropertiesLocator Found 1 core definitions underneath /Users/jenkins/workspace/Lucene-Solr-master-MacOSX/solr/build/solr-core/test/J1/temp/solr.cloud.PeerSyncReplicationTest_279F1AA02F8A725C-001/shard-3-001/cores
   [junit4]   2> 2206131 INFO  (TEST-PeerSyncReplicationTest.test-seed#[279F1AA02F8A725C]) [n:127.0.0.1:64707_    ] o.a.s.c.CorePropertiesLocator Cores are: [collection1]
   [junit4]   2> 2206135 INFO  (OverseerStateUpdate-97223176799911940-127.0.0.1:64672_-n_0000000000) [n:127.0.0.1:64672_    ] o.a.s.c.o.ReplicaMutator Assigning new node to shard shard=shard1
   [junit4]   2> 2206247 INFO  (zkCallback-3530-thread-1-processing-n:127.0.0.1:64707_) [n:127.0.0.1:64707_    ] o.a.s.c.c.ZkStateReader A cluster state change: [WatchedEvent state:SyncConnected type:NodeDataChanged path:/collections/collection1/state.json] for collection [collection1] has occurred - updating... (live nodes size: [4])
   [junit4]   2> 2206247 INFO  (zkCallback-3517-thread-2-processing-n:127.0.0.1:64686_) [n:127.0.0.1:64686_    ] o.a.s.c.c.ZkStateReader A cluster state change: [WatchedEvent state:SyncConnected type:NodeDataChanged path:/collections/collection1/state.json] for collection [collection1] has occurred - updating... (live nodes size: [4])
   [junit4]   2> 2206247 INFO  (zkCallback-3523-thread-1-processing-n:127.0.0.1:64697_) [n:127.0.0.1:64697_    ] o.a.s.c.c.ZkStateReader A cluster state change: [WatchedEvent state:SyncConnected type:NodeDataChanged path:/collections/collection1/state.json] for collection [collection1] has occurred - updating... (live nodes size: [4])
   [junit4]   2> 2207159 WARN  (coreLoadExecutor-7692-thread-1-processing-n:127.0.0.1:64707_) [n:127.0.0.1:64707_ c:collection1   x:collection1] o.a.s.c.Config Beginning with Solr 5.5, <mergePolicy> is deprecated, use <mergePolicyFactory> instead.
   [junit4]   2> 2207160 INFO  (coreLoadExecutor-7692-thread-1-processing-n:127.0.0.1:64707_) [n:127.0.0.1:64707_ c:collection1   x:collection1] o.a.s.c.SolrConfig Using Lucene MatchVersion: 7.0.0
   [junit4]   2> 2207181 INFO  (coreLoadExecutor-7692-thread-1-processing-n:127.0.0.1:64707_) [n:127.0.0.1:64707_ c:collection1   x:collection1] o.a.s.s.IndexSchema [collection1] Schema name=test
   [junit4]   2> 2207334 WARN  (coreLoadExecutor-7692-thread-1-processing-n:127.0.0.1:64707_) [n:127.0.0.1:64707_ c:collection1   x:collection1] o.a.s.s.IndexSchema [collection1] default search field in schema is text. WARNING: Deprecated, please use 'df' on request instead.
   [junit4]   2> 2207338 INFO  (coreLoadExecutor-7692-thread-1-processing-n:127.0.0.1:64707_) [n:127.0.0.1:64707_ c:collection1   x:collection1] o.a.s.s.IndexSchema Loaded schema test/1.0 with uniqueid field id
   [junit4]   2> 2207367 INFO  (coreLoadExecutor-7692-thread-1-processing-n:127.0.0.1:64707_) [n:127.0.0.1:64707_ c:collection1   x:collection1] o.a.s.c.CoreContainer Creating SolrCore 'collection1' using configuration from collection collection1
   [junit4]   2> 2207367 INFO  (coreLoadExecutor-7692-thread-1-processing-n:127.0.0.1:64707_) [n:127.0.0.1:64707_ c:collection1   x:collection1] o.a.s.c.SolrCore [[collection1] ] Opening new SolrCore at [/Users/jenkins/workspace/Lucene-Solr-master-MacOSX/solr/build/solr-core/test/J1/temp/solr.cloud.PeerSyncReplicationTest_279F1AA02F8A725C-001/shard-3-001/cores/collection1], dataDir=[/Users/jenkins/workspace/Lucene-Solr-master-MacOSX/solr/build/solr-core/test/J1/temp/solr.cloud.PeerSyncReplicationTest_279F1AA02F8A725C-001/shard-3-001/cores/collection1/data/]
   [junit4]   2> 2207368 INFO  (coreLoadExecutor-7692-thread-1-processing-n:127.0.0.1:64707_) [n:127.0.0.1:64707_ c:collection1   x:collection1] o.a.s.c.JmxMonitoredMap JMX monitoring is enabled. Adding Solr mbeans to JMX Server: com.sun.jmx.mbeanserver.JmxMBeanServer@37e8379c
   [junit4]   2> 2207372 INFO  (coreLoadExecutor-7692-thread-1-processing-n:127.0.0.1:64707_) [n:127.0.0.1:64707_ c:collection1   x:collection1] o.a.s.u.RandomMergePolicy RandomMergePolicy wrapping class org.apache.lucene.index.LogByteSizeMergePolicy: [LogByteSizeMergePolicy: minMergeSize=1677721, mergeFactor=43, maxMergeSize=2147483648, maxMergeSizeForForcedMerge=9223372036854775807, calibrateSizeByDeletes=true, maxMergeDocs=2147483647, maxCFSSegmentSizeMB=8.796093022207999E12, noCFSRatio=1.0]
   [junit4]   2> 2207389 WARN  (coreLoadExecutor-7692-thread-1-processing-n:127.0.0.1:64707_) [n:127.0.0.1:64707_ c:collection1   x:collection1] o.a.s.c.RequestHandlers INVALID paramSet a in requestHandler {type = requestHandler,name = /dump,class = DumpRequestHandler,attributes = {initParams=a, name=/dump, class=DumpRequestHandler},args = {defaults={a=A,b=B}}}
   [junit4]   2> 2207423 INFO  (coreLoadExecutor-7692-thread-1-processing-n:127.0.0.1:64707_) [n:127.0.0.1:64707_ c:collection1   x:collection1] o.a.s.u.UpdateHandler Using UpdateLog implementation: org.apache.solr.update.UpdateLog
   [junit4]   2> 2207423 INFO  (coreLoadExecutor-7692-thread-1-processing-n:127.0.0.1:64707_) [n:127.0.0.1:64707_ c:collection1   x:collection1] o.a.s.u.UpdateLog Initializing UpdateLog: dataDir= defaultSyncLevel=FLUSH numRecordsToKeep=1000 maxNumLogsToKeep=10 numVersionBuckets=65536
   [junit4]   2> 2207424 INFO  (coreLoadExecutor-7692-thread-1-processing-n:127.0.0.1:64707_) [n:127.0.0.1:64707_ c:collection1   x:collection1] o.a.s.u.CommitTracker Hard AutoCommit: disabled
   [junit4]   2> 2207424 INFO  (coreLoadExecutor-7692-thread-1-processing-n:127.0.0.1:64707_) [n:127.0.0.1:64707_ c:collection1   x:collection1] o.a.s.u.CommitTracker Soft AutoCommit: disabled
   [junit4]   2> 2207425 INFO  (coreLoadExecutor-7692-thread-1-processing-n:127.0.0.1:64707_) [n:127.0.0.1:64707_ c:collection1   x:collection1] o.a.s.u.RandomMergePolicy RandomMergePolicy wrapping class org.apache.lucene.index.LogDocMergePolicy: [LogDocMergePolicy: minMergeSize=1000, mergeFactor=34, maxMergeSize=9223372036854775807, maxMergeSizeForForcedMerge=9223372036854775807, calibrateSizeByDeletes=true, maxMergeDocs=2147483647, maxCFSSegmentSizeMB=8.796093022207999E12, noCFSRatio=0.0]
   [junit4]   2> 2207427 INFO  (coreLoadExecutor-7692-thread-1-processing-n:127.0.0.1:64707_) [n:127.0.0.1:64707_ c:collection1   x:collection1] o.a.s.s.SolrIndexSearcher Opening [Searcher@63dd97d5[collection1] main]
   [junit4]   2> 2207429 INFO  (coreLoadExecutor-7692-thread-1-processing-n:127.0.0.1:64707_) [n:127.0.0.1:64707_ c:collection1   x:collection1] o.a.s.r.ManagedResourceStorage Configured ZooKeeperStorageIO with znodeBase: /configs/conf1
   [junit4]   2> 2207429 INFO  (coreLoadExecutor-7692-thread-1-processing-n:127.0.0.1:64707_) [n:127.0.0.1:64707_ c:collection1   x:collection1] o.a.s.r.ManagedResourceStorage Loaded null at path _rest_managed.json using ZooKeeperStorageIO:path=/configs/conf1
   [junit4]   2> 2207429 INFO  (coreLoadExecutor-7692-thread-1-processing-n:127.0.0.1:64707_) [n:127.0.0.1:64707_ c:collection1   x:collection1] o.a.s.h.ReplicationHandler Commits will be reserved for  10000
   [junit4]   2> 2207430 INFO  (searcherExecutor-7693-thread-1-processing-n:127.0.0.1:64707_ x:collection1 c:collection1) [n:127.0.0.1:64707_ c:collection1   x:collection1] o.a.s.c.SolrCore [collection1] Registered new searcher Searcher@63dd97d5[collection1] main{ExitableDirectoryReader(UninvertingDirectoryReader())}
   [junit4]   2> 2207431 INFO  (coreLoadExecutor-7692-thread-1-processing-n:127.0.0.1:64707_) [n:127.0.0.1:64707_ c:collection1   x:collection1] o.a.s.u.UpdateLog Could not find max version in index or recent updates, using new clock 1555570841528303616
   [junit4]   2> 2207437 INFO  (coreZkRegister-7687-thread-1-processing-n:127.0.0.1:64707_ x:collection1 c:collection1) [n:127.0.0.1:64707_ c:collection1 s:shard1 r:core_node3 x:collection1] o.a.s.c.ZkController Core needs to recover:collection1
   [junit4]   2> 2207438 INFO  (updateExecutor-3527-thread-1-processing-n:127.0.0.1:64707_ x:collection1 s:shard1 c:collection1 r:core_node3) [n:127.0.0.1:64707_ c:collection1 s:shard1 r:core_node3 x:collection1] o.a.s.u.DefaultSolrCoreState Running recovery
   [junit4]   2> 2207439 INFO  (recoveryExecutor-3528-thread-1-processing-n:127.0.0.1:64707_ x:collection1 s:shard1 c:collection1 r:core_node3) [n:127.0.0.1:64707_ c:collection1 s:shard1 r:core_node3 x:collection1] o.a.s.c.RecoveryStrategy Starting recovery process. recoveringAfterStartup=true
   [junit4]   2> 2207439 INFO  (recoveryExecutor-3528-thread-1-processing-n:127.0.0.1:64707_ x:collection1 s:shard1 c:collection1 r:core_node3) [n:127.0.0.1:64707_ c:collection1 s:shard1 r:core_node3 x:collection1] o.a.s.c.RecoveryStrategy ###### startupVersions=[[]]
   [junit4]   2> 2207439 INFO  (recoveryExecutor-3528-thread-1-processing-n:127.0.0.1:64707_ x:collection1 s:shard1 c:collection1 r:core_node3) [n:127.0.0.1:64707_ c:collection1 s:shard1 r:core_node3 x:collection1] o.a.s.c.RecoveryStrategy Begin buffering updates. core=[collection1]
   [junit4]   2> 2207439 INFO  (recoveryExecutor-3528-thread-1-processing-n:127.0.0.1:64707_ x:collection1 s:shard1 c:collection1 r:core_node3) [n:127.0.0.1:64707_ c:collection1 s:shard1 r:core_node3 x:collection1] o.a.s.u.UpdateLog Starting to buffer updates. FSUpdateLog{state=ACTIVE, tlog=null}
   [junit4]   2> 2207439 INFO  (recoveryExecutor-3528-thread-1-processing-n:127.0.0.1:64707_ x:collection1 s:shard1 c:collection1 r:core_node3) [n:127.0.0.1:64707_ c:collection1 s:shard1 r:core_node3 x:collection1] o.a.s.c.RecoveryStrategy Publishing state of core [collection1] as recovering, leader is [http://127.0.0.1:64686/collection1/] and I am [http://127.0.0.1:64707/collection1/]
   [junit4]   2> 2207442 INFO  (recoveryExecutor-3528-thread-1-processing-n:127.0.0.1:64707_ x:collection1 s:shard1 c:collection1 r:core_node3) [n:127.0.0.1:64707_ c:collection1 s:shard1 r:core_node3 x:collection1] o.a.s.c.RecoveryStrategy Sending prep recovery command to [http://127.0.0.1:64686]; [WaitForState: action=PREPRECOVERY&core=collection1&nodeName=127.0.0.1:64707_&coreNodeName=core_node3&state=recovering&checkLive=true&onlyIfLeader=true&onlyIfLeaderActive=true]
   [junit4]   2> 2207444 INFO  (qtp1268827372-18649) [n:127.0.0.1:64686_    ] o.a.s.h.a.PrepRecoveryOp Going to wait for coreNodeName: core_node3, state: recovering, checkLive: true, onlyIfLeader: true, onlyIfLeaderActive: true
   [junit4]   2> 2207445 INFO  (qtp1268827372-18649) [n:127.0.0.1:64686_    ] o.a.s.h.a.PrepRecoveryOp Will wait a max of 183 seconds to see collection1 (shard1 of collection1) have state: recovering
   [junit4]   2> 2207445 INFO  (qtp1268827372-18649) [n:127.0.0.1:64686_    ] o.a.s.h.a.PrepRecoveryOp In WaitForState(recovering): collection=collection1, shard=shard1, thisCore=collection1, leaderDoesNotNeedRecovery=false, isLeader? true, live=true, checkLive=true, currentState=down, localState=active, nodeName=127.0.0.1:64707_, coreNodeName=core_node3, onlyIfActiveCheckResult=false, nodeProps: core_node3:{"core":"collection1","base_url":"http://127.0.0.1:64707","node_name":"127.0.0.1:64707_","state":"down"}
   [junit4]   2> 2207548 INFO  (zkCallback-3523-thread-1-processing-n:127.0.0.1:64697_) [n:127.0.0.1:64697_    ] o.a.s.c.c.ZkStateReader A cluster state change: [WatchedEvent state:SyncConnected type:NodeDataChanged path:/collections/collection1/state.json] for collection [collection1] has occurred - updating... (live nodes size: [4])
   [junit4]   2> 2207549 INFO  (zkCallback-3530-thread-1-processing-n:127.0.0.1:64707_) [n:127.0.0.1:64707_    ] o.a.s.c.c.ZkStateReader A cluster state change: [WatchedEvent state:SyncConnected type:NodeDataChanged path:/collections/collection1/state.json] for collection [collection1] has occurred - updating... (live nodes size: [4])
   [junit4]   2> 2207549 INFO  (zkCallback-3517-thread-2-processing-n:127.0.0.1:64686_) [n:127.0.0.1:64686_    ] o.a.s.c.c.ZkStateReader A cluster state change: [WatchedEvent state:SyncConnected type:NodeDataChanged path:/collections/collection1/state.json] for collection [collection1] has occurred - updating... (live nodes size: [4])
   [junit4]   2> 2207926 INFO  (TEST-PeerSyncReplicationTest.test-seed#[279F1AA02F8A725C]) [    ] o.a.s.SolrTestCaseJ4 ###Starting test
   [junit4]   2> 2207927 INFO  (TEST-PeerSyncReplicationTest.test-seed#[279F1AA02F8A725C]) [    ] o.a.s.c.AbstractFullDistribZkTestBase Wait for recoveries to finish - wait 30 for each attempt
   [junit4]   2> 2207927 INFO  (TEST-PeerSyncReplicationTest.test-seed#[279F1AA02F8A725C]) [    ] o.a.s.c.AbstractDistribZkTestBase Wait for recoveries to finish - collection: collection1 failOnTimeout:true timeout (sec):30
   [junit4]   2> 2208446 INFO  (qtp1268827372-18649) [n:127.0.0.1:64686_    ] o.a.s.h.a.PrepRecoveryOp In WaitForState(recovering): collection=collection1, shard=shard1, thisCore=collection1, leaderDoesNotNeedRecovery=false, isLeader? true, live=true, checkLive=true, currentState=recovering, localState=active, nodeName=127.0.0.1:64707_, coreNodeName=core_node3, onlyIfActiveCheckResult=false, nodeProps: core_node3:{"core":"collection1","base_url":"http://127.0.0.1:64707","node_name":"127.0.0.1:64707_","state":"recovering"}
   [junit4]   2> 2208447 INFO  (qtp1268827372-18649) [n:127.0.0.1:64686_    ] o.a.s.h.a.PrepRecoveryOp Waited coreNodeName: core_node3, state: recovering, checkLive: true, onlyIfLeader: true for: 1 seconds.
   [junit4]   2> 2208447 INFO  (qtp1268827372-18649) [n:127.0.0.1:64686_    ] o.a.s.s.HttpSolrCall [admin] webapp=null path=/admin/cores params={nodeName=127.0.0.1:64707_&onlyIfLeaderActive=true&core=collection1&coreNodeName=core_node3&action=PREPRECOVERY&checkLive=true&state=recovering&onlyIfLeader=true&wt=javabin&version=2} status=0 QTime=1003
   [junit4]   2> 2213073 INFO  (recoveryExecutor-3521-thread-1-processing-n:127.0.0.1:64697_ x:collection1 s:shard1 c:collection1 r:core_node2) [n:127.0.0.1:64697_ c:collection1 s:shard1 r:core_node2 x:collection1] o.a.s.c.RecoveryStrategy Attempting to PeerSync from [http://127.0.0.1:64686/collection1/] - recoveringAfterStartup=[true]
   [junit4]   2> 2213074 INFO  (recoveryExecutor-3521-thread-1-processing-n:127.0.0.1:64697_ x:collection1 s:shard1 c:collection1 r:core_node2) [n:127.0.0.1:64697_ c:collection1 s:shard1 r:core_node2 x:collection1] o.a.s.u.PeerSync PeerSync: core=collection1 url=http://127.0.0.1:64697 START replicas=[http://127.0.0.1:64686/collection1/] nUpdates=1000
   [junit4]   2> 2213077 INFO  (qtp1268827372-18647) [n:127.0.0.1:64686_ c:collection1 s:shard1 r:core_node1 x:collection1] o.a.s.u.IndexFingerprint IndexFingerprint millis:0.0 result:{maxVersionSpecified=9223372036854775807, maxVersionEncountered=0, maxInHash=0, versionsHash=0, numVersions=0, numDocs=0, maxDoc=0}
   [junit4]   2> 2213077 INFO  (qtp1268827372-18647) [n:127.0.0.1:64686_ c:collection1 s:shard1 r:core_node1 x:collection1] o.a.s.c.S.Request [collection1]  webapp= path=/get params={distrib=false&qt=/get&getFingerprint=9223372036854775807&wt=javabin&version=2} status=0 QTime=1
   [junit4]   2> 2213078 INFO  (recoveryExecutor-3521-thread-1-processing-n:127.0.0.1:64697_ x:collection1 s:shard1 c:collection1 r:core_node2) [n:127.0.0.1:64697_ c:collection1 s:shard1 r:core_node2 x:collection1] o.a.s.u.IndexFingerprint IndexFingerprint millis:0.0 result:{maxVersionSpecified=9223372036854775807, maxVersionEncountered=0, maxInHash=0, versionsHash=0, numVersions=0, numDocs=0, maxDoc=0}
   [junit4]   2> 2213078 INFO  (recoveryExecutor-3521-thread-1-processing-n:127.0.0.1:64697_ x:collection1 s:shard1 c:collection1 r:core_node2) [n:127.0.0.1:64697_ c:collection1 s:shard1 r:core_node2 x:collection1] o.a.s.u.PeerSync We are already in sync. No need to do a PeerSync 
   [junit4]   2> 2213078 INFO  (recoveryExecutor-3521-thread-1-processing-n:127.0.0.1:64697_ x:collection1 s:shard1 c:collection1 r:core_node2) [n:127.0.0.1:64697_ c:collection1 s:shard1 r:core_node2 x:collection1] o.a.s.u.DirectUpdateHandler2 start commit{,optimize=false,openSearcher=true,waitSearcher=true,expungeDeletes=false,softCommit=false,prepareCommit=false}
   [junit4]   2> 2213078 INFO  (recoveryExecutor-3521-thread-1-processing-n:127.0.0.1:64697_ x:collection1 s:shard1 c:collection1 r:core_node2) [n:127.0.0.1:64697_ c:collection1 s:shard1 r:core_node2 x:collection1] o.a.s.u.DirectUpdateHandler2 No uncommitted changes. Skipping IW.commit.
   [junit4]   2> 2213078 INFO  (recoveryExecutor-3521-thread-1-processing-n:127.0.0.1:64697_ x:collection1 s:shard1 c:collection1 r:core_node2) [n:127.0.0.1:64697_ c:collection1 s:shard1 r:core_node2 x:collection1] o.a.s.u.DirectUpdateHandler2 end_commit_flush
   [junit4]   2> 2213078 INFO  (recoveryExecutor-3521-thread-1-processing-n:127.0.0.1:64697_ x:collection1 s:shard1 c:collection1 r:core_node2) [n:127.0.0.1:64697_ c:collection1 s:shard1 r:core_node2 x:collection1] o.a.s.c.RecoveryStrategy PeerSync stage of recovery was successful.
   [junit4]   2> 2213079 INFO  (recoveryExecutor-3521-thread-1-processing-n:127.0.0.1:64697_ x:collection1 s:shard1 c:collection1 r:core_node2) [n:127.0.0.1:64697_ c:collection1 s:shard1 r:core_node2 x:collection1] o.a.s.c.RecoveryStrategy Replaying updates buffered during PeerSync.
   [junit4]   2> 2213079 INFO  (recoveryExecutor-3521-thread-1-processing-n:127.0.0.1:64697_ x:collection1 s:shard1 c:collection1 r:core_node2) [n:127.0.0.1:64697_ c:collection1 s:shard1 r:core_node2 x:collection1] o.a.s.c.RecoveryStrategy No replay needed.
   [junit4]   2> 2213079 INFO  (recoveryExecutor-3521-thread-1-processing-n:127.0.0.1:64697_ x:collection1 s:shard1 c:collection1 r:core_node2) [n:127.0.0.1:64697_ c:collection1 s:shard1 r:core_node2 x:collection1] o.a.s.c.RecoveryStrategy Registering as Active after recovery.
   [junit4]   2> 2213085 INFO  (zkCallback-3523-thread-1-processing-n:127.0.0.1:64697_) [n:127.0.0.1:64697_    ] o.a.s.c.c.ZkStateReader A cluster state change: [WatchedEvent state:SyncConnected type:NodeDataChanged path:/collections/collection1/state.json] for collection [collection1] has occurred - updating... (live nodes size: [4])
   [junit4]   2> 2213085 INFO  (zkCallback-3517-thread-2-processing-n:127.0.0.1:64686_) [n:127.0.0.1:64686_    ] o.a.s.c.c.ZkStateReader A cluster state change: [WatchedEvent state:SyncConnected type:NodeDataChanged path:/collections/collection1/state.json] for collection [collection1] has occurred - updating... (live nodes size: [4])
   [junit4]   2> 2213085 INFO  (zkCallback-3530-thread-1-processing-n:127.0.0.1:64707_) [n:127.0.0.1:64707_    ] o.a.s.c.c.ZkStateReader A cluster state change: [WatchedEvent state:SyncConnected type:NodeDataChanged path:/collections/collection1/state.json] for collection [collection1] has occurred - updating... (live nodes size: [4])
   [junit4]   2> 2215456 INFO  (recoveryExecutor-3528-thread-1-processing-n:127.0.0.1:64707_ x:collection1 s:shard1 c:collection1 r:core_node3) [n:127.0.0.1:64707_ c:collection1 s:shard1 r:core_node3 x:collection1] o.a.s.c.RecoveryStrategy Attempting to PeerSync from [http://127.0.0.1:64686/collection1/] - recoveringAfterStartup=[true]
   [junit4]   2> 2215456 INFO  (recoveryExecutor-3528-thread-1-processing-n:127.0.0.1:64707_ x:collection1 s:shard1 c:collection1 r:core_node3) [n:127.0.0.1:64707_ c:collection1 s:shard1 r:core_node3 x:collection1] o.a.s.u.PeerSync PeerSync: core=collection1 url=http://127.0.0.1:64707 START replicas=[http://127.0.0.1:64686/collection1/] nUpdates=1000
   [junit4]   2> 2215458 INFO  (qtp1268827372-18650) [n:127.0.0.1:64686_ c:collection1 s:shard1 r:core_node1 x:collection1] o.a.s.u.IndexFingerprint IndexFingerprint millis:0.0 result:{maxVersionSpecified=9223372036854775807, maxVersionEncountered=0, maxInHash=0, versionsHash=0, numVersions=0, numDocs=0, maxDoc=0}
   [junit4]   2> 2215459 INFO  (qtp1268827372-18650) [n:127.0.0.1:64686_ c:collection1 s:shard1 r:core_node1 x:collection1] o.a.s.c.S.Request [collection1]  webapp= path=/get params={distrib=false&qt=/get&getFingerprint=9223372036854775807&wt=javabin&version=2} status=0 QTime=0
   [junit4]   2> 2215460 INFO  (recoveryExecutor-3528-thread-1-processing-n:127.0.0.1:64707_ x:collection1 s:shard1 c:collection1 r:core_node3) [n:127.0.0.1:64707_ c:collection1 s:shard1 r:core_node3 x:collection1] o.a.s.u.IndexFingerprint IndexFingerprint millis:0.0 result:{maxVersionSpecified=9223372036854775807, maxVersionEncountered=0, maxInHash=0, versionsHash=0, numVersions=0, numDocs=0, maxDoc=0}
   [junit4]   2> 2215460 INFO  (recoveryExecutor-3528-thread-1-processing-n:127.0.0.1:64707_ x:collection1 s:shard1 c:collection1 r:core_node3) [n:127.0.0.1:64707_ c:collection1 s:shard1 r:core_node3 x:collection1] o.a.s.u.PeerSync We are already in sync. No need to do a PeerSync 
   [junit4]   2> 2215460 INFO  (recoveryExecutor-3528-thread-1-processing-n:127.0.0.1:64707_ x:collection1 s:shard1 c:collection1 r:core_node3) [n:127.0.0.1:64707_ c:collection1 s:shard1 r:core_node3 x:collection1] o.a.s.u.DirectUpdateHandler2 start commit{,optimize=false,openSearcher=true,waitSearcher=true,expungeDeletes=false,softCommit=false,prepareCommit=false}
   [junit4]   2> 2215460 INFO  (recoveryExecutor-3528-thread-1-processing-n:127.0.0.1:64707_ x:collection1 s:shard1 c:collection1 r:core_node3) [n:127.0.0.1:64707_ c:collection1 s:shard1 r:core_node3 x:collection1] o.a.s.u.DirectUpdateHandler2 No uncommitted changes. Skipping IW.commit.
   [junit4]   2> 2215461 INFO  (recoveryExecutor-3528-thread-1-processing-n:127.0.0.1:64707_ x:collection1 s:shard1 c:collection1 r:core_node3) [n:127.0.0.1:64707_ c:collection1 s:shard1 r:core_node3 x:collection1] o.a.s.u.DirectUpdateHandler2 end_commit_flush
   [junit4]   2> 2215461 INFO  (recoveryExecutor-3528-thread-1-processing-n:127.0.0.1:64707_ x:collection1 s:shard1 c:collection1 r:core_node3) [n:127.0.0.1:64707_ c:collection1 s:shard1 r:core_node3 x:collection1] o.a.s.c.RecoveryStrategy PeerSync stage of recovery was successful.
   [junit4]   2> 2215461 INFO  (recoveryExecutor-3528-thread-1-processing-n:127.0.0.1:64707_ x:collection1 s:shard1 c:collection1 r:core_node3) [n:127.0.0.1:64707_ c:collection1 s:shard1 r:core_node3 x:collection1] o.a.s.c.RecoveryStrategy Replaying updates buffered during PeerSync.
   [junit4]   2> 2215462 INFO  (recoveryExecutor-3528-thread-1-processing-n:127.0.0.1:64707_ x:collection1 s:shard1 c:collection1 r:core_node3) [n:127.0.0.1:64707_ c:collection1 s:shard1 r:core_node3 x:collection1] o.a.s.c.RecoveryStrategy No replay needed.
   [junit4]   2> 2215462 INFO  (recoveryExecutor-3528-thread-1-processing-n:127.0.0.1:64707_ x:collection1 s:shard1 c:collection1 r:core_node3) [n:127.0.0.1:64707_ c:collection1 s:shard1 r:core_node3 x:collection1] o.a.s.c.RecoveryStrategy Registering as Active after recovery.
   [junit4]   2> 2215471 INFO  (zkCallback-3523-thread-1-processing-n:127.0.0.1:64697_) [n:127.0.0.1:64697_    ] o.a.s.c.c.ZkStateReader A cluster state change: [WatchedEvent state:SyncConnected type:NodeDataChanged path:/collections/collection1/state.json] for collection [collection1] has occurred - updating... (live nodes size: [4])
   [junit4]   2> 2215471 INFO  (zkCallback-3517-thread-2-processing-n:127.0.0.1:64686_) [n:127.0.0.1:64686_    ] o.a.s.c.c.ZkStateReader A cluster state change: [WatchedEvent state:SyncConnected type:NodeDataChanged path:/collections/collection1/state.json] for collection [collection1] has occurred - updating... (live nodes size: [4])
   [junit4]   2> 2215471 INFO  (zkCallback-3530-thread-1-processing-n:127.0.0.1:64707_) [n:127.0.0.1:64707_    ] o.a.s.c.c.ZkStateReader A cluster state change: [WatchedEvent state:SyncConnected type:NodeDataChanged path:/collections/collection1/state.json] for collection [collection1] has occurred - updating... (live nodes size: [4])
   [junit4]   2> 2215998 INFO  (TEST-PeerSyncReplicationTest.test-seed#[279F1AA02F8A725C]) [    ] o.a.s.c.AbstractDistribZkTestBase Recoveries finished - collection: collection1
   [junit4]   2> 2216005 INFO  (qtp1840822050-18608) [n:127.0.0.1:64672_ c:control_collection s:shard1 r:core_node1 x:collection1] o.a.s.u.DirectUpdateHandler2 start commit{,optimize=false,openSearcher=true,waitSearcher=true,expungeDeletes=false,softCommit=false,prepareCommit=false}
   [junit4]   2> 2216006 INFO  (qtp1840822050-18608) [n:127.0.0.1:64672_ c:control_collection s:shard1 r:core_node1 x:collection1] o.a.s.u.DirectUpdateHandler2 No uncommitted changes. Skipping IW.commit.
   [junit4]   2> 2216007 INFO  (qtp1840822050-18608) [n:127.0.0.1:64672_ c:control_collection s:shard1 r:core_node1 x:collection1] o.a.s.u.DirectUpdateHandler2 end_commit_flush
   [junit4]   2> 2216007 INFO  (qtp1840822050-18608) [n:127.0.0.1:64672_ c:control_collection s:shard1 r:core_node1 x:collection1] o.a.s.u.p.LogUpdateProcessorFactory [collection1]  webapp= path=/update params={waitSearcher=true&commit=true&softCommit=false&wt=javabin&version=2}{commit=} 0 2
   [junit4]   2> 2216012 INFO  (qtp1268827372-18645) [n:127.0.0.1:64686_ c:collection1 s:shard1 r:core_node1 x:collection1] o.a.s.u.DirectUpdateHandler2 start commit{,optimize=false,openSearcher=true,waitSearcher=true,expungeDeletes=false,softCommit=false,prepareCommit=false}
   [junit4]   2> 2216013 INFO  (qtp1268827372-18645) [n:127.0.0.1:64686_ c:collection1 s:shard1 r:core_node1 x:collection1] o.a.s.u.DirectUpdateHandler2 No uncommitted changes. Skipping IW.commit.
   [junit4]   2> 2216016 INFO  (qtp1017443405-18712) [n:127.0.0.1:64707_ c:collection1 s:shard1 r:core_node3 x:collection1] o.a.s.u.DirectUpdateHandler2 start commit{,optimize=false,openSearcher=true,waitSearcher=true,expungeDeletes=false,softCommit=false,prepareCommit=false}
   [junit4]   2> 2216016 INFO  (qtp2035448573-18677) [n:127.0.0.1:64697_ c:collection1 s:shard1 r:core_node2 x:collection1] o.a.s.u.DirectUpdateHandler2 start commit{,optimize=false,openSearcher=true,waitSearcher=true,expungeDeletes=false,softCommit=false,prepareCommit=false}
   [junit4]   2> 2216016 INFO  (qtp1017443405-18712) [n:127.0.0.1:64707_ c:collection1 s:shard1 r:core_node3 x:collection1] o.a.s.u.DirectUpdateHandler2 No uncommitted changes. Skipping IW.commit.
   [junit4]   2> 2216017 INFO  (qtp1268827372-18645) [n:127.0.0.1:64686_ c:collection1 s:shard1 r:core_node1 x:collection1] o.a.s.u.DirectUpdateHandler2 end_commit_flush
   [junit4]   2> 2216016 INFO  (qtp2035448573-18677) [n:127.0.0.1:64697_ c:collection1 s:shard1 r:core_node2 x:collection1] o.a.s.u.DirectUpdateHandler2 No uncommitted changes. Skipping IW.commit.
   [junit4]   2> 2216017 INFO  (qtp1017443405-18712) [n:127.0.0.1:64707_ c:collection1 s:shard1 r:core_node3 x:collection1] o.a.s.u.DirectUpdateHandler2 end_commit_flush
   [junit4]   2> 2216017 INFO  (qtp1268827372-18645) [n:127.0.0.1:64686_ c:collection1 s:shard1 r:core_node1 x:collection1] o.a.s.u.p.LogUpdateProcessorFactory [collection1]  webapp= path=/update params={update.distrib=FROMLEADER&waitSearcher=true&openSearcher=true&commit=true&softCommit=false&distrib.from=http://127.0.0.1:64686/collection1/&commit_end_point=true&wt=javabin&version=2&expungeDeletes=false}{commit=} 0 5
   [junit4]   2> 2216018 INFO  (qtp1017443405-18712) [n:127.0.0.1:64707_ c:collection1 s:shard1 r:core_node3 x:collection1] o.a.s.u.p.LogUpdateProcessorFactory [collection1]  webapp= path=/update params={update.distrib=FROMLEADER&waitSearcher=true&openSearcher=true&commit=true&softCommit=false&distrib.from=http://127.0.0.1:64686/collection1/&commit_end_point=true&wt=javabin&version=2&expungeDeletes=false}{commit=} 0 1
   [junit4]   2> 2216019 INFO  (qtp2035448573-18677) [n:127.0.0.1:64697_ c:collection1 s:shard1 r:core_node2 x:collection1] o.a.s.u.DirectUpdateHandler2 end_commit_flush
   [junit4]   2> 2216019 INFO  (qtp2035448573-18677) [n:127.0.0.1:64697_ c:collection1 s:shard1 r:core_node2 x:collection1] o.a.s.u.p.LogUpdateProcessorFactory [collection1]  webapp= path=/update params={update.distrib=FROMLEADER&waitSearcher=true&openSearcher=true&commit=true&softCommit=false&distrib.from=http://127.0.0.1:64686/collection1/&commit_end_point=true&wt=javabin&version=2&expungeDeletes=false}{commit=} 0 2
   [junit4]   2> 2216020 INFO  (qtp1268827372-18651) [n:127.0.0.1:64686_ c:collection1 s:shard1 r:core_node1 x:collection1] o.a.s.u.p.LogUpdateProcessorFactory [collection1]  webapp= path=/update params={_stateVer_=collection1:11&waitSearcher=true&commit=true&softCommit=false&wt=javabin&version=2}{commit=} 0 9
   [junit4]   2> 2216026 INFO  (qtp1268827372-18648) [n:127.0.0.1:64686_ c:collection1 s:shard1 r:core_node1 x:collection1] o.a.s.c.S.Request [collection1]  webapp= path=/select params={q=*:*&distrib=false&tests=checkShardConsistency&rows=0&wt=javabin&version=2} hits=0 status=0 QTime=0
   [junit4]   2> 2216028 INFO  (qtp2035448573-18679) [n:127.0.0.1:64697_ c:collection1 s:shard1 r:core_node2 x:collection1] o.a.s.c.S.Request [collection1]  webapp= path=/select params={q=*:*&distrib=false&tests=checkShardConsistency&rows=0&wt=javabin&version=2} hits=0 status=0 QTime=0
   [junit4]   2> 2216030 INFO  (qtp1017443405-18714) [n:127.0.0.1:64707_ c:collection1 s:shard1 r:core_node3 x:collection1] o.a.s.c.S.Request [collection1]  webapp= path=/select params={q=*:*&distrib=false&tests=checkShardConsistency&rows=0&wt=javabin&version=2} hits=0 status=0 QTime=0
   [junit4]   2> 2218035 INFO  (qtp1840822050-18609) [n:127.0.0.1:64672_ c:control_collection s:shard1 r:core_node1 x:collection1] o.a.s.u.p.LogUpdateProcessorFactory [collection1]  webapp= path=/update params={wt=javabin&version=2}{deleteByQuery=*:* (-1555570852644257792)} 0 2
   [junit4]   2> 2218043 INFO  (qtp2035448573-18680) [n:127.0.0.1:64697_ c:collection1 s:shard1 r:core_node2 x:collection1] o.a.s.u.p.LogUpdateProcessorFactory [collection1]  webapp= path=/update params={update.distrib=FROMLEADER&_version_=-1555570852648452096&distrib.from=http://127.0.0.1:64686/collection1/&wt=javabin&version=2}{deleteByQuery=*:* (-1555570852648452096)} 0 3
   [junit4]   2> 2218043 INFO  (qtp1017443405-18715) [n:127.0.0.1:64707_ c:collection1 s:shard1 r:core_node3 x:collection1] o.a.s.u.p.LogUpdateProcessorFactory [collection1]  webapp= path=/update params={update.distrib=FROMLEADER&_version_=-1555570852648452096&distrib.from=http://127.0.0.1:64686/collection1/&wt=javabin&version=2}{deleteByQuery=*:* (-1555570852648452096)} 0 3
   [junit4]   2> 2218044 INFO  (qtp1268827372-18650) [n:127.0.0.1:64686_ c:collection1 s:shard1 r:core_node1 x:collection1

[...truncated too long message...]

estServer connecting to 127.0.0.1:64669 64669
   [junit4]   2> 2426443 WARN  (Thread-3341) [    ] o.a.s.c.ZkTestServer Watch limit violations: 
   [junit4]   2> Maximum concurrent create/delete watches above limit:
   [junit4]   2> 
   [junit4]   2> 	6	/solr/aliases.json
   [junit4]   2> 	6	/solr/clusterprops.json
   [junit4]   2> 	5	/solr/security.json
   [junit4]   2> 	5	/solr/configs/conf1
   [junit4]   2> 
   [junit4]   2> Maximum concurrent data watches above limit:
   [junit4]   2> 
   [junit4]   2> 	6	/solr/clusterstate.json
   [junit4]   2> 	4	/solr/collections/collection1/state.json
   [junit4]   2> 	2	/solr/overseer_elect/election/97223176799911945-127.0.0.1:64686_-n_0000000001
   [junit4]   2> 	2	/solr/collections/collection1/leader_elect/shard1/election/97223176799911945-core_node1-n_0000000000
   [junit4]   2> 
   [junit4]   2> Maximum concurrent children watches above limit:
   [junit4]   2> 
   [junit4]   2> 	225	/solr/overseer/collection-queue-work
   [junit4]   2> 	42	/solr/overseer/queue
   [junit4]   2> 	16	/solr/overseer/queue-work
   [junit4]   2> 	6	/solr/collections
   [junit4]   2> 	5	/solr/live_nodes
   [junit4]   2> 
   [junit4]   2> NOTE: reproduce with: ant test  -Dtestcase=PeerSyncReplicationTest -Dtests.method=test -Dtests.seed=279F1AA02F8A725C -Dtests.slow=true -Dtests.locale=lv -Dtests.timezone=Brazil/DeNoronha -Dtests.asserts=true -Dtests.file.encoding=UTF-8
   [junit4] FAILURE  231s J1 | PeerSyncReplicationTest.test <<<
   [junit4]    > Throwable #1: java.lang.AssertionError: timeout waiting to see all nodes active
   [junit4]    > 	at __randomizedtesting.SeedInfo.seed([279F1AA02F8A725C:AFCB257A81761FA4]:0)
   [junit4]    > 	at org.apache.solr.cloud.PeerSyncReplicationTest.waitTillNodesActive(PeerSyncReplicationTest.java:311)
   [junit4]    > 	at org.apache.solr.cloud.PeerSyncReplicationTest.bringUpDeadNodeAndEnsureNoReplication(PeerSyncReplicationTest.java:262)
   [junit4]    > 	at org.apache.solr.cloud.PeerSyncReplicationTest.forceNodeFailureAndDoPeerSync(PeerSyncReplicationTest.java:244)
   [junit4]    > 	at org.apache.solr.cloud.PeerSyncReplicationTest.test(PeerSyncReplicationTest.java:133)
   [junit4]    > 	at org.apache.solr.BaseDistributedSearchTestCase$ShardsRepeatRule$ShardsFixedStatement.callStatement(BaseDistributedSearchTestCase.java:985)
   [junit4]    > 	at org.apache.solr.BaseDistributedSearchTestCase$ShardsRepeatRule$ShardsStatement.evaluate(BaseDistributedSearchTestCase.java:960)
   [junit4]    > 	at java.lang.Thread.run(Thread.java:745)
   [junit4]   2> 2426563 INFO  (SUITE-PeerSyncReplicationTest-seed#[279F1AA02F8A725C]-worker) [    ] o.a.s.SolrTestCaseJ4 ###deleteCore
   [junit4]   2> NOTE: leaving temporary files on disk at: /Users/jenkins/workspace/Lucene-Solr-master-MacOSX/solr/build/solr-core/test/J1/temp/solr.cloud.PeerSyncReplicationTest_279F1AA02F8A725C-001
   [junit4]   2> NOTE: test params are: codec=Asserting(Lucene70): {other_tl1=PostingsFormat(name=Memory), range_facet_l_dv=PostingsFormat(name=LuceneVarGapFixedInterval), rnd_s=PostingsFormat(name=Memory), multiDefault=PostingsFormat(name=LuceneVarGapDocFreqInterval), intDefault=PostingsFormat(name=Memory), a_i1=PostingsFormat(name=LuceneVarGapDocFreqInterval), range_facet_l=PostingsFormat(name=LuceneVarGapDocFreqInterval), _version_=PostingsFormat(name=Memory), a_t=PostingsFormat(name=LuceneVarGapDocFreqInterval), id=PostingsFormat(name=LuceneVarGapFixedInterval), range_facet_i_dv=PostingsFormat(name=LuceneVarGapDocFreqInterval), text=FST50, timestamp=PostingsFormat(name=LuceneVarGapDocFreqInterval)}, docValues:{range_facet_l_dv=DocValuesFormat(name=Memory), range_facet_i_dv=DocValuesFormat(name=Asserting), timestamp=DocValuesFormat(name=Asserting)}, maxPointsInLeafNode=1303, maxMBSortInHeap=7.763265534111168, sim=RandomSimilarity(queryNorm=true): {}, locale=lv, timezone=Brazil/DeNoronha
   [junit4]   2> NOTE: Mac OS X 10.11.6 x86_64/Oracle Corporation 1.8.0_102 (64-bit)/cpus=3,threads=1,free=119731120,total=481820672
   [junit4]   2> NOTE: All tests run in this JVM: [TestClusterProperties, TestLeaderElectionZkExpiry, StatsComponentTest, TestRandomFaceting, HdfsUnloadDistributedZkTest, TestAtomicUpdateErrorCases, OverseerModifyCollectionTest, TestLocalFSCloudBackupRestore, TestMiniSolrCloudCluster, TemplateUpdateProcessorTest, LeaderFailureAfterFreshStartTest, SecurityConfHandlerTest, TestNumericTerms64, TestPivotHelperCode, TestManagedResource, TestGraphTermsQParserPlugin, TestReversedWildcardFilterFactory, WordBreakSolrSpellCheckerTest, DeleteShardTest, BlockJoinFacetSimpleTest, TestStressRecovery, TestDynamicLoading, QueryParsingTest, TermVectorComponentDistributedTest, TestDeleteCollectionOnDownNodes, HdfsCollectionsAPIDistributedZkTest, TestBulkSchemaConcurrent, TestSolrCloudWithHadoopAuthPlugin, SuggesterTest, TestHighFrequencyDictionaryFactory, TestStressUserVersions, TermVectorComponentTest, ClassificationUpdateProcessorFactoryTest, BadIndexSchemaTest, TestStressLiveNodes, TestEmbeddedSolrServerConstructors, TestFieldCacheSort, TestLuceneMatchVersion, HLLUtilTest, SortSpecParsingTest, MinimalSchemaTest, TestAuthenticationFramework, TestRuleBasedAuthorizationPlugin, TestJsonRequest, SuggesterTSTTest, TestComponentsName, TestSystemIdResolver, TestLRUStatsCache, TestFileDictionaryLookup, TestUnifiedSolrHighlighter, TestJoin, BitVectorTest, OpenCloseCoreStressTest, TestDownShardTolerantSearch, TestQueryTypes, TestRestManager, TestPHPSerializedResponseWriter, SolrInfoMBeanTest, CircularListTest, SolrGangliaReporterTest, HdfsChaosMonkeyNothingIsSafeTest, TestManagedSchemaAPI, TestSchemaManager, ClassificationUpdateProcessorTest, AddSchemaFieldsUpdateProcessorFactoryTest, TestDynamicFieldResource, TestFieldTypeResource, SpellCheckCollatorTest, ExitableDirectoryReaderTest, TestSolrQueryParser, TestLMDirichletSimilarityFactory, TestValueSourceCache, BasicDistributedZk2Test, TestOmitPositions, RemoteQueryErrorTest, SpellCheckComponentTest, TestCollationFieldDocValues, MultiThreadedOCPTest, CoreSorterTest, ZkStateReaderTest, BigEndianAscendingWordDeserializerTest, ForceLeaderTest, BadComponentTest, SuggesterWFSTTest, PeerSyncWithIndexFingerprintCachingTest, TestTolerantUpdateProcessorRandomCloud, ShufflingReplicaListTransformerTest, WrapperMergePolicyFactoryTest, TestHdfsCloudBackupRestore, JsonLoaderTest, TestExportWriter, LeaderElectionIntegrationTest, TestSolrDynamicMBean, DistributedVersionInfoTest, TestFieldCacheReopen, SolrJmxReporterTest, TestHdfsUpdateLog, TriLevelCompositeIdRoutingTest, AsyncCallRequestStatusResponseTest, BasicFunctionalityTest, TestDocTermOrds, TestCrossCoreJoin, TestUniqueKeyFieldResource, HighlighterConfigTest, TestUtils, TestTestInjection, TestSQLHandlerNonCloud, TestShardHandlerFactory, TestTrie, TestSearcherReuse, TestFiltering, TestConfigReload, TestLMJelinekMercerSimilarityFactory, TestSSLRandomization, TestPushWriter, TestConfigSetsAPI, URLClassifyProcessorTest, HdfsBasicDistributedZk2Test, TestFieldSortValues, StressHdfsTest, TestFuzzyAnalyzedSuggestions, CSVRequestHandlerTest, TestGraphMLResponseWriter, TestRTimerTree, DistanceUnitsTest, SolrCoreCheckLockOnStartupTest, TestFieldCacheVsDocValues, QueryResultKeyTest, TestDistributedMissingSort, MetricUtilsTest, NotRequiredUniqueKeyTest, TestSuggestSpellingConverter, TestMaxScoreQueryParser, CollectionsAPISolrJTest, ShardRoutingCustomTest, TestInitQParser, TestQueryWrapperFilter, TestRecoveryHdfs, FacetPivotSmallTest, ShowFileRequestHandlerTest, HdfsThreadLeakTest, ResponseLogComponentTest, TestAuthorizationFramework, TestDistributedStatsComponentCardinality, CdcrBootstrapTest, TestNRTOpen, TestCloudPseudoReturnFields, StatsReloadRaceTest, TestComplexPhraseQParserPlugin, BasicAuthStandaloneTest, ReplicationFactorTest, TestSolrQueryParserDefaultOperatorResource, FileBasedSpellCheckerTest, DateRangeFieldTest, TestIndexSearcher, TestUseDocValuesAsStored2, DistributedFacetPivotWhiteBoxTest, ScriptEngineTest, HdfsDirectoryTest, ChaosMonkeySafeLeaderTest, CollectionsAPIDistributedZkTest, OverseerTest, ShardRoutingTest, BasicZkTest, RecoveryZkTest, FullSolrCloudDistribCmdsTest, ClusterStateUpdateTest, ZkSolrClientTest, TestZkChroot, TestRandomDVFaceting, AutoCommitTest, TestDistributedGrouping, TestRecovery, TestHashPartitioner, TestRealTimeGet, TestStressReorder, TestReload, DistributedTermsComponentTest, TestSolr4Spatial, TestSort, CurrencyFieldOpenExchangeTest, DistributedQueryElevationComponentTest, SuggesterFSTTest, SolrRequestParserTest, TestFoldingMultitermQuery, DocValuesTest, XsltUpdateRequestHandlerTest, IndexBasedSpellCheckerTest, LukeRequestHandlerTest, TestWriterPerf, TermsComponentTest, PathHierarchyTokenizerFactoryTest, MoreLikeThisHandlerTest, LoggingHandlerTest, SolrPluginUtilsTest, UpdateRequestProcessorFactoryTest, MBeansHandlerTest, UniqFieldsUpdateProcessorFactoryTest, TestPartialUpdateDeduplication, TestLFUCache, TestSolrDeletionPolicy2, MultiTermTest, SampleTest, TestSearchPerf, TestConfig, ExternalFileFieldSortTest, DirectSolrConnectionTest, SpellPossibilityIteratorTest, TestCodecSupport, TestJmxMonitoredMap, TimeZoneUtilsTest, TestFastOutputStream, DateMathParserTest, PreAnalyzedFieldTest, PrimUtilsTest, DateFieldTest, SpellingQueryConverterTest, RAMDirectoryFactoryTest, ClusterStateTest, TestDocumentBuilder, ZkNodePropsTest, SliceStateTest, SystemInfoHandlerTest, UUIDFieldTest, DistributedMLTComponentTest, DistributedIntervalFacetingTest, TestSimpleTrackingShardHandler, TestTolerantSearch, TestJettySolrRunner, ConnectionReuseTest, AliasIntegrationTest, CleanupOldIndexTest, CollectionReloadTest, CollectionTooManyReplicasTest, DeleteNodeTest, DistribCursorPagingTest, LeaderElectionContextKeyTest, LeaderFailoverAfterPartitionTest, LeaderInitiatedRecoveryOnShardRestartTest, OutOfBoxZkACLAndCredentialsProvidersTest, OverriddenZkACLAndCredentialsProvidersTest, PeerSyncReplicationTest]
   [junit4] Completed [510/674 (1!)] on J1 in 231.31s, 1 test, 1 failure <<< FAILURES!

[...truncated 62973 lines...]


Mime
View raw message