lucene-dev mailing list archives

Site index · List index
Message view « Date » · « Thread »
Top « Date » · « Thread »
From Policeman Jenkins Server <jenk...@thetaphi.de>
Subject [JENKINS] Lucene-Solr-master-Solaris (64bit/jdk1.8.0) - Build # 1063 - Still Unstable!
Date Sat, 07 Jan 2017 18:29:25 GMT
Build: https://jenkins.thetaphi.de/job/Lucene-Solr-master-Solaris/1063/
Java: 64bit/jdk1.8.0 -XX:+UseCompressedOops -XX:+UseSerialGC

1 tests failed.
FAILED:  org.apache.solr.security.hadoop.TestDelegationWithHadoopAuth.testDelegationTokenCancelFail

Error Message:
expected:<200> but was:<404>

Stack Trace:
java.lang.AssertionError: expected:<200> but was:<404>
	at __randomizedtesting.SeedInfo.seed([F8B5996390C104A2:900AAC49405B164E]:0)
	at org.junit.Assert.fail(Assert.java:93)
	at org.junit.Assert.failNotEquals(Assert.java:647)
	at org.junit.Assert.assertEquals(Assert.java:128)
	at org.junit.Assert.assertEquals(Assert.java:472)
	at org.junit.Assert.assertEquals(Assert.java:456)
	at org.apache.solr.security.hadoop.TestDelegationWithHadoopAuth.cancelDelegationToken(TestDelegationWithHadoopAuth.java:128)
	at org.apache.solr.security.hadoop.TestDelegationWithHadoopAuth.testDelegationTokenCancelFail(TestDelegationWithHadoopAuth.java:280)
	at sun.reflect.NativeMethodAccessorImpl.invoke0(Native Method)
	at sun.reflect.NativeMethodAccessorImpl.invoke(NativeMethodAccessorImpl.java:62)
	at sun.reflect.DelegatingMethodAccessorImpl.invoke(DelegatingMethodAccessorImpl.java:43)
	at java.lang.reflect.Method.invoke(Method.java:498)
	at com.carrotsearch.randomizedtesting.RandomizedRunner.invoke(RandomizedRunner.java:1713)
	at com.carrotsearch.randomizedtesting.RandomizedRunner$8.evaluate(RandomizedRunner.java:907)
	at com.carrotsearch.randomizedtesting.RandomizedRunner$9.evaluate(RandomizedRunner.java:943)
	at com.carrotsearch.randomizedtesting.RandomizedRunner$10.evaluate(RandomizedRunner.java:957)
	at com.carrotsearch.randomizedtesting.rules.SystemPropertiesRestoreRule$1.evaluate(SystemPropertiesRestoreRule.java:57)
	at org.apache.lucene.util.TestRuleSetupTeardownChained$1.evaluate(TestRuleSetupTeardownChained.java:49)
	at org.apache.lucene.util.AbstractBeforeAfterRule$1.evaluate(AbstractBeforeAfterRule.java:45)
	at org.apache.lucene.util.TestRuleThreadAndTestName$1.evaluate(TestRuleThreadAndTestName.java:48)
	at org.apache.lucene.util.TestRuleIgnoreAfterMaxFailures$1.evaluate(TestRuleIgnoreAfterMaxFailures.java:64)
	at org.apache.lucene.util.TestRuleMarkFailure$1.evaluate(TestRuleMarkFailure.java:47)
	at com.carrotsearch.randomizedtesting.rules.StatementAdapter.evaluate(StatementAdapter.java:36)
	at com.carrotsearch.randomizedtesting.ThreadLeakControl$StatementRunner.run(ThreadLeakControl.java:367)
	at com.carrotsearch.randomizedtesting.ThreadLeakControl.forkTimeoutingTask(ThreadLeakControl.java:811)
	at com.carrotsearch.randomizedtesting.ThreadLeakControl$3.evaluate(ThreadLeakControl.java:462)
	at com.carrotsearch.randomizedtesting.RandomizedRunner.runSingleTest(RandomizedRunner.java:916)
	at com.carrotsearch.randomizedtesting.RandomizedRunner$5.evaluate(RandomizedRunner.java:802)
	at com.carrotsearch.randomizedtesting.RandomizedRunner$6.evaluate(RandomizedRunner.java:852)
	at com.carrotsearch.randomizedtesting.RandomizedRunner$7.evaluate(RandomizedRunner.java:863)
	at com.carrotsearch.randomizedtesting.rules.StatementAdapter.evaluate(StatementAdapter.java:36)
	at com.carrotsearch.randomizedtesting.rules.SystemPropertiesRestoreRule$1.evaluate(SystemPropertiesRestoreRule.java:57)
	at org.apache.lucene.util.AbstractBeforeAfterRule$1.evaluate(AbstractBeforeAfterRule.java:45)
	at com.carrotsearch.randomizedtesting.rules.StatementAdapter.evaluate(StatementAdapter.java:36)
	at org.apache.lucene.util.TestRuleStoreClassName$1.evaluate(TestRuleStoreClassName.java:41)
	at com.carrotsearch.randomizedtesting.rules.NoShadowingOrOverridesOnMethodsRule$1.evaluate(NoShadowingOrOverridesOnMethodsRule.java:40)
	at com.carrotsearch.randomizedtesting.rules.NoShadowingOrOverridesOnMethodsRule$1.evaluate(NoShadowingOrOverridesOnMethodsRule.java:40)
	at com.carrotsearch.randomizedtesting.rules.StatementAdapter.evaluate(StatementAdapter.java:36)
	at com.carrotsearch.randomizedtesting.rules.StatementAdapter.evaluate(StatementAdapter.java:36)
	at com.carrotsearch.randomizedtesting.rules.StatementAdapter.evaluate(StatementAdapter.java:36)
	at org.apache.lucene.util.TestRuleAssertionsRequired$1.evaluate(TestRuleAssertionsRequired.java:53)
	at org.apache.lucene.util.TestRuleMarkFailure$1.evaluate(TestRuleMarkFailure.java:47)
	at org.apache.lucene.util.TestRuleIgnoreAfterMaxFailures$1.evaluate(TestRuleIgnoreAfterMaxFailures.java:64)
	at org.apache.lucene.util.TestRuleIgnoreTestSuites$1.evaluate(TestRuleIgnoreTestSuites.java:54)
	at com.carrotsearch.randomizedtesting.rules.StatementAdapter.evaluate(StatementAdapter.java:36)
	at com.carrotsearch.randomizedtesting.ThreadLeakControl$StatementRunner.run(ThreadLeakControl.java:367)
	at java.lang.Thread.run(Thread.java:745)




Build Log:
[...truncated 11074 lines...]
   [junit4] Suite: org.apache.solr.security.hadoop.TestDelegationWithHadoopAuth
   [junit4]   2> Creating dataDir: /export/home/jenkins/workspace/Lucene-Solr-master-Solaris/solr/build/solr-core/test/J0/temp/solr.security.hadoop.TestDelegationWithHadoopAuth_F8B5996390C104A2-001/init-core-data-001
   [junit4]   2> 477474 INFO  (SUITE-TestDelegationWithHadoopAuth-seed#[F8B5996390C104A2]-worker)
[    ] o.a.s.SolrTestCaseJ4 Randomized ssl (true) and clientAuth (true) via: @org.apache.solr.util.RandomizeSSL(reason=,
value=NaN, ssl=NaN, clientAuth=NaN)
   [junit4]   2> 477477 INFO  (SUITE-TestDelegationWithHadoopAuth-seed#[F8B5996390C104A2]-worker)
[    ] o.a.s.c.MiniSolrCloudCluster Starting cluster of 2 servers in /export/home/jenkins/workspace/Lucene-Solr-master-Solaris/solr/build/solr-core/test/J0/temp/solr.security.hadoop.TestDelegationWithHadoopAuth_F8B5996390C104A2-001/tempDir-001
   [junit4]   2> 477477 INFO  (SUITE-TestDelegationWithHadoopAuth-seed#[F8B5996390C104A2]-worker)
[    ] o.a.s.c.ZkTestServer STARTING ZK TEST SERVER
   [junit4]   2> 477477 INFO  (Thread-5537) [    ] o.a.s.c.ZkTestServer client port:0.0.0.0/0.0.0.0:0
   [junit4]   2> 477477 INFO  (Thread-5537) [    ] o.a.s.c.ZkTestServer Starting server
   [junit4]   2> 477577 INFO  (SUITE-TestDelegationWithHadoopAuth-seed#[F8B5996390C104A2]-worker)
[    ] o.a.s.c.ZkTestServer start zk server on port:53889
   [junit4]   2> 477589 WARN  (NIOServerCxn.Factory:0.0.0.0/0.0.0.0:0) [    ] o.a.z.s.NIOServerCnxn
caught end of stream exception
   [junit4]   2> EndOfStreamException: Unable to read additional data from client sessionid
0x15979fc1e0f0000, likely client has closed socket
   [junit4]   2> 	at org.apache.zookeeper.server.NIOServerCnxn.doIO(NIOServerCnxn.java:228)
   [junit4]   2> 	at org.apache.zookeeper.server.NIOServerCnxnFactory.run(NIOServerCnxnFactory.java:208)
   [junit4]   2> 	at java.lang.Thread.run(Thread.java:745)
   [junit4]   2> 477592 INFO  (jetty-launcher-726-thread-1) [    ] o.e.j.s.Server jetty-9.3.14.v20161028
   [junit4]   2> 477592 INFO  (jetty-launcher-726-thread-2) [    ] o.e.j.s.Server jetty-9.3.14.v20161028
   [junit4]   2> 477595 INFO  (jetty-launcher-726-thread-2) [    ] o.e.j.s.h.ContextHandler
Started o.e.j.s.ServletContextHandler@21d5d65a{/solr,null,AVAILABLE}
   [junit4]   2> 477598 INFO  (jetty-launcher-726-thread-1) [    ] o.e.j.s.h.ContextHandler
Started o.e.j.s.ServletContextHandler@3613497b{/solr,null,AVAILABLE}
   [junit4]   2> 477598 INFO  (jetty-launcher-726-thread-2) [    ] o.e.j.s.AbstractConnector
Started ServerConnector@20b5cd57{SSL,[ssl, http/1.1]}{127.0.0.1:41347}
   [junit4]   2> 477598 INFO  (jetty-launcher-726-thread-2) [    ] o.e.j.s.Server Started
@480612ms
   [junit4]   2> 477598 INFO  (jetty-launcher-726-thread-2) [    ] o.a.s.c.s.e.JettySolrRunner
Jetty properties: {hostContext=/solr, hostPort=41347}
   [junit4]   2> 477598 INFO  (jetty-launcher-726-thread-1) [    ] o.e.j.s.AbstractConnector
Started ServerConnector@3210da34{SSL,[ssl, http/1.1]}{127.0.0.1:62624}
   [junit4]   2> 477598 INFO  (jetty-launcher-726-thread-1) [    ] o.e.j.s.Server Started
@480612ms
   [junit4]   2> 477598 ERROR (jetty-launcher-726-thread-2) [    ] o.a.s.s.StartupLoggingUtils
Missing Java Option solr.log.dir. Logging may be missing or incomplete.
   [junit4]   2> 477599 INFO  (jetty-launcher-726-thread-1) [    ] o.a.s.c.s.e.JettySolrRunner
Jetty properties: {hostContext=/solr, hostPort=62624}
   [junit4]   2> 477599 INFO  (jetty-launcher-726-thread-2) [    ] o.a.s.s.SolrDispatchFilter
 ___      _       Welcome to Apache Solr? version 7.0.0
   [junit4]   2> 477599 ERROR (jetty-launcher-726-thread-1) [    ] o.a.s.s.StartupLoggingUtils
Missing Java Option solr.log.dir. Logging may be missing or incomplete.
   [junit4]   2> 477599 INFO  (jetty-launcher-726-thread-2) [    ] o.a.s.s.SolrDispatchFilter
/ __| ___| |_ _   Starting in cloud mode on port null
   [junit4]   2> 477599 INFO  (jetty-launcher-726-thread-1) [    ] o.a.s.s.SolrDispatchFilter
 ___      _       Welcome to Apache Solr? version 7.0.0
   [junit4]   2> 477599 INFO  (jetty-launcher-726-thread-2) [    ] o.a.s.s.SolrDispatchFilter
\__ \/ _ \ | '_|  Install dir: null
   [junit4]   2> 477599 INFO  (jetty-launcher-726-thread-1) [    ] o.a.s.s.SolrDispatchFilter
/ __| ___| |_ _   Starting in cloud mode on port null
   [junit4]   2> 477599 INFO  (jetty-launcher-726-thread-2) [    ] o.a.s.s.SolrDispatchFilter
|___/\___/_|_|    Start time: 2017-01-07T17:31:23.144Z
   [junit4]   2> 477599 INFO  (jetty-launcher-726-thread-1) [    ] o.a.s.s.SolrDispatchFilter
\__ \/ _ \ | '_|  Install dir: null
   [junit4]   2> 477599 INFO  (jetty-launcher-726-thread-1) [    ] o.a.s.s.SolrDispatchFilter
|___/\___/_|_|    Start time: 2017-01-07T17:31:23.144Z
   [junit4]   2> 477613 INFO  (jetty-launcher-726-thread-1) [    ] o.a.s.s.SolrDispatchFilter
solr.xml found in ZooKeeper. Loading...
   [junit4]   2> 477614 INFO  (jetty-launcher-726-thread-2) [    ] o.a.s.s.SolrDispatchFilter
solr.xml found in ZooKeeper. Loading...
   [junit4]   2> 477642 WARN  (NIOServerCxn.Factory:0.0.0.0/0.0.0.0:0) [    ] o.a.z.s.NIOServerCnxn
caught end of stream exception
   [junit4]   2> EndOfStreamException: Unable to read additional data from client sessionid
0x15979fc1e0f0002, likely client has closed socket
   [junit4]   2> 	at org.apache.zookeeper.server.NIOServerCnxn.doIO(NIOServerCnxn.java:228)
   [junit4]   2> 	at org.apache.zookeeper.server.NIOServerCnxnFactory.run(NIOServerCnxnFactory.java:208)
   [junit4]   2> 	at java.lang.Thread.run(Thread.java:745)
   [junit4]   2> 477644 INFO  (jetty-launcher-726-thread-1) [    ] o.a.s.c.ZkContainer
Zookeeper client=127.0.0.1:53889/solr
   [junit4]   2> 477645 INFO  (jetty-launcher-726-thread-2) [    ] o.a.s.c.ZkContainer
Zookeeper client=127.0.0.1:53889/solr
   [junit4]   2> 477653 WARN  (NIOServerCxn.Factory:0.0.0.0/0.0.0.0:0) [    ] o.a.z.s.NIOServerCnxn
caught end of stream exception
   [junit4]   2> EndOfStreamException: Unable to read additional data from client sessionid
0x15979fc1e0f0004, likely client has closed socket
   [junit4]   2> 	at org.apache.zookeeper.server.NIOServerCnxn.doIO(NIOServerCnxn.java:228)
   [junit4]   2> 	at org.apache.zookeeper.server.NIOServerCnxnFactory.run(NIOServerCnxnFactory.java:208)
   [junit4]   2> 	at java.lang.Thread.run(Thread.java:745)
   [junit4]   2> 477692 INFO  (jetty-launcher-726-thread-2) [n:127.0.0.1:41347_solr   
] o.a.s.c.OverseerElectionContext I am going to be the leader 127.0.0.1:41347_solr
   [junit4]   2> 477693 INFO  (jetty-launcher-726-thread-1) [n:127.0.0.1:62624_solr   
] o.a.s.c.ZkController Register node as live in ZooKeeper:/live_nodes/127.0.0.1:62624_solr
   [junit4]   2> 477694 INFO  (jetty-launcher-726-thread-2) [n:127.0.0.1:41347_solr   
] o.a.s.c.Overseer Overseer (id=97242990708195333-127.0.0.1:41347_solr-n_0000000000) starting
   [junit4]   2> 477696 INFO  (zkCallback-736-thread-1-processing-n:127.0.0.1:41347_solr)
[n:127.0.0.1:41347_solr    ] o.a.s.c.c.ZkStateReader Updated live nodes from ZooKeeper...
(0) -> (1)
   [junit4]   2> 477699 INFO  (zkCallback-737-thread-1-processing-n:127.0.0.1:62624_solr)
[n:127.0.0.1:62624_solr    ] o.a.s.c.c.ZkStateReader Updated live nodes from ZooKeeper...
(0) -> (1)
   [junit4]   2> 477709 INFO  (jetty-launcher-726-thread-2) [n:127.0.0.1:41347_solr   
] o.a.s.c.ZkController Register node as live in ZooKeeper:/live_nodes/127.0.0.1:41347_solr
   [junit4]   2> 477711 INFO  (zkCallback-737-thread-1-processing-n:127.0.0.1:62624_solr)
[n:127.0.0.1:62624_solr    ] o.a.s.c.c.ZkStateReader Updated live nodes from ZooKeeper...
(1) -> (2)
   [junit4]   2> 477718 INFO  (zkCallback-736-thread-1-processing-n:127.0.0.1:41347_solr)
[n:127.0.0.1:41347_solr    ] o.a.s.c.c.ZkStateReader Updated live nodes from ZooKeeper...
(1) -> (2)
   [junit4]   2> 477770 INFO  (jetty-launcher-726-thread-2) [n:127.0.0.1:41347_solr   
] o.a.s.c.CoreContainer Initializing authentication plugin: org.apache.solr.security.HadoopAuthPlugin
   [junit4]   2> 477783 INFO  (jetty-launcher-726-thread-2) [n:127.0.0.1:41347_solr   
] o.a.s.s.HadoopAuthPlugin Params: {delegation-token.token-kind=solr-dt, cookie.domain=127.0.0.1,
zk-dt-secret-manager.znodeWorkingPath=solr/security/zkdtsm, signer.secret.provider.zookeeper.path=/token,
type=simple, zk-dt-secret-manager.enable=true, signer.secret.provider=zookeeper}
   [junit4]   2> 477870 INFO  (jetty-launcher-726-thread-2) [n:127.0.0.1:41347_solr   
] o.a.c.f.i.CuratorFrameworkImpl Starting
   [junit4]   2> 477896 INFO  (jetty-launcher-726-thread-1) [n:127.0.0.1:62624_solr   
] o.a.s.c.CoreContainer Initializing authentication plugin: org.apache.solr.security.HadoopAuthPlugin
   [junit4]   2> 477896 INFO  (jetty-launcher-726-thread-1) [n:127.0.0.1:62624_solr   
] o.a.s.s.HadoopAuthPlugin Params: {delegation-token.token-kind=solr-dt, cookie.domain=127.0.0.1,
zk-dt-secret-manager.znodeWorkingPath=solr/security/zkdtsm, signer.secret.provider.zookeeper.path=/token,
type=simple, zk-dt-secret-manager.enable=true, signer.secret.provider=zookeeper}
   [junit4]   2> 477897 INFO  (jetty-launcher-726-thread-1) [n:127.0.0.1:62624_solr   
] o.a.c.f.i.CuratorFrameworkImpl Starting
   [junit4]   2> 477914 INFO  (jetty-launcher-726-thread-1-EventThread) [n:127.0.0.1:62624_solr
   ] o.a.c.f.s.ConnectionStateManager State change: CONNECTED
   [junit4]   2> 477914 INFO  (jetty-launcher-726-thread-2-EventThread) [n:127.0.0.1:41347_solr
   ] o.a.c.f.s.ConnectionStateManager State change: CONNECTED
   [junit4]   2> 479041 INFO  (jetty-launcher-726-thread-1) [n:127.0.0.1:62624_solr   
] o.a.s.c.CoreContainer PKIAuthenticationPlugin is managing internode requests
   [junit4]   2> 479042 INFO  (jetty-launcher-726-thread-2) [n:127.0.0.1:41347_solr   
] o.a.s.c.CoreContainer PKIAuthenticationPlugin is managing internode requests
   [junit4]   2> 479043 INFO  (jetty-launcher-726-thread-1) [n:127.0.0.1:62624_solr   
] o.a.s.c.CorePropertiesLocator Found 0 core definitions underneath /export/home/jenkins/workspace/Lucene-Solr-master-Solaris/solr/build/solr-core/test/J0/temp/solr.security.hadoop.TestDelegationWithHadoopAuth_F8B5996390C104A2-001/tempDir-001/node1/.
   [junit4]   2> 479056 INFO  (jetty-launcher-726-thread-2) [n:127.0.0.1:41347_solr   
] o.a.s.c.CorePropertiesLocator Found 0 core definitions underneath /export/home/jenkins/workspace/Lucene-Solr-master-Solaris/solr/build/solr-core/test/J0/temp/solr.security.hadoop.TestDelegationWithHadoopAuth_F8B5996390C104A2-001/tempDir-001/node2/.
   [junit4]   2> 479525 INFO  (TEST-TestDelegationWithHadoopAuth.testDelegationTokenSolrClient-seed#[F8B5996390C104A2])
[    ] o.a.s.SolrTestCaseJ4 ###Starting testDelegationTokenSolrClient
   [junit4]   2> 479638 WARN  (TEST-TestDelegationWithHadoopAuth.testDelegationTokenSolrClient-seed#[F8B5996390C104A2])
[    ] o.a.h.c.p.ResponseProcessCookies Invalid cookie header: "Set-Cookie: hadoop.auth=;
Domain=127.0.0.1; Expires= , 01-   -1970 00:00:00 GMT; Secure; HttpOnly". Invalid 'expires'
attribute: , 01- -1970 00:00:00 GMT
   [junit4]   2> 479661 INFO  (qtp591142464-8612) [n:127.0.0.1:62624_solr    ] o.a.s.h.a.CollectionsHandler
Invoked Collection Action :list with params action=LIST&delegation=GgADZm9vA2ZvbwCKAVl5_CZAigFZngiqQAEDFLzxeQOVmrYGUqjXKgT--X1PiwQvB3NvbHItZHQA&wt=javabin&version=2
and sendToOCPQueue=true
   [junit4]   2> 479661 INFO  (qtp591142464-8612) [n:127.0.0.1:62624_solr    ] o.a.s.s.HttpSolrCall
[admin] webapp=null path=/admin/collections params={action=LIST&delegation=GgADZm9vA2ZvbwCKAVl5_CZAigFZngiqQAEDFLzxeQOVmrYGUqjXKgT--X1PiwQvB3NvbHItZHQA&wt=javabin&version=2}
status=0 QTime=0
   [junit4]   2> 479662 INFO  (TEST-TestDelegationWithHadoopAuth.testDelegationTokenSolrClient-seed#[F8B5996390C104A2])
[    ] o.a.s.SolrTestCaseJ4 ###Ending testDelegationTokenSolrClient
   [junit4]   2> 479689 INFO  (TEST-TestDelegationWithHadoopAuth.testDelegationTokenVerify-seed#[F8B5996390C104A2])
[    ] o.a.s.SolrTestCaseJ4 ###Starting testDelegationTokenVerify
   [junit4]   2> 479710 INFO  (qtp591142464-8601) [n:127.0.0.1:62624_solr    ] o.a.s.h.a.CollectionsHandler
Invoked Collection Action :list with params action=LIST&delegation=GgADZm9vA2ZvbwCKAVl5_CazigFZngiqswIDFOaA2kLsYhzszRHYI7HM6qdCaRlDB3NvbHItZHQA&wt=javabin&version=2
and sendToOCPQueue=true
   [junit4]   2> 479710 INFO  (qtp591142464-8601) [n:127.0.0.1:62624_solr    ] o.a.s.s.HttpSolrCall
[admin] webapp=null path=/admin/collections params={action=LIST&delegation=GgADZm9vA2ZvbwCKAVl5_CazigFZngiqswIDFOaA2kLsYhzszRHYI7HM6qdCaRlDB3NvbHItZHQA&wt=javabin&version=2}
status=0 QTime=0
   [junit4]   2> 479716 INFO  (TEST-TestDelegationWithHadoopAuth.testDelegationTokenVerify-seed#[F8B5996390C104A2])
[    ] o.a.s.c.c.ZkStateReader Updated live nodes from ZooKeeper... (0) -> (2)
   [junit4]   2> 479718 INFO  (TEST-TestDelegationWithHadoopAuth.testDelegationTokenVerify-seed#[F8B5996390C104A2])
[    ] o.a.s.c.s.i.ZkClientClusterStateProvider Cluster at 127.0.0.1:53889/solr ready
   [junit4]   2> 479727 WARN  (TEST-TestDelegationWithHadoopAuth.testDelegationTokenVerify-seed#[F8B5996390C104A2])
[    ] o.a.h.c.p.ResponseProcessCookies Invalid cookie header: "Set-Cookie: hadoop.auth=;
Domain=127.0.0.1; Expires= , 01-   -1970 00:00:00 GMT; Secure; HttpOnly". Invalid 'expires'
attribute: , 01- -1970 00:00:00 GMT
   [junit4]   2> 479753 INFO  (qtp556375337-8610) [n:127.0.0.1:41347_solr    ] o.a.s.h.a.CollectionsHandler
Invoked Collection Action :list with params action=LIST&delegation=GgADZm9vA2ZvbwCKAVl5_CazigFZngiqswIDFOaA2kLsYhzszRHYI7HM6qdCaRlDB3NvbHItZHQA&wt=javabin&version=2
and sendToOCPQueue=true
   [junit4]   2> 479754 INFO  (qtp556375337-8610) [n:127.0.0.1:41347_solr    ] o.a.s.s.HttpSolrCall
[admin] webapp=null path=/admin/collections params={action=LIST&delegation=GgADZm9vA2ZvbwCKAVl5_CazigFZngiqswIDFOaA2kLsYhzszRHYI7HM6qdCaRlDB3NvbHItZHQA&wt=javabin&version=2}
status=0 QTime=0
   [junit4]   2> 479760 INFO  (TEST-TestDelegationWithHadoopAuth.testDelegationTokenVerify-seed#[F8B5996390C104A2])
[    ] o.a.s.c.c.ZkStateReader Updated live nodes from ZooKeeper... (0) -> (2)
   [junit4]   2> 479762 INFO  (TEST-TestDelegationWithHadoopAuth.testDelegationTokenVerify-seed#[F8B5996390C104A2])
[    ] o.a.s.c.s.i.ZkClientClusterStateProvider Cluster at 127.0.0.1:53889/solr ready
   [junit4]   2> 479771 WARN  (TEST-TestDelegationWithHadoopAuth.testDelegationTokenVerify-seed#[F8B5996390C104A2])
[    ] o.a.h.c.p.ResponseProcessCookies Invalid cookie header: "Set-Cookie: hadoop.auth=;
Domain=127.0.0.1; Expires= , 01-   -1970 00:00:00 GMT; Secure; HttpOnly". Invalid 'expires'
attribute: , 01- -1970 00:00:00 GMT
   [junit4]   2> 479773 INFO  (TEST-TestDelegationWithHadoopAuth.testDelegationTokenVerify-seed#[F8B5996390C104A2])
[    ] o.a.s.SolrTestCaseJ4 ###Ending testDelegationTokenVerify
   [junit4]   2> 479803 INFO  (TEST-TestDelegationWithHadoopAuth.testDelegationTokenCancel-seed#[F8B5996390C104A2])
[    ] o.a.s.SolrTestCaseJ4 ###Starting testDelegationTokenCancel
   [junit4]   2> 479827 ERROR (qtp591142464-8598) [    ] o.a.h.s.t.d.ZKDelegationTokenSecretManager
No node in path [/ZKDTSMTokensRoot/DT_3]
   [junit4]   2> 479839 INFO  (TEST-TestDelegationWithHadoopAuth.testDelegationTokenCancel-seed#[F8B5996390C104A2])
[    ] o.a.s.c.c.ZkStateReader Updated live nodes from ZooKeeper... (0) -> (2)
   [junit4]   2> 479840 INFO  (TEST-TestDelegationWithHadoopAuth.testDelegationTokenCancel-seed#[F8B5996390C104A2])
[    ] o.a.s.c.s.i.ZkClientClusterStateProvider Cluster at 127.0.0.1:53889/solr ready
   [junit4]   2> 479849 WARN  (TEST-TestDelegationWithHadoopAuth.testDelegationTokenCancel-seed#[F8B5996390C104A2])
[    ] o.a.h.c.p.ResponseProcessCookies Invalid cookie header: "Set-Cookie: hadoop.auth=;
Domain=127.0.0.1; Expires= , 01-   -1970 00:00:00 GMT; Secure; HttpOnly". Invalid 'expires'
attribute: , 01- -1970 00:00:00 GMT
   [junit4]   2> 479855 INFO  (TEST-TestDelegationWithHadoopAuth.testDelegationTokenCancel-seed#[F8B5996390C104A2])
[    ] o.a.s.c.c.ZkStateReader Updated live nodes from ZooKeeper... (0) -> (2)
   [junit4]   2> 479856 INFO  (TEST-TestDelegationWithHadoopAuth.testDelegationTokenCancel-seed#[F8B5996390C104A2])
[    ] o.a.s.c.s.i.ZkClientClusterStateProvider Cluster at 127.0.0.1:53889/solr ready
   [junit4]   2> 479863 WARN  (TEST-TestDelegationWithHadoopAuth.testDelegationTokenCancel-seed#[F8B5996390C104A2])
[    ] o.a.h.c.p.ResponseProcessCookies Invalid cookie header: "Set-Cookie: hadoop.auth=;
Domain=127.0.0.1; Expires= , 01-   -1970 00:00:00 GMT; Secure; HttpOnly". Invalid 'expires'
attribute: , 01- -1970 00:00:00 GMT
   [junit4]   2> 479885 INFO  (TEST-TestDelegationWithHadoopAuth.testDelegationTokenCancel-seed#[F8B5996390C104A2])
[    ] o.a.s.c.c.ZkStateReader Updated live nodes from ZooKeeper... (0) -> (2)
   [junit4]   2> 479886 INFO  (TEST-TestDelegationWithHadoopAuth.testDelegationTokenCancel-seed#[F8B5996390C104A2])
[    ] o.a.s.c.s.i.ZkClientClusterStateProvider Cluster at 127.0.0.1:53889/solr ready
   [junit4]   2> 479895 ERROR (qtp591142464-8612) [n:127.0.0.1:62624_solr    ] o.a.h.s.t.d.ZKDelegationTokenSecretManager
No node in path [/ZKDTSMTokensRoot/DT_4]
   [junit4]   2> 479910 WARN  (TEST-TestDelegationWithHadoopAuth.testDelegationTokenCancel-seed#[F8B5996390C104A2])
[    ] o.a.h.c.p.ResponseProcessCookies Invalid cookie header: "Set-Cookie: hadoop.auth=;
Domain=127.0.0.1; Expires= , 01-   -1970 00:00:00 GMT; Secure; HttpOnly". Invalid 'expires'
attribute: , 01- -1970 00:00:00 GMT
   [junit4]   2> 479920 WARN  (TEST-TestDelegationWithHadoopAuth.testDelegationTokenCancel-seed#[F8B5996390C104A2])
[    ] o.a.h.c.p.ResponseProcessCookies Invalid cookie header: "Set-Cookie: hadoop.auth=;
Domain=127.0.0.1; Expires= , 01-   -1970 00:00:00 GMT; Secure; HttpOnly". Invalid 'expires'
attribute: , 01- -1970 00:00:00 GMT
   [junit4]   2> 479921 INFO  (TEST-TestDelegationWithHadoopAuth.testDelegationTokenCancel-seed#[F8B5996390C104A2])
[    ] o.a.s.SolrTestCaseJ4 ###Ending testDelegationTokenCancel
   [junit4]   2> 479964 INFO  (TEST-TestDelegationWithHadoopAuth.testDelegationTokenRenew-seed#[F8B5996390C104A2])
[    ] o.a.s.SolrTestCaseJ4 ###Starting testDelegationTokenRenew
   [junit4]   2> 480015 INFO  (qtp591142464-8601) [n:127.0.0.1:62624_solr    ] o.a.s.h.a.CollectionsHandler
Invoked Collection Action :list with params action=LIST&delegation=GgADZm9vA2ZvbwCKAVl5_CfHigFZngirxwUDFCzNE4CdpOVMeJVlI9R2BBgkXSjYB3NvbHItZHQA&wt=javabin&version=2
and sendToOCPQueue=true
   [junit4]   2> 480015 INFO  (qtp591142464-8601) [n:127.0.0.1:62624_solr    ] o.a.s.s.HttpSolrCall
[admin] webapp=null path=/admin/collections params={action=LIST&delegation=GgADZm9vA2ZvbwCKAVl5_CfHigFZngirxwUDFCzNE4CdpOVMeJVlI9R2BBgkXSjYB3NvbHItZHQA&wt=javabin&version=2}
status=0 QTime=0
   [junit4]   2> 480024 WARN  (TEST-TestDelegationWithHadoopAuth.testDelegationTokenRenew-seed#[F8B5996390C104A2])
[    ] o.a.h.c.p.ResponseProcessCookies Invalid cookie header: "Set-Cookie: hadoop.auth=;
Domain=127.0.0.1; Expires= , 01-   -1970 00:00:00 GMT; Secure; HttpOnly". Invalid 'expires'
attribute: , 01- -1970 00:00:00 GMT
   [junit4]   2> 480033 INFO  (qtp556375337-8609) [n:127.0.0.1:41347_solr    ] o.a.s.h.a.CollectionsHandler
Invoked Collection Action :list with params action=LIST&delegation=GgADZm9vA2ZvbwCKAVl5_CfHigFZngirxwUDFCzNE4CdpOVMeJVlI9R2BBgkXSjYB3NvbHItZHQA&wt=javabin&version=2
and sendToOCPQueue=true
   [junit4]   2> 480033 INFO  (qtp556375337-8609) [n:127.0.0.1:41347_solr    ] o.a.s.s.HttpSolrCall
[admin] webapp=null path=/admin/collections params={action=LIST&delegation=GgADZm9vA2ZvbwCKAVl5_CfHigFZngirxwUDFCzNE4CdpOVMeJVlI9R2BBgkXSjYB3NvbHItZHQA&wt=javabin&version=2}
status=0 QTime=0
   [junit4]   2> 480037 INFO  (TEST-TestDelegationWithHadoopAuth.testDelegationTokenRenew-seed#[F8B5996390C104A2])
[    ] o.a.s.c.c.ZkStateReader Updated live nodes from ZooKeeper... (0) -> (2)
   [junit4]   2> 480038 INFO  (TEST-TestDelegationWithHadoopAuth.testDelegationTokenRenew-seed#[F8B5996390C104A2])
[    ] o.a.s.c.s.i.ZkClientClusterStateProvider Cluster at 127.0.0.1:53889/solr ready
   [junit4]   2> 480046 WARN  (TEST-TestDelegationWithHadoopAuth.testDelegationTokenRenew-seed#[F8B5996390C104A2])
[    ] o.a.h.c.p.ResponseProcessCookies Invalid cookie header: "Set-Cookie: hadoop.auth=;
Domain=127.0.0.1; Expires= , 01-   -1970 00:00:00 GMT; Secure; HttpOnly". Invalid 'expires'
attribute: , 01- -1970 00:00:00 GMT
   [junit4]   2> 480071 INFO  (qtp591142464-8612) [n:127.0.0.1:62624_solr    ] o.a.s.h.a.CollectionsHandler
Invoked Collection Action :list with params action=LIST&delegation=GgADZm9vA2ZvbwCKAVl5_CgZigFZngisGQYDFNMm77Vm5icYU5Z3TM-MR84A75cLB3NvbHItZHQA&wt=javabin&version=2
and sendToOCPQueue=true
   [junit4]   2> 480071 INFO  (qtp591142464-8612) [n:127.0.0.1:62624_solr    ] o.a.s.s.HttpSolrCall
[admin] webapp=null path=/admin/collections params={action=LIST&delegation=GgADZm9vA2ZvbwCKAVl5_CgZigFZngisGQYDFNMm77Vm5icYU5Z3TM-MR84A75cLB3NvbHItZHQA&wt=javabin&version=2}
status=0 QTime=0
   [junit4]   2> 480085 WARN  (TEST-TestDelegationWithHadoopAuth.testDelegationTokenRenew-seed#[F8B5996390C104A2])
[    ] o.a.h.c.p.ResponseProcessCookies Invalid cookie header: "Set-Cookie: hadoop.auth=;
Domain=127.0.0.1; Expires= , 01-   -1970 00:00:00 GMT; Secure; HttpOnly". Invalid 'expires'
attribute: , 01- -1970 00:00:00 GMT
   [junit4]   2> 480096 INFO  (qtp556375337-8608) [n:127.0.0.1:41347_solr    ] o.a.s.h.a.CollectionsHandler
Invoked Collection Action :list with params action=LIST&delegation=GgADZm9vA2ZvbwCKAVl5_CgZigFZngisGQYDFNMm77Vm5icYU5Z3TM-MR84A75cLB3NvbHItZHQA&wt=javabin&version=2
and sendToOCPQueue=true
   [junit4]   2> 480096 INFO  (qtp556375337-8608) [n:127.0.0.1:41347_solr    ] o.a.s.s.HttpSolrCall
[admin] webapp=null path=/admin/collections params={action=LIST&delegation=GgADZm9vA2ZvbwCKAVl5_CgZigFZngisGQYDFNMm77Vm5icYU5Z3TM-MR84A75cLB3NvbHItZHQA&wt=javabin&version=2}
status=0 QTime=0
   [junit4]   2> 480106 WARN  (TEST-TestDelegationWithHadoopAuth.testDelegationTokenRenew-seed#[F8B5996390C104A2])
[    ] o.a.h.c.p.ResponseProcessCookies Invalid cookie header: "Set-Cookie: hadoop.auth=;
Domain=127.0.0.1; Expires= , 01-   -1970 00:00:00 GMT; Secure; HttpOnly". Invalid 'expires'
attribute: , 01- -1970 00:00:00 GMT
   [junit4]   2> 480130 INFO  (qtp591142464-8601) [n:127.0.0.1:62624_solr    ] o.a.s.h.a.CollectionsHandler
Invoked Collection Action :list with params action=LIST&delegation=GgADZm9vA2ZvbwCKAVl5_ChUigFZngisVAcDFOME9uDYdx4ybep5BpajXzCVoQdAB3NvbHItZHQA&wt=javabin&version=2
and sendToOCPQueue=true
   [junit4]   2> 480130 INFO  (qtp591142464-8601) [n:127.0.0.1:62624_solr    ] o.a.s.s.HttpSolrCall
[admin] webapp=null path=/admin/collections params={action=LIST&delegation=GgADZm9vA2ZvbwCKAVl5_ChUigFZngisVAcDFOME9uDYdx4ybep5BpajXzCVoQdAB3NvbHItZHQA&wt=javabin&version=2}
status=0 QTime=0
   [junit4]   2> 480138 WARN  (TEST-TestDelegationWithHadoopAuth.testDelegationTokenRenew-seed#[F8B5996390C104A2])
[    ] o.a.h.c.p.ResponseProcessCookies Invalid cookie header: "Set-Cookie: hadoop.auth=;
Domain=127.0.0.1; Expires= , 01-   -1970 00:00:00 GMT; Secure; HttpOnly". Invalid 'expires'
attribute: , 01- -1970 00:00:00 GMT
   [junit4]   2> 480143 INFO  (TEST-TestDelegationWithHadoopAuth.testDelegationTokenRenew-seed#[F8B5996390C104A2])
[    ] o.a.s.c.c.ZkStateReader Updated live nodes from ZooKeeper... (0) -> (2)
   [junit4]   2> 480144 INFO  (TEST-TestDelegationWithHadoopAuth.testDelegationTokenRenew-seed#[F8B5996390C104A2])
[    ] o.a.s.c.s.i.ZkClientClusterStateProvider Cluster at 127.0.0.1:53889/solr ready
   [junit4]   2> 480152 INFO  (qtp591142464-8603) [n:127.0.0.1:62624_solr    ] o.a.s.h.a.CollectionsHandler
Invoked Collection Action :list with params action=LIST&delegation=GgADZm9vA2ZvbwCKAVl5_ChUigFZngisVAcDFOME9uDYdx4ybep5BpajXzCVoQdAB3NvbHItZHQA&wt=javabin&version=2
and sendToOCPQueue=true
   [junit4]   2> 480152 INFO  (qtp591142464-8603) [n:127.0.0.1:62624_solr    ] o.a.s.s.HttpSolrCall
[admin] webapp=null path=/admin/collections params={action=LIST&delegation=GgADZm9vA2ZvbwCKAVl5_ChUigFZngisVAcDFOME9uDYdx4ybep5BpajXzCVoQdAB3NvbHItZHQA&wt=javabin&version=2}
status=0 QTime=0
   [junit4]   2> 480181 WARN  (TEST-TestDelegationWithHadoopAuth.testDelegationTokenRenew-seed#[F8B5996390C104A2])
[    ] o.a.h.c.p.ResponseProcessCookies Invalid cookie header: "Set-Cookie: hadoop.auth=;
Domain=127.0.0.1; Expires= , 01-   -1970 00:00:00 GMT; Secure; HttpOnly". Invalid 'expires'
attribute: , 01- -1970 00:00:00 GMT
   [junit4]   2> 480207 INFO  (qtp591142464-8602) [n:127.0.0.1:62624_solr    ] o.a.s.h.a.CollectionsHandler
Invoked Collection Action :list with params action=LIST&delegation=GgADZm9vA2ZvbwCKAVl5_CigigFZngisoAgDFG17ka5BegLHhXtv9cPV-Qf93uY1B3NvbHItZHQA&wt=javabin&version=2
and sendToOCPQueue=true
   [junit4]   2> 480207 INFO  (qtp591142464-8602) [n:127.0.0.1:62624_solr    ] o.a.s.s.HttpSolrCall
[admin] webapp=null path=/admin/collections params={action=LIST&delegation=GgADZm9vA2ZvbwCKAVl5_CigigFZngisoAgDFG17ka5BegLHhXtv9cPV-Qf93uY1B3NvbHItZHQA&wt=javabin&version=2}
status=0 QTime=0
   [junit4]   2> 480216 WARN  (TEST-TestDelegationWithHadoopAuth.testDelegationTokenRenew-seed#[F8B5996390C104A2])
[    ] o.a.h.c.p.ResponseProcessCookies Invalid cookie header: "Set-Cookie: hadoop.auth=;
Domain=127.0.0.1; Expires= , 01-   -1970 00:00:00 GMT; Secure; HttpOnly". Invalid 'expires'
attribute: , 01- -1970 00:00:00 GMT
   [junit4]   2> 480226 INFO  (qtp556375337-8605) [n:127.0.0.1:41347_solr    ] o.a.s.h.a.CollectionsHandler
Invoked Collection Action :list with params action=LIST&delegation=GgADZm9vA2ZvbwCKAVl5_CigigFZngisoAgDFG17ka5BegLHhXtv9cPV-Qf93uY1B3NvbHItZHQA&wt=javabin&version=2
and sendToOCPQueue=true
   [junit4]   2> 480226 INFO  (qtp556375337-8605) [n:127.0.0.1:41347_solr    ] o.a.s.s.HttpSolrCall
[admin] webapp=null path=/admin/collections params={action=LIST&delegation=GgADZm9vA2ZvbwCKAVl5_CigigFZngisoAgDFG17ka5BegLHhXtv9cPV-Qf93uY1B3NvbHItZHQA&wt=javabin&version=2}
status=0 QTime=0
   [junit4]   2> 480233 INFO  (TEST-TestDelegationWithHadoopAuth.testDelegationTokenRenew-seed#[F8B5996390C104A2])
[    ] o.a.s.c.c.ZkStateReader Updated live nodes from ZooKeeper... (0) -> (2)
   [junit4]   2> 480234 INFO  (TEST-TestDelegationWithHadoopAuth.testDelegationTokenRenew-seed#[F8B5996390C104A2])
[    ] o.a.s.c.s.i.ZkClientClusterStateProvider Cluster at 127.0.0.1:53889/solr ready
   [junit4]   2> 480244 WARN  (TEST-TestDelegationWithHadoopAuth.testDelegationTokenRenew-seed#[F8B5996390C104A2])
[    ] o.a.h.c.p.ResponseProcessCookies Invalid cookie header: "Set-Cookie: hadoop.auth=;
Domain=127.0.0.1; Expires= , 01-   -1970 00:00:00 GMT; Secure; HttpOnly". Invalid 'expires'
attribute: , 01- -1970 00:00:00 GMT
   [junit4]   2> 480246 INFO  (TEST-TestDelegationWithHadoopAuth.testDelegationTokenRenew-seed#[F8B5996390C104A2])
[    ] o.a.s.SolrTestCaseJ4 ###Ending testDelegationTokenRenew
   [junit4]   2> 480280 INFO  (TEST-TestDelegationWithHadoopAuth.testDelegationTokenCancelFail-seed#[F8B5996390C104A2])
[    ] o.a.s.SolrTestCaseJ4 ###Starting testDelegationTokenCancelFail
   [junit4]   2> 480294 INFO  (TEST-TestDelegationWithHadoopAuth.testDelegationTokenCancelFail-seed#[F8B5996390C104A2])
[    ] o.a.s.SolrTestCaseJ4 ###Ending testDelegationTokenCancelFail
   [junit4]   2> NOTE: reproduce with: ant test  -Dtestcase=TestDelegationWithHadoopAuth
-Dtests.method=testDelegationTokenCancelFail -Dtests.seed=F8B5996390C104A2 -Dtests.slow=true
-Dtests.locale=he-IL -Dtests.timezone=Antarctica/Rothera -Dtests.asserts=true -Dtests.file.encoding=ISO-8859-1
   [junit4] FAILURE 0.05s J0 | TestDelegationWithHadoopAuth.testDelegationTokenCancelFail
<<<
   [junit4]    > Throwable #1: java.lang.AssertionError: expected:<200> but was:<404>
   [junit4]    > 	at __randomizedtesting.SeedInfo.seed([F8B5996390C104A2:900AAC49405B164E]:0)
   [junit4]    > 	at org.apache.solr.security.hadoop.TestDelegationWithHadoopAuth.cancelDelegationToken(TestDelegationWithHadoopAuth.java:128)
   [junit4]    > 	at org.apache.solr.security.hadoop.TestDelegationWithHadoopAuth.testDelegationTokenCancelFail(TestDelegationWithHadoopAuth.java:280)
   [junit4]    > 	at java.lang.Thread.run(Thread.java:745)
   [junit4]   2> 480330 INFO  (TEST-TestDelegationWithHadoopAuth.testZNodePaths-seed#[F8B5996390C104A2])
[    ] o.a.s.SolrTestCaseJ4 ###Starting testZNodePaths
   [junit4]   2> 480340 INFO  (TEST-TestDelegationWithHadoopAuth.testZNodePaths-seed#[F8B5996390C104A2])
[    ] o.a.s.SolrTestCaseJ4 ###Ending testZNodePaths
   [junit4]   2> 480374 INFO  (TEST-TestDelegationWithHadoopAuth.testDelegationOtherOp-seed#[F8B5996390C104A2])
[    ] o.a.s.SolrTestCaseJ4 ###Starting testDelegationOtherOp
   [junit4]   2> 480379 INFO  (TEST-TestDelegationWithHadoopAuth.testDelegationOtherOp-seed#[F8B5996390C104A2])
[    ] o.a.s.c.c.ZkStateReader Updated live nodes from ZooKeeper... (0) -> (2)
   [junit4]   2> 480381 INFO  (TEST-TestDelegationWithHadoopAuth.testDelegationOtherOp-seed#[F8B5996390C104A2])
[    ] o.a.s.c.s.i.ZkClientClusterStateProvider Cluster at 127.0.0.1:53889/solr ready
   [junit4]   2> 480388 INFO  (qtp591142464-8612) [n:127.0.0.1:62624_solr    ] o.a.s.h.a.CollectionsHandler
Invoked Collection Action :list with params op=someSolrOperation&action=LIST&user.name=foo&wt=javabin&version=2
and sendToOCPQueue=true
   [junit4]   2> 480388 INFO  (qtp591142464-8612) [n:127.0.0.1:62624_solr    ] o.a.s.s.HttpSolrCall
[admin] webapp=null path=/admin/collections params={op=someSolrOperation&action=LIST&user.name=foo&wt=javabin&version=2}
status=0 QTime=0
   [junit4]   2> 480389 WARN  (TEST-TestDelegationWithHadoopAuth.testDelegationOtherOp-seed#[F8B5996390C104A2])
[    ] o.a.h.c.p.ResponseProcessCookies Invalid cookie header: "Set-Cookie: hadoop.auth="u=foo&p=foo&t=simple-dt&e=1483846285932&s=creLYF5dW3QhRx9WqMaAwyGdd4c=";
Domain=127.0.0.1; Expires= , 08-   -2017 03:31:25 GMT; Secure; HttpOnly". Invalid 'expires'
attribute: , 08- -2017 03:31:25 GMT
   [junit4]   2> 480391 INFO  (TEST-TestDelegationWithHadoopAuth.testDelegationOtherOp-seed#[F8B5996390C104A2])
[    ] o.a.s.SolrTestCaseJ4 ###Ending testDelegationOtherOp
   [junit4]   2> 480427 INFO  (TEST-TestDelegationWithHadoopAuth.testDelegationTokenRenewFail-seed#[F8B5996390C104A2])
[    ] o.a.s.SolrTestCaseJ4 ###Starting testDelegationTokenRenewFail
   [junit4]   2> 480436 WARN  (qtp591142464-8602) [n:127.0.0.1:62624_solr    ] o.a.h.s.a.s.AuthenticationFilter
Authentication exception: org.apache.hadoop.security.AccessControlException: bar tries to
renew a token with renewer foo
   [junit4]   2> 480436 WARN  (qtp591142464-8602) [n:127.0.0.1:62624_solr    ] o.a.s.s.HadoopAuthPlugin
Could not find org.apache.solr.security.authentication.requestcontinues
   [junit4]   2> 480437 WARN  (TEST-TestDelegationWithHadoopAuth.testDelegationTokenRenewFail-seed#[F8B5996390C104A2])
[    ] o.a.h.c.p.ResponseProcessCookies Invalid cookie header: "Set-Cookie: hadoop.auth=;
Domain=127.0.0.1; Expires= , 01-   -1970 00:00:00 GMT; Secure; HttpOnly". Invalid 'expires'
attribute: , 01- -1970 00:00:00 GMT
   [junit4]   2> 480438 WARN  (qtp556375337-8606) [    ] o.a.h.s.a.s.AuthenticationFilter
Authentication exception: org.apache.hadoop.security.AccessControlException: bar tries to
renew a token with renewer foo
   [junit4]   2> 480438 WARN  (qtp556375337-8606) [    ] o.a.s.s.HadoopAuthPlugin Could
not find org.apache.solr.security.authentication.requestcontinues
   [junit4]   2> 480438 WARN  (TEST-TestDelegationWithHadoopAuth.testDelegationTokenRenewFail-seed#[F8B5996390C104A2])
[    ] o.a.h.c.p.ResponseProcessCookies Invalid cookie header: "Set-Cookie: hadoop.auth=;
Domain=127.0.0.1; Expires= , 01-   -1970 00:00:00 GMT; Secure; HttpOnly". Invalid 'expires'
attribute: , 01- -1970 00:00:00 GMT
   [junit4]   2> 480446 WARN  (qtp591142464-8601) [n:127.0.0.1:62624_solr    ] o.a.h.s.a.s.AuthenticationFilter
Authentication exception: org.apache.hadoop.security.AccessControlException: notRenewUser
tries to renew a token with renewer renewUser
   [junit4]   2> 480447 WARN  (qtp591142464-8601) [n:127.0.0.1:62624_solr    ] o.a.s.s.HadoopAuthPlugin
Could not find org.apache.solr.security.authentication.requestcontinues
   [junit4]   2> 480448 WARN  (TEST-TestDelegationWithHadoopAuth.testDelegationTokenRenewFail-seed#[F8B5996390C104A2])
[    ] o.a.h.c.p.ResponseProcessCookies Invalid cookie header: "Set-Cookie: hadoop.auth=;
Domain=127.0.0.1; Expires= , 01-   -1970 00:00:00 GMT; Secure; HttpOnly". Invalid 'expires'
attribute: , 01- -1970 00:00:00 GMT
   [junit4]   2> 480449 WARN  (qtp556375337-8606) [    ] o.a.h.s.a.s.AuthenticationFilter
Authentication exception: org.apache.hadoop.security.AccessControlException: notRenewUser
tries to renew a token with renewer renewUser
   [junit4]   2> 480449 WARN  (qtp556375337-8606) [    ] o.a.s.s.HadoopAuthPlugin Could
not find org.apache.solr.security.authentication.requestcontinues
   [junit4]   2> 480449 WARN  (TEST-TestDelegationWithHadoopAuth.testDelegationTokenRenewFail-seed#[F8B5996390C104A2])
[    ] o.a.h.c.p.ResponseProcessCookies Invalid cookie header: "Set-Cookie: hadoop.auth=;
Domain=127.0.0.1; Expires= , 01-   -1970 00:00:00 GMT; Secure; HttpOnly". Invalid 'expires'
attribute: , 01- -1970 00:00:00 GMT
   [junit4]   2> 480449 INFO  (TEST-TestDelegationWithHadoopAuth.testDelegationTokenRenewFail-seed#[F8B5996390C104A2])
[    ] o.a.s.SolrTestCaseJ4 ###Ending testDelegationTokenRenewFail
   [junit4]   2> 480452 INFO  (jetty-launcher-726-thread-1) [    ] o.e.j.s.AbstractConnector
Stopped ServerConnector@20b5cd57{SSL,[ssl, http/1.1]}{127.0.0.1:0}
   [junit4]   2> 480453 INFO  (jetty-launcher-726-thread-1) [    ] o.a.s.c.CoreContainer
Shutting down CoreContainer instance=380478430
   [junit4]   2> 480453 INFO  (jetty-launcher-726-thread-2) [    ] o.e.j.s.AbstractConnector
Stopped ServerConnector@3210da34{SSL,[ssl, http/1.1]}{127.0.0.1:0}
   [junit4]   2> 480454 INFO  (jetty-launcher-726-thread-2) [    ] o.a.s.c.CoreContainer
Shutting down CoreContainer instance=1221494799
   [junit4]   2> 480460 INFO  (jetty-launcher-726-thread-1) [    ] o.a.s.c.Overseer Overseer
(id=97242990708195333-127.0.0.1:41347_solr-n_0000000000) closing
   [junit4]   2> 480461 INFO  (OverseerStateUpdate-97242990708195333-127.0.0.1:41347_solr-n_0000000000)
[n:127.0.0.1:41347_solr    ] o.a.s.c.Overseer Overseer Loop exiting : 127.0.0.1:41347_solr
   [junit4]   2> 480464 INFO  (jetty-launcher-726-thread-1) [    ] o.a.s.m.SolrMetricManager
Closing metric reporters for: solr.node
   [junit4]   2> 480465 ERROR (Thread[Thread-5555,5,TGRP-TestDelegationWithHadoopAuth])
[n:127.0.0.1:41347_solr    ] o.a.h.s.t.d.AbstractDelegationTokenSecretManager ExpiredTokenRemover
received java.lang.InterruptedException: sleep interrupted
   [junit4]   2> 480466 INFO  (zkCallback-737-thread-1-processing-n:127.0.0.1:62624_solr)
[n:127.0.0.1:62624_solr    ] o.a.s.c.c.ZkStateReader Updated live nodes from ZooKeeper...
(2) -> (1)
   [junit4]   2> 480471 INFO  (jetty-launcher-726-thread-2) [    ] o.a.s.m.SolrMetricManager
Closing metric reporters for: solr.node
   [junit4]   2> 480472 ERROR (Thread[Thread-5554,5,TGRP-TestDelegationWithHadoopAuth])
[n:127.0.0.1:62624_solr    ] o.a.h.s.t.d.AbstractDelegationTokenSecretManager ExpiredTokenRemover
received java.lang.InterruptedException: sleep interrupted
   [junit4]   2> 480484 INFO  (jetty-launcher-726-thread-1) [    ] o.e.j.s.h.ContextHandler
Stopped o.e.j.s.ServletContextHandler@21d5d65a{/solr,null,UNAVAILABLE}
   [junit4]   2> 480489 INFO  (jetty-launcher-726-thread-2) [    ] o.e.j.s.h.ContextHandler
Stopped o.e.j.s.ServletContextHandler@3613497b{/solr,null,UNAVAILABLE}
   [junit4]   2> 480492 INFO  (SUITE-TestDelegationWithHadoopAuth-seed#[F8B5996390C104A2]-worker)
[    ] o.a.s.c.ZkTestServer connecting to 127.0.0.1:53889 53889
   [junit4]   2> 480558 INFO  (Thread-5537) [    ] o.a.s.c.ZkTestServer connecting to 127.0.0.1:53889
53889
   [junit4]   2> 480559 WARN  (Thread-5537) [    ] o.a.s.c.ZkTestServer Watch limit violations:

   [junit4]   2> Maximum concurrent create/delete watches above limit:
   [junit4]   2> 
   [junit4]   2> 	11	/solr/aliases.json
   [junit4]   2> 	2	/solr/security.json
   [junit4]   2> 
   [junit4]   2> Maximum concurrent data watches above limit:
   [junit4]   2> 
   [junit4]   2> 	11	/solr/clusterprops.json
   [junit4]   2> 	11	/solr/clusterstate.json
   [junit4]   2> 	3	/solr/security/zkdtsm/ZKDTSMRoot/ZKDTSMKeyIdRoot
   [junit4]   2> 	2	/solr/security/zkdtsm/ZKDTSMRoot/ZKDTSMTokensRoot/DT_7
   [junit4]   2> 	2	/solr/security/zkdtsm/ZKDTSMRoot/ZKDTSMTokensRoot/DT_6
   [junit4]   2> 	2	/solr/security/zkdtsm/ZKDTSMRoot/ZKDTSMTokensRoot/DT_9
   [junit4]   2> 	2	/solr/security/zkdtsm/ZKDTSMRoot/ZKDTSMTokensRoot/DT_8
   [junit4]   2> 	2	/solr/security/zkdtsm/ZKDTSMRoot/ZKDTSMMasterKeyRoot/DK_1
   [junit4]   2> 	2	/solr/security/zkdtsm/ZKDTSMRoot/ZKDTSMTokensRoot/DT_1
   [junit4]   2> 	2	/solr/security/zkdtsm/ZKDTSMRoot/ZKDTSMMasterKeyRoot/DK_3
   [junit4]   2> 	2	/solr/security/zkdtsm/ZKDTSMRoot/ZKDTSMTokensRoot/DT_3
   [junit4]   2> 	2	/solr/security/zkdtsm/ZKDTSMRoot/ZKDTSMMasterKeyRoot/DK_2
   [junit4]   2> 	2	/solr/security/zkdtsm/ZKDTSMRoot/ZKDTSMTokensRoot/DT_2
   [junit4]   2> 	2	/solr/security/zkdtsm/ZKDTSMRoot/ZKDTSMTokensRoot/DT_5
   [junit4]   2> 	2	/solr/security/zkdtsm/ZKDTSMRoot/ZKDTSMMasterKeyRoot/DK_4
   [junit4]   2> 	2	/solr/security/zkdtsm/ZKDTSMRoot/ZKDTSMTokensRoot/DT_4
   [junit4]   2> 	2	/solr/security/zkdtsm/ZKDTSMRoot/ZKDTSMTokensRoot/DT_12
   [junit4]   2> 	2	/solr/security/zkdtsm/ZKDTSMRoot/ZKDTSMSeqNumRoot
   [junit4]   2> 	2	/solr/security/zkdtsm/ZKDTSMRoot/ZKDTSMTokensRoot/DT_11
   [junit4]   2> 	2	/solr/security/zkdtsm/ZKDTSMRoot/ZKDTSMTokensRoot/DT_10
   [junit4]   2> 
   [junit4]   2> Maximum concurrent children watches above limit:
   [junit4]   2> 
   [junit4]   2> 	11	/solr/live_nodes
   [junit4]   2> 	11	/solr/collections
   [junit4]   2> 	3	/solr/overseer/collection-queue-work
   [junit4]   2> 	2	/solr/overseer/queue
   [junit4]   2> 	2	/solr/security/zkdtsm/ZKDTSMRoot/ZKDTSMMasterKeyRoot
   [junit4]   2> 	2	/solr/overseer/queue-work
   [junit4]   2> 	2	/solr/security/zkdtsm/ZKDTSMRoot/ZKDTSMTokensRoot
   [junit4]   2> 
   [junit4]   2> 480559 INFO  (SUITE-TestDelegationWithHadoopAuth-seed#[F8B5996390C104A2]-worker)
[    ] o.a.s.SolrTestCaseJ4 ###deleteCore
   [junit4]   2> NOTE: leaving temporary files on disk at: /export/home/jenkins/workspace/Lucene-Solr-master-Solaris/solr/build/solr-core/test/J0/temp/solr.security.hadoop.TestDelegationWithHadoopAuth_F8B5996390C104A2-001
   [junit4]   2> Jan 07, 2017 5:31:26 PM com.carrotsearch.randomizedtesting.ThreadLeakControl
checkThreadLeaks
   [junit4]   2> WARNING: Will linger awaiting termination of 4 leaked thread(s).
   [junit4]   2> NOTE: test params are: codec=Asserting(Lucene70): {}, docValues:{}, maxPointsInLeafNode=1654,
maxMBSortInHeap=6.916381429675816, sim=RandomSimilarity(queryNorm=false): {}, locale=he-IL,
timezone=Antarctica/Rothera
   [junit4]   2> NOTE: SunOS 5.11 amd64/Oracle Corporation 1.8.0_112 (64-bit)/cpus=3,threads=1,free=97480160,total=233226240
   [junit4]   2> NOTE: All tests run in this JVM: [TestAnalyzeInfixSuggestions, TestSegmentSorting,
CdcrRequestHandlerTest, ConcurrentDeleteAndCreateCollectionTest, TestBinaryField, DOMUtilTest,
SolrMetricsIntegrationTest, TestSolrDeletionPolicy1, FastVectorHighlighterTest, TestExclusionRuleCollectionAccess,
ActionThrottleTest, TestJmxIntegration, TestSlowCompositeReaderWrapper, OverseerRolesTest,
TestCollectionAPI, TestManagedSchema, DeleteReplicaTest, CurrencyFieldXmlFileTest, SyncSliceTest,
TestSortByMinMaxFunction, CopyFieldTest, CdcrUpdateLogTest, TestSerializedLuceneMatchVersion,
CheckHdfsIndexTest, TestRecoveryHdfs, TestCopyFieldCollectionResource, TestSQLHandler, SolrGraphiteReporterTest,
TestConfigSetsAPIExclusivity, TestRTGBase, TestManagedResourceStorage, TestCollationField,
TestRandomDVFaceting, TestSubQueryTransformer, TestGraphTermsQParserPlugin, TestAddFieldRealTimeGet,
DocExpirationUpdateProcessorFactoryTest, TestCloudSchemaless, TestFieldCacheReopen, PluginInfoTest,
SmileWriterTest, TestCustomStream, HdfsNNFailoverTest, TestDelegationWithHadoopAuth]
   [junit4] Completed [128/675 (1!)] on J0 in 4.13s, 8 tests, 1 failure <<< FAILURES!

[...truncated 64185 lines...]


Mime
View raw message