lucene-dev mailing list archives

Site index · List index
Message view « Date » · « Thread »
Top « Date » · « Thread »
From Policeman Jenkins Server <jenk...@thetaphi.de>
Subject [JENKINS] Lucene-Solr-master-MacOSX (64bit/jdk1.8.0) - Build # 3774 - Still Unstable!
Date Thu, 12 Jan 2017 18:19:51 GMT
Build: https://jenkins.thetaphi.de/job/Lucene-Solr-master-MacOSX/3774/
Java: 64bit/jdk1.8.0 -XX:+UseCompressedOops -XX:+UseG1GC

2 tests failed.
FAILED:  org.apache.solr.cloud.ShardSplitTest.testSplitAfterFailedSplit

Error Message:
expected:<1> but was:<2>

Stack Trace:
java.lang.AssertionError: expected:<1> but was:<2>
	at __randomizedtesting.SeedInfo.seed([782CBBD5E8B225F6:8161287AD4C7687C]:0)
	at org.junit.Assert.fail(Assert.java:93)
	at org.junit.Assert.failNotEquals(Assert.java:647)
	at org.junit.Assert.assertEquals(Assert.java:128)
	at org.junit.Assert.assertEquals(Assert.java:472)
	at org.junit.Assert.assertEquals(Assert.java:456)
	at org.apache.solr.cloud.ShardSplitTest.testSplitAfterFailedSplit(ShardSplitTest.java:279)
	at sun.reflect.NativeMethodAccessorImpl.invoke0(Native Method)
	at sun.reflect.NativeMethodAccessorImpl.invoke(NativeMethodAccessorImpl.java:62)
	at sun.reflect.DelegatingMethodAccessorImpl.invoke(DelegatingMethodAccessorImpl.java:43)
	at java.lang.reflect.Method.invoke(Method.java:498)
	at com.carrotsearch.randomizedtesting.RandomizedRunner.invoke(RandomizedRunner.java:1713)
	at com.carrotsearch.randomizedtesting.RandomizedRunner$8.evaluate(RandomizedRunner.java:907)
	at com.carrotsearch.randomizedtesting.RandomizedRunner$9.evaluate(RandomizedRunner.java:943)
	at com.carrotsearch.randomizedtesting.RandomizedRunner$10.evaluate(RandomizedRunner.java:957)
	at org.apache.solr.BaseDistributedSearchTestCase$ShardsRepeatRule$ShardsFixedStatement.callStatement(BaseDistributedSearchTestCase.java:985)
	at org.apache.solr.BaseDistributedSearchTestCase$ShardsRepeatRule$ShardsStatement.evaluate(BaseDistributedSearchTestCase.java:960)
	at com.carrotsearch.randomizedtesting.rules.SystemPropertiesRestoreRule$1.evaluate(SystemPropertiesRestoreRule.java:57)
	at org.apache.lucene.util.TestRuleSetupTeardownChained$1.evaluate(TestRuleSetupTeardownChained.java:49)
	at org.apache.lucene.util.AbstractBeforeAfterRule$1.evaluate(AbstractBeforeAfterRule.java:45)
	at org.apache.lucene.util.TestRuleThreadAndTestName$1.evaluate(TestRuleThreadAndTestName.java:48)
	at org.apache.lucene.util.TestRuleIgnoreAfterMaxFailures$1.evaluate(TestRuleIgnoreAfterMaxFailures.java:64)
	at org.apache.lucene.util.TestRuleMarkFailure$1.evaluate(TestRuleMarkFailure.java:47)
	at com.carrotsearch.randomizedtesting.rules.StatementAdapter.evaluate(StatementAdapter.java:36)
	at com.carrotsearch.randomizedtesting.ThreadLeakControl$StatementRunner.run(ThreadLeakControl.java:367)
	at com.carrotsearch.randomizedtesting.ThreadLeakControl.forkTimeoutingTask(ThreadLeakControl.java:811)
	at com.carrotsearch.randomizedtesting.ThreadLeakControl$3.evaluate(ThreadLeakControl.java:462)
	at com.carrotsearch.randomizedtesting.RandomizedRunner.runSingleTest(RandomizedRunner.java:916)
	at com.carrotsearch.randomizedtesting.RandomizedRunner$5.evaluate(RandomizedRunner.java:802)
	at com.carrotsearch.randomizedtesting.RandomizedRunner$6.evaluate(RandomizedRunner.java:852)
	at com.carrotsearch.randomizedtesting.RandomizedRunner$7.evaluate(RandomizedRunner.java:863)
	at com.carrotsearch.randomizedtesting.rules.StatementAdapter.evaluate(StatementAdapter.java:36)
	at com.carrotsearch.randomizedtesting.rules.SystemPropertiesRestoreRule$1.evaluate(SystemPropertiesRestoreRule.java:57)
	at org.apache.lucene.util.AbstractBeforeAfterRule$1.evaluate(AbstractBeforeAfterRule.java:45)
	at com.carrotsearch.randomizedtesting.rules.StatementAdapter.evaluate(StatementAdapter.java:36)
	at org.apache.lucene.util.TestRuleStoreClassName$1.evaluate(TestRuleStoreClassName.java:41)
	at com.carrotsearch.randomizedtesting.rules.NoShadowingOrOverridesOnMethodsRule$1.evaluate(NoShadowingOrOverridesOnMethodsRule.java:40)
	at com.carrotsearch.randomizedtesting.rules.NoShadowingOrOverridesOnMethodsRule$1.evaluate(NoShadowingOrOverridesOnMethodsRule.java:40)
	at com.carrotsearch.randomizedtesting.rules.StatementAdapter.evaluate(StatementAdapter.java:36)
	at com.carrotsearch.randomizedtesting.rules.StatementAdapter.evaluate(StatementAdapter.java:36)
	at com.carrotsearch.randomizedtesting.rules.StatementAdapter.evaluate(StatementAdapter.java:36)
	at org.apache.lucene.util.TestRuleAssertionsRequired$1.evaluate(TestRuleAssertionsRequired.java:53)
	at org.apache.lucene.util.TestRuleMarkFailure$1.evaluate(TestRuleMarkFailure.java:47)
	at org.apache.lucene.util.TestRuleIgnoreAfterMaxFailures$1.evaluate(TestRuleIgnoreAfterMaxFailures.java:64)
	at org.apache.lucene.util.TestRuleIgnoreTestSuites$1.evaluate(TestRuleIgnoreTestSuites.java:54)
	at com.carrotsearch.randomizedtesting.rules.StatementAdapter.evaluate(StatementAdapter.java:36)
	at com.carrotsearch.randomizedtesting.ThreadLeakControl$StatementRunner.run(ThreadLeakControl.java:367)
	at java.lang.Thread.run(Thread.java:745)


FAILED:  org.apache.solr.cloud.PeerSyncReplicationTest.test

Error Message:
timeout waiting to see all nodes active

Stack Trace:
java.lang.AssertionError: timeout waiting to see all nodes active
	at __randomizedtesting.SeedInfo.seed([782CBBD5E8B225F6:F078840F464E480E]:0)
	at org.junit.Assert.fail(Assert.java:93)
	at org.apache.solr.cloud.PeerSyncReplicationTest.waitTillNodesActive(PeerSyncReplicationTest.java:326)
	at org.apache.solr.cloud.PeerSyncReplicationTest.bringUpDeadNodeAndEnsureNoReplication(PeerSyncReplicationTest.java:277)
	at org.apache.solr.cloud.PeerSyncReplicationTest.forceNodeFailureAndDoPeerSync(PeerSyncReplicationTest.java:259)
	at org.apache.solr.cloud.PeerSyncReplicationTest.test(PeerSyncReplicationTest.java:138)
	at sun.reflect.NativeMethodAccessorImpl.invoke0(Native Method)
	at sun.reflect.NativeMethodAccessorImpl.invoke(NativeMethodAccessorImpl.java:62)
	at sun.reflect.DelegatingMethodAccessorImpl.invoke(DelegatingMethodAccessorImpl.java:43)
	at java.lang.reflect.Method.invoke(Method.java:498)
	at com.carrotsearch.randomizedtesting.RandomizedRunner.invoke(RandomizedRunner.java:1713)
	at com.carrotsearch.randomizedtesting.RandomizedRunner$8.evaluate(RandomizedRunner.java:907)
	at com.carrotsearch.randomizedtesting.RandomizedRunner$9.evaluate(RandomizedRunner.java:943)
	at com.carrotsearch.randomizedtesting.RandomizedRunner$10.evaluate(RandomizedRunner.java:957)
	at org.apache.solr.BaseDistributedSearchTestCase$ShardsRepeatRule$ShardsFixedStatement.callStatement(BaseDistributedSearchTestCase.java:985)
	at org.apache.solr.BaseDistributedSearchTestCase$ShardsRepeatRule$ShardsStatement.evaluate(BaseDistributedSearchTestCase.java:960)
	at com.carrotsearch.randomizedtesting.rules.SystemPropertiesRestoreRule$1.evaluate(SystemPropertiesRestoreRule.java:57)
	at org.apache.lucene.util.TestRuleSetupTeardownChained$1.evaluate(TestRuleSetupTeardownChained.java:49)
	at org.apache.lucene.util.AbstractBeforeAfterRule$1.evaluate(AbstractBeforeAfterRule.java:45)
	at org.apache.lucene.util.TestRuleThreadAndTestName$1.evaluate(TestRuleThreadAndTestName.java:48)
	at org.apache.lucene.util.TestRuleIgnoreAfterMaxFailures$1.evaluate(TestRuleIgnoreAfterMaxFailures.java:64)
	at org.apache.lucene.util.TestRuleMarkFailure$1.evaluate(TestRuleMarkFailure.java:47)
	at com.carrotsearch.randomizedtesting.rules.StatementAdapter.evaluate(StatementAdapter.java:36)
	at com.carrotsearch.randomizedtesting.ThreadLeakControl$StatementRunner.run(ThreadLeakControl.java:367)
	at com.carrotsearch.randomizedtesting.ThreadLeakControl.forkTimeoutingTask(ThreadLeakControl.java:811)
	at com.carrotsearch.randomizedtesting.ThreadLeakControl$3.evaluate(ThreadLeakControl.java:462)
	at com.carrotsearch.randomizedtesting.RandomizedRunner.runSingleTest(RandomizedRunner.java:916)
	at com.carrotsearch.randomizedtesting.RandomizedRunner$5.evaluate(RandomizedRunner.java:802)
	at com.carrotsearch.randomizedtesting.RandomizedRunner$6.evaluate(RandomizedRunner.java:852)
	at com.carrotsearch.randomizedtesting.RandomizedRunner$7.evaluate(RandomizedRunner.java:863)
	at com.carrotsearch.randomizedtesting.rules.StatementAdapter.evaluate(StatementAdapter.java:36)
	at com.carrotsearch.randomizedtesting.rules.SystemPropertiesRestoreRule$1.evaluate(SystemPropertiesRestoreRule.java:57)
	at org.apache.lucene.util.AbstractBeforeAfterRule$1.evaluate(AbstractBeforeAfterRule.java:45)
	at com.carrotsearch.randomizedtesting.rules.StatementAdapter.evaluate(StatementAdapter.java:36)
	at org.apache.lucene.util.TestRuleStoreClassName$1.evaluate(TestRuleStoreClassName.java:41)
	at com.carrotsearch.randomizedtesting.rules.NoShadowingOrOverridesOnMethodsRule$1.evaluate(NoShadowingOrOverridesOnMethodsRule.java:40)
	at com.carrotsearch.randomizedtesting.rules.NoShadowingOrOverridesOnMethodsRule$1.evaluate(NoShadowingOrOverridesOnMethodsRule.java:40)
	at com.carrotsearch.randomizedtesting.rules.StatementAdapter.evaluate(StatementAdapter.java:36)
	at com.carrotsearch.randomizedtesting.rules.StatementAdapter.evaluate(StatementAdapter.java:36)
	at com.carrotsearch.randomizedtesting.rules.StatementAdapter.evaluate(StatementAdapter.java:36)
	at org.apache.lucene.util.TestRuleAssertionsRequired$1.evaluate(TestRuleAssertionsRequired.java:53)
	at org.apache.lucene.util.TestRuleMarkFailure$1.evaluate(TestRuleMarkFailure.java:47)
	at org.apache.lucene.util.TestRuleIgnoreAfterMaxFailures$1.evaluate(TestRuleIgnoreAfterMaxFailures.java:64)
	at org.apache.lucene.util.TestRuleIgnoreTestSuites$1.evaluate(TestRuleIgnoreTestSuites.java:54)
	at com.carrotsearch.randomizedtesting.rules.StatementAdapter.evaluate(StatementAdapter.java:36)
	at com.carrotsearch.randomizedtesting.ThreadLeakControl$StatementRunner.run(ThreadLeakControl.java:367)
	at java.lang.Thread.run(Thread.java:745)




Build Log:
[...truncated 11215 lines...]
   [junit4] Suite: org.apache.solr.cloud.PeerSyncReplicationTest
   [junit4]   2> Creating dataDir: /Users/jenkins/workspace/Lucene-Solr-master-MacOSX/solr/build/solr-core/test/J1/temp/solr.cloud.PeerSyncReplicationTest_782CBBD5E8B225F6-001/init-core-data-001
   [junit4]   2> 634847 INFO  (SUITE-PeerSyncReplicationTest-seed#[782CBBD5E8B225F6]-worker) [    ] o.a.s.SolrTestCaseJ4 Randomized ssl (false) and clientAuth (false) via: @org.apache.solr.util.RandomizeSSL(reason=, value=NaN, ssl=NaN, clientAuth=NaN) w/ MAC_OS_X supressed clientAuth
   [junit4]   2> 634847 INFO  (SUITE-PeerSyncReplicationTest-seed#[782CBBD5E8B225F6]-worker) [    ] o.a.s.BaseDistributedSearchTestCase Setting hostContext system property: /xpu/
   [junit4]   2> 634849 INFO  (TEST-PeerSyncReplicationTest.test-seed#[782CBBD5E8B225F6]) [    ] o.a.s.c.ZkTestServer STARTING ZK TEST SERVER
   [junit4]   2> 634849 INFO  (Thread-1193) [    ] o.a.s.c.ZkTestServer client port:0.0.0.0/0.0.0.0:0
   [junit4]   2> 634849 INFO  (Thread-1193) [    ] o.a.s.c.ZkTestServer Starting server
   [junit4]   2> 634950 INFO  (TEST-PeerSyncReplicationTest.test-seed#[782CBBD5E8B225F6]) [    ] o.a.s.c.ZkTestServer start zk server on port:52873
   [junit4]   2> 634978 INFO  (TEST-PeerSyncReplicationTest.test-seed#[782CBBD5E8B225F6]) [    ] o.a.s.c.AbstractZkTestCase put /Users/jenkins/workspace/Lucene-Solr-master-MacOSX/solr/core/src/test-files/solr/collection1/conf/solrconfig-tlog.xml to /configs/conf1/solrconfig.xml
   [junit4]   2> 634992 INFO  (TEST-PeerSyncReplicationTest.test-seed#[782CBBD5E8B225F6]) [    ] o.a.s.c.AbstractZkTestCase put /Users/jenkins/workspace/Lucene-Solr-master-MacOSX/solr/core/src/test-files/solr/collection1/conf/schema.xml to /configs/conf1/schema.xml
   [junit4]   2> 634997 INFO  (TEST-PeerSyncReplicationTest.test-seed#[782CBBD5E8B225F6]) [    ] o.a.s.c.AbstractZkTestCase put /Users/jenkins/workspace/Lucene-Solr-master-MacOSX/solr/core/src/test-files/solr/collection1/conf/solrconfig.snippet.randomindexconfig.xml to /configs/conf1/solrconfig.snippet.randomindexconfig.xml
   [junit4]   2> 635000 INFO  (TEST-PeerSyncReplicationTest.test-seed#[782CBBD5E8B225F6]) [    ] o.a.s.c.AbstractZkTestCase put /Users/jenkins/workspace/Lucene-Solr-master-MacOSX/solr/core/src/test-files/solr/collection1/conf/stopwords.txt to /configs/conf1/stopwords.txt
   [junit4]   2> 635003 INFO  (TEST-PeerSyncReplicationTest.test-seed#[782CBBD5E8B225F6]) [    ] o.a.s.c.AbstractZkTestCase put /Users/jenkins/workspace/Lucene-Solr-master-MacOSX/solr/core/src/test-files/solr/collection1/conf/protwords.txt to /configs/conf1/protwords.txt
   [junit4]   2> 635006 INFO  (TEST-PeerSyncReplicationTest.test-seed#[782CBBD5E8B225F6]) [    ] o.a.s.c.AbstractZkTestCase put /Users/jenkins/workspace/Lucene-Solr-master-MacOSX/solr/core/src/test-files/solr/collection1/conf/currency.xml to /configs/conf1/currency.xml
   [junit4]   2> 635009 INFO  (TEST-PeerSyncReplicationTest.test-seed#[782CBBD5E8B225F6]) [    ] o.a.s.c.AbstractZkTestCase put /Users/jenkins/workspace/Lucene-Solr-master-MacOSX/solr/core/src/test-files/solr/collection1/conf/enumsConfig.xml to /configs/conf1/enumsConfig.xml
   [junit4]   2> 635012 INFO  (TEST-PeerSyncReplicationTest.test-seed#[782CBBD5E8B225F6]) [    ] o.a.s.c.AbstractZkTestCase put /Users/jenkins/workspace/Lucene-Solr-master-MacOSX/solr/core/src/test-files/solr/collection1/conf/open-exchange-rates.json to /configs/conf1/open-exchange-rates.json
   [junit4]   2> 635016 INFO  (TEST-PeerSyncReplicationTest.test-seed#[782CBBD5E8B225F6]) [    ] o.a.s.c.AbstractZkTestCase put /Users/jenkins/workspace/Lucene-Solr-master-MacOSX/solr/core/src/test-files/solr/collection1/conf/mapping-ISOLatin1Accent.txt to /configs/conf1/mapping-ISOLatin1Accent.txt
   [junit4]   2> 635019 INFO  (TEST-PeerSyncReplicationTest.test-seed#[782CBBD5E8B225F6]) [    ] o.a.s.c.AbstractZkTestCase put /Users/jenkins/workspace/Lucene-Solr-master-MacOSX/solr/core/src/test-files/solr/collection1/conf/old_synonyms.txt to /configs/conf1/old_synonyms.txt
   [junit4]   2> 635023 INFO  (TEST-PeerSyncReplicationTest.test-seed#[782CBBD5E8B225F6]) [    ] o.a.s.c.AbstractZkTestCase put /Users/jenkins/workspace/Lucene-Solr-master-MacOSX/solr/core/src/test-files/solr/collection1/conf/synonyms.txt to /configs/conf1/synonyms.txt
   [junit4]   2> 637688 INFO  (TEST-PeerSyncReplicationTest.test-seed#[782CBBD5E8B225F6]) [    ] o.a.s.SolrTestCaseJ4 Writing core.properties file to /Users/jenkins/workspace/Lucene-Solr-master-MacOSX/solr/build/solr-core/test/J1/temp/solr.cloud.PeerSyncReplicationTest_782CBBD5E8B225F6-001/control-001/cores/collection1
   [junit4]   2> 637691 INFO  (TEST-PeerSyncReplicationTest.test-seed#[782CBBD5E8B225F6]) [    ] o.e.j.s.Server jetty-9.3.14.v20161028
   [junit4]   2> 637692 INFO  (TEST-PeerSyncReplicationTest.test-seed#[782CBBD5E8B225F6]) [    ] o.e.j.s.h.ContextHandler Started o.e.j.s.ServletContextHandler@628cc1eb{/xpu,null,AVAILABLE}
   [junit4]   2> 637694 INFO  (TEST-PeerSyncReplicationTest.test-seed#[782CBBD5E8B225F6]) [    ] o.e.j.s.AbstractConnector Started ServerConnector@7dc6ad03{HTTP/1.1,[http/1.1]}{127.0.0.1:52880}
   [junit4]   2> 637694 INFO  (TEST-PeerSyncReplicationTest.test-seed#[782CBBD5E8B225F6]) [    ] o.e.j.s.Server Started @642667ms
   [junit4]   2> 637694 INFO  (TEST-PeerSyncReplicationTest.test-seed#[782CBBD5E8B225F6]) [    ] o.a.s.c.s.e.JettySolrRunner Jetty properties: {solr.data.dir=/Users/jenkins/workspace/Lucene-Solr-master-MacOSX/solr/build/solr-core/test/J1/temp/solr.cloud.PeerSyncReplicationTest_782CBBD5E8B225F6-001/tempDir-001/control/data, hostContext=/xpu, hostPort=52880, coreRootDirectory=/Users/jenkins/workspace/Lucene-Solr-master-MacOSX/solr/build/solr-core/test/J1/../../../../../../../../../Users/jenkins/workspace/Lucene-Solr-master-MacOSX/solr/build/solr-core/test/J1/temp/solr.cloud.PeerSyncReplicationTest_782CBBD5E8B225F6-001/control-001/cores}
   [junit4]   2> 637694 ERROR (TEST-PeerSyncReplicationTest.test-seed#[782CBBD5E8B225F6]) [    ] o.a.s.s.StartupLoggingUtils Missing Java Option solr.log.dir. Logging may be missing or incomplete.
   [junit4]   2> 637694 INFO  (TEST-PeerSyncReplicationTest.test-seed#[782CBBD5E8B225F6]) [    ] o.a.s.s.SolrDispatchFilter  ___      _       Welcome to Apache Solr™ version 7.0.0
   [junit4]   2> 637694 INFO  (TEST-PeerSyncReplicationTest.test-seed#[782CBBD5E8B225F6]) [    ] o.a.s.s.SolrDispatchFilter / __| ___| |_ _   Starting in cloud mode on port null
   [junit4]   2> 637694 INFO  (TEST-PeerSyncReplicationTest.test-seed#[782CBBD5E8B225F6]) [    ] o.a.s.s.SolrDispatchFilter \__ \/ _ \ | '_|  Install dir: null
   [junit4]   2> 637694 INFO  (TEST-PeerSyncReplicationTest.test-seed#[782CBBD5E8B225F6]) [    ] o.a.s.s.SolrDispatchFilter |___/\___/_|_|    Start time: 2017-01-12T17:06:19.644Z
   [junit4]   2> 637699 INFO  (TEST-PeerSyncReplicationTest.test-seed#[782CBBD5E8B225F6]) [    ] o.a.s.s.SolrDispatchFilter Loading solr.xml from SolrHome (not found in ZooKeeper)
   [junit4]   2> 637699 INFO  (TEST-PeerSyncReplicationTest.test-seed#[782CBBD5E8B225F6]) [    ] o.a.s.c.SolrXmlConfig Loading container configuration from /Users/jenkins/workspace/Lucene-Solr-master-MacOSX/solr/build/solr-core/test/J1/temp/solr.cloud.PeerSyncReplicationTest_782CBBD5E8B225F6-001/control-001/solr.xml
   [junit4]   2> 637709 INFO  (TEST-PeerSyncReplicationTest.test-seed#[782CBBD5E8B225F6]) [    ] o.a.s.c.ZkContainer Zookeeper client=127.0.0.1:52873/solr
   [junit4]   2> 637752 INFO  (TEST-PeerSyncReplicationTest.test-seed#[782CBBD5E8B225F6]) [n:127.0.0.1:52880_xpu    ] o.a.s.c.OverseerElectionContext I am going to be the leader 127.0.0.1:52880_xpu
   [junit4]   2> 637754 INFO  (TEST-PeerSyncReplicationTest.test-seed#[782CBBD5E8B225F6]) [n:127.0.0.1:52880_xpu    ] o.a.s.c.Overseer Overseer (id=97271203548430340-127.0.0.1:52880_xpu-n_0000000000) starting
   [junit4]   2> 637768 INFO  (TEST-PeerSyncReplicationTest.test-seed#[782CBBD5E8B225F6]) [n:127.0.0.1:52880_xpu    ] o.a.s.c.ZkController Register node as live in ZooKeeper:/live_nodes/127.0.0.1:52880_xpu
   [junit4]   2> 637771 INFO  (OverseerStateUpdate-97271203548430340-127.0.0.1:52880_xpu-n_0000000000) [n:127.0.0.1:52880_xpu    ] o.a.s.c.c.ZkStateReader Updated live nodes from ZooKeeper... (0) -> (1)
   [junit4]   2> 637831 INFO  (TEST-PeerSyncReplicationTest.test-seed#[782CBBD5E8B225F6]) [n:127.0.0.1:52880_xpu    ] o.a.s.c.CorePropertiesLocator Found 1 core definitions underneath /Users/jenkins/workspace/Lucene-Solr-master-MacOSX/solr/build/solr-core/test/J1/../../../../../../../../../Users/jenkins/workspace/Lucene-Solr-master-MacOSX/solr/build/solr-core/test/J1/temp/solr.cloud.PeerSyncReplicationTest_782CBBD5E8B225F6-001/control-001/cores
   [junit4]   2> 637831 INFO  (TEST-PeerSyncReplicationTest.test-seed#[782CBBD5E8B225F6]) [n:127.0.0.1:52880_xpu    ] o.a.s.c.CorePropertiesLocator Cores are: [collection1]
   [junit4]   2> 637836 INFO  (OverseerStateUpdate-97271203548430340-127.0.0.1:52880_xpu-n_0000000000) [n:127.0.0.1:52880_xpu    ] o.a.s.c.o.ReplicaMutator Assigning new node to shard shard=shard1
   [junit4]   2> 638861 INFO  (coreLoadExecutor-2801-thread-1-processing-n:127.0.0.1:52880_xpu) [n:127.0.0.1:52880_xpu c:control_collection   x:collection1] o.a.s.c.SolrConfig Using Lucene MatchVersion: 7.0.0
   [junit4]   2> 638873 INFO  (coreLoadExecutor-2801-thread-1-processing-n:127.0.0.1:52880_xpu) [n:127.0.0.1:52880_xpu c:control_collection   x:collection1] o.a.s.s.IndexSchema [collection1] Schema name=test
   [junit4]   2> 638936 WARN  (coreLoadExecutor-2801-thread-1-processing-n:127.0.0.1:52880_xpu) [n:127.0.0.1:52880_xpu c:control_collection   x:collection1] o.a.s.s.IndexSchema [collection1] default search field in schema is text. WARNING: Deprecated, please use 'df' on request instead.
   [junit4]   2> 638938 INFO  (coreLoadExecutor-2801-thread-1-processing-n:127.0.0.1:52880_xpu) [n:127.0.0.1:52880_xpu c:control_collection   x:collection1] o.a.s.s.IndexSchema Loaded schema test/1.0 with uniqueid field id
   [junit4]   2> 638957 INFO  (coreLoadExecutor-2801-thread-1-processing-n:127.0.0.1:52880_xpu) [n:127.0.0.1:52880_xpu c:control_collection   x:collection1] o.a.s.c.CoreContainer Creating SolrCore 'collection1' using configuration from collection control_collection
   [junit4]   2> 638958 INFO  (coreLoadExecutor-2801-thread-1-processing-n:127.0.0.1:52880_xpu) [n:127.0.0.1:52880_xpu c:control_collection   x:collection1] o.a.s.c.SolrCore [[collection1] ] Opening new SolrCore at [/Users/jenkins/workspace/Lucene-Solr-master-MacOSX/solr/build/solr-core/test/J1/temp/solr.cloud.PeerSyncReplicationTest_782CBBD5E8B225F6-001/control-001/cores/collection1], dataDir=[/Users/jenkins/workspace/Lucene-Solr-master-MacOSX/solr/build/solr-core/test/J1/../../../../../../../../../Users/jenkins/workspace/Lucene-Solr-master-MacOSX/solr/build/solr-core/test/J1/temp/solr.cloud.PeerSyncReplicationTest_782CBBD5E8B225F6-001/control-001/cores/collection1/data/]
   [junit4]   2> 638958 INFO  (coreLoadExecutor-2801-thread-1-processing-n:127.0.0.1:52880_xpu) [n:127.0.0.1:52880_xpu c:control_collection   x:collection1] o.a.s.c.JmxMonitoredMap JMX monitoring is enabled. Adding Solr mbeans to JMX Server: com.sun.jmx.mbeanserver.JmxMBeanServer@1d80f344
   [junit4]   2> 638961 INFO  (coreLoadExecutor-2801-thread-1-processing-n:127.0.0.1:52880_xpu) [n:127.0.0.1:52880_xpu c:control_collection   x:collection1] o.a.s.u.RandomMergePolicy RandomMergePolicy wrapping class org.apache.lucene.index.LogByteSizeMergePolicy: [LogByteSizeMergePolicy: minMergeSize=1677721, mergeFactor=11, maxMergeSize=2147483648, maxMergeSizeForForcedMerge=9223372036854775807, calibrateSizeByDeletes=true, maxMergeDocs=2147483647, maxCFSSegmentSizeMB=8.796093022207999E12, noCFSRatio=0.12150505008661111]
   [junit4]   2> 638972 WARN  (coreLoadExecutor-2801-thread-1-processing-n:127.0.0.1:52880_xpu) [n:127.0.0.1:52880_xpu c:control_collection   x:collection1] o.a.s.c.RequestHandlers INVALID paramSet a in requestHandler {type = requestHandler,name = /dump,class = DumpRequestHandler,attributes = {initParams=a, name=/dump, class=DumpRequestHandler},args = {defaults={a=A,b=B}}}
   [junit4]   2> 638986 INFO  (coreLoadExecutor-2801-thread-1-processing-n:127.0.0.1:52880_xpu) [n:127.0.0.1:52880_xpu c:control_collection   x:collection1] o.a.s.u.UpdateHandler Using UpdateLog implementation: org.apache.solr.update.UpdateLog
   [junit4]   2> 638986 INFO  (coreLoadExecutor-2801-thread-1-processing-n:127.0.0.1:52880_xpu) [n:127.0.0.1:52880_xpu c:control_collection   x:collection1] o.a.s.u.UpdateLog Initializing UpdateLog: dataDir= defaultSyncLevel=FLUSH numRecordsToKeep=1000 maxNumLogsToKeep=10 numVersionBuckets=65536
   [junit4]   2> 638987 INFO  (coreLoadExecutor-2801-thread-1-processing-n:127.0.0.1:52880_xpu) [n:127.0.0.1:52880_xpu c:control_collection   x:collection1] o.a.s.u.CommitTracker Hard AutoCommit: disabled
   [junit4]   2> 638987 INFO  (coreLoadExecutor-2801-thread-1-processing-n:127.0.0.1:52880_xpu) [n:127.0.0.1:52880_xpu c:control_collection   x:collection1] o.a.s.u.CommitTracker Soft AutoCommit: disabled
   [junit4]   2> 638987 INFO  (coreLoadExecutor-2801-thread-1-processing-n:127.0.0.1:52880_xpu) [n:127.0.0.1:52880_xpu c:control_collection   x:collection1] o.a.s.u.RandomMergePolicy RandomMergePolicy wrapping class org.apache.lucene.index.AlcoholicMergePolicy: [AlcoholicMergePolicy: minMergeSize=0, mergeFactor=10, maxMergeSize=1269580271, maxMergeSizeForForcedMerge=9223372036854775807, calibrateSizeByDeletes=true, maxMergeDocs=2147483647, maxCFSSegmentSizeMB=8.796093022207999E12, noCFSRatio=0.1]
   [junit4]   2> 638988 INFO  (coreLoadExecutor-2801-thread-1-processing-n:127.0.0.1:52880_xpu) [n:127.0.0.1:52880_xpu c:control_collection   x:collection1] o.a.s.s.SolrIndexSearcher Opening [Searcher@31276939[collection1] main]
   [junit4]   2> 638990 INFO  (coreLoadExecutor-2801-thread-1-processing-n:127.0.0.1:52880_xpu) [n:127.0.0.1:52880_xpu c:control_collection   x:collection1] o.a.s.r.ManagedResourceStorage Configured ZooKeeperStorageIO with znodeBase: /configs/conf1
   [junit4]   2> 638990 INFO  (coreLoadExecutor-2801-thread-1-processing-n:127.0.0.1:52880_xpu) [n:127.0.0.1:52880_xpu c:control_collection   x:collection1] o.a.s.r.ManagedResourceStorage Loaded null at path _rest_managed.json using ZooKeeperStorageIO:path=/configs/conf1
   [junit4]   2> 638990 INFO  (coreLoadExecutor-2801-thread-1-processing-n:127.0.0.1:52880_xpu) [n:127.0.0.1:52880_xpu c:control_collection   x:collection1] o.a.s.h.ReplicationHandler Commits will be reserved for  10000
   [junit4]   2> 638991 INFO  (searcherExecutor-2802-thread-1-processing-n:127.0.0.1:52880_xpu x:collection1 c:control_collection) [n:127.0.0.1:52880_xpu c:control_collection   x:collection1] o.a.s.c.SolrCore [collection1] Registered new searcher Searcher@31276939[collection1] main{ExitableDirectoryReader(UninvertingDirectoryReader())}
   [junit4]   2> 638992 INFO  (coreLoadExecutor-2801-thread-1-processing-n:127.0.0.1:52880_xpu) [n:127.0.0.1:52880_xpu c:control_collection   x:collection1] o.a.s.u.UpdateLog Could not find max version in index or recent updates, using new clock 1556339261117038592
   [junit4]   2> 639003 INFO  (coreZkRegister-2794-thread-1-processing-n:127.0.0.1:52880_xpu x:collection1 c:control_collection) [n:127.0.0.1:52880_xpu c:control_collection s:shard1 r:core_node1 x:collection1] o.a.s.c.ShardLeaderElectionContext Enough replicas found to continue.
   [junit4]   2> 639003 INFO  (coreZkRegister-2794-thread-1-processing-n:127.0.0.1:52880_xpu x:collection1 c:control_collection) [n:127.0.0.1:52880_xpu c:control_collection s:shard1 r:core_node1 x:collection1] o.a.s.c.ShardLeaderElectionContext I may be the new leader - try and sync
   [junit4]   2> 639003 INFO  (coreZkRegister-2794-thread-1-processing-n:127.0.0.1:52880_xpu x:collection1 c:control_collection) [n:127.0.0.1:52880_xpu c:control_collection s:shard1 r:core_node1 x:collection1] o.a.s.c.SyncStrategy Sync replicas to http://127.0.0.1:52880/xpu/collection1/
   [junit4]   2> 639003 INFO  (coreZkRegister-2794-thread-1-processing-n:127.0.0.1:52880_xpu x:collection1 c:control_collection) [n:127.0.0.1:52880_xpu c:control_collection s:shard1 r:core_node1 x:collection1] o.a.s.c.SyncStrategy Sync Success - now sync replicas to me
   [junit4]   2> 639003 INFO  (coreZkRegister-2794-thread-1-processing-n:127.0.0.1:52880_xpu x:collection1 c:control_collection) [n:127.0.0.1:52880_xpu c:control_collection s:shard1 r:core_node1 x:collection1] o.a.s.c.SyncStrategy http://127.0.0.1:52880/xpu/collection1/ has no replicas
   [junit4]   2> 639011 INFO  (coreZkRegister-2794-thread-1-processing-n:127.0.0.1:52880_xpu x:collection1 c:control_collection) [n:127.0.0.1:52880_xpu c:control_collection s:shard1 r:core_node1 x:collection1] o.a.s.c.ShardLeaderElectionContext I am the new leader: http://127.0.0.1:52880/xpu/collection1/ shard1
   [junit4]   2> 639125 INFO  (coreZkRegister-2794-thread-1-processing-n:127.0.0.1:52880_xpu x:collection1 c:control_collection) [n:127.0.0.1:52880_xpu c:control_collection s:shard1 r:core_node1 x:collection1] o.a.s.c.ZkController I am the leader, no recovery necessary
   [junit4]   2> 639135 INFO  (TEST-PeerSyncReplicationTest.test-seed#[782CBBD5E8B225F6]) [    ] o.a.s.c.c.ZkStateReader Updated live nodes from ZooKeeper... (0) -> (1)
   [junit4]   2> 639138 INFO  (TEST-PeerSyncReplicationTest.test-seed#[782CBBD5E8B225F6]) [    ] o.a.s.c.s.i.ZkClientClusterStateProvider Cluster at 127.0.0.1:52873/solr ready
   [junit4]   2> 639138 INFO  (TEST-PeerSyncReplicationTest.test-seed#[782CBBD5E8B225F6]) [    ] o.a.s.c.ChaosMonkey monkey: init - expire sessions:false cause connection loss:false
   [junit4]   2> 639451 INFO  (TEST-PeerSyncReplicationTest.test-seed#[782CBBD5E8B225F6]) [    ] o.a.s.SolrTestCaseJ4 Writing core.properties file to /Users/jenkins/workspace/Lucene-Solr-master-MacOSX/solr/build/solr-core/test/J1/temp/solr.cloud.PeerSyncReplicationTest_782CBBD5E8B225F6-001/shard-1-001/cores/collection1
   [junit4]   2> 639453 INFO  (TEST-PeerSyncReplicationTest.test-seed#[782CBBD5E8B225F6]) [    ] o.a.s.c.AbstractFullDistribZkTestBase create jetty 1 in directory /Users/jenkins/workspace/Lucene-Solr-master-MacOSX/solr/build/solr-core/test/J1/temp/solr.cloud.PeerSyncReplicationTest_782CBBD5E8B225F6-001/shard-1-001
   [junit4]   2> 639454 INFO  (TEST-PeerSyncReplicationTest.test-seed#[782CBBD5E8B225F6]) [    ] o.e.j.s.Server jetty-9.3.14.v20161028
   [junit4]   2> 639456 INFO  (TEST-PeerSyncReplicationTest.test-seed#[782CBBD5E8B225F6]) [    ] o.e.j.s.h.ContextHandler Started o.e.j.s.ServletContextHandler@49892fa1{/xpu,null,AVAILABLE}
   [junit4]   2> 639456 INFO  (TEST-PeerSyncReplicationTest.test-seed#[782CBBD5E8B225F6]) [    ] o.e.j.s.AbstractConnector Started ServerConnector@200cb81b{HTTP/1.1,[http/1.1]}{127.0.0.1:52889}
   [junit4]   2> 639456 INFO  (TEST-PeerSyncReplicationTest.test-seed#[782CBBD5E8B225F6]) [    ] o.e.j.s.Server Started @644430ms
   [junit4]   2> 639456 INFO  (TEST-PeerSyncReplicationTest.test-seed#[782CBBD5E8B225F6]) [    ] o.a.s.c.s.e.JettySolrRunner Jetty properties: {solr.data.dir=/Users/jenkins/workspace/Lucene-Solr-master-MacOSX/solr/build/solr-core/test/J1/temp/solr.cloud.PeerSyncReplicationTest_782CBBD5E8B225F6-001/tempDir-001/jetty1, solrconfig=solrconfig.xml, hostContext=/xpu, hostPort=52889, coreRootDirectory=/Users/jenkins/workspace/Lucene-Solr-master-MacOSX/solr/build/solr-core/test/J1/../../../../../../../../../Users/jenkins/workspace/Lucene-Solr-master-MacOSX/solr/build/solr-core/test/J1/temp/solr.cloud.PeerSyncReplicationTest_782CBBD5E8B225F6-001/shard-1-001/cores}
   [junit4]   2> 639457 ERROR (TEST-PeerSyncReplicationTest.test-seed#[782CBBD5E8B225F6]) [    ] o.a.s.s.StartupLoggingUtils Missing Java Option solr.log.dir. Logging may be missing or incomplete.
   [junit4]   2> 639457 INFO  (TEST-PeerSyncReplicationTest.test-seed#[782CBBD5E8B225F6]) [    ] o.a.s.s.SolrDispatchFilter  ___      _       Welcome to Apache Solr™ version 7.0.0
   [junit4]   2> 639457 INFO  (TEST-PeerSyncReplicationTest.test-seed#[782CBBD5E8B225F6]) [    ] o.a.s.s.SolrDispatchFilter / __| ___| |_ _   Starting in cloud mode on port null
   [junit4]   2> 639458 INFO  (TEST-PeerSyncReplicationTest.test-seed#[782CBBD5E8B225F6]) [    ] o.a.s.s.SolrDispatchFilter \__ \/ _ \ | '_|  Install dir: null
   [junit4]   2> 639458 INFO  (TEST-PeerSyncReplicationTest.test-seed#[782CBBD5E8B225F6]) [    ] o.a.s.s.SolrDispatchFilter |___/\___/_|_|    Start time: 2017-01-12T17:06:21.408Z
   [junit4]   2> 639462 INFO  (TEST-PeerSyncReplicationTest.test-seed#[782CBBD5E8B225F6]) [    ] o.a.s.s.SolrDispatchFilter Loading solr.xml from SolrHome (not found in ZooKeeper)
   [junit4]   2> 639462 INFO  (TEST-PeerSyncReplicationTest.test-seed#[782CBBD5E8B225F6]) [    ] o.a.s.c.SolrXmlConfig Loading container configuration from /Users/jenkins/workspace/Lucene-Solr-master-MacOSX/solr/build/solr-core/test/J1/temp/solr.cloud.PeerSyncReplicationTest_782CBBD5E8B225F6-001/shard-1-001/solr.xml
   [junit4]   2> 639515 INFO  (TEST-PeerSyncReplicationTest.test-seed#[782CBBD5E8B225F6]) [    ] o.a.s.c.ZkContainer Zookeeper client=127.0.0.1:52873/solr
   [junit4]   2> 639535 INFO  (TEST-PeerSyncReplicationTest.test-seed#[782CBBD5E8B225F6]) [n:127.0.0.1:52889_xpu    ] o.a.s.c.c.ZkStateReader Updated live nodes from ZooKeeper... (0) -> (1)
   [junit4]   2> 639546 INFO  (TEST-PeerSyncReplicationTest.test-seed#[782CBBD5E8B225F6]) [n:127.0.0.1:52889_xpu    ] o.a.s.c.ZkController Register node as live in ZooKeeper:/live_nodes/127.0.0.1:52889_xpu
   [junit4]   2> 639551 INFO  (zkCallback-1552-thread-3-processing-n:127.0.0.1:52880_xpu) [n:127.0.0.1:52880_xpu    ] o.a.s.c.c.ZkStateReader Updated live nodes from ZooKeeper... (1) -> (2)
   [junit4]   2> 639551 INFO  (zkCallback-1561-thread-1-processing-n:127.0.0.1:52889_xpu) [n:127.0.0.1:52889_xpu    ] o.a.s.c.c.ZkStateReader Updated live nodes from ZooKeeper... (1) -> (2)
   [junit4]   2> 639551 INFO  (zkCallback-1556-thread-1) [    ] o.a.s.c.c.ZkStateReader Updated live nodes from ZooKeeper... (1) -> (2)
   [junit4]   2> 639614 INFO  (TEST-PeerSyncReplicationTest.test-seed#[782CBBD5E8B225F6]) [n:127.0.0.1:52889_xpu    ] o.a.s.c.CorePropertiesLocator Found 1 core definitions underneath /Users/jenkins/workspace/Lucene-Solr-master-MacOSX/solr/build/solr-core/test/J1/../../../../../../../../../Users/jenkins/workspace/Lucene-Solr-master-MacOSX/solr/build/solr-core/test/J1/temp/solr.cloud.PeerSyncReplicationTest_782CBBD5E8B225F6-001/shard-1-001/cores
   [junit4]   2> 639614 INFO  (TEST-PeerSyncReplicationTest.test-seed#[782CBBD5E8B225F6]) [n:127.0.0.1:52889_xpu    ] o.a.s.c.CorePropertiesLocator Cores are: [collection1]
   [junit4]   2> 639617 INFO  (OverseerStateUpdate-97271203548430340-127.0.0.1:52880_xpu-n_0000000000) [n:127.0.0.1:52880_xpu    ] o.a.s.c.o.ReplicaMutator Assigning new node to shard shard=shard1
   [junit4]   2> 640642 INFO  (coreLoadExecutor-2812-thread-1-processing-n:127.0.0.1:52889_xpu) [n:127.0.0.1:52889_xpu c:collection1   x:collection1] o.a.s.c.SolrConfig Using Lucene MatchVersion: 7.0.0
   [junit4]   2> 640653 INFO  (coreLoadExecutor-2812-thread-1-processing-n:127.0.0.1:52889_xpu) [n:127.0.0.1:52889_xpu c:collection1   x:collection1] o.a.s.s.IndexSchema [collection1] Schema name=test
   [junit4]   2> 640714 WARN  (coreLoadExecutor-2812-thread-1-processing-n:127.0.0.1:52889_xpu) [n:127.0.0.1:52889_xpu c:collection1   x:collection1] o.a.s.s.IndexSchema [collection1] default search field in schema is text. WARNING: Deprecated, please use 'df' on request instead.
   [junit4]   2> 640716 INFO  (coreLoadExecutor-2812-thread-1-processing-n:127.0.0.1:52889_xpu) [n:127.0.0.1:52889_xpu c:collection1   x:collection1] o.a.s.s.IndexSchema Loaded schema test/1.0 with uniqueid field id
   [junit4]   2> 640737 INFO  (coreLoadExecutor-2812-thread-1-processing-n:127.0.0.1:52889_xpu) [n:127.0.0.1:52889_xpu c:collection1   x:collection1] o.a.s.c.CoreContainer Creating SolrCore 'collection1' using configuration from collection collection1
   [junit4]   2> 640738 INFO  (coreLoadExecutor-2812-thread-1-processing-n:127.0.0.1:52889_xpu) [n:127.0.0.1:52889_xpu c:collection1   x:collection1] o.a.s.c.SolrCore [[collection1] ] Opening new SolrCore at [/Users/jenkins/workspace/Lucene-Solr-master-MacOSX/solr/build/solr-core/test/J1/temp/solr.cloud.PeerSyncReplicationTest_782CBBD5E8B225F6-001/shard-1-001/cores/collection1], dataDir=[/Users/jenkins/workspace/Lucene-Solr-master-MacOSX/solr/build/solr-core/test/J1/../../../../../../../../../Users/jenkins/workspace/Lucene-Solr-master-MacOSX/solr/build/solr-core/test/J1/temp/solr.cloud.PeerSyncReplicationTest_782CBBD5E8B225F6-001/shard-1-001/cores/collection1/data/]
   [junit4]   2> 640738 INFO  (coreLoadExecutor-2812-thread-1-processing-n:127.0.0.1:52889_xpu) [n:127.0.0.1:52889_xpu c:collection1   x:collection1] o.a.s.c.JmxMonitoredMap JMX monitoring is enabled. Adding Solr mbeans to JMX Server: com.sun.jmx.mbeanserver.JmxMBeanServer@1d80f344
   [junit4]   2> 640741 INFO  (coreLoadExecutor-2812-thread-1-processing-n:127.0.0.1:52889_xpu) [n:127.0.0.1:52889_xpu c:collection1   x:collection1] o.a.s.u.RandomMergePolicy RandomMergePolicy wrapping class org.apache.lucene.index.LogByteSizeMergePolicy: [LogByteSizeMergePolicy: minMergeSize=1677721, mergeFactor=11, maxMergeSize=2147483648, maxMergeSizeForForcedMerge=9223372036854775807, calibrateSizeByDeletes=true, maxMergeDocs=2147483647, maxCFSSegmentSizeMB=8.796093022207999E12, noCFSRatio=0.12150505008661111]
   [junit4]   2> 640773 WARN  (coreLoadExecutor-2812-thread-1-processing-n:127.0.0.1:52889_xpu) [n:127.0.0.1:52889_xpu c:collection1   x:collection1] o.a.s.c.RequestHandlers INVALID paramSet a in requestHandler {type = requestHandler,name = /dump,class = DumpRequestHandler,attributes = {initParams=a, name=/dump, class=DumpRequestHandler},args = {defaults={a=A,b=B}}}
   [junit4]   2> 640789 INFO  (coreLoadExecutor-2812-thread-1-processing-n:127.0.0.1:52889_xpu) [n:127.0.0.1:52889_xpu c:collection1   x:collection1] o.a.s.u.UpdateHandler Using UpdateLog implementation: org.apache.solr.update.UpdateLog
   [junit4]   2> 640789 INFO  (coreLoadExecutor-2812-thread-1-processing-n:127.0.0.1:52889_xpu) [n:127.0.0.1:52889_xpu c:collection1   x:collection1] o.a.s.u.UpdateLog Initializing UpdateLog: dataDir= defaultSyncLevel=FLUSH numRecordsToKeep=1000 maxNumLogsToKeep=10 numVersionBuckets=65536
   [junit4]   2> 640790 INFO  (coreLoadExecutor-2812-thread-1-processing-n:127.0.0.1:52889_xpu) [n:127.0.0.1:52889_xpu c:collection1   x:collection1] o.a.s.u.CommitTracker Hard AutoCommit: disabled
   [junit4]   2> 640790 INFO  (coreLoadExecutor-2812-thread-1-processing-n:127.0.0.1:52889_xpu) [n:127.0.0.1:52889_xpu c:collection1   x:collection1] o.a.s.u.CommitTracker Soft AutoCommit: disabled
   [junit4]   2> 640791 INFO  (coreLoadExecutor-2812-thread-1-processing-n:127.0.0.1:52889_xpu) [n:127.0.0.1:52889_xpu c:collection1   x:collection1] o.a.s.u.RandomMergePolicy RandomMergePolicy wrapping class org.apache.lucene.index.AlcoholicMergePolicy: [AlcoholicMergePolicy: minMergeSize=0, mergeFactor=10, maxMergeSize=1269580271, maxMergeSizeForForcedMerge=9223372036854775807, calibrateSizeByDeletes=true, maxMergeDocs=2147483647, maxCFSSegmentSizeMB=8.796093022207999E12, noCFSRatio=0.1]
   [junit4]   2> 640792 INFO  (coreLoadExecutor-2812-thread-1-processing-n:127.0.0.1:52889_xpu) [n:127.0.0.1:52889_xpu c:collection1   x:collection1] o.a.s.s.SolrIndexSearcher Opening [Searcher@3a8ed5b1[collection1] main]
   [junit4]   2> 640794 INFO  (coreLoadExecutor-2812-thread-1-processing-n:127.0.0.1:52889_xpu) [n:127.0.0.1:52889_xpu c:collection1   x:collection1] o.a.s.r.ManagedResourceStorage Configured ZooKeeperStorageIO with znodeBase: /configs/conf1
   [junit4]   2> 640795 INFO  (coreLoadExecutor-2812-thread-1-processing-n:127.0.0.1:52889_xpu) [n:127.0.0.1:52889_xpu c:collection1   x:collection1] o.a.s.r.ManagedResourceStorage Loaded null at path _rest_managed.json using ZooKeeperStorageIO:path=/configs/conf1
   [junit4]   2> 640795 INFO  (coreLoadExecutor-2812-thread-1-processing-n:127.0.0.1:52889_xpu) [n:127.0.0.1:52889_xpu c:collection1   x:collection1] o.a.s.h.ReplicationHandler Commits will be reserved for  10000
   [junit4]   2> 640796 INFO  (searcherExecutor-2813-thread-1-processing-n:127.0.0.1:52889_xpu x:collection1 c:collection1) [n:127.0.0.1:52889_xpu c:collection1   x:collection1] o.a.s.c.SolrCore [collection1] Registered new searcher Searcher@3a8ed5b1[collection1] main{ExitableDirectoryReader(UninvertingDirectoryReader())}
   [junit4]   2> 640797 INFO  (coreLoadExecutor-2812-thread-1-processing-n:127.0.0.1:52889_xpu) [n:127.0.0.1:52889_xpu c:collection1   x:collection1] o.a.s.u.UpdateLog Could not find max version in index or recent updates, using new clock 1556339263009718272
   [junit4]   2> 640827 INFO  (coreZkRegister-2807-thread-1-processing-n:127.0.0.1:52889_xpu x:collection1 c:collection1) [n:127.0.0.1:52889_xpu c:collection1 s:shard1 r:core_node1 x:collection1] o.a.s.c.ShardLeaderElectionContext Enough replicas found to continue.
   [junit4]   2> 640827 INFO  (coreZkRegister-2807-thread-1-processing-n:127.0.0.1:52889_xpu x:collection1 c:collection1) [n:127.0.0.1:52889_xpu c:collection1 s:shard1 r:core_node1 x:collection1] o.a.s.c.ShardLeaderElectionContext I may be the new leader - try and sync
   [junit4]   2> 640827 INFO  (coreZkRegister-2807-thread-1-processing-n:127.0.0.1:52889_xpu x:collection1 c:collection1) [n:127.0.0.1:52889_xpu c:collection1 s:shard1 r:core_node1 x:collection1] o.a.s.c.SyncStrategy Sync replicas to http://127.0.0.1:52889/xpu/collection1/
   [junit4]   2> 640827 INFO  (coreZkRegister-2807-thread-1-processing-n:127.0.0.1:52889_xpu x:collection1 c:collection1) [n:127.0.0.1:52889_xpu c:collection1 s:shard1 r:core_node1 x:collection1] o.a.s.c.SyncStrategy Sync Success - now sync replicas to me
   [junit4]   2> 640827 INFO  (coreZkRegister-2807-thread-1-processing-n:127.0.0.1:52889_xpu x:collection1 c:collection1) [n:127.0.0.1:52889_xpu c:collection1 s:shard1 r:core_node1 x:collection1] o.a.s.c.SyncStrategy http://127.0.0.1:52889/xpu/collection1/ has no replicas
   [junit4]   2> 640843 INFO  (coreZkRegister-2807-thread-1-processing-n:127.0.0.1:52889_xpu x:collection1 c:collection1) [n:127.0.0.1:52889_xpu c:collection1 s:shard1 r:core_node1 x:collection1] o.a.s.c.ShardLeaderElectionContext I am the new leader: http://127.0.0.1:52889/xpu/collection1/ shard1
   [junit4]   2> 641006 INFO  (coreZkRegister-2807-thread-1-processing-n:127.0.0.1:52889_xpu x:collection1 c:collection1) [n:127.0.0.1:52889_xpu c:collection1 s:shard1 r:core_node1 x:collection1] o.a.s.c.ZkController I am the leader, no recovery necessary
   [junit4]   2> 641393 INFO  (TEST-PeerSyncReplicationTest.test-seed#[782CBBD5E8B225F6]) [    ] o.a.s.SolrTestCaseJ4 Writing core.properties file to /Users/jenkins/workspace/Lucene-Solr-master-MacOSX/solr/build/solr-core/test/J1/temp/solr.cloud.PeerSyncReplicationTest_782CBBD5E8B225F6-001/shard-2-001/cores/collection1
   [junit4]   2> 641395 INFO  (TEST-PeerSyncReplicationTest.test-seed#[782CBBD5E8B225F6]) [    ] o.a.s.c.AbstractFullDistribZkTestBase create jetty 2 in directory /Users/jenkins/workspace/Lucene-Solr-master-MacOSX/solr/build/solr-core/test/J1/temp/solr.cloud.PeerSyncReplicationTest_782CBBD5E8B225F6-001/shard-2-001
   [junit4]   2> 641395 INFO  (TEST-PeerSyncReplicationTest.test-seed#[782CBBD5E8B225F6]) [    ] o.e.j.s.Server jetty-9.3.14.v20161028
   [junit4]   2> 641397 INFO  (TEST-PeerSyncReplicationTest.test-seed#[782CBBD5E8B225F6]) [    ] o.e.j.s.h.ContextHandler Started o.e.j.s.ServletContextHandler@7eb28636{/xpu,null,AVAILABLE}
   [junit4]   2> 641397 INFO  (TEST-PeerSyncReplicationTest.test-seed#[782CBBD5E8B225F6]) [    ] o.e.j.s.AbstractConnector Started ServerConnector@199f109d{HTTP/1.1,[http/1.1]}{127.0.0.1:52893}
   [junit4]   2> 641397 INFO  (TEST-PeerSyncReplicationTest.test-seed#[782CBBD5E8B225F6]) [    ] o.e.j.s.Server Started @646371ms
   [junit4]   2> 641398 INFO  (TEST-PeerSyncReplicationTest.test-seed#[782CBBD5E8B225F6]) [    ] o.a.s.c.s.e.JettySolrRunner Jetty properties: {solr.data.dir=/Users/jenkins/workspace/Lucene-Solr-master-MacOSX/solr/build/solr-core/test/J1/temp/solr.cloud.PeerSyncReplicationTest_782CBBD5E8B225F6-001/tempDir-001/jetty2, solrconfig=solrconfig.xml, hostContext=/xpu, hostPort=52893, coreRootDirectory=/Users/jenkins/workspace/Lucene-Solr-master-MacOSX/solr/build/solr-core/test/J1/../../../../../../../../../Users/jenkins/workspace/Lucene-Solr-master-MacOSX/solr/build/solr-core/test/J1/temp/solr.cloud.PeerSyncReplicationTest_782CBBD5E8B225F6-001/shard-2-001/cores}
   [junit4]   2> 641398 ERROR (TEST-PeerSyncReplicationTest.test-seed#[782CBBD5E8B225F6]) [    ] o.a.s.s.StartupLoggingUtils Missing Java Option solr.log.dir. Logging may be missing or incomplete.
   [junit4]   2> 641399 INFO  (TEST-PeerSyncReplicationTest.test-seed#[782CBBD5E8B225F6]) [    ] o.a.s.s.SolrDispatchFilter  ___      _       Welcome to Apache Solr™ version 7.0.0
   [junit4]   2> 641399 INFO  (TEST-PeerSyncReplicationTest.test-seed#[782CBBD5E8B225F6]) [    ] o.a.s.s.SolrDispatchFilter / __| ___| |_ _   Starting in cloud mode on port null
   [junit4]   2> 641399 INFO  (TEST-PeerSyncReplicationTest.test-seed#[782CBBD5E8B225F6]) [    ] o.a.s.s.SolrDispatchFilter \__ \/ _ \ | '_|  Install dir: null
   [junit4]   2> 641399 INFO  (TEST-PeerSyncReplicationTest.test-seed#[782CBBD5E8B225F6]) [    ] o.a.s.s.SolrDispatchFilter |___/\___/_|_|    Start time: 2017-01-12T17:06:23.349Z
   [junit4]   2> 641403 INFO  (TEST-PeerSyncReplicationTest.test-seed#[782CBBD5E8B225F6]) [    ] o.a.s.s.SolrDispatchFilter Loading solr.xml from SolrHome (not found in ZooKeeper)
   [junit4]   2> 641403 INFO  (TEST-PeerSyncReplicationTest.test-seed#[782CBBD5E8B225F6]) [    ] o.a.s.c.SolrXmlConfig Loading container configuration from /Users/jenkins/workspace/Lucene-Solr-master-MacOSX/solr/build/solr-core/test/J1/temp/solr.cloud.PeerSyncReplicationTest_782CBBD5E8B225F6-001/shard-2-001/solr.xml
   [junit4]   2> 641433 INFO  (TEST-PeerSyncReplicationTest.test-seed#[782CBBD5E8B225F6]) [    ] o.a.s.c.ZkContainer Zookeeper client=127.0.0.1:52873/solr
   [junit4]   2> 641450 INFO  (TEST-PeerSyncReplicationTest.test-seed#[782CBBD5E8B225F6]) [n:127.0.0.1:52893_xpu    ] o.a.s.c.c.ZkStateReader Updated live nodes from ZooKeeper... (0) -> (2)
   [junit4]   2> 641462 INFO  (TEST-PeerSyncReplicationTest.test-seed#[782CBBD5E8B225F6]) [n:127.0.0.1:52893_xpu    ] o.a.s.c.ZkController Register node as live in ZooKeeper:/live_nodes/127.0.0.1:52893_xpu
   [junit4]   2> 641466 INFO  (zkCallback-1552-thread-1-processing-n:127.0.0.1:52880_xpu) [n:127.0.0.1:52880_xpu    ] o.a.s.c.c.ZkStateReader Updated live nodes from ZooKeeper... (2) -> (3)
   [junit4]   2> 641467 INFO  (zkCallback-1567-thread-1-processing-n:127.0.0.1:52893_xpu) [n:127.0.0.1:52893_xpu    ] o.a.s.c.c.ZkStateReader Updated live nodes from ZooKeeper... (2) -> (3)
   [junit4]   2> 641466 INFO  (zkCallback-1556-thread-1) [    ] o.a.s.c.c.ZkStateReader Updated live nodes from ZooKeeper... (2) -> (3)
   [junit4]   2> 641466 INFO  (zkCallback-1561-thread-1-processing-n:127.0.0.1:52889_xpu) [n:127.0.0.1:52889_xpu    ] o.a.s.c.c.ZkStateReader Updated live nodes from ZooKeeper... (2) -> (3)
   [junit4]   2> 641557 INFO  (TEST-PeerSyncReplicationTest.test-seed#[782CBBD5E8B225F6]) [n:127.0.0.1:52893_xpu    ] o.a.s.c.CorePropertiesLocator Found 1 core definitions underneath /Users/jenkins/workspace/Lucene-Solr-master-MacOSX/solr/build/solr-core/test/J1/../../../../../../../../../Users/jenkins/workspace/Lucene-Solr-master-MacOSX/solr/build/solr-core/test/J1/temp/solr.cloud.PeerSyncReplicationTest_782CBBD5E8B225F6-001/shard-2-001/cores
   [junit4]   2> 641557 INFO  (TEST-PeerSyncReplicationTest.test-seed#[782CBBD5E8B225F6]) [n:127.0.0.1:52893_xpu    ] o.a.s.c.CorePropertiesLocator Cores are: [collection1]
   [junit4]   2> 641559 INFO  (OverseerStateUpdate-97271203548430340-127.0.0.1:52880_xpu-n_0000000000) [n:127.0.0.1:52880_xpu    ] o.a.s.c.o.ReplicaMutator Assigning new node to shard shard=shard1
   [junit4]   2> 642583 INFO  (coreLoadExecutor-2823-thread-1-processing-n:127.0.0.1:52893_xpu) [n:127.0.0.1:52893_xpu c:collection1   x:collection1] o.a.s.c.SolrConfig Using Lucene MatchVersion: 7.0.0
   [junit4]   2> 642594 INFO  (coreLoadExecutor-2823-thread-1-processing-n:127.0.0.1:52893_xpu) [n:127.0.0.1:52893_xpu c:collection1   x:collection1] o.a.s.s.IndexSchema [collection1] Schema name=test
   [junit4]   2> 642655 WARN  (coreLoadExecutor-2823-thread-1-processing-n:127.0.0.1:52893_xpu) [n:127.0.0.1:52893_xpu c:collection1   x:collection1] o.a.s.s.IndexSchema [collection1] default search field in schema is text. WARNING: Deprecated, please use 'df' on request instead.
   [junit4]   2> 642657 INFO  (coreLoadExecutor-2823-thread-1-processing-n:127.0.0.1:52893_xpu) [n:127.0.0.1:52893_xpu c:collection1   x:collection1] o.a.s.s.IndexSchema Loaded schema test/1.0 with uniqueid field id
   [junit4]   2> 642677 INFO  (coreLoadExecutor-2823-thread-1-processing-n:127.0.0.1:52893_xpu) [n:127.0.0.1:52893_xpu c:collection1   x:collection1] o.a.s.c.CoreContainer Creating SolrCore 'collection1' using configuration from collection collection1
   [junit4]   2> 642677 INFO  (coreLoadExecutor-2823-thread-1-processing-n:127.0.0.1:52893_xpu) [n:127.0.0.1:52893_xpu c:collection1   x:collection1] o.a.s.c.SolrCore [[collection1] ] Opening new SolrCore at [/Users/jenkins/workspace/Lucene-Solr-master-MacOSX/solr/build/solr-core/test/J1/temp/solr.cloud.PeerSyncReplicationTest_782CBBD5E8B225F6-001/shard-2-001/cores/collection1], dataDir=[/Users/jenkins/workspace/Lucene-Solr-master-MacOSX/solr/build/solr-core/test/J1/../../../../../../../../../Users/jenkins/workspace/Lucene-Solr-master-MacOSX/solr/build/solr-core/test/J1/temp/solr.cloud.PeerSyncReplicationTest_782CBBD5E8B225F6-001/shard-2-001/cores/collection1/data/]
   [junit4]   2> 642677 INFO  (coreLoadExecutor-2823-thread-1-processing-n:127.0.0.1:52893_xpu) [n:127.0.0.1:52893_xpu c:collection1   x:collection1] o.a.s.c.JmxMonitoredMap JMX monitoring is enabled. Adding Solr mbeans to JMX Server: com.sun.jmx.mbeanserver.JmxMBeanServer@1d80f344
   [junit4]   2> 642681 INFO  (coreLoadExecutor-2823-thread-1-processing-n:127.0.0.1:52893_xpu) [n:127.0.0.1:52893_xpu c:collection1   x:collection1] o.a.s.u.RandomMergePolicy RandomMergePolicy wrapping class org.apache.lucene.index.LogByteSizeMergePolicy: [LogByteSizeMergePolicy: minMergeSize=1677721, mergeFactor=11, maxMergeSize=2147483648, maxMergeSizeForForcedMerge=9223372036854775807, calibrateSizeByDeletes=true, maxMergeDocs=2147483647, maxCFSSegmentSizeMB=8.796093022207999E12, noCFSRatio=0.12150505008661111]
   [junit4]   2> 642709 WARN  (coreLoadExecutor-2823-thread-1-processing-n:127.0.0.1:52893_xpu) [n:127.0.0.1:52893_xpu c:collection1   x:collection1] o.a.s.c.RequestHandlers INVALID paramSet a in requestHandler {type = requestHandler,name = /dump,class = DumpRequestHandler,attributes = {initParams=a, name=/dump, class=DumpRequestHandler},args = {defaults={a=A,b=B}}}
   [junit4]   2> 642725 INFO  (coreLoadExecutor-2823-thread-1-processing-n:127.0.0.1:52893_xpu) [n:127.0.0.1:52893_xpu c:collection1   x:collection1] o.a.s.u.UpdateHandler Using UpdateLog implementation: org.apache.solr.update.UpdateLog
   [junit4]   2> 642725 INFO  (coreLoadExecutor-2823-thread-1-processing-n:127.0.0.1:52893_xpu) [n:127.0.0.1:52893_xpu c:collection1   x:collection1] o.a.s.u.UpdateLog Initializing UpdateLog: dataDir= defaultSyncLevel=FLUSH numRecordsToKeep=1000 maxNumLogsToKeep=10 numVersionBuckets=65536
   [junit4]   2> 642726 INFO  (coreLoadExecutor-2823-thread-1-processing-n:127.0.0.1:52893_xpu) [n:127.0.0.1:52893_xpu c:collection1   x:collection1] o.a.s.u.CommitTracker Hard AutoCommit: disabled
   [junit4]   2> 642726 INFO  (coreLoadExecutor-2823-thread-1-processing-n:127.0.0.1:52893_xpu) [n:127.0.0.1:52893_xpu c:collection1   x:collection1] o.a.s.u.CommitTracker Soft AutoCommit: disabled
   [junit4]   2> 642727 INFO  (coreLoadExecutor-2823-thread-1-processing-n:127.0.0.1:52893_xpu) [n:127.0.0.1:52893_xpu c:collection1   x:collection1] o.a.s.u.RandomMergePolicy RandomMergePolicy wrapping class org.apache.lucene.index.AlcoholicMergePolicy: [AlcoholicMergePolicy: minMergeSize=0, mergeFactor=10, maxMergeSize=1269580271, maxMergeSizeForForcedMerge=9223372036854775807, calibrateSizeByDeletes=true, maxMergeDocs=2147483647, maxCFSSegmentSizeMB=8.796093022207999E12, noCFSRatio=0.1]
   [junit4]   2> 642728 INFO  (coreLoadExecutor-2823-thread-1-processing-n:127.0.0.1:52893_xpu) [n:127.0.0.1:52893_xpu c:collection1   x:collection1] o.a.s.s.SolrIndexSearcher Opening [Searcher@149471c3[collection1] main]
   [junit4]   2> 642729 INFO  (coreLoadExecutor-2823-thread-1-processing-n:127.0.0.1:52893_xpu) [n:127.0.0.1:52893_xpu c:collection1   x:collection1] o.a.s.r.ManagedResourceStorage Configured ZooKeeperStorageIO with znodeBase: /configs/conf1
   [junit4]   2> 642730 INFO  (coreLoadExecutor-2823-thread-1-processing-n:127.0.0.1:52893_xpu) [n:127.0.0.1:52893_xpu c:collection1   x:collection1] o.a.s.r.ManagedResourceStorage Loaded null at path _rest_managed.json using ZooKeeperStorageIO:path=/configs/conf1
   [junit4]   2> 642730 INFO  (coreLoadExecutor-2823-thread-1-processing-n:127.0.0.1:52893_xpu) [n:127.0.0.1:52893_xpu c:collection1   x:collection1] o.a.s.h.ReplicationHandler Commits will be reserved for  10000
   [junit4]   2> 642731 INFO  (searcherExecutor-2824-thread-1-processing-n:127.0.0.1:52893_xpu x:collection1 c:collection1) [n:127.0.0.1:52893_xpu c:collection1   x:collection1] o.a.s.c.SolrCore [collection1] Registered new searcher Searcher@149471c3[collection1] main{ExitableDirectoryReader(UninvertingDirectoryReader())}
   [junit4]   2> 642732 INFO  (coreLoadExecutor-2823-thread-1-processing-n:127.0.0.1:52893_xpu) [n:127.0.0.1:52893_xpu c:collection1   x:collection1] o.a.s.u.UpdateLog Could not find max version in index or recent updates, using new clock 1556339265038712832
   [junit4]   2> 642738 INFO  (coreZkRegister-2818-thread-1-processing-n:127.0.0.1:52893_xpu x:collection1 c:collection1) [n:127.0.0.1:52893_xpu c:collection1 s:shard1 r:core_node2 x:collection1] o.a.s.c.ZkController Core needs to recover:collection1
   [junit4]   2> 642739 INFO  (updateExecutor-1564-thread-1-processing-n:127.0.0.1:52893_xpu x:collection1 s:shard1 c:collection1 r:core_node2) [n:127.0.0.1:52893_xpu c:collection1 s:shard1 r:core_node2 x:collection1] o.a.s.u.DefaultSolrCoreState Running recovery
   [junit4]   2> 642739 INFO  (recoveryExecutor-1565-thread-1-processing-n:127.0.0.1:52893_xpu x:collection1 s:shard1 c:collection1 r:core_node2) [n:127.0.0.1:52893_xpu c:collection1 s:shard1 r:core_node2 x:collection1] o.a.s.c.RecoveryStrategy Starting recovery process. recoveringAfterStartup=true
   [junit4]   2> 642739 INFO  (recoveryExecutor-1565-thread-1-processing-n:127.0.0.1:52893_xpu x:collection1 s:shard1 c:collection1 r:core_node2) [n:127.0.0.1:52893_xpu c:collection1 s:shard1 r:core_node2 x:collection1] o.a.s.c.RecoveryStrategy ###### startupVersions=[[]]
   [junit4]   2> 642739 INFO  (recoveryExecutor-1565-thread-1-processing-n:127.0.0.1:52893_xpu x:collection1 s:shard1 c:collection1 r:core_node2) [n:127.0.0.1:52893_xpu c:collection1 s:shard1 r:core_node2 x:collection1] o.a.s.c.RecoveryStrategy Begin buffering updates. core=[collection1]
   [junit4]   2> 642740 INFO  (recoveryExecutor-1565-thread-1-processing-n:127.0.0.1:52893_xpu x:collection1 s:shard1 c:collection1 r:core_node2) [n:127.0.0.1:52893_xpu c:collection1 s:shard1 r:core_node2 x:collection1] o.a.s.u.UpdateLog Starting to buffer updates. FSUpdateLog{state=ACTIVE, tlog=null}
   [junit4]   2> 642740 INFO  (recoveryExecutor-1565-thread-1-processing-n:127.0.0.1:52893_xpu x:collection1 s:shard1 c:collection1 r:core_node2) [n:127.0.0.1:52893_xpu c:collection1 s:shard1 r:core_node2 x:collection1] o.a.s.c.RecoveryStrategy Publishing state of core [collection1] as recovering, leader is [http://127.0.0.1:52889/xpu/collection1/] and I am [http://127.0.0.1:52893/xpu/collection1/]
   [junit4]   2> 642742 INFO  (recoveryExecutor-1565-thread-1-processing-n:127.0.0.1:52893_xpu x:collection1 s:shard1 c:collection1 r:core_node2) [n:127.0.0.1:52893_xpu c:collection1 s:shard1 r:core_node2 x:collection1] o.a.s.c.RecoveryStrategy Sending prep recovery command to [http://127.0.0.1:52889/xpu]; [WaitForState: action=PREPRECOVERY&core=collection1&nodeName=127.0.0.1:52893_xpu&coreNodeName=core_node2&state=recovering&checkLive=true&onlyIfLeader=true&onlyIfLeaderActive=true]
   [junit4]   2> 642745 INFO  (qtp1304918254-7629) [n:127.0.0.1:52889_xpu    ] o.a.s.h.a.PrepRecoveryOp Going to wait for coreNodeName: core_node2, state: recovering, checkLive: true, onlyIfLeader: true, onlyIfLeaderActive: true
   [junit4]   2> 642746 INFO  (qtp1304918254-7629) [n:127.0.0.1:52889_xpu    ] o.a.s.h.a.PrepRecoveryOp Will wait a max of 183 seconds to see collection1 (shard1 of collection1) have state: recovering
   [junit4]   2> 642746 INFO  (qtp1304918254-7629) [n:127.0.0.1:52889_xpu    ] o.a.s.h.a.PrepRecoveryOp In WaitForState(recovering): collection=collection1, shard=shard1, thisCore=collection1, leaderDoesNotNeedRecovery=false, isLeader? true, live=true, checkLive=true, currentState=down, localState=active, nodeName=127.0.0.1:52893_xpu, coreNodeName=core_node2, onlyIfActiveCheckResult=false, nodeProps: core_node2:{"core":"collection1","base_url":"http://127.0.0.1:52893/xpu","node_name":"127.0.0.1:52893_xpu","state":"down"}
   [junit4]   2> 643183 INFO  (TEST-PeerSyncReplicationTest.test-seed#[782CBBD5E8B225F6]) [    ] o.a.s.SolrTestCaseJ4 Writing core.properties file to /Users/jenkins/workspace/Lucene-Solr-master-MacOSX/solr/build/solr-core/test/J1/temp/solr.cloud.PeerSyncReplicationTest_782CBBD5E8B225F6-001/shard-3-001/cores/collection1
   [junit4]   2> 643195 INFO  (TEST-PeerSyncReplicationTest.test-seed#[782CBBD5E8B225F6]) [    ] o.a.s.c.AbstractFullDistribZkTestBase create jetty 3 in directory /Users/jenkins/workspace/Lucene-Solr-master-MacOSX/solr/build/solr-core/test/J1/temp/solr.cloud.PeerSyncReplicationTest_782CBBD5E8B225F6-001/shard-3-001
   [junit4]   2> 643196 INFO  (TEST-PeerSyncReplicationTest.test-seed#[782CBBD5E8B225F6]) [    ] o.e.j.s.Server jetty-9.3.14.v20161028
   [junit4]   2> 643197 INFO  (TEST-PeerSyncReplicationTest.test-seed#[782CBBD5E8B225F6]) [    ] o.e.j.s.h.ContextHandler Started o.e.j.s.ServletContextHandler@5783085f{/xpu,null,AVAILABLE}
   [junit4]   2> 643198 INFO  (TEST-PeerSyncReplicationTest.test-seed#[782CBBD5E8B225F6]) [    ] o.e.j.s.AbstractConnector Started ServerConnector@14050800{HTTP/1.1,[http/1.1]}{127.0.0.1:52902}
   [junit4]   2> 643198 INFO  (TEST-PeerSyncReplicationTest.test-seed#[782CBBD5E8B225F6]) [    ] o.e.j.s.Server Started @648171ms
   [junit4]   2> 643198 INFO  (TEST-PeerSyncReplicationTest.test-seed#[782CBBD5E8B225F6]) [    ] o.a.s.c.s.e.JettySolrRunner Jetty properties: {solr.data.dir=/Users/jenkins/workspace/Lucene-Solr-master-MacOSX/solr/build/solr-core/test/J1/temp/solr.cloud.PeerSyncReplicationTest_782CBBD5E8B225F6-001/tempDir-001/jetty3, solrconfig=solrconfig.xml, hostContext=/xpu, hostPort=52902, coreRootDirectory=/Users/jenkins/workspace/Lucene-Solr-master-MacOSX/solr/build/solr-core/test/J1/temp/solr.cloud.PeerSyncReplicationTest_782CBBD5E8B225F6-001/shard-3-001/cores}
   [junit4]   2> 643199 ERROR (TEST-PeerSyncReplicationTest.test-seed#[782CBBD5E8B225F6]) [    ] o.a.s.s.StartupLoggingUtils Missing Java Option solr.log.dir. Logging may be missing or incomplete.
   [junit4]   2> 643199 INFO  (TEST-PeerSyncReplicationTest.test-seed#[782CBBD5E8B225F6]) [    ] o.a.s.s.SolrDispatchFilter  ___      _       Welcome to Apache Solr™ version 7.0.0
   [junit4]   2> 643199 INFO  (TEST-PeerSyncReplicationTest.test-seed#[782CBBD5E8B225F6]) [    ] o.a.s.s.SolrDispatchFilter / __| ___| |_ _   Starting in cloud mode on port null
   [junit4]   2> 643199 INFO  (TEST-PeerSyncReplicationTest.test-seed#[782CBBD5E8B225F6]) [    ] o.a.s.s.SolrDispatchFilter \__ \/ _ \ | '_|  Install dir: null
   [junit4]   2> 643200 INFO  (TEST-PeerSyncReplicationTest.test-seed#[782CBBD5E8B225F6]) [    ] o.a.s.s.SolrDispatchFilter |___/\___/_|_|    Start time: 2017-01-12T17:06:25.150Z
   [junit4]   2> 643204 INFO  (TEST-PeerSyncReplicationTest.test-seed#[782CBBD5E8B225F6]) [    ] o.a.s.s.SolrDispatchFilter Loading solr.xml from SolrHome (not found in ZooKeeper)
   [junit4]   2> 643204 INFO  (TEST-PeerSyncReplicationTest.test-seed#[782CBBD5E8B225F6]) [    ] o.a.s.c.SolrXmlConfig Loading container configuration from /Users/jenkins/workspace/Lucene-Solr-master-MacOSX/solr/build/solr-core/test/J1/temp/solr.cloud.PeerSyncReplicationTest_782CBBD5E8B225F6-001/shard-3-001/solr.xml
   [junit4]   2> 643266 INFO  (TEST-PeerSyncReplicationTest.test-seed#[782CBBD5E8B225F6]) [    ] o.a.s.c.ZkContainer Zookeeper client=127.0.0.1:52873/solr
   [junit4]   2> 643283 INFO  (TEST-PeerSyncReplicationTest.test-seed#[782CBBD5E8B225F6]) [n:127.0.0.1:52902_xpu    ] o.a.s.c.c.ZkStateReader Updated live nodes from ZooKeeper... (0) -> (3)
   [junit4]   2> 643292 INFO  (TEST-PeerSyncReplicationTest.test-seed#[782CBBD5E8B225F6]) [n:127.0.0.1:52902_xpu    ] o.a.s.c.ZkController Register node as live in ZooKeeper:/live_nodes/127.0.0.1:52902_xpu
   [junit4]   2> 643297 INFO  (zkCallback-1561-thread-1-processing-n:127.0.0.1:52889_xpu) [n:127.0.0.1:52889_xpu    ] o.a.s.c.c.ZkStateReader Updated live nodes from ZooKeeper... (3) -> (4)
   [junit4]   2> 643299 INFO  (zkCallback-1574-thread-1-processing-n:127.0.0.1:52902_xpu) [n:127.0.0.1:52902_xpu    ] o.a.s.c.c.ZkStateReader Updated live nodes from ZooKeeper... (3) -> (4)
   [junit4]   2> 643298 INFO  (zkCallback-1567-thread-1-processing-n:127.0.0.1:52893_xpu) [n:127.0.0.1:52893_xpu    ] o.a.s.c.c.ZkStateReader Updated live nodes from ZooKeeper... (3) -> (4)
   [junit4]   2> 643299 INFO  (zkCallback-1556-thread-1) [    ] o.a.s.c.c.ZkStateReader Updated live nodes from ZooKeeper... (3) -> (4)
   [junit4]   2> 643297 INFO  (zkCallback-1552-thread-3-processing-n:127.0.0.1:52880_xpu) [n:127.0.0.1:52880_xpu    ] o.a.s.c.c.ZkStateReader Updated live nodes from ZooKeeper... (3) -> (4)
   [junit4]   2> 643363 INFO  (TEST-PeerSyncReplicationTest.test-seed#[782CBBD5E8B225F6]) [n:127.0.0.1:52902_xpu    ] o.a.s.c.CorePropertiesLocator Found 1 core definitions underneath /Users/jenkins/workspace/Lucene-Solr-master-MacOSX/solr/build/solr-core/test/J1/temp/solr.cloud.PeerSyncReplicationTest_782CBBD5E8B225F6-001/shard-3-001/cores
   [junit4]   2> 643363 INFO  (TEST-PeerSyncReplicationTest.test-seed#[782CBBD5E8B225F6]) [n:127.0.0.1:52902_xpu    ] o.a.s.c.CorePropertiesLocator Cores are: [collection1]
   [junit4]   2> 643366 INFO  (OverseerStateUpdate-97271203548430340-127.0.0.1:52880_xpu-n_0000000000) [n:127.0.0.1:52880_xpu    ] o.a.s.c.o.ReplicaMutator Assigning new node to shard shard=shard1
   [junit4]   2> 643755 INFO  (qtp1304918254-7629) [n:127.0.0.1:52889_xpu    ] o.a.s.h.a.PrepRecoveryOp In WaitForState(recovering): collection=collection1, shard=shard1, thisCore=collection1, leaderDoesNotNeedRecovery=false, isLeader? true, live=true, checkLive=true, currentState=recovering, localState=active, nodeName=127.0.0.1:52893_xpu, coreNodeName=core_node2, onlyIfActiveCheckResult=false, nodeProps: core_node2:{"core":"collection1","base_url":"http://127.0.0.1:52893/xpu","node_name":"127.0.0.1:52893_xpu","state":"recovering"}
   [junit4]   2> 643755 INFO  (qtp1304918254-7629) [n:127.0.0.1:52889_xpu    ] o.a.s.h.a.PrepRecoveryOp Waited coreNodeName: core_node2, state: recovering, checkLive: true, onlyIfLeader: true for: 1 seconds.
   [junit4]   2> 643755 INFO  (qtp1304918254-7629) [n:127.0.0.1:52889_xpu    ] o.a.s.s.HttpSolrCall [admin] webapp=null path=/admin/cores params={nodeName=127.0.0.1:52893_xpu&onlyIfLeaderActive=true&core=collection1&coreNodeName=core_node2&action=PREPRECOVERY&checkLive=true&state=recovering&onlyIfLeader=true&wt=javabin&version=2} status=0 QTime=1009
   [junit4]   2> 644389 INFO  (coreLoadExecutor-2834-thread-1-processing-n:127.0.0.1:52902_xpu) [n:127.0.0.1:52902_xpu c:collection1   x:collection1] o.a.s.c.SolrConfig Using Lucene MatchVersion: 7.0.0
   [junit4]   2> 644400 INFO  (coreLoadExecutor-2834-thread-1-processing-n:127.0.0.1:52902_xpu) [n:127.0.0.1:52902_xpu c:collection1   x:collection1] o.a.s.s.IndexSchema [collection1] Schema name=test
   [junit4]   2> 644462 WARN  (coreLoadExecutor-2834-thread-1-processing-n:127.0.0.1:52902_xpu) [n:127.0.0.1:52902_xpu c:collection1   x:collection1] o.a.s.s.IndexSchema [collection1] default search field in schema is text. WARNING: Deprecated, please use 'df' on request instead.
   [junit4]   2> 644463 INFO  (coreLoadExecutor-2834-thread-1-processing-n:127.0.0.1:52902_xpu) [n:127.0.0.1:52902_xpu c:collection1   x:collection1] o.a.s.s.IndexSchema Loaded schema test/1.0 with uniqueid field id
   [junit4]   2> 644482 INFO  (coreLoadExecutor-2834-thread-1-processing-n:127.0.0.1:52902_xpu) [n:127.0.0.1:52902_xpu c:collection1   x:collection1] o.a.s.c.CoreContainer Creating SolrCore 'collection1' using configuration from collection collection1
   [junit4]   2> 644483 INFO  (coreLoadExecutor-2834-thread-1-processing-n:127.0.0.1:52902_xpu) [n:127.0.0.1:52902_xpu c:collection1   x:collection1] o.a.s.c.SolrCore [[collection1] ] Opening new SolrCore at [/Users/jenkins/workspace/Lucene-Solr-master-MacOSX/solr/build/solr-core/test/J1/temp/solr.cloud.PeerSyncReplicationTest_782CBBD5E8B225F6-001/shard-3-001/cores/collection1], dataDir=[/Users/jenkins/workspace/Lucene-Solr-master-MacOSX/solr/build/solr-core/test/J1/temp/solr.cloud.PeerSyncReplicationTest_782CBBD5E8B225F6-001/shard-3-001/cores/collection1/data/]
   [junit4]   2> 644483 INFO  (coreLoadExecutor-2834-thread-1-processing-n:127.0.0.1:52902_xpu) [n:127.0.0.1:52902_xpu c:collection1   x:collection1] o.a.s.c.JmxMonitoredMap JMX monitoring is enabled. Adding Solr mbeans to JMX Server: com.sun.jmx.mbeanserver.JmxMBeanServer@1d80f344
   [junit4]   2> 644485 INFO  (coreLoadExecutor-2834-thread-1-processing-n:127.0.0.1:52902_xpu) [n:127.0.0.1:52902_xpu c:collection1   x:collection1] o.a.s.u.RandomMergePolicy RandomMergePolicy wrapping class org.apache.lucene.index.LogByteSizeMergePolicy: [LogByteSizeMergePolicy: minMergeSize=1677721, mergeFactor=11, maxMergeSize=2147483648, maxMergeSizeForForcedMerge=9223372036854775807, calibrateSizeByDeletes=true, maxMergeDocs=2147483647, maxCFSSegmentSizeMB=8.796093022207999E12, noCFSRatio=0.12150505008661111]
   [junit4]   2> 644511 WARN  (coreLoadExecutor-2834-thread-1-processing-n:127.0.0.1:52902_xpu) [n:127.0.0.1:52902_xpu c:collection1   x:collection1] o.a.s.c.RequestHandlers INVALID paramSet a in requestHandler {type = requestHandler,name = /dump,class = DumpRequestHandler,attributes = {initParams=a, name=/dump, class=DumpRequestHandler},args = {defaults={a=A,b=B}}}
   [junit4]   2> 644527 INFO  (coreLoadExecutor-2834-thread-1-processing-n:127.0.0.1:52902_xpu) [n:127.0.0.1:52902_xpu c:collection1   x:collection1] o.a.s.u.UpdateHandler Using UpdateLog implementation: org.apache.solr.update.UpdateLog
   [junit4]   2> 644527 INFO  (coreLoadExecutor-2834-thread-1-processing-n:127.0.0.1:52902_xpu) [n:127.0.0.1:52902_xpu c:collection1   x:collection1] o.a.s.u.UpdateLog Initializing UpdateLog: dataDir= defaultSyncLevel=FLUSH numRecordsToKeep=1000 maxNumLogsToKeep=10 numVersionBuckets=65536
   [junit4]   2> 644528 INFO  (coreLoadExecutor-2834-thread-1-processing-n:127.0.0.1:52902_xpu) [n:127.0.0.1:52902_xpu c:collection1   x:collection1] o.a.s.u.CommitTracker Hard AutoCommit: disabled
   [junit4]   2> 644528 INFO  (coreLoadExecutor-2834-thread-1-processing-n:127.0.0.1:52902_xpu) [n:127.0.0.1:52902_xpu c:collection1   x:collection1] o.a.s.u.CommitTracker Soft AutoCommit: disabled
   [junit4]   2> 644528 INFO  (coreLoadExecutor-2834-thread-1-processing-n:127.0.0.1:52902_xpu) [n:127.0.0.1:52902_xpu c:collection1   x:collection1] o.a.s.u.RandomMergePolicy RandomMergePolicy wrapping class org.apache.lucene.index.AlcoholicMergePolicy: [AlcoholicMergePolicy: minMergeSize=0, mergeFactor=10, maxMergeSize=1269580271, maxMergeSizeForForcedMerge=9223372036854775807, calibrateSizeByDeletes=true, maxMergeDocs=2147483647, maxCFSSegmentSizeMB=8.796093022207999E12, noCFSRatio=0.1]
   [junit4]   2> 644529 INFO  (coreLoadExecutor-2834-thread-1-processing-n:127.0.0.1:52902_xpu) [n:127.0.0.1:52902_xpu c:collection1   x:collection1] o.a.s.s.SolrIndexSearcher Opening [Searcher@4b9c79d4[collection1] main]
   [junit4]   2> 644531 INFO  (coreLoadExecutor-2834-thread-1-processing-n:127.0.0.1:52902_xpu) [n:127.0.0.1:52902_xpu c:collection1   x:collection1] o.a.s.r.ManagedResourceStorage Configured ZooKeeperStorageIO with znodeBase: /configs/conf1
   [junit4]   2> 644531 INFO  (coreLoadExecutor-2834-thread-1-processing-n:127.0.0.1:52902_xpu) [n:127.0.0.1:52902_xpu c:collection1   x:collection1] o.a.s.r.ManagedResourceStorage Loaded null at path _rest_managed.json using ZooKeeperStorageIO:path=/configs/conf1
   [junit4]   2> 644532 INFO  (coreLoadExecutor-2834-thread-1-processing-n:127.0.0.1:52902_xpu) [n:127.0.0.1:52902_xpu c:collection1   x:collection1] o.a.s.h.ReplicationHandler Commits will be reserved for  10000
   [junit4]   2> 644533 INFO  (searcherExecutor-2835-thread-1-processing-n:127.0.0.1:52902_xpu x:collection1 c:collection1) [n:127.0.0.1:52902_xpu c:collection1   x:collection1] o.a.s.c.SolrCore [collection1] Registered new searcher Searcher@4b9c79d4[collection1] main{ExitableDirectoryReader(UninvertingDirectoryReader())}
   [junit4]   2> 644533 INFO  (coreLoadExecutor-2834-thread-1-processing-n:127.0.0.1:52902_xpu) [n:127.0.0.1:52902_xpu c:collection1   x:collection1] o.a.s.u.UpdateLog Could not find max version in index or recent updates, using new clock 1556339266927198208
   [junit4]   2> 644539 INFO  (coreZkRegister-2829-thread-1-processing-n:127.0.0.1:52902_xpu x:collection1 c:collection1) [n:127.0.0.1:52902_xpu c:collection1 s:shard1 r:core_node3 x:collection1] o.a.s.c.ZkController Core needs to recover:collection1
   [junit4]   2> 644539 INFO  (updateExecutor-1571-thread-1-processing-n:127.0.0.1:52902_xpu x:collection1 s:shard1 c:collection1 r:core_node3) [n:127.0.0.1:52902_xpu c:collection1 s:shard1 r:core_node3 x:collection1] o.a.s.u.DefaultSolrCoreState Running recovery
   [junit4]   2> 644540 INFO  (recoveryExecutor-1572-thread-1-processing-n:127.0.0.1:52902_xpu x:collection1 s:shard1 c:collection1 r:core_node3) [n:127.0.0.1:52902_xpu c:collection1 s:shard1 r:core_node3 x:collection1] o.a.s.c.RecoveryStrategy Starting recovery process. recoveringAfterStartup=true
   [junit4]   2> 644540 INFO  (recoveryExecutor-1572-thread-1-processing-n:127.0.0.1:52902_xpu x:collection1 s:shard1 c:collection1 r:core_node3) [n:127.0.0.1:52902_xpu c:collection1 s:shard1 r:core_node3 x:collection1] o.a.s.c.RecoveryStrategy ###### startupVersions=[[]]
   [junit4]   2> 644540 INFO  (recoveryExecutor-1572-thread-1-processing-n:127.0.0.1:52902_xpu x:collection1 s:shard1 c:collection1 r:core_node3) [n:127.0.0.1:52902_xpu c:collection1 s:shard1 r:core_node3 x:collection1] o.a.s.c.RecoveryStrategy Begin buffering updates. core=[collection1]
   [junit4]   2> 644540 INFO  (recoveryExecutor-1572-thread-1-processing-n:127.0.0.1:52902_xpu x:collection1 s:shard1 c:collection1 r:core_node3) [n:127.0.0.1:52902_xpu c:collection1 s:shard1 r:core_node3 x:collection1] o.a.s.u.UpdateLog Starting to buffer updates. FSUpdateLog{state=ACTIVE, tlog=null}
   [junit4]   2> 644540 INFO  (recoveryExecutor-1572-thread-1-processing-n:127.0.0.1:52902_xpu x:collection1 s:shard1 c:collection1 r:core_node3) [n:127.0.0.1:52902_xpu c:collection1 s:shard1 r:core_node3 x:collection1] o.a.s.c.RecoveryStrategy Publishing state of core [collection1] as recovering, leader is [http://127.0.0.1:52889/xpu/collection1/] and I am [http://127.0.0.1:52902/xpu/collection1/]
   [junit4]   2> 644543 INFO  (recoveryExecutor-1572-thread-1-processing-n:127.0.0.1:52902_xpu x:collection1 s:shard1 c:collection1 r:core_node3) [n:127.0.0.1:52902_xpu c:collection1 s:shard1 r:core_node3 x:collection1] o.a.s.c.RecoveryStrategy Sending prep recovery command to [http://127.0.0.1:52889/xpu]; [WaitForState: action=PREPRECOVERY&core=collection1&nodeName=127.0.0.1:52902_xpu&coreNodeName=core_node3&state=recovering&checkLive=true&onlyIfLeader=true&onlyIfLeaderActive=true]
   [junit4]   2> 644545 INFO  (qtp1304918254-7633) [n:127.0.0.1:52889_xpu    ] o.a.s.h.a.PrepRecoveryOp Going to wait for coreNodeName: core_node3, state: recovering, checkLive: true, onlyIfLeader: true, onlyIfLeaderActive: true
   [junit4]   2> 644545 INFO  (qtp1304918254-7633) [n:127.0.0.1:52889_xpu    ] o.a.s.h.a.PrepRecoveryOp Will wait a max of 183 seconds to see collection1 (shard1 of collection1) have state: recovering
   [junit4]   2> 644545 INFO  (qtp1304918254-7633) [n:127.0.0.1:52889_xpu    ] o.a.s.h.a.PrepRecoveryOp In WaitForState(recovering): collection=collection1, shard=shard1, thisCore=collection1, leaderDoesNotNeedRecovery=false, isLeader? true, live=true, checkLive=true, currentState=down, localState=active, nodeName=127.0.0.1:52902_xpu, coreNodeName=core_node3, onlyIfActiveCheckResult=false, nodeProps: core_node3:{"core":"collection1","base_url":"http://127.0.0.1:52902/xpu","node_name":"127.0.0.1:52902_xpu","state":"down"}
   [junit4]   2> 644679 INFO  (TEST-PeerSyncReplicationTest.test-seed#[782CBBD5E8B225F6]) [    ] o.a.s.SolrTestCaseJ4 ###Starting test
   [junit4]   2> 644679 INFO  (TEST-PeerSyncReplicationTest.test-seed#[782CBBD5E8B225F6]) [    ] o.a.s.c.AbstractFullDistribZkTestBase Wait for recoveries to finish - wait 30 for each attempt
   [junit4]   2> 644679 INFO  (TEST-PeerSyncReplicationTest.test-seed#[782CBBD5E8B225F6]) [    ] o.a.s.c.AbstractDistribZkTestBase Wait for recoveries to finish - collection: collection1 failOnTimeout:true timeout (sec):30
   [junit4]   2> 645546 INFO  (qtp1304918254-7633) [n:127.0.0.1:52889_xpu    ] o.a.s.h.a.PrepRecoveryOp In WaitForState(recovering): collection=collection1, shard=shard1, thisCore=collection1, leaderDoesNotNeedRecovery=false, isLeader? true, live=true, checkLive=true, currentState=recovering, localState=active, nodeName=127.0.0.1:52902_xpu, coreNodeName=core_node3, onlyIfActiveCheckResult=false, nodeProps: core_node3:{"core":"collection1","base_url":"http://127.0.0.1:52902/xpu","node_name":"127.0.0.1:52902_xpu","state":"recovering"}
   [junit4]   2> 645546 INFO  (qtp1304918254-7633) [n:127.0.0.1:52889_xpu    ] o.a.s.h.a.PrepRecoveryOp Waited coreNodeName: core_node3, state: recovering, checkLive: true, onlyIfLeader: true for: 1 seconds.
   [junit4]   2> 645546 INFO  (qtp1304918254-7633) [n:127.0.0.1:52889_xpu    ] o.a.s.s.HttpSolrCall [admin] webapp=null path=/admin/cores params={nodeName=127.0.0.1:52902_xpu&onlyIfLeaderActive=true&core=collection1&coreNodeName=core_node3&action=PREPRECOVERY&checkLive=true&state=recovering&onlyIfLeader=true&wt=javabin&version=2} status=0 QTime=1001
   [junit4]   2> 650756 INFO  (recoveryExecutor-1565-thread-1-processing-n:127.0.0.1:52893_xpu x:collection1 s:shard1 c:collection1 r:core_node2) [n:127.0.0.1:52893_xpu c:collection1 s:shard1 r:core_node2 x:collection1] o.a.s.c.RecoveryStrategy Attempting to PeerSync from [http://127.0.0.1:52889/xpu/collection1/] - recoveringAfterStartup=[true]
   [junit4]   2> 650756 INFO  (recoveryExecutor-1565-thread-1-processing-n:127.0.0.1:52893_xpu x:collection1 s:shard1 c:collection1 r:core_node2) [n:127.0.0.1:52893_xpu c:collection1 s:shard1 r:core_node2 x:collection1] o.a.s.u.PeerSync PeerSync: core=collection1 url=http://127.0.0.1:52893/xpu START replicas=[http://127.0.0.1:52889/xpu/collection1/] nUpdates=1000
   [junit4]   2> 650759 INFO  (qtp1304918254-7630) [n:127.0.0.1:52889_xpu c:collection1 s:shard1 r:core_node1 x:collection1] o.a.s.u.IndexFingerprint IndexFingerprint millis:0.0 result:{maxVersionSpecified=9223372036854775807, maxVersionEncountered=0, maxInHash=0, versionsHash=0, numVersions=0, numDocs=0, maxDoc=0}
   [junit4]   2> 650759 INFO  (qtp1304918254-7630) [n:127.0.0.1:52889_xpu c:collection1 s:shard1 r:core_node1 x:collection1] o.a.s.c.S.Request [collection1]  webapp=/xpu path=/get params={distrib=false&qt=/get&getFingerprint=9223372036854775807&wt=javabin&version=2} status=0 QTime=1
   [junit4]   2> 650760 INFO  (recoveryExecutor-1565-thread-1-processing-n:127.0.0.1:52893_xpu x:collection1 s:shard1 c:collection1 r:core_node2) [n:127.0.0.1:52893_xpu c:collection1 s:shard1 r:core_node2 x:collection1] o.a.s.u.IndexFingerprint IndexFingerprint millis:0.0 result:{maxVersionSpecified=9223372036854775807, maxVersionEncountered=0, maxInHash=0, versionsHash=0, numVersions=0, numDocs=0, maxDoc=0}
   [junit4]   2> 650760 INFO  (recoveryExecutor-1565-thread-1-processing-n:127.0.0.1:52893_xpu x:collection1 s:shard1 c:collection1 r:core_node2) [n:127.0.0.1:52893_xpu c:collection1 s:shard1 r:core_node2 x:collection1] o.a.s.u.PeerSync We are already in sync. No need to do a PeerSync 
   [junit4]   2> 650760 INFO  (recoveryExecutor-1565-thread-1-processing-n:127.0.0.1:52893_xpu x:collection1 s:shard1 c:collection1 r:core_node2) [n:127.0.0.1:52893_xpu c:collection1 s:shard1 r:core_node2 x:collection1] o.a.s.u.DirectUpdateHandler2 start commit{,optimize=false,openSearcher=true,waitSearcher=true,expungeDeletes=false,softCommit=false,prepareCommit=false}
   [junit4]   2> 650760 INFO  (recoveryExecutor-1565-thread-1-processing-n:127.0.0.1:52893_xpu x:collection1 s:shard1 c:collection1 r:core_node2) [n:127.0.0.1:52893_xpu c:collection1 s:shard1 r:core_node2 x:collection1] o.a.s.u.DirectUpdateHandler2 No uncommitted changes. Skipping IW.commit.
   [junit4]   2> 650761 INFO  (recoveryExecutor-1565-thread-1-processing-n:127.0.0.1:52893_xpu x:collection1 s:shard1 c:collection1 r:core_node2) [n:127.0.0.1:52893_xpu c:collection1 s:shard1 r:core_node2 x:collection1] o.a.s.u.DirectUpdateHandler2 end_commit_flush
   [junit4]   2> 650761 INFO  (recoveryExecutor-1565-thread-1-processing-n:127.0.0.1:52893_xpu x:collection1 s:shard1 c:collection1 r:core_node2) [n:127.0.0.1:52893_xpu c:collection1 s:shard1 r:core_node2 x:collection1] o.a.s.c.RecoveryStrategy PeerSync stage of recovery was successful.
   [junit4]   2> 650761 INFO  (recoveryExecutor-1565-thread-1-processing-n:127.0.0.1:52893_xpu x:collection1 s:shard1 c:collection1 r:core_node2) [n:127.0.0.1:52893_xpu c:collection1 s:shard1 r:core_node2 x:collection1] o.a.s.c.RecoveryStrategy Replaying updates buffered during PeerSync.
   [junit4]   2> 650761 INFO  (recoveryExecutor-1565-thread-1-processing-n:127.0.0.1:52893_xpu x:collection1 s:shard1 c:collection1 r:core_node2) [n:127.0.0.1:52893_xpu c:collection1 s:shard1 r:core_node2 x:collection1] o.a.s.c.RecoveryStrategy No replay needed.
   [junit4]   2> 650761 INFO  (recoveryExecutor-1565-thread-1-processing-n:127.0.0.1:52893_xpu x:collection1 s:shard1 c:collection1 r:core_node2) [n:127.0.0.1:52893_xpu c:collection1 s:shard1 r:core_node2 x:collection1] o.a.s.c.RecoveryStrategy Registering as Active after recovery.
   [junit4]   2> 652557 INFO  (recoveryExecutor-1572-thread-1-processing-n:127.0.0.1:52902_xpu x:collection1 s:shard1 c:collection1 r:core_node3) [n:127.0.0.1:52902_xpu c:collection1 s:shard1 r:core_node3 x:collection1] o.a.s.c.RecoveryStrategy Attempting to PeerSync from [http://127.0.0.1:52889/xpu/collection1/] - recoveringAfterStartup=[true]
   [junit4]   2> 652558 INFO  (recoveryExecutor-1572-thread-1-processing-n:127.0.0.1:52902_xpu x:collection1 s:shard1 c:collection1 r:core_node3) [n:127.0.0.1:52902_xpu c:collection1 s:shard1 r:core_node3 x:collection1] o.a.s.u.PeerSync PeerSync: core=collection1 url=http://127.0.0.1:52902/xpu START replicas=[http://127.0.0.1:52889/xpu/collection1/] nUpdates=1000
   [junit4]   2> 652560 INFO  (qtp1304918254-7631) [n:127.0.0.1:52889_xpu c:collection1 s:shard1 r:core_node1 x:collection1] o.a.s.u.IndexFingerprint IndexFingerprint millis:0.0 result:{maxVersionSpecified=9223372036854775807, maxVersionEncountered=0, maxInHash=0, versionsHash=0, numVersions=0, numDocs=0, maxDoc=0}
   [junit4]   2> 652560 INFO  (qtp1304918254-7631) [n:127.0.0.1:52889_xpu c:collection1 s:shard1 r:core_node1 x:collection1] o.a.s.c.S.Request [collection1]  webapp=/xpu path=/get params={distrib=false&qt=/get&getFingerprint=9223372036854775807&wt=javabin&version=2} status=0 QTime=0
   [junit4]   2> 652561 INFO  (recoveryExecutor-1572-thread-1-processing-n:127.0.0.1:52902_xpu x:collection1 s:shard1 c:collection1 r:core_node3) [n:127.0.0.1:52902_xpu c:collection1 s:shard1 r:core_node3 x:collection1] o.a.s.u.IndexFingerprint IndexFingerprint millis:0.0 result:{maxVersionSpecified=9223372036854775807, maxVersionEncountered=0, maxInHash=0, versionsHash=0, numVersions=0, numDocs=0, maxDoc=0}
   [junit4]   2> 652561 INFO  (recoveryExecutor-1572-thread-1-processing-n:127.0.0.1:52902_xpu x:collection1 s:shard1 c:collection1 r:core_node3) [n:127.0.0.1:52902_xpu c:collection1 s:shard1 r:core_node3 x:collection1] o.a.s.u.PeerSync We are already in sync. No need to do a PeerSync 
   [junit4]   2> 652561 INFO  (recoveryExecutor-1572-thread-1-processing-n:127.0.0.1:52902_xpu x:collection1 s:shard1 c:collection1 r:core_node3) [n:127.0.0.1:52902_xpu c:collection1 s:shard1 r:core_node3 x:collection1] o.a.s.u.DirectUpdateHandler2 start commit{,optimize=false,openSearcher=true,waitSearcher=true,expungeDeletes=false,softCommit=false,prepareCommit=false}
   [junit4]   2> 652561 INFO  (recoveryExecutor-1572-thread-1-processing-n:127.0.0.1:52902_xpu x:collection1 s:shard1 c:collection1 r:core_node3) [n:127.0.0.1:52902_xpu c:collection1 s:shard1 r:core_node3 x:collection1] o.a.s.u.DirectUpdateHandler2 No uncommitted changes. Skipping IW.commit.
   [junit4]   2> 652561 INFO  (recoveryExecutor-1572-thread-1-processing-n:127.0.0.1:52902_xpu x:collection1 s:shard1 c:collection1 r:core_node3) [n:127.0.0.1:52902_xpu c:collection1 s:shard1 r:core_node3 x:collection1] o.a.s.u.DirectUpdateHandler2 end_commit_flush
   [junit4]   2> 652561 INFO  (recoveryExecutor-1572-thread-1-processing-n:127.0.0.1:52902_xpu x:collection1 s:shard1 c:collection1 r:core_node3) [n:127.0.0.1:52902_xpu c:collection1 s:shard1 r:core_node3 x:collection1] o.a.s.c.RecoveryStrategy PeerSync stage of recovery was successful.
   [junit4]   2> 652561 INFO  (recoveryExecutor-1572-thread-1-processing-n:127.0.0.1:52902_xpu x:collection1 s:shard1 c:collection1 r:core_node3) [n:127.0.0.1:52902_xpu c:collection1 s:shard1 r:core_node3 x:collection1] o.a.s.c.RecoveryStrategy Replaying updates buffered during PeerSync.
   [junit4]   2> 652561 INFO  (recoveryExecutor-1572-thread-1-processing-n:127.0.0.1:52902_xpu x:collection1 s:shard1 c:collection1 r:core_node3) [n:127.0.0.1:52902_xpu c:collection1 s:shard1 r:core_node3 x:collection1] o.a.s.c.RecoveryStrategy No replay needed.
   [junit4]   2> 652561 INFO  (recoveryExecutor-1572-thread-1-processing-n:127.0.0.1:52902_xpu x:collection1 s:shard1 c:collection1 r:core_node3) [n:127.0.0.1:52902_xpu c:collection1 s:shard1 r:core_node3 x:collection1] o.a.s.c.RecoveryStrategy Registering as Active after recovery.
   [junit4]   2> 652702 INFO  (TEST-PeerSyncReplicationTest.test-seed#[782CBBD5E8B225F6]) [    ] o.a.s.c.AbstractDistribZkTestBase Recoveries finished - collection: collection1
   [junit4]   2> 652705 INFO  (qtp1173753132-7593) [n:127.0.0.1:52880_xpu c:control_collection s:shard1 r:core_node1 x:collection1] o.a.s.u.DirectUpdateHandler2 start commit{,optimize=false,openSearcher=true,waitSearcher=true,expungeDeletes=false,softCommit=false,prepareCommit=false}
   [junit4]   2> 652705 INFO  (qtp1173753132-7593) [n:127.0.0.1:52880_xpu c:control_collection s:shard1 r:core_node1 x:collection1] o.a.s.u.DirectUpdateHandler2 No uncommitted changes. Skipping IW.commit.
   [junit4]   2> 652707 INFO  (qtp1173753132-7593) [n:127.0.0.1:52880_xpu c:control_collection s:shard1 r:core_node1 x:collection1] o.a.s.u.DirectUpdateHandler2 end_commit_flush
   [junit4]   2> 652707 INFO  (qtp1173753132-7593) [n:127.0.0.1:52880_xpu c:control_collection s:shard1 r:core_node1 x:collection1] o.a.s.u.p.LogUpdateProcessorFactory [collection1]  webapp=/xpu path=/update params={waitSearcher=true&commit=true&softCommit=false&wt=javabin&version=2}{commit=} 0 1
   [junit4]   2> 652711 INFO  (qtp1304918254-7629) [n:127.0.0.1:52889_xpu c:collection1 s:shard1 r:core_node1 x:collection1] o.a.s.u.DirectUpdateHandler2 start commit{,optimize=false,openSearcher=true,waitSearcher=true,expungeDeletes=false,softCommit=false,prepareCommit=false}
   [junit4]   2> 652711 INFO  (qtp1304918254-7629) [n:127.0.0.1:52889_xpu c:collection1 s:shard1 r:core_node1 x:collection1] o.a.s.u.DirectUpdateHandler2 No uncommitted changes. Skipping IW.commit.
   [junit4]   2> 652712 INFO  (qtp1304918254-7629) [n:127.0.0.1:52889_xpu c:collection1 s:shard1 r:core_node1 x:collection1] o.a.s.u.DirectUpdateHandler2 end_commit_flush
   [junit4]   2> 652714 INFO  (qtp1304918254-7629) [n:127.0.0.1:52889_xpu c:collection1 s:shard1 r:core_node1 x:collection1] o.a.s.u.p.LogUpdateProcessorFactory [collection1]  webapp=/xpu path=/update params={update.distrib=FROMLEADER&waitSearcher=true&openSearcher=true&commit=true&softCommit=false&distrib.from=http://127.0.0.1:52889/xpu/collection1/&commit_end_point=true&wt=javabin&version=2&expungeDeletes=false}{commit=} 0 3
   [junit4]   2> 652716 INFO  (qtp1188528492-7656) [n:127.0.0.1:52893_xpu c:collection1 s:shard1 r:core_node2 x:collection1] o.a.s.u.DirectUpdateHandler2 start commit{,optimize=false,openSearcher=true,waitSearcher=true,expungeDeletes=false,softCommit=false,prepareCommit=false}
   [junit4]   2> 652718 INFO  (qtp1188528492-7656) [n:127.0.0.1:52893_xpu c:collection1 s:shard1 r:core_node2 x:collection1] o.a.s.u.DirectUpdateHandler2 No uncommitted changes. Skipping IW.commit.
   [junit4]   2> 652718 INFO  (qtp491618873-7693) [n:127.0.0.1:52902_xpu c:collection1 s:shard1 r:core_node3 x:collection1] o.a.s.u.DirectUpdateHandler2 start commit{,optimize=false,openSearcher=true,waitSearcher=true,expungeDeletes=false,softCommit=false,prepareCommit=false}
   [junit4]   2> 652718 INFO  (qtp491618873-7693) [n:127.0.0.1:52902_xpu c:collection1 s:shard1 r:core_node3 x:collection1] o.a.s.u.DirectUpdateHandler2 No uncommitted changes. Skipping IW.commit.
   [junit4]   2> 652718 INFO  (qtp1188528492-7656) [n:127.0.0.1:52893_xpu c:collection1 s:shard1 r:core_node2 x:collection1] o.a.s.u.DirectUpdateHandler2 end_commit_flush
   [junit4]   2> 652719 INFO  (qtp1188528492-7656) [n:127.0.0.1:52893_xpu c:collection1 s:shard1 r:core_node2 x:collection1] o.a.s.u.p.LogUpdateProcessorFactory [collection1]  webapp=/xpu path=/update params={update.distrib=FROMLEADER&waitSearcher=true&openSearcher=true&commit=true&softCommit=false&distrib.from=http://127.0.0.1:52889/xpu/collection1/&commit_end_point=true&wt=javabin&version=2&expungeDeletes=false}{commit=} 0 4
   [junit4]   2> 652720 INFO  (qtp491618873-7693) [n:127.0.0.1:52902_xpu c:collection1 s:shard1 r:core_node3 x:collection1] o.a.s.u.DirectUpdateHandler2 end_commit_flush
   [junit4]   2> 652720 INFO  (qtp491618873-7693) [n:127.0.0.1:52902_xpu c:collection1 s:shard1 r:core_node3 x:collection1] o.a.s.u.p.LogUpdateProcessorFactory [collection1]  webapp=/xpu path=/update params={update.distrib=FROMLEADER&waitSearcher=true&openSearcher=true&commit=true&softCommit=false&distrib.from=http://127.0.0.1:52889/xpu/collection1/&commit_end_point=true&wt=javabin&version=2&expungeDeletes=false}{commit=} 0 2
   [junit4]   2> 652721 INFO  (qtp1304918254-7634) [n:127.0.0.1:52889_xpu c:collection1 s:shard1 r:core_node1 x:collection1] o.a.s.u.p.LogUpdateProcessorFactory [collection1]  webapp=/xpu path=/update params={waitSearcher=true&commit=true&softCommit=false&wt=javabin&version=2}{commit=} 0 11
   [junit4]   2> 652723 INFO  (qtp1304918254-7627) [n:127.0.0.1:52889_xpu c:collection1 s:shard1 r:core_node1 x:collection1] o.a.s.c.S.Request [collection1]  webapp=/xpu path=/select params={q=*:*&distrib=false&tests=checkShardConsistency&rows=0&wt=javabin&version=2} hits=0 status=0 QTime=0
   [junit4]   2> 652725 INFO  (qtp1188528492-7659) [n:127.0.0.1:52893_xpu c:collection1 s:shard1 r:core_node2 x:collection1] o.a.s.c.S.Request [collection1]  webapp=/xpu path=/select params={q=*:*&distrib=false&tests=checkShardConsistency&rows=0&wt=javabin&version=2} hits=0 status=0 QTime=0
   [junit4]   2> 652726 INFO  (qtp491618873-7694) [n:127.0.0.1:52902_xpu c:collection1 s:shard1 r:core_node3 x:collection1] o.a.s.c.S.Request [collection1]  webapp=/xpu path=/select params={q=*:*&distrib=false&tests=checkShardConsistency&rows=0&wt=javabin&version=2} hits=0 status=0 QTime=0
   [junit4]   2> 654732 INFO  (qtp1173753132-7594) [n:127.0.0.1:52880_xpu c:control_collection s:shard1 r:core_node1 x:collection1] o.a.s.u.p.LogUpdateProcessorFactory [collection1]  webapp=/xpu path=/update params={wt=javabin&version=2}{deleteByQuery=*:* (-1556339277617430528)} 0 3
   [junit4]   2> 654740 INFO  (qtp1188528492-7659) [n:127.0.0.1:52893_xpu c:collection1 s:shard1 r:core_node2 x:collection1] o.a.s.u.p.LogUpdateProcessorFactory [collection1]  webapp=/xpu path=/update params={update.distrib=FROMLEADER&_version_=-1556339277623721984&distrib.from=http://127.0.0.1:52889/xpu/collection1/&wt=javabin&version=2}{deleteByQuery=*:* (-1556339277623721984)} 0 3
   [junit4]   2> 654742 INFO  (qtp491618873-7694) [n:127.0.0.1:52902_xpu c:collection1 s:shard1 r:core_node3 x:collection1] o.a.s.u.p.LogUpdateProcessorFactory [collection1]  webapp=/xpu path=/update params={update.distrib=FROMLEADER&_version_=-1556339277623721984&distrib.from=http://127.0.0.1:52889/xpu/collection1/&wt=javabin&version=2}{deleteByQuery=*:* (-1556339277623721984)} 0 5
   [junit4]   2> 654743 INFO  (qtp1304918254-7630) [n:127.0.0.1:52889_xpu c:collection1 s:shard1 r:core_node1 x:collection1] o.a.s.u.p.LogUpdateProcessorFactory [collection1]  webapp=/xpu path=/update params={wt=javabin&version=2}{deleteByQuery=*:* (-1556339277623721984)} 0 9
   [junit4]   2> 654750 INFO  (qtp1188528492-7661) [n:127.0.0.1:52893_xpu c:collection1 s:shard1 r:core_node2 x:collection1] o.a.s.u.p.LogUpdateProcessorFactory [collection1]  webapp=/xpu path=/update params={update.distrib=FROMLEADER&distrib.from=http://127.0.0.1:52889/xpu/collection1/&wt=javabin&version=2}{add=[0 (1556339277634207744)]} 0 1
   [junit4]   2> 654750 INFO  (qtp491618873-7696) [n:127.0.0.1:52902_xpu c:collection1 s:shard1 r:core_node3 x:collection1] o.a.s.u.p.LogUpdateProcessorFactory [collection1]  webapp=/xpu path=/update params={update.distrib=FROMLEADER&distrib.from=http://127.0.0.1:52889/xpu/collection1/&wt=javabin&version=2}{add=[0 (1556339277634207744)]} 0 1
   [junit4]   2> 654751 INFO  (qtp1304918254-7632) [n:127.0.0.1:52889_xpu c:collection1 s:shard1 r:core_node1 x:collection1] o.a.s.u.p.LogUpdateProcessorFactory [collection1]  webapp=/xpu path=/update params={wt=javabin&version=2}{add=[0 (1556339277634207744)]} 0 6
   [junit4]   2> 654754 INFO  (qtp1188528492-7661) [n:127.0.0.1:52893_xpu c:collection1 s:shard1 r:core_node2 x:collection1] o.a.s.u.p.LogUpdateProcessorFactory [collection1]  webapp=/xpu path=/update params={update.distrib=FROMLEADER&distrib.from=http://127.0.0.1:52889/xpu/collection1/&wt=javabin&version=2}{add=[1 (1556339277642596352)]} 0 0
   [junit4]   2> 654755 INFO  (qtp491618873-7697) [n:127.0.0.1:52902_xpu c:collection1 s:shard1 r:core_node3 x:collection1] o.a.s.u.p.LogUpdateProcessorFactory [collection1]  webapp=/xpu path=/update params={update.distrib=FROMLEADER&distrib.from=http://127.0.0.1:52889/xpu/collection1/&wt=javabin&version=2}{add=[1 (1556339277642596352)]} 0 0
   [junit4]   2> 654755 INFO  (qtp1304918254-7631) [n:127.0.0.1:52889_xpu c:collection1 s:shard1 r:core_node1 x:collection1] o.a.s.u.p.LogUpdateProcessorFactory [collection1]  webapp=/xpu path=/update params={wt=javabin&version=2}{add=[1 (1556339277642596352)]} 0 3
   [junit4]   2> 654758 INFO  (qtp1188528492-7661) [n:127.0.0.1:52893_xpu c:collection1 s:shard1 r:core_node2 x:collection1] o.a.s.u.p.LogUpdateProcessorFactory [collection1]  webapp=/xpu path=/update params={update.distrib=FROMLEADER&distrib.from=http://127.0.0.1:52889/xpu/collection

[...truncated too long message...]

rs for: solr.core.collection1
   [junit4]   2> 2615967 INFO  (TEST-ShardSplitTest.testSplitAfterFailedSplit-seed#[782CBBD5E8B225F6]) [    ] o.a.s.m.SolrMetricManager Closing metric reporters for: solr.node
   [junit4]   2> 2615968 INFO  (TEST-ShardSplitTest.testSplitAfterFailedSplit-seed#[782CBBD5E8B225F6]) [    ] o.e.j.s.AbstractConnector Stopped ServerConnector@7d7a92f4{HTTP/1.1,[http/1.1]}{127.0.0.1:0}
   [junit4]   2> 2615968 INFO  (TEST-ShardSplitTest.testSplitAfterFailedSplit-seed#[782CBBD5E8B225F6]) [    ] o.e.j.s.h.ContextHandler Stopped o.e.j.s.ServletContextHandler@31ecb957{/_edi/vj,null,UNAVAILABLE}
   [junit4]   2> 2615971 INFO  (TEST-ShardSplitTest.testSplitAfterFailedSplit-seed#[782CBBD5E8B225F6]) [    ] o.a.s.c.ZkTestServer connecting to 127.0.0.1:57810 57810
   [junit4]   2> 2616022 INFO  (Thread-4031) [    ] o.a.s.c.ZkTestServer connecting to 127.0.0.1:57810 57810
   [junit4]   2> 2618965 WARN  (Thread-4031) [    ] o.a.s.c.ZkTestServer Watch limit violations: 
   [junit4]   2> Maximum concurrent create/delete watches above limit:
   [junit4]   2> 
   [junit4]   2> 	6	/solr/aliases.json
   [junit4]   2> 	6	/solr/clusterprops.json
   [junit4]   2> 	5	/solr/security.json
   [junit4]   2> 	5	/solr/configs/conf1
   [junit4]   2> 
   [junit4]   2> Maximum concurrent data watches above limit:
   [junit4]   2> 
   [junit4]   2> 	6	/solr/clusterstate.json
   [junit4]   2> 	4	/solr/collections/collection1/state.json
   [junit4]   2> 
   [junit4]   2> Maximum concurrent children watches above limit:
   [junit4]   2> 
   [junit4]   2> 	57	/solr/overseer/queue
   [junit4]   2> 	22	/solr/overseer/collection-queue-work
   [junit4]   2> 	11	/solr/overseer/queue-work
   [junit4]   2> 	6	/solr/live_nodes
   [junit4]   2> 	6	/solr/collections
   [junit4]   2> 
   [junit4]   2> NOTE: reproduce with: ant test  -Dtestcase=ShardSplitTest -Dtests.method=testSplitAfterFailedSplit -Dtests.seed=782CBBD5E8B225F6 -Dtests.slow=true -Dtests.locale=es-MX -Dtests.timezone=Asia/Hong_Kong -Dtests.asserts=true -Dtests.file.encoding=UTF-8
   [junit4] FAILURE 38.8s J0 | ShardSplitTest.testSplitAfterFailedSplit <<<
   [junit4]    > Throwable #1: java.lang.AssertionError: expected:<1> but was:<2>
   [junit4]    > 	at __randomizedtesting.SeedInfo.seed([782CBBD5E8B225F6:8161287AD4C7687C]:0)
   [junit4]    > 	at org.apache.solr.cloud.ShardSplitTest.testSplitAfterFailedSplit(ShardSplitTest.java:279)
   [junit4]    > 	at org.apache.solr.BaseDistributedSearchTestCase$ShardsRepeatRule$ShardsFixedStatement.callStatement(BaseDistributedSearchTestCase.java:985)
   [junit4]    > 	at org.apache.solr.BaseDistributedSearchTestCase$ShardsRepeatRule$ShardsStatement.evaluate(BaseDistributedSearchTestCase.java:960)
   [junit4]    > 	at java.lang.Thread.run(Thread.java:745)
   [junit4]   2> 2619009 INFO  (SUITE-ShardSplitTest-seed#[782CBBD5E8B225F6]-worker) [    ] o.a.s.SolrTestCaseJ4 ###deleteCore
   [junit4]   2> NOTE: leaving temporary files on disk at: /Users/jenkins/workspace/Lucene-Solr-master-MacOSX/solr/build/solr-core/test/J0/temp/solr.cloud.ShardSplitTest_782CBBD5E8B225F6-001
   [junit4]   2> NOTE: test params are: codec=Asserting(Lucene70): {rnd_b=PostingsFormat(name=LuceneVarGapDocFreqInterval), shard_s=TestBloomFilteredLucenePostings(BloomFilteringPostingsFormat(Lucene50(blocksize=128))), _version_=TestBloomFilteredLucenePostings(BloomFilteringPostingsFormat(Lucene50(blocksize=128))), n_ti=TestBloomFilteredLucenePostings(BloomFilteringPostingsFormat(Lucene50(blocksize=128))), a_t=TestBloomFilteredLucenePostings(BloomFilteringPostingsFormat(Lucene50(blocksize=128))), a_i=PostingsFormat(name=LuceneVarGapDocFreqInterval), id=PostingsFormat(name=LuceneVarGapDocFreqInterval)}, docValues:{}, maxPointsInLeafNode=827, maxMBSortInHeap=7.028553128135178, sim=RandomSimilarity(queryNorm=true): {}, locale=es-MX, timezone=Asia/Hong_Kong
   [junit4]   2> NOTE: Mac OS X 10.11.6 x86_64/Oracle Corporation 1.8.0_102 (64-bit)/cpus=3,threads=1,free=311515824,total=536870912
   [junit4]   2> NOTE: All tests run in this JVM: [PolyFieldTest, TestFieldCacheSort, DirectSolrSpellCheckerTest, OverseerTaskQueueTest, TestManagedSchema, ShardRoutingTest, TestSolrCloudWithKerberosAlt, DirectUpdateHandlerTest, TestTrackingShardHandlerFactory, BlockJoinFacetSimpleTest, SolrGraphiteReporterTest, DeleteStatusTest, HdfsDirectoryFactoryTest, TestCustomDocTransformer, SynonymTokenizerTest, SolrCoreTest, SolrTestCaseJ4Test, TestSerializedLuceneMatchVersion, OverseerRolesTest, TestSegmentSorting, TestSQLHandler, TestRandomRequestDistribution, HighlighterMaxOffsetTest, SortSpecParsingTest, TestJavabinTupleStreamParser, TestWordDelimiterFilterFactory, TestPerFieldSimilarityWithDefaultOverride, TestLeaderInitiatedRecoveryThread, HdfsTlogReplayBufferedWhileIndexingTest, UUIDUpdateProcessorFallbackTest, TestDefaultStatsCache, TestCustomSort, ZkCLITest, PingRequestHandlerTest, TestLRUStatsCache, PathHierarchyTokenizerFactoryTest, TestJmxIntegration, HighlighterTest, TestStressLucene, QueryElevationComponentTest, TestOverriddenPrefixQueryForCustomFieldType, PrimitiveFieldTypeTest, TestSubQueryTransformer, LeaderFailoverAfterPartitionTest, SearchHandlerTest, HdfsDirectoryTest, TestCloudPivotFacet, DistributedSuggestComponentTest, TermsComponentTest, SolrSlf4jReporterTest, TestTolerantUpdateProcessorCloud, TestSchemalessBufferedUpdates, TestIBSimilarityFactory, HttpPartitionTest, TestDocumentBuilder, TestLegacyFieldCache, CdcrReplicationDistributedZkTest, TestLazyCores, SystemInfoHandlerTest, DistributedQueueTest, MetricsHandlerTest, RecoveryAfterSoftCommitTest, ChangedSchemaMergeTest, TestReRankQParserPlugin, SpatialRPTFieldTypeTest, DirectoryFactoryTest, TestCryptoKeys, TestUseDocValuesAsStored2, SimplePostToolTest, TestFieldCacheReopen, HdfsSyncSliceTest, SampleTest, TestCopyFieldCollectionResource, TestRandomCollapseQParserPlugin, TestSolrConfigHandlerCloud, TestDFISimilarityFactory, DisMaxRequestHandlerTest, TestConfigSetsAPIExclusivity, TestOnReconnectListenerSupport, TestLockTree, CustomCollectionTest, AlternateDirectoryTest, IndexSchemaRuntimeFieldTest, ZkControllerTest, DistributedDebugComponentTest, OutOfBoxZkACLAndCredentialsProvidersTest, DistributedSpellCheckComponentTest, PeerSyncTest, TestDynamicFieldCollectionResource, MergeStrategyTest, TestSlowCompositeReaderWrapper, TestSolrCLIRunExample, TestCSVResponseWriter, OverseerTest, HdfsChaosMonkeySafeLeaderTest, AnalysisAfterCoreReloadTest, DocValuesNotIndexedTest, SmileWriterTest, SolrCLIZkUtilsTest, CoreMergeIndexesAdminHandlerTest, SuggesterFSTTest, TestPerFieldSimilarity, TestRTGBase, TestManagedStopFilterFactory, RequiredFieldsTest, TestHashQParserPlugin, TestExtendedDismaxParser, TestMinMaxOnMultiValuedField, DistributedFacetPivotSmallTest, TestBulkSchemaAPI, PluginInfoTest, TestInitParams, ClassificationUpdateProcessorFactoryTest, TestSolrCoreSnapshots, TestDelegationWithHadoopAuth, VMParamsZkACLAndCredentialsProvidersTest, TestStressReorder, HLLSerializationTest, UnloadDistributedZkTest, PrimUtilsTest, TestConfigSets, HdfsNNFailoverTest, TestHighFrequencyDictionaryFactory, TestReplicaProperties, TestSubQueryTransformerDistrib, ClusterStateUpdateTest, ZkNodePropsTest, TestHashPartitioner, TestElisionMultitermQuery, AnalyticsQueryTest, RuleEngineTest, SharedFSAutoReplicaFailoverUtilsTest, TestNumericTerms64, DocValuesMultiTest, TestExactSharedStatsCache, OutputWriterTest, TestClusterStateMutator, SegmentsInfoRequestHandlerTest, SolrIndexConfigTest, TestTolerantSearch, TestBlobHandler, TestMacros, DOMUtilTest, JvmMetricsTest, MBeansHandlerTest, TestFaceting, TestHdfsBackupRestoreCore, TestManagedSchemaThreadSafety, BlockJoinFacetDistribTest, TestFieldTypeCollectionResource, SpatialFilterTest, CurrencyFieldXmlFileTest, TestGroupingSearch, TestJettySolrRunner, TestHdfsUpdateLog, BadCopyFieldTest, ChaosMonkeyNothingIsSafeTest, TestCursorMarkWithoutUniqueKey, TestFieldCacheVsDocValues, SolrMetricsIntegrationTest, TestLegacyNumericRangeQueryBuilder, DistributedMLTComponentTest, XmlUpdateRequestHandlerTest, HardAutoCommitTest, SyncSliceTest, TestReplicationHandler, TestRandomDVFaceting, TestDistributedSearch, TestSolr4Spatial, TestFiltering, TestIndexSearcher, ShowFileRequestHandlerTest, CurrencyFieldOpenExchangeTest, DistributedQueryElevationComponentTest, SolrRequestParserTest, SuggesterTSTTest, TestTrie, TestCSVLoader, NoCacheHeaderTest, WordBreakSolrSpellCheckerTest, SchemaVersionSpecificBehaviorTest, TestPseudoReturnFields, TestAtomicUpdateErrorCases, QueryEqualityTest, TestRemoteStreaming, DistanceFunctionTest, SolrInfoMBeanTest, CacheHeaderTest, TestSurroundQueryParser, TestQueryUtils, TestWriterPerf, TestOmitPositions, RequestHandlersTest, TestIndexingPerformance, TestSolrQueryParser, RegexBoostProcessorTest, TestCollationField, ReturnFieldsTest, TestAnalyzedSuggestions, TestPartialUpdateDeduplication, SOLR749Test, UpdateParamsTest, TestQuerySenderNoQuery, CopyFieldTest, BadComponentTest, TestMergePolicyConfig, MultiTermTest, TestDocSet, TestBinaryField, TestSearchPerf, NumericFieldsTest, MinimalSchemaTest, TestConfig, ExternalFileFieldSortTest, TestSolrCoreProperties, TestPostingsSolrHighlighter, DirectSolrConnectionTest, TestPhraseSuggestions, SpellPossibilityIteratorTest, TestCharFilters, TestCodecSupport, TestXIncludeConfig, TestSweetSpotSimilarityFactory, TestBM25SimilarityFactory, TestJmxMonitoredMap, OpenExchangeRatesOrgProviderTest, TestFastLRUCache, PreAnalyzedFieldTest, DateFieldTest, RAMDirectoryFactoryTest, TestSolrJ, TestLRUCache, SliceStateTest, CursorPagingTest, CloudExitableDirectoryReaderTest, CollectionReloadTest, CollectionsAPIAsyncDistributedZkTest, DeleteLastCustomShardedReplicaTest, DeleteReplicaTest, DistribDocExpirationUpdateProcessorTest, ForceLeaderTest, OverseerCollectionConfigSetProcessorTest, OverseerModifyCollectionTest, ReplaceNodeTest, SSLMigrationTest, ShardSplitTest]
   [junit4] Completed [516/678 (2!)] on J0 in 322.68s, 5 tests, 1 failure <<< FAILURES!

[...truncated 62982 lines...]


Mime
View raw message