lucene-dev mailing list archives

Site index · List index
Message view « Date » · « Thread »
Top « Date » · « Thread »
From Policeman Jenkins Server <jenk...@thetaphi.de>
Subject [JENKINS] Lucene-Solr-6.x-Linux (64bit/jdk1.8.0_112) - Build # 2590 - Unstable!
Date Wed, 04 Jan 2017 19:47:09 GMT
Build: https://jenkins.thetaphi.de/job/Lucene-Solr-6.x-Linux/2590/
Java: 64bit/jdk1.8.0_112 -XX:+UseCompressedOops -XX:+UseParallelGC

1 tests failed.
FAILED:  org.apache.solr.cloud.CollectionsAPISolrJTest.testAddAndDeleteReplica

Error Message:
Error from server at https://127.0.0.1:46218/solr: Could not fully remove collection: solrj_replicatests

Stack Trace:
org.apache.solr.client.solrj.impl.HttpSolrClient$RemoteSolrException: Error from server at https://127.0.0.1:46218/solr: Could not fully remove collection: solrj_replicatests
	at __randomizedtesting.SeedInfo.seed([3176EEA35D335595:DFC697F65AFF422F]:0)
	at org.apache.solr.client.solrj.impl.HttpSolrClient.executeMethod(HttpSolrClient.java:610)
	at org.apache.solr.client.solrj.impl.HttpSolrClient.request(HttpSolrClient.java:279)
	at org.apache.solr.client.solrj.impl.HttpSolrClient.request(HttpSolrClient.java:268)
	at org.apache.solr.client.solrj.impl.LBHttpSolrClient.doRequest(LBHttpSolrClient.java:435)
	at org.apache.solr.client.solrj.impl.LBHttpSolrClient.request(LBHttpSolrClient.java:387)
	at org.apache.solr.client.solrj.impl.CloudSolrClient.sendRequest(CloudSolrClient.java:1344)
	at org.apache.solr.client.solrj.impl.CloudSolrClient.requestWithRetryOnStaleState(CloudSolrClient.java:1095)
	at org.apache.solr.client.solrj.impl.CloudSolrClient.request(CloudSolrClient.java:1037)
	at org.apache.solr.client.solrj.SolrRequest.process(SolrRequest.java:149)
	at org.apache.solr.client.solrj.SolrRequest.process(SolrRequest.java:166)
	at org.apache.solr.cloud.CollectionsAPISolrJTest.testAddAndDeleteReplica(CollectionsAPISolrJTest.java:210)
	at sun.reflect.NativeMethodAccessorImpl.invoke0(Native Method)
	at sun.reflect.NativeMethodAccessorImpl.invoke(NativeMethodAccessorImpl.java:62)
	at sun.reflect.DelegatingMethodAccessorImpl.invoke(DelegatingMethodAccessorImpl.java:43)
	at java.lang.reflect.Method.invoke(Method.java:498)
	at com.carrotsearch.randomizedtesting.RandomizedRunner.invoke(RandomizedRunner.java:1713)
	at com.carrotsearch.randomizedtesting.RandomizedRunner$8.evaluate(RandomizedRunner.java:907)
	at com.carrotsearch.randomizedtesting.RandomizedRunner$9.evaluate(RandomizedRunner.java:943)
	at com.carrotsearch.randomizedtesting.RandomizedRunner$10.evaluate(RandomizedRunner.java:957)
	at com.carrotsearch.randomizedtesting.rules.SystemPropertiesRestoreRule$1.evaluate(SystemPropertiesRestoreRule.java:57)
	at org.apache.lucene.util.TestRuleSetupTeardownChained$1.evaluate(TestRuleSetupTeardownChained.java:49)
	at org.apache.lucene.util.AbstractBeforeAfterRule$1.evaluate(AbstractBeforeAfterRule.java:45)
	at org.apache.lucene.util.TestRuleThreadAndTestName$1.evaluate(TestRuleThreadAndTestName.java:48)
	at org.apache.lucene.util.TestRuleIgnoreAfterMaxFailures$1.evaluate(TestRuleIgnoreAfterMaxFailures.java:64)
	at org.apache.lucene.util.TestRuleMarkFailure$1.evaluate(TestRuleMarkFailure.java:47)
	at com.carrotsearch.randomizedtesting.rules.StatementAdapter.evaluate(StatementAdapter.java:36)
	at com.carrotsearch.randomizedtesting.ThreadLeakControl$StatementRunner.run(ThreadLeakControl.java:367)
	at com.carrotsearch.randomizedtesting.ThreadLeakControl.forkTimeoutingTask(ThreadLeakControl.java:811)
	at com.carrotsearch.randomizedtesting.ThreadLeakControl$3.evaluate(ThreadLeakControl.java:462)
	at com.carrotsearch.randomizedtesting.RandomizedRunner.runSingleTest(RandomizedRunner.java:916)
	at com.carrotsearch.randomizedtesting.RandomizedRunner$5.evaluate(RandomizedRunner.java:802)
	at com.carrotsearch.randomizedtesting.RandomizedRunner$6.evaluate(RandomizedRunner.java:852)
	at com.carrotsearch.randomizedtesting.RandomizedRunner$7.evaluate(RandomizedRunner.java:863)
	at com.carrotsearch.randomizedtesting.rules.StatementAdapter.evaluate(StatementAdapter.java:36)
	at com.carrotsearch.randomizedtesting.rules.SystemPropertiesRestoreRule$1.evaluate(SystemPropertiesRestoreRule.java:57)
	at org.apache.lucene.util.AbstractBeforeAfterRule$1.evaluate(AbstractBeforeAfterRule.java:45)
	at com.carrotsearch.randomizedtesting.rules.StatementAdapter.evaluate(StatementAdapter.java:36)
	at org.apache.lucene.util.TestRuleStoreClassName$1.evaluate(TestRuleStoreClassName.java:41)
	at com.carrotsearch.randomizedtesting.rules.NoShadowingOrOverridesOnMethodsRule$1.evaluate(NoShadowingOrOverridesOnMethodsRule.java:40)
	at com.carrotsearch.randomizedtesting.rules.NoShadowingOrOverridesOnMethodsRule$1.evaluate(NoShadowingOrOverridesOnMethodsRule.java:40)
	at com.carrotsearch.randomizedtesting.rules.StatementAdapter.evaluate(StatementAdapter.java:36)
	at com.carrotsearch.randomizedtesting.rules.StatementAdapter.evaluate(StatementAdapter.java:36)
	at com.carrotsearch.randomizedtesting.rules.StatementAdapter.evaluate(StatementAdapter.java:36)
	at org.apache.lucene.util.TestRuleAssertionsRequired$1.evaluate(TestRuleAssertionsRequired.java:53)
	at org.apache.lucene.util.TestRuleMarkFailure$1.evaluate(TestRuleMarkFailure.java:47)
	at org.apache.lucene.util.TestRuleIgnoreAfterMaxFailures$1.evaluate(TestRuleIgnoreAfterMaxFailures.java:64)
	at org.apache.lucene.util.TestRuleIgnoreTestSuites$1.evaluate(TestRuleIgnoreTestSuites.java:54)
	at com.carrotsearch.randomizedtesting.rules.StatementAdapter.evaluate(StatementAdapter.java:36)
	at com.carrotsearch.randomizedtesting.ThreadLeakControl$StatementRunner.run(ThreadLeakControl.java:367)
	at java.lang.Thread.run(Thread.java:745)




Build Log:
[...truncated 12326 lines...]
   [junit4] Suite: org.apache.solr.cloud.CollectionsAPISolrJTest
   [junit4]   2> Creating dataDir: /home/jenkins/workspace/Lucene-Solr-6.x-Linux/solr/build/solr-core/test/J1/temp/solr.cloud.CollectionsAPISolrJTest_3176EEA35D335595-001/init-core-data-001
   [junit4]   2> 1102530 INFO  (SUITE-CollectionsAPISolrJTest-seed#[3176EEA35D335595]-worker) [    ] o.a.s.SolrTestCaseJ4 Randomized ssl (true) and clientAuth (false) via: @org.apache.solr.util.RandomizeSSL(reason=, ssl=NaN, value=NaN, clientAuth=NaN)
   [junit4]   2> 1102531 INFO  (SUITE-CollectionsAPISolrJTest-seed#[3176EEA35D335595]-worker) [    ] o.a.s.c.MiniSolrCloudCluster Starting cluster of 4 servers in /home/jenkins/workspace/Lucene-Solr-6.x-Linux/solr/build/solr-core/test/J1/temp/solr.cloud.CollectionsAPISolrJTest_3176EEA35D335595-001/tempDir-001
   [junit4]   2> 1102531 INFO  (SUITE-CollectionsAPISolrJTest-seed#[3176EEA35D335595]-worker) [    ] o.a.s.c.ZkTestServer STARTING ZK TEST SERVER
   [junit4]   2> 1102531 INFO  (Thread-2589) [    ] o.a.s.c.ZkTestServer client port:0.0.0.0/0.0.0.0:0
   [junit4]   2> 1102531 INFO  (Thread-2589) [    ] o.a.s.c.ZkTestServer Starting server
   [junit4]   2> 1102631 INFO  (SUITE-CollectionsAPISolrJTest-seed#[3176EEA35D335595]-worker) [    ] o.a.s.c.ZkTestServer start zk server on port:46164
   [junit4]   2> 1102636 INFO  (jetty-launcher-1718-thread-1) [    ] o.e.j.s.Server jetty-9.3.14.v20161028
   [junit4]   2> 1102636 INFO  (jetty-launcher-1718-thread-2) [    ] o.e.j.s.Server jetty-9.3.14.v20161028
   [junit4]   2> 1102636 INFO  (jetty-launcher-1718-thread-4) [    ] o.e.j.s.Server jetty-9.3.14.v20161028
   [junit4]   2> 1102636 INFO  (jetty-launcher-1718-thread-3) [    ] o.e.j.s.Server jetty-9.3.14.v20161028
   [junit4]   2> 1102638 INFO  (jetty-launcher-1718-thread-3) [    ] o.e.j.s.h.ContextHandler Started o.e.j.s.ServletContextHandler@580df86a{/solr,null,AVAILABLE}
   [junit4]   2> 1102638 INFO  (jetty-launcher-1718-thread-1) [    ] o.e.j.s.h.ContextHandler Started o.e.j.s.ServletContextHandler@29c6963f{/solr,null,AVAILABLE}
   [junit4]   2> 1102638 INFO  (jetty-launcher-1718-thread-2) [    ] o.e.j.s.h.ContextHandler Started o.e.j.s.ServletContextHandler@7fb99278{/solr,null,AVAILABLE}
   [junit4]   2> 1102638 INFO  (jetty-launcher-1718-thread-4) [    ] o.e.j.s.h.ContextHandler Started o.e.j.s.ServletContextHandler@2883c856{/solr,null,AVAILABLE}
   [junit4]   2> 1102639 INFO  (jetty-launcher-1718-thread-3) [    ] o.e.j.s.AbstractConnector Started ServerConnector@5e30276b{SSL,[ssl, http/1.1]}{127.0.0.1:44651}
   [junit4]   2> 1102640 INFO  (jetty-launcher-1718-thread-3) [    ] o.e.j.s.Server Started @1104415ms
   [junit4]   2> 1102640 INFO  (jetty-launcher-1718-thread-3) [    ] o.a.s.c.s.e.JettySolrRunner Jetty properties: {hostContext=/solr, hostPort=44651}
   [junit4]   2> 1102640 ERROR (jetty-launcher-1718-thread-3) [    ] o.a.s.s.StartupLoggingUtils Missing Java Option solr.log.dir. Logging may be missing or incomplete.
   [junit4]   2> 1102640 INFO  (jetty-launcher-1718-thread-3) [    ] o.a.s.s.SolrDispatchFilter  ___      _       Welcome to Apache Solr? version 6.4.0
   [junit4]   2> 1102640 INFO  (jetty-launcher-1718-thread-1) [    ] o.e.j.s.AbstractConnector Started ServerConnector@79ea2f0e{SSL,[ssl, http/1.1]}{127.0.0.1:37489}
   [junit4]   2> 1102640 INFO  (jetty-launcher-1718-thread-3) [    ] o.a.s.s.SolrDispatchFilter / __| ___| |_ _   Starting in cloud mode on port null
   [junit4]   2> 1102640 INFO  (jetty-launcher-1718-thread-1) [    ] o.e.j.s.Server Started @1104416ms
   [junit4]   2> 1102640 INFO  (jetty-launcher-1718-thread-3) [    ] o.a.s.s.SolrDispatchFilter \__ \/ _ \ | '_|  Install dir: null
   [junit4]   2> 1102640 INFO  (jetty-launcher-1718-thread-1) [    ] o.a.s.c.s.e.JettySolrRunner Jetty properties: {hostContext=/solr, hostPort=37489}
   [junit4]   2> 1102641 INFO  (jetty-launcher-1718-thread-3) [    ] o.a.s.s.SolrDispatchFilter |___/\___/_|_|    Start time: 2017-01-04T19:20:37.350Z
   [junit4]   2> 1102640 INFO  (jetty-launcher-1718-thread-2) [    ] o.e.j.s.AbstractConnector Started ServerConnector@41cbe227{SSL,[ssl, http/1.1]}{127.0.0.1:46218}
   [junit4]   2> 1102641 ERROR (jetty-launcher-1718-thread-1) [    ] o.a.s.s.StartupLoggingUtils Missing Java Option solr.log.dir. Logging may be missing or incomplete.
   [junit4]   2> 1102641 INFO  (jetty-launcher-1718-thread-2) [    ] o.e.j.s.Server Started @1104416ms
   [junit4]   2> 1102641 INFO  (jetty-launcher-1718-thread-1) [    ] o.a.s.s.SolrDispatchFilter  ___      _       Welcome to Apache Solr? version 6.4.0
   [junit4]   2> 1102641 INFO  (jetty-launcher-1718-thread-2) [    ] o.a.s.c.s.e.JettySolrRunner Jetty properties: {hostContext=/solr, hostPort=46218}
   [junit4]   2> 1102641 INFO  (jetty-launcher-1718-thread-1) [    ] o.a.s.s.SolrDispatchFilter / __| ___| |_ _   Starting in cloud mode on port null
   [junit4]   2> 1102640 INFO  (jetty-launcher-1718-thread-4) [    ] o.e.j.s.AbstractConnector Started ServerConnector@18cd9daf{SSL,[ssl, http/1.1]}{127.0.0.1:40190}
   [junit4]   2> 1102641 ERROR (jetty-launcher-1718-thread-2) [    ] o.a.s.s.StartupLoggingUtils Missing Java Option solr.log.dir. Logging may be missing or incomplete.
   [junit4]   2> 1102641 INFO  (jetty-launcher-1718-thread-4) [    ] o.e.j.s.Server Started @1104416ms
   [junit4]   2> 1102641 INFO  (jetty-launcher-1718-thread-1) [    ] o.a.s.s.SolrDispatchFilter \__ \/ _ \ | '_|  Install dir: null
   [junit4]   2> 1102641 INFO  (jetty-launcher-1718-thread-4) [    ] o.a.s.c.s.e.JettySolrRunner Jetty properties: {hostContext=/solr, hostPort=40190}
   [junit4]   2> 1102641 INFO  (jetty-launcher-1718-thread-1) [    ] o.a.s.s.SolrDispatchFilter |___/\___/_|_|    Start time: 2017-01-04T19:20:37.350Z
   [junit4]   2> 1102641 INFO  (jetty-launcher-1718-thread-2) [    ] o.a.s.s.SolrDispatchFilter  ___      _       Welcome to Apache Solr? version 6.4.0
   [junit4]   2> 1102641 ERROR (jetty-launcher-1718-thread-4) [    ] o.a.s.s.StartupLoggingUtils Missing Java Option solr.log.dir. Logging may be missing or incomplete.
   [junit4]   2> 1102641 INFO  (jetty-launcher-1718-thread-2) [    ] o.a.s.s.SolrDispatchFilter / __| ___| |_ _   Starting in cloud mode on port null
   [junit4]   2> 1102641 INFO  (jetty-launcher-1718-thread-4) [    ] o.a.s.s.SolrDispatchFilter  ___      _       Welcome to Apache Solr? version 6.4.0
   [junit4]   2> 1102641 INFO  (jetty-launcher-1718-thread-2) [    ] o.a.s.s.SolrDispatchFilter \__ \/ _ \ | '_|  Install dir: null
   [junit4]   2> 1102641 INFO  (jetty-launcher-1718-thread-4) [    ] o.a.s.s.SolrDispatchFilter / __| ___| |_ _   Starting in cloud mode on port null
   [junit4]   2> 1102642 INFO  (jetty-launcher-1718-thread-2) [    ] o.a.s.s.SolrDispatchFilter |___/\___/_|_|    Start time: 2017-01-04T19:20:37.351Z
   [junit4]   2> 1102642 INFO  (jetty-launcher-1718-thread-4) [    ] o.a.s.s.SolrDispatchFilter \__ \/ _ \ | '_|  Install dir: null
   [junit4]   2> 1102642 INFO  (jetty-launcher-1718-thread-4) [    ] o.a.s.s.SolrDispatchFilter |___/\___/_|_|    Start time: 2017-01-04T19:20:37.351Z
   [junit4]   2> 1102643 INFO  (jetty-launcher-1718-thread-2) [    ] o.a.s.s.SolrDispatchFilter solr.xml found in ZooKeeper. Loading...
   [junit4]   2> 1102643 INFO  (jetty-launcher-1718-thread-1) [    ] o.a.s.s.SolrDispatchFilter solr.xml found in ZooKeeper. Loading...
   [junit4]   2> 1102644 INFO  (jetty-launcher-1718-thread-3) [    ] o.a.s.s.SolrDispatchFilter solr.xml found in ZooKeeper. Loading...
   [junit4]   2> 1102643 INFO  (jetty-launcher-1718-thread-4) [    ] o.a.s.s.SolrDispatchFilter solr.xml found in ZooKeeper. Loading...
   [junit4]   2> 1102649 INFO  (jetty-launcher-1718-thread-4) [    ] o.a.s.u.UpdateShardHandler Creating UpdateShardHandler HTTP client with params: socketTimeout=340000&connTimeout=45000&retry=true
   [junit4]   2> 1102649 INFO  (jetty-launcher-1718-thread-3) [    ] o.a.s.u.UpdateShardHandler Creating UpdateShardHandler HTTP client with params: socketTimeout=340000&connTimeout=45000&retry=true
   [junit4]   2> 1102649 INFO  (jetty-launcher-1718-thread-4) [    ] o.a.s.c.ZkContainer Zookeeper client=127.0.0.1:46164/solr
   [junit4]   2> 1102649 INFO  (jetty-launcher-1718-thread-2) [    ] o.a.s.u.UpdateShardHandler Creating UpdateShardHandler HTTP client with params: socketTimeout=340000&connTimeout=45000&retry=true
   [junit4]   2> 1102650 INFO  (jetty-launcher-1718-thread-1) [    ] o.a.s.u.UpdateShardHandler Creating UpdateShardHandler HTTP client with params: socketTimeout=340000&connTimeout=45000&retry=true
   [junit4]   2> 1102650 INFO  (jetty-launcher-1718-thread-2) [    ] o.a.s.c.ZkContainer Zookeeper client=127.0.0.1:46164/solr
   [junit4]   2> 1102652 INFO  (jetty-launcher-1718-thread-3) [    ] o.a.s.c.ZkContainer Zookeeper client=127.0.0.1:46164/solr
   [junit4]   2> 1102652 INFO  (jetty-launcher-1718-thread-1) [    ] o.a.s.c.ZkContainer Zookeeper client=127.0.0.1:46164/solr
   [junit4]   2> 1102653 WARN  (NIOServerCxn.Factory:0.0.0.0/0.0.0.0:0) [    ] o.a.z.s.NIOServerCnxn caught end of stream exception
   [junit4]   2> EndOfStreamException: Unable to read additional data from client sessionid 0x1596aed0c790007, likely client has closed socket
   [junit4]   2> 	at org.apache.zookeeper.server.NIOServerCnxn.doIO(NIOServerCnxn.java:228)
   [junit4]   2> 	at org.apache.zookeeper.server.NIOServerCnxnFactory.run(NIOServerCnxnFactory.java:208)
   [junit4]   2> 	at java.lang.Thread.run(Thread.java:745)
   [junit4]   2> 1102662 INFO  (jetty-launcher-1718-thread-4) [n:127.0.0.1:40190_solr    ] o.a.s.c.OverseerElectionContext I am going to be the leader 127.0.0.1:40190_solr
   [junit4]   2> 1102664 INFO  (jetty-launcher-1718-thread-1) [n:127.0.0.1:37489_solr    ] o.a.s.c.ZkController Register node as live in ZooKeeper:/live_nodes/127.0.0.1:37489_solr
   [junit4]   2> 1102664 INFO  (jetty-launcher-1718-thread-3) [n:127.0.0.1:44651_solr    ] o.a.s.c.ZkController Register node as live in ZooKeeper:/live_nodes/127.0.0.1:44651_solr
   [junit4]   2> 1102664 INFO  (jetty-launcher-1718-thread-2) [n:127.0.0.1:46218_solr    ] o.a.s.c.ZkController Register node as live in ZooKeeper:/live_nodes/127.0.0.1:46218_solr
   [junit4]   2> 1102664 INFO  (jetty-launcher-1718-thread-4) [n:127.0.0.1:40190_solr    ] o.a.s.c.Overseer Overseer (id=97226433314226185-127.0.0.1:40190_solr-n_0000000000) starting
   [junit4]   2> 1102665 INFO  (zkCallback-1738-thread-1-processing-n:127.0.0.1:46218_solr) [n:127.0.0.1:46218_solr    ] o.a.s.c.c.ZkStateReader Updated live nodes from ZooKeeper... (0) -> (3)
   [junit4]   2> 1102666 INFO  (zkCallback-1739-thread-1-processing-n:127.0.0.1:37489_solr) [n:127.0.0.1:37489_solr    ] o.a.s.c.c.ZkStateReader Updated live nodes from ZooKeeper... (0) -> (3)
   [junit4]   2> 1102666 INFO  (zkCallback-1737-thread-1-processing-n:127.0.0.1:44651_solr) [n:127.0.0.1:44651_solr    ] o.a.s.c.c.ZkStateReader Updated live nodes from ZooKeeper... (0) -> (3)
   [junit4]   2> 1102666 INFO  (zkCallback-1736-thread-1-processing-n:127.0.0.1:40190_solr) [n:127.0.0.1:40190_solr    ] o.a.s.c.c.ZkStateReader Updated live nodes from ZooKeeper... (0) -> (3)
   [junit4]   2> 1102673 INFO  (jetty-launcher-1718-thread-4) [n:127.0.0.1:40190_solr    ] o.a.s.c.ZkController Register node as live in ZooKeeper:/live_nodes/127.0.0.1:40190_solr
   [junit4]   2> 1102676 INFO  (zkCallback-1739-thread-1-processing-n:127.0.0.1:37489_solr) [n:127.0.0.1:37489_solr    ] o.a.s.c.c.ZkStateReader Updated live nodes from ZooKeeper... (3) -> (4)
   [junit4]   2> 1102677 INFO  (zkCallback-1738-thread-1-processing-n:127.0.0.1:46218_solr) [n:127.0.0.1:46218_solr    ] o.a.s.c.c.ZkStateReader Updated live nodes from ZooKeeper... (3) -> (4)
   [junit4]   2> 1102682 INFO  (zkCallback-1736-thread-1-processing-n:127.0.0.1:40190_solr) [n:127.0.0.1:40190_solr    ] o.a.s.c.c.ZkStateReader Updated live nodes from ZooKeeper... (3) -> (4)
   [junit4]   2> 1102683 INFO  (zkCallback-1737-thread-1-processing-n:127.0.0.1:44651_solr) [n:127.0.0.1:44651_solr    ] o.a.s.c.c.ZkStateReader Updated live nodes from ZooKeeper... (3) -> (4)
   [junit4]   2> 1102692 INFO  (jetty-launcher-1718-thread-2) [n:127.0.0.1:46218_solr    ] o.a.s.c.CorePropertiesLocator Found 0 core definitions underneath /home/jenkins/workspace/Lucene-Solr-6.x-Linux/solr/build/solr-core/test/J1/temp/solr.cloud.CollectionsAPISolrJTest_3176EEA35D335595-001/tempDir-001/node2/.
   [junit4]   2> 1102729 INFO  (jetty-launcher-1718-thread-4) [n:127.0.0.1:40190_solr    ] o.a.s.c.CorePropertiesLocator Found 0 core definitions underneath /home/jenkins/workspace/Lucene-Solr-6.x-Linux/solr/build/solr-core/test/J1/temp/solr.cloud.CollectionsAPISolrJTest_3176EEA35D335595-001/tempDir-001/node4/.
   [junit4]   2> 1102745 INFO  (jetty-launcher-1718-thread-3) [n:127.0.0.1:44651_solr    ] o.a.s.c.CorePropertiesLocator Found 0 core definitions underneath /home/jenkins/workspace/Lucene-Solr-6.x-Linux/solr/build/solr-core/test/J1/temp/solr.cloud.CollectionsAPISolrJTest_3176EEA35D335595-001/tempDir-001/node3/.
   [junit4]   2> 1102798 INFO  (jetty-launcher-1718-thread-1) [n:127.0.0.1:37489_solr    ] o.a.s.c.CorePropertiesLocator Found 0 core definitions underneath /home/jenkins/workspace/Lucene-Solr-6.x-Linux/solr/build/solr-core/test/J1/temp/solr.cloud.CollectionsAPISolrJTest_3176EEA35D335595-001/tempDir-001/node1/.
   [junit4]   2> 1103973 INFO  (SUITE-CollectionsAPISolrJTest-seed#[3176EEA35D335595]-worker) [    ] o.a.s.c.c.ZkStateReader Updated live nodes from ZooKeeper... (0) -> (4)
   [junit4]   2> 1103973 INFO  (SUITE-CollectionsAPISolrJTest-seed#[3176EEA35D335595]-worker) [    ] o.a.s.c.s.i.ZkClientClusterStateProvider Cluster at 127.0.0.1:46164/solr ready
   [junit4]   2> 1103991 INFO  (TEST-CollectionsAPISolrJTest.testAddAndRemoveRole-seed#[3176EEA35D335595]) [    ] o.a.s.SolrTestCaseJ4 ###Starting testAddAndRemoveRole
   [junit4]   2> 1104045 INFO  (qtp1984148991-9961) [n:127.0.0.1:46218_solr    ] o.a.s.h.a.CollectionsHandler Invoked Collection Action :addrole with params node=127.0.0.1:46218_solr&role=overseer&action=ADDROLE&wt=javabin&version=2 and sendToOCPQueue=true
   [junit4]   2> 1104046 INFO  (OverseerThreadFactory-4852-thread-1-processing-n:127.0.0.1:40190_solr) [n:127.0.0.1:40190_solr    ] o.a.s.c.OverseerRoleCmd Overseer role added to 127.0.0.1:46218_solr
   [junit4]   2> 1104048 INFO  (Thread-2626) [n:127.0.0.1:40190_solr    ] o.a.s.c.OverseerNodePrioritizer prioritizing overseer nodes at 97226433314226185-127.0.0.1:40190_solr-n_0000000000 overseer designates are [127.0.0.1:46218_solr]
   [junit4]   2> 1104048 INFO  (qtp1984148991-9961) [n:127.0.0.1:46218_solr    ] o.a.s.s.HttpSolrCall [admin] webapp=null path=/admin/collections params={node=127.0.0.1:46218_solr&role=overseer&action=ADDROLE&wt=javabin&version=2} status=0 QTime=3
   [junit4]   2> 1104048 INFO  (Thread-2626) [n:127.0.0.1:40190_solr    ] o.a.s.c.OverseerNodePrioritizer sorted nodes [97226433314226185-127.0.0.1:40190_solr-n_0000000000, 97226433314226188-127.0.0.1:37489_solr-n_0000000001, 97226433314226186-127.0.0.1:44651_solr-n_0000000002, 97226433314226187-127.0.0.1:46218_solr-n_0000000003]
   [junit4]   2> 1104048 INFO  (Thread-2626) [n:127.0.0.1:40190_solr    ] o.a.s.c.OverseerNodePrioritizer asking node 97226433314226187-127.0.0.1:46218_solr-n_0000000003 to come join election at head
   [junit4]   2> 1104051 INFO  (qtp1984148991-9982) [n:127.0.0.1:46218_solr    ] o.a.s.h.a.CollectionsHandler Invoked Collection Action :clusterstatus with params action=CLUSTERSTATUS&wt=javabin&version=2 and sendToOCPQueue=true
   [junit4]   2> 1104051 INFO  (qtp1984148991-9965) [n:127.0.0.1:46218_solr    ] o.a.s.s.HttpSolrCall [admin] webapp=null path=/admin/cores params={op=rejoinAtHead&qt=/admin/cores&action=OVERSEEROP&electionNode=97226433314226187-127.0.0.1:46218_solr-n_0000000003&wt=javabin&version=2} status=0 QTime=0
   [junit4]   2> 1104052 INFO  (Thread-2626) [n:127.0.0.1:40190_solr    ] o.a.s.c.OverseerNodePrioritizer asking the old first in line 97226433314226188-127.0.0.1:37489_solr-n_0000000001 to rejoin election  
   [junit4]   2> 1104052 INFO  (qtp1984148991-9982) [n:127.0.0.1:46218_solr    ] o.a.s.s.HttpSolrCall [admin] webapp=null path=/admin/collections params={action=CLUSTERSTATUS&wt=javabin&version=2} status=0 QTime=0
   [junit4]   2> 1104055 INFO  (qtp1984148991-9961) [n:127.0.0.1:46218_solr    ] o.a.s.h.a.CollectionsHandler Invoked Collection Action :removerole with params node=127.0.0.1:46218_solr&role=overseer&action=REMOVEROLE&wt=javabin&version=2 and sendToOCPQueue=true
   [junit4]   2> 1104056 INFO  (OverseerCollectionConfigSetProcessor-97226433314226185-127.0.0.1:40190_solr-n_0000000000) [n:127.0.0.1:40190_solr    ] o.a.s.c.OverseerTaskQueue Response ZK path: /overseer/collection-queue-work/qnr-0000000000 doesn't exist.  Requestor may have disconnected from ZooKeeper
   [junit4]   2> 1104056 INFO  (OverseerThreadFactory-4852-thread-2-processing-n:127.0.0.1:40190_solr) [n:127.0.0.1:40190_solr    ] o.a.s.c.OverseerRoleCmd Overseer role removed from 127.0.0.1:46218_solr
   [junit4]   2> 1104058 INFO  (qtp1984148991-9961) [n:127.0.0.1:46218_solr    ] o.a.s.s.HttpSolrCall [admin] webapp=null path=/admin/collections params={node=127.0.0.1:46218_solr&role=overseer&action=REMOVEROLE&wt=javabin&version=2} status=0 QTime=2
   [junit4]   2> 1104059 INFO  (qtp1984148991-9990) [n:127.0.0.1:46218_solr    ] o.a.s.h.a.CollectionsHandler Invoked Collection Action :clusterstatus with params action=CLUSTERSTATUS&wt=javabin&version=2 and sendToOCPQueue=true
   [junit4]   2> 1104060 INFO  (qtp1984148991-9990) [n:127.0.0.1:46218_solr    ] o.a.s.s.HttpSolrCall [admin] webapp=null path=/admin/collections params={action=CLUSTERSTATUS&wt=javabin&version=2} status=0 QTime=0
   [junit4]   2> 1104060 INFO  (TEST-CollectionsAPISolrJTest.testAddAndRemoveRole-seed#[3176EEA35D335595]) [    ] o.a.s.SolrTestCaseJ4 ###Ending testAddAndRemoveRole
   [junit4]   2> 1104078 INFO  (TEST-CollectionsAPISolrJTest.testAddAndDeleteReplica-seed#[3176EEA35D335595]) [    ] o.a.s.SolrTestCaseJ4 ###Starting testAddAndDeleteReplica
   [junit4]   2> 1104079 INFO  (qtp1984148991-9986) [n:127.0.0.1:46218_solr    ] o.a.s.h.a.CollectionsHandler Invoked Collection Action :create with params replicationFactor=2&collection.configName=conf&name=solrj_replicatests&action=CREATE&numShards=1&wt=javabin&version=2 and sendToOCPQueue=true
   [junit4]   2> 1104081 INFO  (OverseerThreadFactory-4852-thread-3-processing-n:127.0.0.1:40190_solr) [n:127.0.0.1:40190_solr    ] o.a.s.c.CreateCollectionCmd Create collection solrj_replicatests
   [junit4]   2> 1104081 INFO  (OverseerCollectionConfigSetProcessor-97226433314226185-127.0.0.1:40190_solr-n_0000000000) [n:127.0.0.1:40190_solr    ] o.a.s.c.OverseerTaskQueue Response ZK path: /overseer/collection-queue-work/qnr-0000000002 doesn't exist.  Requestor may have disconnected from ZooKeeper
   [junit4]   2> 1104124 INFO  (qtp1429873541-9960) [n:127.0.0.1:37489_solr    ] o.a.s.s.HttpSolrCall [admin] webapp=null path=/admin/cores params={op=rejoin&qt=/admin/cores&action=OVERSEEROP&electionNode=97226433314226188-127.0.0.1:37489_solr-n_0000000001&wt=javabin&version=2} status=0 QTime=0
   [junit4]   2> 1104126 INFO  (OverseerStateUpdate-97226433314226185-127.0.0.1:40190_solr-n_0000000000) [n:127.0.0.1:40190_solr    ] o.a.s.c.Overseer Quit command received {
   [junit4]   2>   "operation":"quit",
   [junit4]   2>   "id":"97226433314226185-127.0.0.1:40190_solr-n_0000000000"} 127.0.0.1:40190_solr
   [junit4]   2> 1104186 INFO  (qtp1429873541-9979) [n:127.0.0.1:37489_solr    ] o.a.s.h.a.CoreAdminOperation core create command qt=/admin/cores&collection.configName=conf&newCollection=true&name=solrj_replicatests_shard1_replica2&action=CREATE&numShards=1&collection=solrj_replicatests&shard=shard1&wt=javabin&version=2
   [junit4]   2> 1104236 INFO  (qtp899330898-9962) [n:127.0.0.1:40190_solr    ] o.a.s.h.a.CoreAdminOperation core create command qt=/admin/cores&collection.configName=conf&newCollection=true&name=solrj_replicatests_shard1_replica1&action=CREATE&numShards=1&collection=solrj_replicatests&shard=shard1&wt=javabin&version=2
   [junit4]   2> 1194275 ERROR (OverseerThreadFactory-4852-thread-3-processing-n:127.0.0.1:40190_solr) [n:127.0.0.1:40190_solr    ] o.a.s.c.OverseerCollectionMessageHandler Error from shard: https://127.0.0.1:37489/solr
   [junit4]   2> org.apache.solr.client.solrj.SolrServerException: Timeout occured while waiting response from server at: https://127.0.0.1:37489/solr
   [junit4]   2> 	at org.apache.solr.client.solrj.impl.HttpSolrClient.executeMethod(HttpSolrClient.java:621)
   [junit4]   2> 	at org.apache.solr.client.solrj.impl.HttpSolrClient.request(HttpSolrClient.java:279)
   [junit4]   2> 	at org.apache.solr.client.solrj.impl.HttpSolrClient.request(HttpSolrClient.java:268)
   [junit4]   2> 	at org.apache.solr.client.solrj.SolrClient.request(SolrClient.java:1219)
   [junit4]   2> 	at org.apache.solr.handler.component.HttpShardHandler.lambda$submit$0(HttpShardHandler.java:163)
   [junit4]   2> 	at java.util.concurrent.FutureTask.run(FutureTask.java:266)
   [junit4]   2> 	at java.util.concurrent.Executors$RunnableAdapter.call(Executors.java:511)
   [junit4]   2> 	at java.util.concurrent.FutureTask.run(FutureTask.java:266)
   [junit4]   2> 	at com.codahale.metrics.InstrumentedExecutorService$InstrumentedRunnable.run(InstrumentedExecutorService.java:176)
   [junit4]   2> 	at org.apache.solr.common.util.ExecutorUtil$MDCAwareThreadPoolExecutor.lambda$execute$0(ExecutorUtil.java:229)
   [junit4]   2> 	at java.util.concurrent.ThreadPoolExecutor.runWorker(ThreadPoolExecutor.java:1142)
   [junit4]   2> 	at java.util.concurrent.ThreadPoolExecutor$Worker.run(ThreadPoolExecutor.java:617)
   [junit4]   2> 	at java.lang.Thread.run(Thread.java:745)
   [junit4]   2> Caused by: java.net.SocketTimeoutException: Read timed out
   [junit4]   2> 	at java.net.SocketInputStream.socketRead0(Native Method)
   [junit4]   2> 	at java.net.SocketInputStream.socketRead(SocketInputStream.java:116)
   [junit4]   2> 	at java.net.SocketInputStream.read(SocketInputStream.java:170)
   [junit4]   2> 	at java.net.SocketInputStream.read(SocketInputStream.java:141)
   [junit4]   2> 	at sun.security.ssl.InputRecord.readFully(InputRecord.java:465)
   [junit4]   2> 	at sun.security.ssl.InputRecord.read(InputRecord.java:503)
   [junit4]   2> 	at sun.security.ssl.SSLSocketImpl.readRecord(SSLSocketImpl.java:973)
   [junit4]   2> 	at sun.security.ssl.SSLSocketImpl.readDataRecord(SSLSocketImpl.java:930)
   [junit4]   2> 	at sun.security.ssl.AppInputStream.read(AppInputStream.java:105)
   [junit4]   2> 	at org.apache.http.impl.io.AbstractSessionInputBuffer.fillBuffer(AbstractSessionInputBuffer.java:160)
   [junit4]   2> 	at org.apache.http.impl.io.SocketInputBuffer.fillBuffer(SocketInputBuffer.java:84)
   [junit4]   2> 	at org.apache.http.impl.io.AbstractSessionInputBuffer.readLine(AbstractSessionInputBuffer.java:273)
   [junit4]   2> 	at org.apache.http.impl.conn.DefaultHttpResponseParser.parseHead(DefaultHttpResponseParser.java:140)
   [junit4]   2> 	at org.apache.http.impl.conn.DefaultHttpResponseParser.parseHead(DefaultHttpResponseParser.java:57)
   [junit4]   2> 	at org.apache.http.impl.io.AbstractMessageParser.parse(AbstractMessageParser.java:261)
   [junit4]   2> 	at org.apache.http.impl.AbstractHttpClientConnection.receiveResponseHeader(AbstractHttpClientConnection.java:283)
   [junit4]   2> 	at org.apache.http.impl.conn.DefaultClientConnection.receiveResponseHeader(DefaultClientConnection.java:251)
   [junit4]   2> 	at org.apache.http.impl.conn.ManagedClientConnectionImpl.receiveResponseHeader(ManagedClientConnectionImpl.java:197)
   [junit4]   2> 	at org.apache.http.protocol.HttpRequestExecutor.doReceiveResponse(HttpRequestExecutor.java:272)
   [junit4]   2> 	at org.apache.http.protocol.HttpRequestExecutor.execute(HttpRequestExecutor.java:124)
   [junit4]   2> 	at org.apache.solr.util.stats.InstrumentedHttpRequestExecutor.execute(InstrumentedHttpRequestExecutor.java:57)
   [junit4]   2> 	at org.apache.http.impl.client.DefaultRequestDirector.tryExecute(DefaultRequestDirector.java:685)
   [junit4]   2> 	at org.apache.http.impl.client.DefaultRequestDirector.execute(DefaultRequestDirector.java:487)
   [junit4]   2> 	at org.apache.http.impl.client.AbstractHttpClient.doExecute(AbstractHttpClient.java:882)
   [junit4]   2> 	at org.apache.http.impl.client.CloseableHttpClient.execute(CloseableHttpClient.java:82)
   [junit4]   2> 	at org.apache.http.impl.client.CloseableHttpClient.execute(CloseableHttpClient.java:55)
   [junit4]   2> 	at org.apache.solr.client.solrj.impl.HttpSolrClient.executeMethod(HttpSolrClient.java:515)
   [junit4]   2> 	... 12 more
   [junit4]   2> 1194323 ERROR (OverseerThreadFactory-4852-thread-3-processing-n:127.0.0.1:40190_solr) [n:127.0.0.1:40190_solr    ] o.a.s.c.OverseerCollectionMessageHandler Error from shard: https://127.0.0.1:40190/solr
   [junit4]   2> org.apache.solr.client.solrj.SolrServerException: Timeout occured while waiting response from server at: https://127.0.0.1:40190/solr
   [junit4]   2> 	at org.apache.solr.client.solrj.impl.HttpSolrClient.executeMethod(HttpSolrClient.java:621)
   [junit4]   2> 	at org.apache.solr.client.solrj.impl.HttpSolrClient.request(HttpSolrClient.java:279)
   [junit4]   2> 	at org.apache.solr.client.solrj.impl.HttpSolrClient.request(HttpSolrClient.java:268)
   [junit4]   2> 	at org.apache.solr.client.solrj.SolrClient.request(SolrClient.java:1219)
   [junit4]   2> 	at org.apache.solr.handler.component.HttpShardHandler.lambda$submit$0(HttpShardHandler.java:163)
   [junit4]   2> 	at java.util.concurrent.FutureTask.run(FutureTask.java:266)
   [junit4]   2> 	at java.util.concurrent.Executors$RunnableAdapter.call(Executors.java:511)
   [junit4]   2> 	at java.util.concurrent.FutureTask.run(FutureTask.java:266)
   [junit4]   2> 	at com.codahale.metrics.InstrumentedExecutorService$InstrumentedRunnable.run(InstrumentedExecutorService.java:176)
   [junit4]   2> 	at org.apache.solr.common.util.ExecutorUtil$MDCAwareThreadPoolExecutor.lambda$execute$0(ExecutorUtil.java:229)
   [junit4]   2> 	at java.util.concurrent.ThreadPoolExecutor.runWorker(ThreadPoolExecutor.java:1142)
   [junit4]   2> 	at java.util.concurrent.ThreadPoolExecutor$Worker.run(ThreadPoolExecutor.java:617)
   [junit4]   2> 	at java.lang.Thread.run(Thread.java:745)
   [junit4]   2> Caused by: java.net.SocketTimeoutException: Read timed out
   [junit4]   2> 	at java.net.SocketInputStream.socketRead0(Native Method)
   [junit4]   2> 	at java.net.SocketInputStream.socketRead(SocketInputStream.java:116)
   [junit4]   2> 	at java.net.SocketInputStream.read(SocketInputStream.java:170)
   [junit4]   2> 	at java.net.SocketInputStream.read(SocketInputStream.java:141)
   [junit4]   2> 	at sun.security.ssl.InputRecord.readFully(InputRecord.java:465)
   [junit4]   2> 	at sun.security.ssl.InputRecord.read(InputRecord.java:503)
   [junit4]   2> 	at sun.security.ssl.SSLSocketImpl.readRecord(SSLSocketImpl.java:973)
   [junit4]   2> 	at sun.security.ssl.SSLSocketImpl.readDataRecord(SSLSocketImpl.java:930)
   [junit4]   2> 	at sun.security.ssl.AppInputStream.read(AppInputStream.java:105)
   [junit4]   2> 	at org.apache.http.impl.io.AbstractSessionInputBuffer.fillBuffer(AbstractSessionInputBuffer.java:160)
   [junit4]   2> 	at org.apache.http.impl.io.SocketInputBuffer.fillBuffer(SocketInputBuffer.java:84)
   [junit4]   2> 	at org.apache.http.impl.io.AbstractSessionInputBuffer.readLine(AbstractSessionInputBuffer.java:273)
   [junit4]   2> 	at org.apache.http.impl.conn.DefaultHttpResponseParser.parseHead(DefaultHttpResponseParser.java:140)
   [junit4]   2> 	at org.apache.http.impl.conn.DefaultHttpResponseParser.parseHead(DefaultHttpResponseParser.java:57)
   [junit4]   2> 	at org.apache.http.impl.io.AbstractMessageParser.parse(AbstractMessageParser.java:261)
   [junit4]   2> 	at org.apache.http.impl.AbstractHttpClientConnection.receiveResponseHeader(AbstractHttpClientConnection.java:283)
   [junit4]   2> 	at org.apache.http.impl.conn.DefaultClientConnection.receiveResponseHeader(DefaultClientConnection.java:251)
   [junit4]   2> 	at org.apache.http.impl.conn.ManagedClientConnectionImpl.receiveResponseHeader(ManagedClientConnectionImpl.java:197)
   [junit4]   2> 	at org.apache.http.protocol.HttpRequestExecutor.doReceiveResponse(HttpRequestExecutor.java:272)
   [junit4]   2> 	at org.apache.http.protocol.HttpRequestExecutor.execute(HttpRequestExecutor.java:124)
   [junit4]   2> 	at org.apache.solr.util.stats.InstrumentedHttpRequestExecutor.execute(InstrumentedHttpRequestExecutor.java:57)
   [junit4]   2> 	at org.apache.http.impl.client.DefaultRequestDirector.tryExecute(DefaultRequestDirector.java:685)
   [junit4]   2> 	at org.apache.http.impl.client.DefaultRequestDirector.execute(DefaultRequestDirector.java:487)
   [junit4]   2> 	at org.apache.http.impl.client.AbstractHttpClient.doExecute(AbstractHttpClient.java:882)
   [junit4]   2> 	at org.apache.http.impl.client.CloseableHttpClient.execute(CloseableHttpClient.java:82)
   [junit4]   2> 	at org.apache.http.impl.client.CloseableHttpClient.execute(CloseableHttpClient.java:55)
   [junit4]   2> 	at org.apache.solr.client.solrj.impl.HttpSolrClient.executeMethod(HttpSolrClient.java:515)
   [junit4]   2> 	... 12 more
   [junit4]   2> 1194324 ERROR (OverseerThreadFactory-4852-thread-3-processing-n:127.0.0.1:40190_solr) [n:127.0.0.1:40190_solr    ] o.a.s.c.OverseerCollectionMessageHandler Cleaning up collection [solrj_replicatests].
   [junit4]   2> 1194324 INFO  (OverseerThreadFactory-4852-thread-3-processing-n:127.0.0.1:40190_solr) [n:127.0.0.1:40190_solr    ] o.a.s.c.OverseerCollectionMessageHandler Executing Collection Cmd : action=UNLOAD&deleteInstanceDir=true&deleteDataDir=true
   [junit4]   2> 1224356 INFO  (zkCallback-1736-thread-3-processing-n:127.0.0.1:40190_solr) [n:127.0.0.1:40190_solr    ] o.a.s.c.c.ZkStateReader A cluster state change: [WatchedEvent state:SyncConnected type:NodeDeleted path:/collections/solrj_replicatests/state.json] for collection [solrj_replicatests] has occurred - updating... (live nodes size: [4])
   [junit4]   2> 1224356 INFO  (zkCallback-1739-thread-2-processing-n:127.0.0.1:37489_solr) [n:127.0.0.1:37489_solr    ] o.a.s.c.c.ZkStateReader A cluster state change: [WatchedEvent state:SyncConnected type:NodeDeleted path:/collections/solrj_replicatests/state.json] for collection [solrj_replicatests] has occurred - updating... (live nodes size: [4])
   [junit4]   2> 1224357 ERROR (OverseerThreadFactory-4852-thread-3-processing-n:127.0.0.1:40190_solr) [n:127.0.0.1:40190_solr    ] o.a.s.c.OverseerCollectionMessageHandler Collection: solrj_replicatests operation: create failed:org.apache.solr.common.SolrException: Could not fully remove collection: solrj_replicatests
   [junit4]   2> 	at org.apache.solr.cloud.DeleteCollectionCmd.call(DeleteCollectionCmd.java:99)
   [junit4]   2> 	at org.apache.solr.cloud.OverseerCollectionMessageHandler.cleanupCollection(OverseerCollectionMessageHandler.java:694)
   [junit4]   2> 	at org.apache.solr.cloud.CreateCollectionCmd.call(CreateCollectionCmd.java:276)
   [junit4]   2> 	at org.apache.solr.cloud.OverseerCollectionMessageHandler.processMessage(OverseerCollectionMessageHandler.java:224)
   [junit4]   2> 	at org.apache.solr.cloud.OverseerTaskProcessor$Runner.run(OverseerTaskProcessor.java:463)
   [junit4]   2> 	at org.apache.solr.common.util.ExecutorUtil$MDCAwareThreadPoolExecutor.lambda$execute$0(ExecutorUtil.java:229)
   [junit4]   2> 	at java.util.concurrent.ThreadPoolExecutor.runWorker(ThreadPoolExecutor.java:1142)
   [junit4]   2> 	at java.util.concurrent.ThreadPoolExecutor$Worker.run(ThreadPoolExecutor.java:617)
   [junit4]   2> 	at java.lang.Thread.run(Thread.java:745)
   [junit4]   2> 
   [junit4]   2> 1224360 INFO  (OverseerStateUpdate-97226433314226185-127.0.0.1:40190_solr-n_0000000000) [n:127.0.0.1:40190_solr    ] o.a.s.c.Overseer Overseer Loop exiting : 127.0.0.1:40190_solr
   [junit4]   2> 1224360 INFO  (qtp1984148991-9986) [n:127.0.0.1:46218_solr    ] o.a.s.s.HttpSolrCall [admin] webapp=null path=/admin/collections params={replicationFactor=2&collection.configName=conf&name=solrj_replicatests&action=CREATE&numShards=1&wt=javabin&version=2} status=500 QTime=120280
   [junit4]   2> 1224360 WARN  (OverseerExitThread) [n:127.0.0.1:40190_solr    ] o.a.s.c.Overseer I'm exiting, but I'm still the leader
   [junit4]   2> 1224360 ERROR (qtp1984148991-9986) [n:127.0.0.1:46218_solr    ] o.a.s.s.HttpSolrCall null:org.apache.solr.common.SolrException: Could not fully remove collection: solrj_replicatests
   [junit4]   2> 	at org.apache.solr.handler.admin.CollectionsHandler.handleResponse(CollectionsHandler.java:287)
   [junit4]   2> 	at org.apache.solr.handler.admin.CollectionsHandler.handleRequestBody(CollectionsHandler.java:218)
   [junit4]   2> 	at org.apache.solr.handler.RequestHandlerBase.handleRequest(RequestHandlerBase.java:166)
   [junit4]   2> 	at org.apache.solr.servlet.HttpSolrCall.handleAdminRequest(HttpSolrCall.java:664)
   [junit4]   2> 	at org.apache.solr.servlet.HttpSolrCall.call(HttpSolrCall.java:445)
   [junit4]   2> 	at org.apache.solr.servlet.SolrDispatchFilter.doFilter(SolrDispatchFilter.java:345)
   [junit4]   2> 	at org.apache.solr.servlet.SolrDispatchFilter.doFilter(SolrDispatchFilter.java:296)
   [junit4]   2> 	at org.eclipse.jetty.servlet.ServletHandler$CachedChain.doFilter(ServletHandler.java:1699)
   [junit4]   2> 	at org.apache.solr.client.solrj.embedded.JettySolrRunner$DebugFilter.doFilter(JettySolrRunner.java:110)
   [junit4]   2> 	at org.eclipse.jetty.servlet.ServletHandler$CachedChain.doFilter(ServletHandler.java:1699)
   [junit4]   2> 	at org.eclipse.jetty.servlet.ServletHandler.doHandle(ServletHandler.java:582)
   [junit4]   2> 	at org.eclipse.jetty.server.session.SessionHandler.doHandle(SessionHandler.java:224)
   [junit4]   2> 	at org.eclipse.jetty.server.handler.ContextHandler.doHandle(ContextHandler.java:1180)
   [junit4]   2> 	at org.eclipse.jetty.servlet.ServletHandler.doScope(ServletHandler.java:512)
   [junit4]   2> 	at org.eclipse.jetty.server.session.SessionHandler.doScope(SessionHandler.java:185)
   [junit4]   2> 	at org.eclipse.jetty.server.handler.ContextHandler.doScope(ContextHandler.java:1112)
   [junit4]   2> 	at org.eclipse.jetty.server.handler.ScopedHandler.handle(ScopedHandler.java:141)
   [junit4]   2> 	at org.eclipse.jetty.server.handler.gzip.GzipHandler.handle(GzipHandler.java:462)
   [junit4]   2> 	at org.eclipse.jetty.server.handler.HandlerWrapper.handle(HandlerWrapper.java:134)
   [junit4]   2> 	at org.eclipse.jetty.server.Server.handle(Server.java:534)
   [junit4]   2> 	at org.eclipse.jetty.server.HttpChannel.handle(HttpChannel.java:320)
   [junit4]   2> 	at org.eclipse.jetty.server.HttpConnection.onFillable(HttpConnection.java:251)
   [junit4]   2> 	at org.eclipse.jetty.io.AbstractConnection$ReadCallback.succeeded(AbstractConnection.java:273)
   [junit4]   2> 	at org.eclipse.jetty.io.FillInterest.fillable(FillInterest.java:95)
   [junit4]   2> 	at org.eclipse.jetty.io.ssl.SslConnection.onFillable(SslConnection.java:202)
   [junit4]   2> 	at org.eclipse.jetty.io.AbstractConnection$ReadCallback.succeeded(AbstractConnection.java:273)
   [junit4]   2> 	at org.eclipse.jetty.io.FillInterest.fillable(FillInterest.java:95)
   [junit4]   2> 	at org.eclipse.jetty.io.SelectChannelEndPoint$2.run(SelectChannelEndPoint.java:93)
   [junit4]   2> 	at org.eclipse.jetty.util.thread.strategy.ExecuteProduceConsume.executeProduceConsume(ExecuteProduceConsume.java:303)
   [junit4]   2> 	at org.eclipse.jetty.util.thread.strategy.ExecuteProduceConsume.produceConsume(ExecuteProduceConsume.java:148)
   [junit4]   2> 	at org.eclipse.jetty.util.thread.strategy.ExecuteProduceConsume.run(ExecuteProduceConsume.java:136)
   [junit4]   2> 	at org.eclipse.jetty.util.thread.QueuedThreadPool.runJob(QueuedThreadPool.java:671)
   [junit4]   2> 	at org.eclipse.jetty.util.thread.QueuedThreadPool$2.run(QueuedThreadPool.java:589)
   [junit4]   2> 	at java.lang.Thread.run(Thread.java:745)
   [junit4]   2> 
   [junit4]   2> 1224361 INFO  (OverseerExitThread) [n:127.0.0.1:40190_solr    ] o.a.s.c.Overseer Overseer (id=97226433314226185-127.0.0.1:40190_solr-n_0000000000) closing
   [junit4]   2> 1224362 INFO  (zkCallback-1739-thread-2-processing-n:127.0.0.1:37489_solr) [n:127.0.0.1:37489_solr    ] o.a.s.c.OverseerElectionContext I am going to be the leader 127.0.0.1:37489_solr
   [junit4]   2> 1224362 INFO  (TEST-CollectionsAPISolrJTest.testAddAndDeleteReplica-seed#[3176EEA35D335595]) [    ] o.a.s.SolrTestCaseJ4 ###Ending testAddAndDeleteReplica
   [junit4]   2> 1224363 INFO  (zkCallback-1739-thread-2-processing-n:127.0.0.1:37489_solr) [n:127.0.0.1:37489_solr    ] o.a.s.c.Overseer Overseer (id=97226433314226188-127.0.0.1:37489_solr-n_0000000001) starting
   [junit4]   2> NOTE: reproduce with: ant test  -Dtestcase=CollectionsAPISolrJTest -Dtests.method=testAddAndDeleteReplica -Dtests.seed=3176EEA35D335595 -Dtests.multiplier=3 -Dtests.slow=true -Dtests.locale=tr-TR -Dtests.timezone=Africa/Malabo -Dtests.asserts=true -Dtests.file.encoding=US-ASCII
   [junit4] ERROR    120s J1 | CollectionsAPISolrJTest.testAddAndDeleteReplica <<<
   [junit4]    > Throwable #1: org.apache.solr.client.solrj.impl.HttpSolrClient$RemoteSolrException: Error from server at https://127.0.0.1:46218/solr: Could not fully remove collection: solrj_replicatests
   [junit4]    > 	at __randomizedtesting.SeedInfo.seed([3176EEA35D335595:DFC697F65AFF422F]:0)
   [junit4]    > 	at org.apache.solr.client.solrj.impl.HttpSolrClient.executeMethod(HttpSolrClient.java:610)
   [junit4]    > 	at org.apache.solr.client.solrj.impl.HttpSolrClient.request(HttpSolrClient.java:279)
   [junit4]    > 	at org.apache.solr.client.solrj.impl.HttpSolrClient.request(HttpSolrClient.java:268)
   [junit4]    > 	at org.apache.solr.client.solrj.impl.LBHttpSolrClient.doRequest(LBHttpSolrClient.java:435)
   [junit4]    > 	at org.apache.solr.client.solrj.impl.LBHttpSolrClient.request(LBHttpSolrClient.java:387)
   [junit4]    > 	at org.apache.solr.client.solrj.impl.CloudSolrClient.sendRequest(CloudSolrClient.java:1344)
   [junit4]    > 	at org.apache.solr.client.solrj.impl.CloudSolrClient.requestWithRetryOnStaleState(CloudSolrClient.java:1095)
   [junit4]    > 	at org.apache.solr.client.solrj.impl.CloudSolrClient.request(CloudSolrClient.java:1037)
   [junit4]    > 	at org.apache.solr.client.solrj.SolrRequest.process(SolrRequest.java:149)
   [junit4]    > 	at org.apache.solr.client.solrj.SolrRequest.process(SolrRequest.java:166)
   [junit4]    > 	at org.apache.solr.cloud.CollectionsAPISolrJTest.testAddAndDeleteReplica(CollectionsAPISolrJTest.java:210)
   [junit4]    > 	at java.lang.Thread.run(Thread.java:745)
   [junit4]   2> 1224383 INFO  (TEST-CollectionsAPISolrJTest.testCreateAndDeleteCollection-seed#[3176EEA35D335595]) [    ] o.a.s.SolrTestCaseJ4 ###Starting testCreateAndDeleteCollection
   [junit4]   2> 1224385 INFO  (qtp1984148991-9982) [n:127.0.0.1:46218_solr    ] o.a.s.h.a.CollectionsHandler Invoked Collection Action :create with params replicationFactor=2&collection.configName=conf&name=solrj_test&action=CREATE&numShards=2&stateFormat=1&wt=javabin&version=2 and sendToOCPQueue=true
   [junit4]   2> 1224386 INFO  (OverseerThreadFactory-4862-thread-1-processing-n:127.0.0.1:37489_solr) [n:127.0.0.1:37489_solr    ] o.a.s.c.CreateCollectionCmd Create collection solrj_test
   [junit4]   2> 1224592 INFO  (qtp899330898-9987) [n:127.0.0.1:40190_solr    ] o.a.s.h.a.CoreAdminOperation core create command qt=/admin/cores&collection.configName=conf&newCollection=true&name=solrj_test_shard1_replica2&action=CREATE&numShards=2&collection=solrj_test&shard=shard1&wt=javabin&version=2
   [junit4]   2> 1224592 INFO  (qtp1984148991-9986) [n:127.0.0.1:46218_solr    ] o.a.s.h.a.CoreAdminOperation core create command qt=/admin/cores&collection.configName=conf&newCollection=true&name=solrj_test_shard2_replica2&action=CREATE&numShards=2&collection=solrj_test&shard=shard2&wt=javabin&version=2
   [junit4]   2> 1224592 INFO  (qtp1429873541-9963) [n:127.0.0.1:37489_solr    ] o.a.s.h.a.CoreAdminOperation core create command qt=/admin/cores&collection.configName=conf&newCollection=true&name=solrj_test_shard2_replica1&action=CREATE&numShards=2&collection=solrj_test&shard=shard2&wt=javabin&version=2
   [junit4]   2> 1224649 INFO  (qtp1607714764-9964) [n:127.0.0.1:44651_solr    ] o.a.s.h.a.CoreAdminOperation core create command qt=/admin/cores&collection.configName=conf&newCollection=true&name=solrj_test_shard1_replica1&action=CREATE&numShards=2&collection=solrj_test&shard=shard1&wt=javabin&version=2
   [junit4]   2> 1225600 INFO  (qtp1429873541-9963) [n:127.0.0.1:37489_solr c:solrj_test s:shard2  x:solrj_test_shard2_replica1] o.a.s.c.SolrConfig Using Lucene MatchVersion: 6.4.0
   [junit4]   2> 1225600 INFO  (qtp899330898-9987) [n:127.0.0.1:40190_solr c:solrj_test s:shard1  x:solrj_test_shard1_replica2] o.a.s.c.SolrConfig Using Lucene MatchVersion: 6.4.0
   [junit4]   2> 1225601 INFO  (qtp1984148991-9986) [n:127.0.0.1:46218_solr c:solrj_test s:shard2  x:solrj_test_shard2_replica2] o.a.s.c.SolrConfig Using Lucene MatchVersion: 6.4.0
   [junit4]   2> 1225618 INFO  (qtp899330898-9987) [n:127.0.0.1:40190_solr c:solrj_test s:shard1  x:solrj_test_shard1_replica2] o.a.s.s.IndexSchema [solrj_test_shard1_replica2] Schema name=minimal
   [junit4]   2> 1225619 INFO  (qtp1429873541-9963) [n:127.0.0.1:37489_solr c:solrj_test s:shard2  x:solrj_test_shard2_replica1] o.a.s.s.IndexSchema [solrj_test_shard2_replica1] Schema name=minimal
   [junit4]   2> 1225620 INFO  (qtp1984148991-9986) [n:127.0.0.1:46218_solr c:solrj_test s:shard2  x:solrj_test_shard2_replica2] o.a.s.s.IndexSchema [solrj_test_shard2_replica2] Schema name=minimal
   [junit4]   2> 1225620 INFO  (qtp899330898-9987) [n:127.0.0.1:40190_solr c:solrj_test s:shard1  x:solrj_test_shard1_replica2] o.a.s.s.IndexSchema Loaded schema minimal/1.1 with uniqueid field id
   [junit4]   2> 1225621 INFO  (qtp899330898-9987) [n:127.0.0.1:40190_solr c:solrj_test s:shard1  x:solrj_test_shard1_replica2] o.a.s.c.CoreContainer Creating SolrCore 'solrj_test_shard1_replica2' using configuration from collection solrj_test
   [junit4]   2> 1225622 INFO  (qtp899330898-9987) [n:127.0.0.1:40190_solr c:solrj_test s:shard1  x:solrj_test_shard1_replica2] o.a.s.c.SolrCore [[solrj_test_shard1_replica2] ] Opening new SolrCore at [/home/jenkins/workspace/Lucene-Solr-6.x-Linux/solr/build/solr-core/test/J1/temp/solr.cloud.CollectionsAPISolrJTest_3176EEA35D335595-001/tempDir-001/node4/solrj_test_shard1_replica2], dataDir=[/home/jenkins/workspace/Lucene-Solr-6.x-Linux/solr/build/solr-core/test/J1/temp/solr.cloud.CollectionsAPISolrJTest_3176EEA35D335595-001/tempDir-001/node4/./solrj_test_shard1_replica2/data/]
   [junit4]   2> 1225622 INFO  (qtp1429873541-9963) [n:127.0.0.1:37489_solr c:solrj_test s:shard2  x:solrj_test_shard2_replica1] o.a.s.s.IndexSchema Loaded schema minimal/1.1 with uniqueid field id
   [junit4]   2> 1225623 INFO  (qtp1984148991-9986) [n:127.0.0.1:46218_solr c:solrj_test s:shard2  x:solrj_test_shard2_replica2] o.a.s.s.IndexSchema Loaded schema minimal/1.1 with uniqueid field id
   [junit4]   2> 1225623 INFO  (qtp1429873541-9963) [n:127.0.0.1:37489_solr c:solrj_test s:shard2  x:solrj_test_shard2_replica1] o.a.s.c.CoreContainer Creating SolrCore 'solrj_test_shard2_replica1' using configuration from collection solrj_test
   [junit4]   2> 1225623 INFO  (qtp1429873541-9963) [n:127.0.0.1:37489_solr c:solrj_test s:shard2  x:solrj_test_shard2_replica1] o.a.s.c.SolrCore [[solrj_test_shard2_replica1] ] Opening new SolrCore at [/home/jenkins/workspace/Lucene-Solr-6.x-Linux/solr/build/solr-core/test/J1/temp/solr.cloud.CollectionsAPISolrJTest_3176EEA35D335595-001/tempDir-001/node1/solrj_test_shard2_replica1], dataDir=[/home/jenkins/workspace/Lucene-Solr-6.x-Linux/solr/build/solr-core/test/J1/temp/solr.cloud.CollectionsAPISolrJTest_3176EEA35D335595-001/tempDir-001/node1/./solrj_test_shard2_replica1/data/]
   [junit4]   2> 1225624 INFO  (qtp1984148991-9986) [n:127.0.0.1:46218_solr c:solrj_test s:shard2  x:solrj_test_shard2_replica2] o.a.s.c.CoreContainer Creating SolrCore 'solrj_test_shard2_replica2' using configuration from collection solrj_test
   [junit4]   2> 1225624 INFO  (qtp1984148991-9986) [n:127.0.0.1:46218_solr c:solrj_test s:shard2  x:solrj_test_shard2_replica2] o.a.s.c.SolrCore [[solrj_test_shard2_replica2] ] Opening new SolrCore at [/home/jenkins/workspace/Lucene-Solr-6.x-Linux/solr/build/solr-core/test/J1/temp/solr.cloud.CollectionsAPISolrJTest_3176EEA35D335595-001/tempDir-001/node2/solrj_test_shard2_replica2], dataDir=[/home/jenkins/workspace/Lucene-Solr-6.x-Linux/solr/build/solr-core/test/J1/temp/solr.cloud.CollectionsAPISolrJTest_3176EEA35D335595-001/tempDir-001/node2/./solrj_test_shard2_replica2/data/]
   [junit4]   2> 1225633 INFO  (qtp899330898-9987) [n:127.0.0.1:40190_solr c:solrj_test s:shard1  x:solrj_test_shard1_replica2] o.a.s.u.UpdateHandler Using UpdateLog implementation: org.apache.solr.update.UpdateLog
   [junit4]   2> 1225633 INFO  (qtp899330898-9987) [n:127.0.0.1:40190_solr c:solrj_test s:shard1  x:solrj_test_shard1_replica2] o.a.s.u.UpdateLog Initializing UpdateLog: dataDir=null defaultSyncLevel=FLUSH numRecordsToKeep=100 maxNumLogsToKeep=10 numVersionBuckets=65536
   [junit4]   2> 1225634 INFO  (qtp899330898-9987) [n:127.0.0.1:40190_solr c:solrj_test s:shard1  x:solrj_test_shard1_replica2] o.a.s.u.CommitTracker Hard AutoCommit: disabled
   [junit4]   2> 1225634 INFO  (qtp899330898-9987) [n:127.0.0.1:40190_solr c:solrj_test s:shard1  x:solrj_test_shard1_replica2] o.a.s.u.CommitTracker Soft AutoCommit: disabled
   [junit4]   2> 1225634 INFO  (qtp899330898-9987) [n:127.0.0.1:40190_solr c:solrj_test s:shard1  x:solrj_test_shard1_replica2] o.a.s.s.SolrIndexSearcher Opening [Searcher@26120b60[solrj_test_shard1_replica2] main]
   [junit4]   2> 1225635 INFO  (qtp899330898-9987) [n:127.0.0.1:40190_solr c:solrj_test s:shard1  x:solrj_test_shard1_replica2] o.a.s.r.ManagedResourceStorage Configured ZooKeeperStorageIO with znodeBase: /configs/conf
   [junit4]   2> 1225635 INFO  (qtp899330898-9987) [n:127.0.0.1:40190_solr c:solrj_test s:shard1  x:solrj_test_shard1_replica2] o.a.s.r.ManagedResourceStorage Loaded null at path _rest_managed.json using ZooKeeperStorageIO:path=/configs/conf
   [junit4]   2> 1225635 INFO  (qtp899330898-9987) [n:127.0.0.1:40190_solr c:solrj_test s:shard1  x:solrj_test_shard1_replica2] o.a.s.h.ReplicationHandler Commits will be reserved for  10000
   [junit4]   2> 1225635 INFO  (searcherExecutor-4863-thread-1-processing-n:127.0.0.1:40190_solr x:solrj_test_shard1_replica2 s:shard1 c:solrj_test) [n:127.0.0.1:40190_solr c:solrj_test s:shard1  x:solrj_test_shard1_replica2] o.a.s.c.SolrCore [solrj_test_shard1_replica2] Registered new searcher Searcher@26120b60[solrj_test_shard1_replica2] main{ExitableDirectoryReader(UninvertingDirectoryReader())}
   [junit4]   2> 1225635 INFO  (qtp899330898-9987) [n:127.0.0.1:40190_solr c:solrj_test s:shard1  x:solrj_test_shard1_replica2] o.a.s.u.UpdateLog Could not find max version in index or recent updates, using new clock 1555623062110470144
   [junit4]   2> 1225638 INFO  (qtp1429873541-9963) [n:127.0.0.1:37489_solr c:solrj_test s:shard2  x:solrj_test_shard2_replica1] o.a.s.u.UpdateHandler Using UpdateLog implementation: org.apache.solr.update.UpdateLog
   [junit4]   2> 1225638 INFO  (qtp1429873541-9963) [n:127.0.0.1:37489_solr c:solrj_test s:shard2  x:solrj_test_shard2_replica1] o.a.s.u.UpdateLog Initializing UpdateLog: dataDir=null defaultSyncLevel=FLUSH numRecordsToKeep=100 maxNumLogsToKeep=10 numVersionBuckets=65536
   [junit4]   2> 1225638 INFO  (qtp1984148991-9986) [n:127.0.0.1:46218_solr c:solrj_test s:shard2  x:solrj_test_shard2_replica2] o.a.s.u.UpdateHandler Using UpdateLog implementation: org.apache.solr.update.UpdateLog
   [junit4]   2> 1225638 INFO  (qtp1984148991-9986) [n:127.0.0.1:46218_solr c:solrj_test s:shard2  x:solrj_test_shard2_replica2] o.a.s.u.UpdateLog Initializing UpdateLog: dataDir=null defaultSyncLevel=FLUSH numRecordsToKeep=100 maxNumLogsToKeep=10 numVersionBuckets=65536
   [junit4]   2> 1225639 INFO  (qtp1429873541-9963) [n:127.0.0.1:37489_solr c:solrj_test s:shard2  x:solrj_test_shard2_replica1] o.a.s.u.CommitTracker Hard AutoCommit: disabled
   [junit4]   2> 1225640 INFO  (qtp1429873541-9963) [n:127.0.0.1:37489_solr c:solrj_test s:shard2  x:solrj_test_shard2_replica1] o.a.s.u.CommitTracker Soft AutoCommit: disabled
   [junit4]   2> 1225640 INFO  (qtp1984148991-9986) [n:127.0.0.1:46218_solr c:solrj_test s:shard2  x:solrj_test_shard2_replica2] o.a.s.u.CommitTracker Hard AutoCommit: disabled
   [junit4]   2> 1225640 INFO  (qtp1984148991-9986) [n:127.0.0.1:46218_solr c:solrj_test s:shard2  x:solrj_test_shard2_replica2] o.a.s.u.CommitTracker Soft AutoCommit: disabled
   [junit4]   2> 1225640 INFO  (qtp899330898-9987) [n:127.0.0.1:40190_solr c:solrj_test s:shard1  x:solrj_test_shard1_replica2] o.a.s.c.ShardLeaderElectionContext Waiting until we see more replicas up for shard shard1: total=2 found=1 timeoutin=9999ms
   [junit4]   2> 1225640 INFO  (qtp1429873541-9963) [n:127.0.0.1:37489_solr c:solrj_test s:shard2  x:solrj_test_shard2_replica1] o.a.s.s.SolrIndexSearcher Opening [Searcher@288b9f48[solrj_test_shard2_replica1] main]
   [junit4]   2> 1225640 INFO  (qtp1984148991-9986) [n:127.0.0.1:46218_solr c:solrj_test s:shard2  x:solrj_test_shard2_replica2] o.a.s.s.SolrIndexSearcher Opening [Searcher@632ab67f[solrj_test_shard2_replica2] main]
   [junit4]   2> 1225641 INFO  (qtp1429873541-9963) [n:127.0.0.1:37489_solr c:solrj_test s:shard2  x:solrj_test_shard2_replica1] o.a.s.r.ManagedResourceStorage Configured ZooKeeperStorageIO with znodeBase: /configs/conf
   [junit4]   2> 1225641 INFO  (qtp1984148991-9986) [n:127.0.0.1:46218_solr c:solrj_test s:shard2  x:solrj_test_shard2_replica2] o.a.s.r.ManagedResourceStorage Configured ZooKeeperStorageIO with znodeBase: /configs/conf
   [junit4]   2> 1225641 INFO  (qtp1429873541-9963) [n:127.0.0.1:37489_solr c:solrj_test s:shard2  x:solrj_test_shard2_replica1] o.a.s.r.ManagedResourceStorage Loaded null at path _rest_managed.json using ZooKeeperStorageIO:path=/configs/conf
   [junit4]   2> 1225641 INFO  (qtp1429873541-9963) [n:127.0.0.1:37489_solr c:solrj_test s:shard2  x:solrj_test_shard2_replica1] o.a.s.h.ReplicationHandler Commits will be reserved for  10000
   [junit4]   2> 1225641 INFO  (qtp1984148991-9986) [n:127.0.0.1:46218_solr c:solrj_test s:shard2  x:solrj_test_shard2_replica2] o.a.s.r.ManagedResourceStorage Loaded null at path _rest_managed.json using ZooKeeperStorageIO:path=/configs/conf
   [junit4]   2> 1225641 INFO  (qtp1984148991-9986) [n:127.0.0.1:46218_solr c:solrj_test s:shard2  x:solrj_test_shard2_replica2] o.a.s.h.ReplicationHandler Commits will be reserved for  10000
   [junit4]   2> 1225641 INFO  (searcherExecutor-4864-thread-1-processing-n:127.0.0.1:37489_solr x:solrj_test_shard2_replica1 s:shard2 c:solrj_test) [n:127.0.0.1:37489_solr c:solrj_test s:shard2  x:solrj_test_shard2_replica1] o.a.s.c.SolrCore [solrj_test_shard2_replica1] Registered new searcher Searcher@288b9f48[solrj_test_shard2_replica1] main{ExitableDirectoryReader(UninvertingDirectoryReader())}
   [junit4]   2> 1225642 INFO  (qtp1429873541-9963) [n:127.0.0.1:37489_solr c:solrj_test s:shard2  x:solrj_test_shard2_replica1] o.a.s.u.UpdateLog Could not find max version in index or recent updates, using new clock 1555623062117810176
   [junit4]   2> 1225642 INFO  (searcherExecutor-4865-thread-1-processing-n:127.0.0.1:46218_solr x:solrj_test_shard2_replica2 s:shard2 c:solrj_test) [n:127.0.0.1:46218_solr c:solrj_test s:shard2  x:solrj_test_shard2_replica2] o.a.s.c.SolrCore [solrj_test_shard2_replica2] Registered new searcher Searcher@632ab67f[solrj_test_shard2_replica2] main{ExitableDirectoryReader(UninvertingDirectoryReader())}
   [junit4]   2> 1225642 INFO  (qtp1984148991-9986) [n:127.0.0.1:46218_solr c:solrj_test s:shard2  x:solrj_test_shard2_replica2] o.a.s.u.UpdateLog Could not find max version in index or recent updates, using new clock 1555623062117810176
   [junit4]   2> 1225647 INFO  (qtp1429873541-9963) [n:127.0.0.1:37489_solr c:solrj_test s:shard2  x:solrj_test_shard2_replica1] o.a.s.c.ShardLeaderElectionContext Enough replicas found to continue.
   [junit4]   2> 1225647 INFO  (qtp1429873541-9963) [n:127.0.0.1:37489_solr c:solrj_test s:shard2  x:solrj_test_shard2_replica1] o.a.s.c.ShardLeaderElectionContext I may be the new leader - try and sync
   [junit4]   2> 1225647 INFO  (qtp1429873541-9963) [n:127.0.0.1:37489_solr c:solrj_test s:shard2  x:solrj_test_shard2_replica1] o.a.s.c.SyncStrategy Sync replicas to https://127.0.0.1:37489/solr/solrj_test_shard2_replica1/
   [junit4]   2> 1225647 INFO  (qtp1429873541-9963) [n:127.0.0.1:37489_solr c:solrj_test s:shard2  x:solrj_test_shard2_replica1] o.a.s.u.PeerSync PeerSync: core=solrj_test_shard2_replica1 url=https://127.0.0.1:37489/solr START replicas=[https://127.0.0.1:46218/solr/solrj_test_shard2_replica2/] nUpdates=100
   [junit4]   2> 1225647 INFO  (qtp1429873541-9963) [n:127.0.0.1:37489_solr c:solrj_test s:shard2  x:solrj_test_shard2_replica1] o.a.s.u.PeerSync PeerSync: core=solrj_test_shard2_replica1 url=https://127.0.0.1:37489/solr DONE.  We have no versions.  sync failed.
   [junit4]   2> 1225651 INFO  (qtp1984148991-10102) [n:127.0.0.1:46218_solr c:solrj_test s:shard2 r:core_node3 x:solrj_test_shard2_replica2] o.a.s.c.S.Request [solrj_test_shard2_replica2]  webapp=/solr path=/get params={distrib=false&qt=/get&fingerprint=false&getVersions=100&wt=javabin&version=2} status=0 QTime=1
   [junit4]   2> 1225652 INFO  (qtp1429873541-9963) [n:127.0.0.1:37489_solr c:solrj_test s:shard2  x:solrj_test_shard2_replica1] o.a.s.c.SyncStrategy Leader's attempt to sync with shard failed, moving to the next candidate
   [junit4]   2> 1225652 INFO  (qtp1429873541-9963) [n:127.0.0.1:37489_solr c:solrj_test s:shard2  x:solrj_test_shard2_replica1] o.a.s.c.ShardLeaderElectionContext We failed sync, but we have no versions - we can't sync in that case - we were active before, so become leader anyway
   [junit4]   2> 1225656 INFO  (qtp1429873541-9963) [n:127.0.0.1:37489_solr c:solrj_test s:shard2  x:solrj_test_shard2_replica1] o.a.s.c.ShardLeaderElectionContext I am the new leader: https://127.0.0.1:37489/solr/solrj_test_shard2_replica1/ shard2
   [junit4]   2> 1225657 INFO  (qtp1607714764-9964) [n:127.0.0.1:44651_solr c:solrj_test s:shard1  x:solrj_test_shard1_replica1] o.a.s.c.SolrConfig Using Lucene MatchVersion: 6.4.0
   [junit4]   2> 1225664 INFO  (qtp1607714764-9964) [n:127.0.0.1:44651_solr c:solrj_test s:shard1  x:solrj_test_shard1_replica1] o.a.s.s.IndexSchema [solrj_test_shard1_replica1] Schema name=minimal
   [junit4]   2> 1225666 INFO  (qtp1607714764-9964) [n:127.0.0.1:44651_solr c:solrj_test s:shard1  x:solrj_test_shard1_replica1] o.a.s.s.IndexSchema Loaded schema minimal/1.1 with uniqueid field id
   [junit4]   2> 1225667 INFO  (qtp1607714764-9964) [n:127.0.0.1:44651_solr c:solrj_test s:shard1  x:solrj_test_shard1_replica1] o.a.s.c.CoreContainer Creating SolrCore 'solrj_test_shard1_replica1' using configuration from collection solrj_test
   [junit4]   2> 1225667 INFO  (qtp1607714764-9964) [n:127.0.0.1:44651_solr c:solrj_test s:shard1  x:solrj_test_shard1_replica1] o.a.s.c.SolrCore [[solrj_test_shard1_replica1] ] Opening new SolrCore at [/home/jenkins/workspace/Lucene-Solr-6.x-Linux/solr/build/solr-core/test/J1/temp/solr.cloud.CollectionsAPISolrJTest_3176EEA35D335595-001/tempDir-001/node3/solrj_test_shard1_replica1], dataDir=[/home/jenkins/workspace/Lucene-Solr-6.x-Linux/solr/build/solr-core/test/J1/temp/solr.cloud.CollectionsAPISolrJTest_3176EEA35D335595-001/tempDir-001/node3/./solrj_test_shard1_replica1/data/]
   [junit4]   2> 1225678 INFO  (qtp1607714764-9964) [n:127.0.0.1:44651_solr c:solrj_test s:shard1  x:solrj_test_shard1_replica1] o.a.s.u.UpdateHandler Using UpdateLog implementation: org.apache.solr.update.UpdateLog
   [junit4]   2> 1225678 INFO  (qtp1607714764-9964) [n:127.0.0.1:44651_solr c:solrj_test s:shard1  x:solrj_test_shard1_replica1] o.a.s.u.UpdateLog Initializing UpdateLog: dataDir=null defaultSyncLevel=FLUSH numRecordsToKeep=100 maxNumLogsToKeep=10 numVersionBuckets=65536
   [junit4]   2> 1225679 INFO  (qtp1607714764-9964) [n:127.0.0.1:44651_solr c:solrj_test s:shard1  x:solrj_test_shard1_replica1] o.a.s.u.CommitTracker Hard AutoCommit: disabled
   [junit4]   2> 1225679 INFO  (qtp1607714764-9964) [n:127.0.0.1:44651_solr c:solrj_test s:shard1  x:solrj_test_shard1_replica1] o.a.s.u.CommitTracker Soft AutoCommit: disabled
   [junit4]   2> 1225679 INFO  (qtp1607714764-9964) [n:127.0.0.1:44651_solr c:solrj_test s:shard1  x:solrj_test_shard1_replica1] o.a.s.s.SolrIndexSearcher Opening [Searcher@60141f63[solrj_test_shard1_replica1] main]
   [junit4]   2> 1225680 INFO  (qtp1607714764-9964) [n:127.0.0.1:44651_solr c:solrj_test s:shard1  x:solrj_test_shard1_replica1] o.a.s.r.ManagedResourceStorage Configured ZooKeeperStorageIO with znodeBase: /configs/conf
   [junit4]   2> 1225680 INFO  (qtp1607714764-9964) [n:127.0.0.1:44651_solr c:solrj_test s:shard1  x:solrj_test_shard1_replica1] o.a.s.r.ManagedResourceStorage Loaded null at path _rest_managed.json using ZooKeeperStorageIO:path=/configs/conf
   [junit4]   2> 1225680 INFO  (qtp1607714764-9964) [n:127.0.0.1:44651_solr c:solrj_test s:shard1  x:solrj_test_shard1_replica1] o.a.s.h.ReplicationHandler Commits will be reserved for  10000
   [junit4]   2> 1225680 INFO  (searcherExecutor-4878-thread-1-processing-n:127.0.0.1:44651_solr x:solrj_test_shard1_replica1 s:shard1 c:solrj_test) [n:127.0.0.1:44651_solr c:solrj_test s:shard1  x:solrj_test_shard1_replica1] o.a.s.c.SolrCore [solrj_test_shard1_replica1] Registered new searcher Searcher@60141f63[solrj_test_shard1_replica1] main{ExitableDirectoryReader(UninvertingDirectoryReader())}
   [junit4]   2> 1225680 INFO  (qtp1607714764-9964) [n:127.0.0.1:44651_solr c:solrj_test s:shard1  x:solrj_test_shard1_replica1] o.a.s.u.UpdateLog Could not find max version in index or recent updates, using new clock 1555623062157656064
   [junit4]   2> 1225807 INFO  (qtp1429873541-9963) [n:127.0.0.1:37489_solr c:solrj_test s:shard2  x:solrj_test_shard2_replica1] o.a.s.c.ZkController I am the leader, no recovery necessary
   [junit4]   2> 1225809 INFO  (qtp1429873541-9963) [n:127.0.0.1:37489_solr c:solrj_test s:shard2  x:solrj_test_shard2_replica1] o.a.s.s.HttpSolrCall [admin] webapp=null path=/admin/cores params={qt=/admin/cores&collection.configName=conf&newCollection=true&name=solrj_test_shard2_replica1&action=CREATE&numShards=2&collection=solrj_test&shard=shard2&wt=javabin&version=2} status=0 QTime=1216
   [junit4]   2> 1226141 INFO  (qtp899330898-9987) [n:127.0.0.1:40190_solr c:solrj_test s:shard1  x:solrj_test_shard1_replica2] o.a.s.c.ShardLeaderElectionContext Enough replicas found to continue.
   [junit4]   2> 1226141 INFO  (qtp899330898-9987) [n:127.0.0.1:40190_solr c:solrj_test s:shard1  x:solrj_test_shard1_replica2] o.a.s.c.ShardLeaderElectionContext I may be the new leader - try and sync
   [junit4]   2> 1226141 INFO  (qtp899330898-9987) [n:127.0.0.1:40190_solr c:solrj_test s:shard1  x:solrj_test_shard1_replica2] o.a.s.c.SyncStrategy Sync replicas to https://127.0.0.1:40190/solr/solrj_test_shard1_replica2/
   [junit4]   2> 1226141 INFO  (qtp899330898-9987) [n:127.0.0.1:40190_solr c:solrj_test s:shard1  x:solrj_test_shard1_replica2] o.a.s.u.PeerSync PeerSync: core=solrj_test_shard1_replica2 url=https://127.0.0.1:40190/solr START replicas=[https://127.0.0.1:44651/solr/solrj_test_shard1_replica1/] nUpdates=100
   [junit4]   2> 1226141 INFO  (qtp899330898-9987) [n:127.0.0.1:40190_solr c:solrj_test s:shard1  x:solrj_test_shard1_replica2] o.a.s.u.PeerSync PeerSync: core=solrj_test_shard1_replica2 url=https://127.0.0.1:40190/solr DONE.  We have no versions.  sync failed.
   [junit4]   2> 1226145 INFO  (qtp1607714764-9985) [n:127.0.0.1:44651_solr c:solrj_test s:shard1 r:core_node4 x:solrj_test_shard1_replica1] o.a.s.c.S.Request [solrj_test_shard1_replica1]  webapp=/solr path=/get params={distrib=false&qt=/get&fingerprint=false&getVersions=100&wt=javabin&version=2} status=0 QTime=0
   [junit4]   2> 1226145 INFO  (qtp899330898-9987) [n:127.0.0.1:40190_solr c:solrj_test s:shard1  x:solrj_test_shard1_replica2] o.a.s.c.SyncStrategy Leader's attempt to sync with shard failed, moving to the next candidate
   [junit4]   2> 1226145 INFO  (qtp899330898-9987) [n:127.0.0.1:40190_solr c:solrj_test s:shard1  x:solrj_test_shard1_replica2] o.a.s.c.ShardLeaderElectionContext We failed sync, but we have no versions - we can't sync in that case - we were active before, so become leader anyway
   [junit4]   2> 1226146 INFO  (qtp899330898-9987) [n:127.0.0.1:40190_solr c:solrj_test s:shard1  x:solrj_test_shard1_replica2] o.a.s.c.ShardLeaderElectionContext I am the new leader: https://127.0.0.1:40190/solr/solrj_test_shard1_replica2/ shard1
   [junit4]   2> 1226297 INFO  (qtp899330898-9987) [n:127.0.0.1:40190_solr c:solrj_test s:shard1  x:solrj_test_shard1_replica2] o.a.s.c.ZkController I am the leader, no recovery necessary
   [junit4]   2> 1226302 INFO  (qtp899330898-9987) [n:127.0.0.1:40190_solr c:solrj_test s:shard1  x:solrj_test_shard1_replica2] o.a.s.s.HttpSolrCall [admin] webapp=null path=/admin/cores params={qt=/admin/cores&collection.configName=conf&newCollection=true&name=solrj_test_shard1_replica2&action=CREATE&numShards=2&collection=solrj_test&shard=shard1&wt=javabin&version=2} status=0 QTime=1709
   [junit4]   2> 1226647 INFO  (qtp1984148991-9986) [n:127.0.0.1:46218_solr c:solrj_test s:shard2  x:solrj_test_shard2_replica2] o.a.s.s.HttpSolrCall [admin] webapp=null path=/admin/cores params={qt=/admin/cores&collection.configName=conf&newCollection=true&name=solrj_test_shard2_replica2&action=CREATE&numShards=2&collection=solrj_test&shard=shard2&wt=javabin&version=2} status=0 QTime=2055
   [junit4]   2> 1226687 INFO  (qtp1607714764-9964) [n:127.0.0.1:44651_solr c:solrj_test s:shard1  x:solrj_test_shard1_replica1] o.a.s.s.HttpSolrCall [admin] webapp=null path=/admin/cores params={qt=/admin/cores&collection.configName=conf&newCollection=true&name=solrj_test_shard1_replica1&action=CREATE&numShards=2&collection=solrj_test&shard=shard1&wt=javabin&version=2} status=0 QTime=2037
   [junit4]   2> 1226689 INFO  (qtp1984148991-9982) [n:127.0.0.1:46218_solr    ] o.a.s.h.a.CollectionsHandler Wait for new collection to be active for at most 30 seconds. Check all shard replicas
   [junit4]   2> 1227689 INFO  (qtp1984148991-9982) [n:127.0.0.1:46218_solr    ] o.a.s.s.HttpSolrCall [admin] webapp=null path=/admin/collections params={replicationFactor=2&collection.configName=conf&name=solrj_test&action=CREATE&numShards=2&stateFormat=1&wt=javabin&version=2} status=0 QTime=3304
   [junit4]   2> 1227691 INFO  (qtp1984148991-9961) [n:127.0.0.1:46218_solr    ] o.a.s.h.a.CollectionsHandler Invoked Collection Action :delete with params name=solrj_test&action=DELETE&wt=javabin&version=2 and sendToOCPQueue=true
   [junit4]   2> 1227692 INFO  (OverseerThreadFactory-4862-thread-2-processing-n:127.0.0.1:37489_solr) [n:127.0.0.1:37489_solr    ] o.a.s.c.OverseerCollectionMessageHandler Executing Collection Cmd : action=UNLOAD&deleteInstanceDir=true&deleteDataDir=true
   [junit4]   2> 1227692 INFO  (OverseerCollectionConfigSetProcessor-97226433314226188-127.0.0.1:37489_solr-n_0000000001) [n:127.0.0.1:37489_solr    ] o.a.s.c.OverseerTaskQueue Response ZK path: /overseer/collection-queue-work/qnr-0000000006 doesn't exist.  Requestor may have disconnected from ZooKeeper
   [junit4]   2> 1227695 INFO  (qtp899330898-9993) [n:127.0.0.1:40190_solr    ] o.a.s.m.SolrMetricManager Closing metric reporters for: solr.core.solrj_test_shard1_replica2
   [junit4]   2> 1227695 INFO  (qtp1607714764-9989) [n:127.0.0.1:44651_solr    ] o.a.s.m.SolrMetricManager Closing metric reporters for: solr.core.solrj_test_shard1_replica1
   [junit4]   2> 1227695 INFO  (qtp899330898-9993) [n:127.0.0.1:40190_solr    ] o.a.s.c.SolrCore [solrj_test_shard1_replica2]  CLOSING SolrCore org.apache.solr.core.SolrCore@48b3c22c
   [junit4]   2> 1227695 INFO  (qtp1607714764-9989) [n:127.0.0.1:44651_solr    ] o.a.s.c.SolrCore [solrj_test_shard1_replica1]  CLOSING SolrCore org.apache.solr.core.SolrCore@76cdfd4
   [junit4]   2> 1227696 INFO  (qtp899330898-9993) [n:127.0.0.1:40190_solr    ] o.a.s.m.SolrMetricManager Closing metric reporters for: solr.core.solrj_test.shard1.replica2
   [junit4]   2> 1227696 INFO  (qtp1607714764-9989) [n:127.0.0.1:44651_solr    ] o.a.s.m.SolrMetricManager Closing metric reporters for: solr.core.solrj_test.shard1.replica1
   [junit4]   2> 1227696 INFO  (qtp1429873541-9988) [n:127.0.0.1:37489_solr    ] o.a.s.m.SolrMetricManager Closing metric reporters for: solr.core.solrj_test_shard2_replica1
   [junit4]   2> 1227696 INFO  (qtp1984148991-9970) [n:127.0.0.1:46218_solr    ] o.a.s.m.SolrMetricManager Closing metric reporters for: solr.core.solrj_test_shard2_replica2
   [junit4]   2> 1227696 INFO  (qtp1429873541-9988) [n:127.0.0.1:37489_solr    ] o.a.s.c.SolrCore [solrj_test_shard2_replica1]  CLOSING SolrCore org.apache.solr.core.SolrCore@5f6711da
   [junit4]   2> 1227696 INFO  (qtp1984148991-9970) [n:127.0.0.1:46218_solr    ] o.a.s.c.SolrCore [solrj_test_shard2_replica2]  CLOSING SolrCore org.apache.solr.core.SolrCore@5e6174b6
   [junit4]   2> 1227697 INFO  (qtp1429873541-9988) [n:127.0.0.1:37489_solr    ] o.a.s.m.SolrMetricManager Closing metric reporters for: solr.core.solrj_test.shard2.replica1
   [junit4]   2> 1227697 INFO  (qtp1984148991-9970) [n:127.0.0.1:46218_solr    ] o.a.s.m.SolrMetricManager Closing metric reporters for: solr.core.solrj_test.shard2.replica2
   [junit4]   2> 1227698 WARN  (zkCallback-1737-thread-2-processing-n:127.0.0.1:44651_solr) [n:127.0.0.1:44651_solr    ] o.a.s.c.LeaderElector 
   [junit4]   2> org.apache.solr.common.SolrException: SolrCore not found:solrj_test_shard1_replica1 in []
   [junit4]   2> 	at org.apache.solr.cloud.ShardLeaderElectionContext.runLeaderProcess(ElectionContext.java:292)
   [junit4]   2> 	at org.apache.solr.cloud.LeaderElector.runIamLeaderProcess(LeaderElector.java:170)
   [junit4]   2> 	at org.apache.solr.cloud.LeaderElector.checkIfIamLeader(LeaderElector.java:135)
   [junit4]   2> 	at org.apache.solr.cloud.LeaderElector.access$200(LeaderElector.java:56)
   [junit4]   2> 	at org.apache.solr.cloud.LeaderElector$ElectionWatcher.process(LeaderElector.java:348)
   [junit4]   2> 	at org.apache.solr.common.cloud.SolrZkClient$3.lambda$process$0(SolrZkClient.java:268)
   [junit4]   2> 	at java.util.concurrent.Executors$RunnableAdapter.call(Executors.java:511)
   [junit4]   2> 	at java.util.concurrent.FutureTask.run(FutureTask.java:266)
   [junit4]   2> 	at org.apache.solr.common.util.ExecutorUtil$MDCAwareThreadPoolExecutor.lambda$execute$0(ExecutorUtil.java:229)
   [junit4]   2> 	at java.util.concurrent.ThreadPoolExecutor.runWorker(ThreadPoolExecutor.java:1142)
   [junit4]   2> 	at java.util.concurrent.ThreadPoolExecutor$Worker.run(ThreadPoolExecutor.java:617)
   [junit4]   2> 	at java.lang.Thread.run(Thread.java:745)
   [junit4]   2> 1227698 INFO  (qtp1607714764-9989) [n:127.0.0.1:44651_solr    ] o.a.s.c.ShardLeaderElectionContextBase No version found for ephemeral leader parent node, won't remove previous leader registration.
   [junit4]   2> 1227699 INFO  (qtp899330898-9993) [n:127.0.0.1:40190_solr    ] o.a.s.s.HttpSolrCall [admin] webapp=null path=/admin/cores params={deleteInstanceDir=true&core=solrj_test_shard1_replica2&qt=/admin/cores&deleteDataDir=true&action=UNLOAD&wt=javabin&version=2} status=0 QTime=3
   [junit4]   2> 1227699 INFO  (qtp1984148991-9970) [n:127.0.0.1:46218_solr    ] o.a.s.c.ShardLeaderElectionContextBase No version found for ephemeral leader parent node, won't remove previous leader registration.
   [junit4]   2> 1227699 INFO  (qtp1607714764-9989) [n:127.0.0.1:44651_solr    ] o.a.s.s.HttpSolrCall [admin] webapp=null path=/admin/cores params={deleteInstanceDir=true&core=solrj_test_shard1_replica1&qt=/admin/cores&deleteDataDir=true&action=UNLOAD&wt=javabin&version=2} status=0 QTime=4
   [junit4]   2> 1227699 INFO  (qtp1984148991-9970) [n:127.0.0.1:46218_solr    ] o.a.s.s.HttpSolrCall [admin] webapp=null path=/admin/cores params={deleteInstanceDir=true&core=solrj_test_shard2_replica2&qt=/admin/cores&deleteDataDir=true&action=UNLOAD&wt=javabin&version=2} status=0 QTime=3
   [junit4]   2> 1227700 WARN  (zkCallback-1738-thread-2-processing-n:127.0.0.1:46218_solr) [n:127.0.0.1:46218_solr    ] o.a.s.c.LeaderElector Our node is no longer in line to be leader
   [junit4]   2> 1227700 INFO  (qtp1429873541-9988) [n:127.0.0.1:37489_solr    ] o.a.s.s.HttpSolrCall [admin] webapp=null path=/admin/cores params={deleteInstanceDir=true&core=solrj_test_shard2_replica1&qt=/admin/cores&deleteDataDir=true&action=UNLOAD&wt=javabin&version=2} status=0 QTime=3
   [junit4]   2> 1228402 INFO  (qtp1984148991-9961) [n:127.0.0.1:46218_solr    ] o.a.s.s.HttpSolrCall [admin] webapp=null path=/admin/collections params={name=solrj_test&action=DELETE&wt=javabin&version=2} status=0 QTime=711
   [junit4]   2> 1228405 INFO  (qtp1984148991-9975) [n:127.0.0.1:46218_solr    ] o.a.s.h.a.CollectionsHandler Invoked Collection Action :create with params replicationFactor=2&collection.configName=conf&name=solrj_newstateformat&action=CREATE&numShards=2&stateFormat=2&wt=javabin&version=2 and sendToOCPQueue=true
   [junit4]   2> 1228407 INFO  (OverseerThreadFactory-4862-thread-3-processing-n:127.0.0.1:37489_solr) [n:127.0.0.1:37489_solr    ] o.a.s.c.CreateCollectionCmd Create collection solrj_newstateformat
   [junit4]   2> 1228407 INFO  (OverseerCollectionConfigSetProcessor-97226433314226188-127.0.0.1:37489_solr-n_0000000001) [n:127.0.0.1:37489_solr    ] o.a.s.c.OverseerTaskQueue Response ZK path: /overseer/collection-queue-work/qnr-0000000008 doesn't exist.  Requestor may have disconnected from ZooKeeper
   [junit4]   2> 1228611 INFO  (qtp1607714764-9983) [n:127.0.0.1:44651_solr    ] o.a.s.h.a.CoreAdminOperation core create command qt=/admin/cores&collection.configName=conf&newCollection=true&name=solrj_newstateformat_shard2_replica1&action=CREATE&numShards=2&collection=solrj_newstateformat&shard=shard2&wt=javabin&version=2
   [junit4]   2> 1228611 INFO  (qtp1429873541-9960) [n:127.0.0.1:37489_solr    ] o.a.s.h.a.CoreAdminOperation core create command qt=/admin/cores&collection.configName=conf&newCollection=true&name=solrj_newstateformat_shard2_replica2&action=CREATE&numShards=2&collection=solrj_newstateformat&shard=shard2&wt=javabin&version=2
   [junit4]   2> 1228611 INFO  (qtp1984148991-10102) [n:127.0.0.1:46218_solr    ] o.a.s.h.a.CoreAdminOperation core create command qt=/admin/cores&collection.configName=conf&newCollection=true&name=solrj_newstateformat_shard1_replica2&action=CREATE&numShards=2&collection=solrj_newstateformat&shard=shard1&wt=javabin&version=2
   [junit4]   2> 1228611 INFO  (qtp899330898-9967) [n:127.0.0.1:40190_solr    ] o.a.s.h.a.CoreAdminOperation core create command qt=/admin/cores&collection.configName=conf&newCollection=true&name=solrj_newstateformat_shard1_replica1&action=CREATE&numShards=2&collection=solrj_newstateformat&shard=shard1&wt=javabin&version=2
   [junit4]   2> 1228716 INFO  (zkCallback-1739-thread-2-processing-n:127.0.0.1:37489_solr) [n:127.0.0.1:37489_solr    ] o.a.s.c.c.ZkStateReader A cluster state change: [WatchedEvent state:SyncConnected type:NodeDataChanged path:/collections/solrj_newstateformat/state.json] for collection [solrj_newstateformat] has occurred - updating... (live nodes size: [4])
   [junit4]   2> 1228716 INFO  (zkCallback-1738-thread-3-processing-n:127.0.0.1:46218_solr) [n:127.0.0.1:46218_solr    ] o.a.s.c.c.ZkStateReader A cluster state change: [WatchedEvent state:SyncConnected type:NodeDataChanged path:/collections/solrj_newstateformat/state.json] for collection [solrj_newstateformat] has occurred - updating... (live nodes size: [4])
   [junit4]   2> 1228716 INFO  (zkCallback-1736-thread-3-processing-n:127.0.0.1:40190_solr) [n:127.0.0.1:40190_solr    ] o.a.s.c.c.ZkStateReader A cluster state change: [WatchedEvent state:SyncConnected type:NodeDataChanged path:/collections/solrj_newstateformat/state.json] for collection [solrj_newstateformat] has occurred - updating... (live nodes size: [4])
   [junit4]   2> 1228716 INFO  (zkCallback-1737-thread-2-processing-n:127.0.0.1:44651_solr) [n:127.0.0.1:44651_solr    ] o.a.s.c.c.ZkStateReader A cluster state change: [WatchedEvent state:SyncConnected type:NodeDataChanged path:/collections/solrj_newstateformat/state.json] for collection [solrj_newstateformat] has occurred - updating... (live nodes size: [4])
   [junit4]   2> 1229619 INFO  (qtp1984148991-10102) [n:127.0.0.1:46218_solr c:solrj_newstateformat s:shard1  x:solrj_newstateformat_shard1_replica2] o.a.s.c.SolrConfig Using Lucene MatchVersion: 6.4.0
   [junit4]   2> 1229619 INFO  (qtp1607714764-9983) [n:127.0.0.1:44651_solr c:solrj_newstateformat s:shard2  x:solrj_newstateformat_shard2_replica1] o.a.s.c.SolrConfig Using Lucene MatchVersion: 6.4.0
   [junit4]   2> 1229620 INFO  (qtp899330898-9967) [n:127.0.0.1:40190_solr c:solrj_newstateformat s:shard1  x:solrj_newstateformat_shard1_replica1] o.a.s.c.SolrConfig Using Lucene MatchVersion: 6.4.0
   [junit4]   2> 1229620 INFO  (qtp1429873541-9960) [n:127.0.0.1:37489_solr c:solrj_newstateformat s:shard2  x:solrj_newstateformat_shard2_replica2] o.a.s.c.SolrConfig Using Lucene MatchVersion: 6.4.0
   [junit4]   2> 1229643 INFO  (qtp1607714764-9983) [n:127.0.0.1:44651_solr c:solrj_newstateformat s:shard2  x:solrj_newstateformat_shard2_replica1] o.a.s.s.IndexSchema [solrj_newstateformat_shard2_replica1] Schema name=minimal
   [junit4]   2> 1229643 INFO  (qtp1984148991-10102) [n:127.0.0.1:46218_solr c:solrj_newstateformat s:shard1  x:solrj_newstateformat_shard1_replica2] o.a.s.s.IndexSchema [solrj_newstateformat_shard1_replica2] Schema name=minimal
   [junit4]   2> 1229643 INFO  (qtp1429873541-9960) [n:127.0.0.1:37489_solr c:solrj_newstateformat s:shard2  x:solrj_newstateformat_shard2_replica2] o.a.s.s.IndexSchema [solrj_newstateformat_shard2_replica2] Schema name=minimal
   [junit4]   2> 1229645 INFO  (qtp899330898-9967) [n:127.0.0.1:40190_solr c:solrj_newstateformat s:shard1  x:solrj_newstateformat_shard1_replica1] o.a.s.s.IndexSchema [solrj_newstateformat_shard1_replica1] Schema name=minimal
   [junit4]   2> 1229645 INFO  (qtp1607714764-9983) [n:127.0.0.1:44651_solr c:solrj_newstateformat s:shard2  x:solrj_newstateformat_shard2_replica1] o.a.s.s.IndexSchema Loaded schema minimal/1.1 with uniqueid field id
   [junit4]   2> 1229646 INFO  (qtp1984148991-10102) [n:127.0.0.1:46218_solr c:solrj_newstateformat s:shard1  x:solrj_newstateformat_shard1_replica2] o.a.s.s.IndexSchema Loaded schema minimal/1.1 with uniqueid field id
   [junit4]   2> 1229646 INFO  (qtp1429873541-9960) [n:127.0.0.1:37489_solr c:solrj_newstateformat s:shard2  x:solrj_newstateformat_shard2_replica2] o.a.s.s.IndexSchema Loaded schema minimal/1.1 with uniqueid field id
   [junit4]   2> 1229647 INFO  (qtp1429873541-9960) [n:127.0.0.1:37489_solr c:solrj_newstateformat s:shard2  x:solrj_newstateformat_shard2_replica2] o.a.s.c.CoreContainer Creating SolrCore 'solrj_newstateformat_shard2_replica2' using configuration from collection solrj_newstateformat
   [junit4]   2> 1229647 INFO  (qtp1607714764-9983) [n:127.0.0.1:44651_solr c:solrj_newstateformat s:shard2  x:solrj_newstateformat_shard2_replica1] o.a.s.c.CoreContainer Creating SolrCore 'solrj_newstateformat_shard2_replica1' using configuration from collection solrj_newstateformat
   [junit4]   2> 1229647 INFO  (qtp1984148991-10102) [n:127.0.0.1:46218_solr c:solrj_newstateformat s:shard1  x:solrj_newstateformat_shard1_replica2] o.a.s.c.CoreContainer Creating SolrCore 'solrj_newstateformat_shard1_replica2' using configuration from collection solrj_newstateformat
   [junit4]   2> 1229647 INFO  (qtp1429873541-9960) [n:127.0.0.1:37489_solr c:solrj_newstateformat s:shard2  x:solrj_newstateformat_shard2_replica2] o.a.s.c.SolrCore [[solrj_newstateformat_shard2_replica2] ] Opening new SolrCore at [/home/jenkins/workspace/Lucene-Solr-6.x-Linux/solr/build/solr-core/test/J1/temp/solr.cloud.CollectionsAPISolrJTest_3176EEA35D335595-001/tempDir-001/node1/solrj_newstateformat_shard2_replica2], dataDir=[/home/jenkins/workspace/Lucene-Solr-6.x-Linux/solr/build/solr-core/test/J1/temp/solr.cloud.CollectionsAPISolrJTest_3176EEA35D335595-001/tempDir-001/node1/./solrj_newstateformat_shard2_replica2/data/]
   [junit4]   2> 1229647 INFO  (qtp1607714764-9983) [n:127.0.0.1:44651_solr c:solrj_newstateformat s:shard2  x:solrj_newstateformat_shard2_replica1] o.a.s.c.SolrCore [[solrj_newstateformat_shard2_replica1] ] Opening new SolrCore at [/home/jenkins/workspace/Lucene-Solr-6.x-Linux/solr/build/solr-core/test/J1/temp/solr.cloud.CollectionsAPISolrJTest_3176EEA35D335595-001/tempDir-001/node3/solrj_newstateformat_shard2_replica1], dataDir=[/home/jenkins/workspace/Lucene-Solr-6.x-Linux/solr/build/solr-core/test/J1/temp/solr.cloud.CollectionsAPISolrJTest_3176EEA35D335595-001/tempDir-001/node3/./solrj_newstateformat_shard2_replica1/data/]
   [junit4]   2> 1229647 INFO  (qtp1984148991-10102) [n:127.0.0.1:46218_solr c:solrj_newstateformat s:shard1  x:solrj_newstateformat_shard1_replica2] o.a.s.c.SolrCore [[solrj_newstateformat_shard1_replica2] ] Opening new SolrCore at [/home/jenkins/workspace/Lucene-Solr-6.x-Linux/solr/build/solr-core/test/J1/temp/solr.cloud.CollectionsAPISolrJTest_3176EEA35D335595-001/tempDir-001/node2/solrj_newstateformat_shard1_replica2], dataDir=[/home/jenkins/workspace/Lucene-Solr-6.x-Linux/solr/build/solr-core/test/J1/temp/solr.cloud.CollectionsAPISolrJTest_3176EEA35D335595-001/tempDir-001/node2/./solrj_newstateformat_shard1_replica2/data/]
   [junit4]   2> 1229648 INFO  (qtp899330898-9967) [n:127.0.0.1:40190_solr c:solrj_newstateformat s:shard1  x:solrj_newstateformat_shard1_replica1] o.a.s.s.IndexSchema Loaded schema minimal/1.1 with uniqueid field id
   [junit4]   2> 1229649 INFO  (qtp899330898-9967) [n:127.0.0.1:40190_solr c:solrj_newstateformat s:shard1  x:solrj_newstateformat_shard1_replica1] o.a.s.c.CoreContainer Creating SolrCore 'solrj_newstateformat_shard1_replica1' using configuration from collection solrj_newstateformat
   [junit4]   2> 1229649 INFO  (qtp899330898-9967) [n:127.0.0.1:40190_solr c:solrj_newstateformat s:shard1  x:solrj_newstateformat_shard1_replica1] o.a.s.c.SolrCore [[solrj_newstateformat_shard1_replica1] ] Opening new SolrCore at [/home/jenkins/workspace/Lucene-Solr-6.x-Linux/solr/build/solr-core/test/J1/temp/solr.cloud.CollectionsAPISolrJTest_3176EEA35D335595-001/tempDir-001/node4/solrj_newstateformat_shard1_replica1], dataDir=[/home/jenkins/workspace/Lucene-Solr-6.x-Linux/solr/build/solr-core/test/J1/temp/solr.cloud.CollectionsAPISolrJTest_3176EEA35D335595-001/tempDir-001/node4/./solrj_newstateformat_shard1_replica1/data/]
   [junit4]   2> 1229659 INFO  (qtp1607714764-9983) [n:127.0.0.1:44651_solr c:solrj_newstateformat s:shard2  x:solrj_newstateformat_shard2_replica1] o.a.s.u.UpdateHandler Using UpdateLog implementation: org.apache.solr.update.UpdateLog
   [junit4]   2> 1229660 INFO  (qtp1607714764-9983) [n:127.0.0.1:44651_solr c:solrj_newstateformat s:shard2  x:solrj_newstateformat_shard2_replica1] o.a.s.u.UpdateLog Initializing UpdateLog: dataDir=null defaultSyncLevel=FLUSH numRecordsToKeep=100 maxNumLogsToKeep=10 numVersionBuckets=65536
   [junit4]   2> 1229660 INFO  (qtp1607714764-9983) [n:127.0.0.1:44651_solr c:solrj_newstateformat s:shard2  x:solrj_newstateformat_shard2_replica1] o.a.s.u.CommitTracker Hard AutoCommit: disabled
   [junit4]   2> 1229660 INFO  (qtp1607714764-9983) [n:127.0.0.1:44651_solr c:solrj_newstateformat s:shard2  x:solrj_newstateformat_shard2_replica1] o.a.s.u.CommitTracker Soft AutoCommit: disabled
   [junit4]   2> 1229661 INFO  (qtp1607714764-9983) [n:127.0.0.1:44651_solr c:solrj_newstateformat s:shard2  x:solrj_newstateformat_shard2_replica1] o.a.s.s.SolrIndexSearcher Opening [Searcher@1cb08a48[solrj_newstateformat_shard2_replica1] main]
   [junit4]   2> 1229661 INFO  (qtp1429873541-9960) [n:127.0.0.1:37489_solr c:solrj_newstateformat s:shard2  x:solrj_newstateformat_shard2_replica2] o.a.s.u.UpdateHandler Using UpdateLog implementation: org.apache.solr.update.UpdateLog
   [junit4]   2> 1229661 INFO  (qtp1429873541-9960) [n:127.0.0.1:37489_solr c:solrj_newstateformat s:shard2  x:solrj_newstateformat_shard2_replica2] o.a.s.u.UpdateLog Initializing UpdateLog: dataDir=null defaultSyncLevel=FLUSH numRecordsToKeep=100 maxNumLogsToKeep=10 numVersionBuckets=65536
   [junit4]   2> 1229661 INFO  (qtp1607714764-9983) [n:127.0.0.1:44651_solr c:solrj_newstateformat s:shard2  x:solrj_newstateformat_shard2_replica1] o.a.s.r.ManagedResourceStorage Configured ZooKeeperStorageIO with znodeBase: /configs/conf
   [junit4]   2> 1229662 INFO  (qtp1607714764-9983) [n:127.0.0.1:44651_solr c:solrj_newstateformat s:shard2  x:solrj_newstateformat_shard2_replica1] o.a.s.r.ManagedResourceStorage Loaded null at path _rest_managed.json using ZooKeeperStorageIO:path=/configs/conf
   [junit4]   2> 1229662 INFO  (qtp1607714764-9983) [n:127.0.0.1:44651_solr c:solrj_newstateformat s:shard2  x:solrj_newstateformat_shard2_replica1] o.a.s.h.ReplicationHandler Commits will be reserved for  10000
   [junit4]   2> 1229662 INFO  (searcherExecutor-4884-thread-1-processing-n:127.0.0.1:44651_solr x:solrj_newstateformat_shard2_replica1 s:shard2 c:solrj_newstateformat) [n:127.0.0.1:44651_solr c:solrj_newstateformat s:shard2  x:solrj_newstateformat_shard2_replica1] o.a.s.c.SolrCore [solrj_newstateformat_shard2_replica1] Registered new searcher Searcher@1cb08a48[solrj_newstateformat_shard2_replica1] main{ExitableDirectoryReader(UninvertingDirectoryReader())}
   [junit4]   2> 1229662 INFO  (qtp1607714764-9983) [n:127.0.0.1:44651_solr c:solrj_newstateformat s:shard2  x:solrj_newstateformat_shard2_replica1] o.a.s.u.UpdateLog Could not find max version in index or recent updates, using new clock 1555623066333085696
   [junit4]   2> 1229662 INFO  (qtp1984148991-10102) [n:127.0.0.1:46218_solr c:solrj_newstateformat s:shard1  x:solrj_newstateformat_shard1_replica2] o.a.s.u.UpdateHandler Using UpdateLog implementation: org.apache.solr.update.UpdateLog
   [junit4]   2> 1229662 INFO  (qtp1984148991-10102) [n:127.0.0.1:46218_solr c:solrj_newstateformat s:shard1  x:solrj_newstateformat_shard1_replica2] o.a.s.u.UpdateLog Initializing UpdateLog: dataDir=null defaultSyncLevel=FLUSH numRecordsToKeep=100 maxNumLogsToKeep=10 numVersionBuckets=65536
   [junit4]   2> 1229663 INFO  (qtp1429873541-9960) [n:127.0.0.1:37489_solr c:solrj_newstateformat s:shard2  x:solrj_newstateformat_shard2_replica2] o.a.s.u.CommitTracker Hard AutoCommit: disabled
   [junit4]   2> 1229663 INFO  (qtp1429873541-9960) [n:127.0.0.1:37489_solr c:solrj_newstateformat s:shard2  x:solrj_newstateformat_shard2_replica2] o.a.s.u.CommitTracker Soft AutoCommit: disabled
   [junit4]   2> 1229663 INFO  (qtp1984148991-10102) [n:127.0.0.1:46218_solr c:solrj_newstateformat s:shard1  x:solrj_newstateformat_shard1_replica2] o.a.s.u.CommitTracker Hard AutoCommit: disabled
   [junit4]   2> 1229663 INFO  (qtp1984148991-10102) [n:127.0.0.1:46218_solr c:solrj_newstateformat s:shard1  x:solrj_newstateformat_shard1_replica2] o.a.s.u.CommitTracker Soft AutoCommit: disabled
   [junit4]   2> 1229663 INFO  (qtp1429873541-9960) [n:127.0.0.1:37489_solr c:solrj_newstateformat s:shard2  x:solrj_newstateformat_shard2_replica2] o.a.s.s.SolrIndexSearcher Opening [Searcher@20cb5440[solrj_newstateformat_shard2_replica2] main]
   [junit4]   2> 1229664 INFO  (qtp899330898-9967) [n:127.0.0.1:40190_solr c:solrj_newstateformat s:shard1  x:solrj_newstateformat_shard1_replica1] o.a.s.u.UpdateHandler Using UpdateLog implementation: org.apache.solr.update.UpdateLog
   [junit4]   2> 1229664 INFO  (qtp899330898-9967) [n:127.0.0.1:40190_solr c:solrj_newstateformat s:shard1  x:solrj_newstateformat_shard1_replica1] o.a.s.u.UpdateLog Initializing UpdateLog: dataDir=null defaultSyncLevel=FLUSH numRecordsToKeep=100 maxNumLogsToKeep=10 numVersionBuckets=65536
   [junit4]   2> 1229664 INFO  (qtp1984148991-10102) [n:127.0.0.1:46218_solr c:solrj_newstateformat s:shard1  x:solrj_newstateformat_shard1_replica2] o.a.s.s.SolrIndexSearcher Opening [Searcher@41bb1c50[s

[...truncated too long message...]

n(ExecuteProduceConsume.java:136)
   [junit4]   2> 	at org.eclipse.jetty.util.thread.QueuedThreadPool.runJob(QueuedThreadPool.java:671)
   [junit4]   2> 	at org.eclipse.jetty.util.thread.QueuedThreadPool$2.run(QueuedThreadPool.java:589)
   [junit4]   2> 	at java.lang.Thread.run(Thread.java:745)
   [junit4]   2> Caused by: org.apache.solr.common.SolrException: Unable to create core [solrj_replicatests_shard1_replica1]
   [junit4]   2> 	at org.apache.solr.core.CoreContainer.create(CoreContainer.java:903)
   [junit4]   2> 	at org.apache.solr.core.CoreContainer.create(CoreContainer.java:827)
   [junit4]   2> 	... 36 more
   [junit4]   2> Caused by: org.apache.solr.common.SolrException: Could not load collection from ZK: aliasedCollection
   [junit4]   2> 	at org.apache.solr.common.cloud.ZkStateReader.getCollectionLive(ZkStateReader.java:1098)
   [junit4]   2> 	at org.apache.solr.common.cloud.ZkStateReader$LazyCollectionRef.get(ZkStateReader.java:638)
   [junit4]   2> 	at org.apache.solr.common.cloud.ClusterState.getShardId(ClusterState.java:277)
   [junit4]   2> 	at org.apache.solr.cloud.ZkController.waitForShardId(ZkController.java:1329)
   [junit4]   2> 	at org.apache.solr.cloud.ZkController.doGetShardIdAndNodeNameProcess(ZkController.java:1287)
   [junit4]   2> 	at org.apache.solr.cloud.ZkController.preRegister(ZkController.java:1393)
   [junit4]   2> 	at org.apache.solr.core.CoreContainer.create(CoreContainer.java:885)
   [junit4]   2> 	... 37 more
   [junit4]   2> Caused by: org.apache.zookeeper.KeeperException$SessionExpiredException: KeeperErrorCode = Session expired for /collections/aliasedCollection/state.json
   [junit4]   2> 	at org.apache.zookeeper.KeeperException.create(KeeperException.java:127)
   [junit4]   2> 	at org.apache.zookeeper.KeeperException.create(KeeperException.java:51)
   [junit4]   2> 	at org.apache.zookeeper.ZooKeeper.getData(ZooKeeper.java:1155)
   [junit4]   2> 	at org.apache.solr.common.cloud.SolrZkClient$7.execute(SolrZkClient.java:356)
   [junit4]   2> 	at org.apache.solr.common.cloud.SolrZkClient$7.execute(SolrZkClient.java:353)
   [junit4]   2> 	at org.apache.solr.common.cloud.ZkCmdExecutor.retryOperation(ZkCmdExecutor.java:60)
   [junit4]   2> 	at org.apache.solr.common.cloud.SolrZkClient.getData(SolrZkClient.java:353)
   [junit4]   2> 	at org.apache.solr.common.cloud.ZkStateReader.fetchCollectionState(ZkStateReader.java:1110)
   [junit4]   2> 	at org.apache.solr.common.cloud.ZkStateReader.getCollectionLive(ZkStateReader.java:1096)
   [junit4]   2> 	... 43 more
   [junit4]   2> 
   [junit4]   2> 1280224 INFO  (qtp899330898-9962) [n:127.0.0.1:40190_solr c:solrj_replicatests s:shard1  x:solrj_replicatests_shard1_replica1] o.a.s.s.HttpSolrCall [admin] webapp=null path=/admin/cores params={qt=/admin/cores&collection.configName=conf&newCollection=true&name=solrj_replicatests_shard1_replica1&action=CREATE&numShards=1&collection=solrj_replicatests&shard=shard1&wt=javabin&version=2} status=400 QTime=175987
   [junit4]   2> 1280224 INFO  (SUITE-CollectionsAPISolrJTest-seed#[3176EEA35D335595]-worker) [    ] o.a.s.c.ZkTestServer connecting to 127.0.0.1:46164 46164
   [junit4]   2> 1280373 INFO  (Thread-2589) [    ] o.a.s.c.ZkTestServer connecting to 127.0.0.1:46164 46164
   [junit4]   2> 1280374 WARN  (Thread-2589) [    ] o.a.s.c.ZkTestServer Watch limit violations: 
   [junit4]   2> Maximum concurrent create/delete watches above limit:
   [junit4]   2> 
   [junit4]   2> 	8	/solr/configs/conf
   [junit4]   2> 	5	/solr/collections/solrj_test/state.json
   [junit4]   2> 	5	/solr/aliases.json
   [junit4]   2> 	4	/solr/security.json
   [junit4]   2> 
   [junit4]   2> Maximum concurrent data watches above limit:
   [junit4]   2> 
   [junit4]   2> 	7	/solr/collections/replicaProperties/state.json
   [junit4]   2> 	5	/solr/clusterprops.json
   [junit4]   2> 	5	/solr/collections/balancedProperties/state.json
   [junit4]   2> 	5	/solr/clusterstate.json
   [junit4]   2> 	5	/solr/collections/solrj_newstateformat/state.json
   [junit4]   2> 	3	/solr/overseer_elect/election/97226433314226188-127.0.0.1:37489_solr-n_0000000001
   [junit4]   2> 	3	/solr/collections/solrj_implicit/state.json
   [junit4]   2> 	3	/solr/collections/solrj_test_splitshard/state.json
   [junit4]   2> 	2	/solr/collections/solrj_replicatests/state.json
   [junit4]   2> 
   [junit4]   2> Maximum concurrent children watches above limit:
   [junit4]   2> 
   [junit4]   2> 	81	/solr/overseer/queue
   [junit4]   2> 	11	/solr/overseer/queue-work
   [junit4]   2> 	7	/solr/overseer/collection-queue-work
   [junit4]   2> 	5	/solr/live_nodes
   [junit4]   2> 	5	/solr/collections
   [junit4]   2> 
   [junit4]   2> 1280374 INFO  (SUITE-CollectionsAPISolrJTest-seed#[3176EEA35D335595]-worker) [    ] o.a.s.SolrTestCaseJ4 ###deleteCore
   [junit4]   2> NOTE: leaving temporary files on disk at: /home/jenkins/workspace/Lucene-Solr-6.x-Linux/solr/build/solr-core/test/J1/temp/solr.cloud.CollectionsAPISolrJTest_3176EEA35D335595-001
   [junit4]   2> NOTE: test params are: codec=Asserting(Lucene62): {}, docValues:{}, maxPointsInLeafNode=77, maxMBSortInHeap=5.470283308382744, sim=RandomSimilarity(queryNorm=true,coord=yes): {}, locale=tr-TR, timezone=Africa/Malabo
   [junit4]   2> NOTE: Linux 4.4.0-53-generic amd64/Oracle Corporation 1.8.0_112 (64-bit)/cpus=12,threads=1,free=168382088,total=517472256
   [junit4]   2> NOTE: All tests run in this JVM: [CachingDirectoryFactoryTest, TestLRUCache, TestFieldCacheWithThreads, MultiTermTest, CollectionReloadTest, TestQuerySenderListener, TestLockTree, ConfigSetsAPITest, TestDistributedGrouping, SolrGraphiteReporterTest, HdfsDirectoryTest, TestReqParamsAPI, TestSweetSpotSimilarityFactory, TestCollapseQParserPlugin, TestSurroundQueryParser, SegmentsInfoRequestHandlerTest, SortSpecParsingTest, ConvertedLegacyTest, AliasIntegrationTest, SpellingQueryConverterTest, TestFiltering, TestQueryUtils, TestLRUStatsCache, TestSimpleTrackingShardHandler, BlockJoinFacetRandomTest, HdfsRestartWhileUpdatingTest, TestTolerantUpdateProcessorRandomCloud, TestAuthorizationFramework, TestRTGBase, TestSolrDynamicMBean, TestUpdate, SolrInfoMBeanTest, TestJettySolrRunner, ZkControllerTest, CollectionsAPIAsyncDistributedZkTest, TestNumericTerms64, TestHashPartitioner, DistributedTermsComponentTest, TestReloadAndDeleteDocs, TestSubQueryTransformer, TestCollationFieldDocValues, InfoHandlerTest, RulesTest, DocumentBuilderTest, SliceStateTest, TestDFISimilarityFactory, TestSchemaSimilarityResource, OverseerCollectionConfigSetProcessorTest, TestManagedStopFilterFactory, IndexSchemaTest, ClassificationUpdateProcessorIntegrationTest, TestGraphTermsQParserPlugin, DistanceFunctionTest, VMParamsZkACLAndCredentialsProvidersTest, SpatialFilterTest, TestFieldTypeResource, TestCloudPivotFacet, TestStressVersions, TestTestInjection, DocValuesTest, TestLuceneMatchVersion, TestCSVResponseWriter, BooleanFieldTest, DistributedFacetPivotLongTailTest, TestSystemIdResolver, TestCursorMarkWithoutUniqueKey, TestSuggestSpellingConverter, DistributedSuggestComponentTest, TestSolrIndexConfig, TestFieldCacheSort, SystemInfoHandlerTest, TestSQLHandlerNonCloud, TestRequestForwarding, SpellCheckComponentTest, SoftAutoCommitTest, TestReloadDeadlock, TestCoreContainer, TestManagedResource, TestClusterProperties, LeaderElectionContextKeyTest, OverseerStatusTest, HdfsChaosMonkeyNothingIsSafeTest, TestFastOutputStream, AddSchemaFieldsUpdateProcessorFactoryTest, TestCharFilters, TestMiniSolrCloudClusterSSL, ZkStateWriterTest, TestObjectReleaseTracker, HighlighterTest, OpenCloseCoreStressTest, TestQueryTypes, ChaosMonkeySafeLeaderTest, TestFieldCollectionResource, CursorMarkTest, BasicFunctionalityTest, DeleteNodeTest, TestMaxScoreQueryParser, TestDeleteCollectionOnDownNodes, TestConfigSetsAPIExclusivity, SortByFunctionTest, HdfsTlogReplayBufferedWhileIndexingTest, RAMDirectoryFactoryTest, IndexBasedSpellCheckerTest, TestSolrCloudWithHadoopAuthPlugin, RecoveryAfterSoftCommitTest, TestSearchPerf, TestSolrCloudWithDelegationTokens, TestStandardQParsers, TestBulkSchemaAPI, ZkCLITest, CdcrReplicationHandlerTest, BasicDistributedZk2Test, CollectionsAPIDistributedZkTest, SyncSliceTest, RecoveryZkTest, ClusterStateUpdateTest, LeaderElectionTest, ZkSolrClientTest, ShardRoutingCustomTest, TestFaceting, DistributedSpellCheckComponentTest, TestJoin, SimpleFacetsTest, TestSolr4Spatial, TestGroupingSearch, SolrCmdDistributorTest, PeerSyncTest, TestFunctionQuery, ShowFileRequestHandlerTest, SimplePostToolTest, AnalysisAfterCoreReloadTest, SpellCheckCollatorTest, SuggesterTSTTest, PolyFieldTest, NoCacheHeaderTest, WordBreakSolrSpellCheckerTest, TestPseudoReturnFields, TestWordDelimiterFilterFactory, CacheHeaderTest, TestWriterPerf, DocumentAnalysisRequestHandlerTest, XmlUpdateRequestHandlerTest, TestValueSourceCache, TermVectorComponentTest, TestSolrQueryParser, IndexSchemaRuntimeFieldTest, RegexBoostProcessorTest, UpdateRequestProcessorFactoryTest, QueryParsingTest, TestAnalyzedSuggestions, TestPartialUpdateDeduplication, TestPHPSerializedResponseWriter, CSVRequestHandlerTest, SearchHandlerTest, SOLR749Test, AlternateDirectoryTest, SolrIndexConfigTest, TestSolrDeletionPolicy2, SampleTest, TestDocSet, TestBinaryField, MinimalSchemaTest, TestElisionMultitermQuery, TestConfig, OutputWriterTest, TestFuzzyAnalyzedSuggestions, ExternalFileFieldSortTest, TestSolrCoreProperties, TestPostingsSolrHighlighter, DirectSolrConnectionTest, NotRequiredUniqueKeyTest, SpellPossibilityIteratorTest, TestCodecSupport, SynonymTokenizerTest, EchoParamsTest, TestLMJelinekMercerSimilarityFactory, TestBM25SimilarityFactory, PluginInfoTest, DateMathParserTest, TestSolrJ, TestUtils, FileUtilsTest, DistributedMLTComponentTest, DistributedIntervalFacetingTest, CdcrReplicationDistributedZkTest, CleanupOldIndexTest, CloudExitableDirectoryReaderTest, CollectionStateFormat2Test, CollectionsAPISolrJTest]
   [junit4] Completed [479/677 (1!)] on J1 in 177.87s, 12 tests, 1 error <<< FAILURES!

[...truncated 63091 lines...]


Mime
View raw message