lucene-dev mailing list archives

Site index · List index
Message view « Date » · « Thread »
Top « Date » · « Thread »
From Policeman Jenkins Server <jenk...@thetaphi.de>
Subject [JENKINS] Lucene-Solr-6.x-Linux (32bit/jdk1.8.0_112) - Build # 2601 - Unstable!
Date Fri, 06 Jan 2017 04:57:50 GMT
Build: https://jenkins.thetaphi.de/job/Lucene-Solr-6.x-Linux/2601/
Java: 32bit/jdk1.8.0_112 -server -XX:+UseSerialGC

1 tests failed.
FAILED:  org.apache.solr.metrics.SolrMetricManagerTest.testClearMetrics

Error Message:
expected:<80> but was:<81>

Stack Trace:
java.lang.AssertionError: expected:<80> but was:<81>
	at __randomizedtesting.SeedInfo.seed([69FC2910FF09178E:2D5EAEAF876EEC7E]:0)
	at org.junit.Assert.fail(Assert.java:93)
	at org.junit.Assert.failNotEquals(Assert.java:647)
	at org.junit.Assert.assertEquals(Assert.java:128)
	at org.junit.Assert.assertEquals(Assert.java:472)
	at org.junit.Assert.assertEquals(Assert.java:456)
	at org.apache.solr.metrics.SolrMetricManagerTest.testClearMetrics(SolrMetricManagerTest.java:148)
	at sun.reflect.NativeMethodAccessorImpl.invoke0(Native Method)
	at sun.reflect.NativeMethodAccessorImpl.invoke(NativeMethodAccessorImpl.java:62)
	at sun.reflect.DelegatingMethodAccessorImpl.invoke(DelegatingMethodAccessorImpl.java:43)
	at java.lang.reflect.Method.invoke(Method.java:498)
	at com.carrotsearch.randomizedtesting.RandomizedRunner.invoke(RandomizedRunner.java:1713)
	at com.carrotsearch.randomizedtesting.RandomizedRunner$8.evaluate(RandomizedRunner.java:907)
	at com.carrotsearch.randomizedtesting.RandomizedRunner$9.evaluate(RandomizedRunner.java:943)
	at com.carrotsearch.randomizedtesting.RandomizedRunner$10.evaluate(RandomizedRunner.java:957)
	at com.carrotsearch.randomizedtesting.rules.SystemPropertiesRestoreRule$1.evaluate(SystemPropertiesRestoreRule.java:57)
	at org.apache.lucene.util.TestRuleSetupTeardownChained$1.evaluate(TestRuleSetupTeardownChained.java:49)
	at org.apache.lucene.util.AbstractBeforeAfterRule$1.evaluate(AbstractBeforeAfterRule.java:45)
	at org.apache.lucene.util.TestRuleThreadAndTestName$1.evaluate(TestRuleThreadAndTestName.java:48)
	at org.apache.lucene.util.TestRuleIgnoreAfterMaxFailures$1.evaluate(TestRuleIgnoreAfterMaxFailures.java:64)
	at org.apache.lucene.util.TestRuleMarkFailure$1.evaluate(TestRuleMarkFailure.java:47)
	at com.carrotsearch.randomizedtesting.rules.StatementAdapter.evaluate(StatementAdapter.java:36)
	at com.carrotsearch.randomizedtesting.ThreadLeakControl$StatementRunner.run(ThreadLeakControl.java:367)
	at com.carrotsearch.randomizedtesting.ThreadLeakControl.forkTimeoutingTask(ThreadLeakControl.java:811)
	at com.carrotsearch.randomizedtesting.ThreadLeakControl$3.evaluate(ThreadLeakControl.java:462)
	at com.carrotsearch.randomizedtesting.RandomizedRunner.runSingleTest(RandomizedRunner.java:916)
	at com.carrotsearch.randomizedtesting.RandomizedRunner$5.evaluate(RandomizedRunner.java:802)
	at com.carrotsearch.randomizedtesting.RandomizedRunner$6.evaluate(RandomizedRunner.java:852)
	at com.carrotsearch.randomizedtesting.RandomizedRunner$7.evaluate(RandomizedRunner.java:863)
	at com.carrotsearch.randomizedtesting.rules.StatementAdapter.evaluate(StatementAdapter.java:36)
	at com.carrotsearch.randomizedtesting.rules.SystemPropertiesRestoreRule$1.evaluate(SystemPropertiesRestoreRule.java:57)
	at org.apache.lucene.util.AbstractBeforeAfterRule$1.evaluate(AbstractBeforeAfterRule.java:45)
	at com.carrotsearch.randomizedtesting.rules.StatementAdapter.evaluate(StatementAdapter.java:36)
	at org.apache.lucene.util.TestRuleStoreClassName$1.evaluate(TestRuleStoreClassName.java:41)
	at com.carrotsearch.randomizedtesting.rules.NoShadowingOrOverridesOnMethodsRule$1.evaluate(NoShadowingOrOverridesOnMethodsRule.java:40)
	at com.carrotsearch.randomizedtesting.rules.NoShadowingOrOverridesOnMethodsRule$1.evaluate(NoShadowingOrOverridesOnMethodsRule.java:40)
	at com.carrotsearch.randomizedtesting.rules.StatementAdapter.evaluate(StatementAdapter.java:36)
	at com.carrotsearch.randomizedtesting.rules.StatementAdapter.evaluate(StatementAdapter.java:36)
	at com.carrotsearch.randomizedtesting.rules.StatementAdapter.evaluate(StatementAdapter.java:36)
	at org.apache.lucene.util.TestRuleAssertionsRequired$1.evaluate(TestRuleAssertionsRequired.java:53)
	at org.apache.lucene.util.TestRuleMarkFailure$1.evaluate(TestRuleMarkFailure.java:47)
	at org.apache.lucene.util.TestRuleIgnoreAfterMaxFailures$1.evaluate(TestRuleIgnoreAfterMaxFailures.java:64)
	at org.apache.lucene.util.TestRuleIgnoreTestSuites$1.evaluate(TestRuleIgnoreTestSuites.java:54)
	at com.carrotsearch.randomizedtesting.rules.StatementAdapter.evaluate(StatementAdapter.java:36)
	at com.carrotsearch.randomizedtesting.ThreadLeakControl$StatementRunner.run(ThreadLeakControl.java:367)
	at java.lang.Thread.run(Thread.java:745)




Build Log:
[...truncated 12635 lines...]
   [junit4] Suite: org.apache.solr.metrics.SolrMetricManagerTest
   [junit4]   2> Creating dataDir: /home/jenkins/workspace/Lucene-Solr-6.x-Linux/solr/build/solr-core/test/J1/temp/solr.metrics.SolrMetricManagerTest_69FC2910FF09178E-001/init-core-data-001
   [junit4]   2> 1735935 INFO  (SUITE-SolrMetricManagerTest-seed#[69FC2910FF09178E]-worker)
[    ] o.a.s.SolrTestCaseJ4 Randomized ssl (true) and clientAuth (true) via: @org.apache.solr.util.RandomizeSSL(reason=,
ssl=NaN, value=NaN, clientAuth=NaN)
   [junit4]   2> 1735937 INFO  (TEST-SolrMetricManagerTest.testReporters-seed#[69FC2910FF09178E])
[    ] o.a.s.SolrTestCaseJ4 ###Starting testReporters
   [junit4]   2> 1735943 INFO  (TEST-SolrMetricManagerTest.testReporters-seed#[69FC2910FF09178E])
[    ] o.a.s.m.SolrMetricManager Closing metric reporters for: solr.jvm
   [junit4]   2> 1735944 INFO  (TEST-SolrMetricManagerTest.testReporters-seed#[69FC2910FF09178E])
[    ] o.a.s.m.SolrMetricManager Closing metric reporters for: solr.node
   [junit4]   2> 1735944 INFO  (TEST-SolrMetricManagerTest.testReporters-seed#[69FC2910FF09178E])
[    ] o.a.s.m.SolrMetricManager Closing metric reporters for: solr.core.collection1
   [junit4]   2> 1735944 INFO  (TEST-SolrMetricManagerTest.testReporters-seed#[69FC2910FF09178E])
[    ] o.a.s.SolrTestCaseJ4 ###Ending testReporters
   [junit4]   2> 1735946 INFO  (TEST-SolrMetricManagerTest.testSimpleMetrics-seed#[69FC2910FF09178E])
[    ] o.a.s.SolrTestCaseJ4 ###Starting testSimpleMetrics
   [junit4]   2> 1735946 INFO  (TEST-SolrMetricManagerTest.testSimpleMetrics-seed#[69FC2910FF09178E])
[    ] o.a.s.SolrTestCaseJ4 ###Ending testSimpleMetrics
   [junit4]   2> 1735947 INFO  (TEST-SolrMetricManagerTest.testMoveMetrics-seed#[69FC2910FF09178E])
[    ] o.a.s.SolrTestCaseJ4 ###Starting testMoveMetrics
   [junit4]   2> 1735956 INFO  (TEST-SolrMetricManagerTest.testMoveMetrics-seed#[69FC2910FF09178E])
[    ] o.a.s.SolrTestCaseJ4 ###Ending testMoveMetrics
   [junit4]   2> 1735958 INFO  (TEST-SolrMetricManagerTest.testRegisterAll-seed#[69FC2910FF09178E])
[    ] o.a.s.SolrTestCaseJ4 ###Starting testRegisterAll
   [junit4]   2> 1735959 INFO  (TEST-SolrMetricManagerTest.testRegisterAll-seed#[69FC2910FF09178E])
[    ] o.a.s.SolrTestCaseJ4 ###Ending testRegisterAll
   [junit4]   2> 1735960 INFO  (TEST-SolrMetricManagerTest.testOverridableRegistryName-seed#[69FC2910FF09178E])
[    ] o.a.s.SolrTestCaseJ4 ###Starting testOverridableRegistryName
   [junit4]   2> 1735960 INFO  (TEST-SolrMetricManagerTest.testOverridableRegistryName-seed#[69FC2910FF09178E])
[    ] o.a.s.SolrTestCaseJ4 ###Ending testOverridableRegistryName
   [junit4]   2> 1735961 INFO  (TEST-SolrMetricManagerTest.testRegistryName-seed#[69FC2910FF09178E])
[    ] o.a.s.SolrTestCaseJ4 ###Starting testRegistryName
   [junit4]   2> 1735961 INFO  (TEST-SolrMetricManagerTest.testRegistryName-seed#[69FC2910FF09178E])
[    ] o.a.s.SolrTestCaseJ4 ###Ending testRegistryName
   [junit4]   2> 1735962 INFO  (TEST-SolrMetricManagerTest.testClearMetrics-seed#[69FC2910FF09178E])
[    ] o.a.s.SolrTestCaseJ4 ###Starting testClearMetrics
   [junit4]   2> 1735968 INFO  (TEST-SolrMetricManagerTest.testClearMetrics-seed#[69FC2910FF09178E])
[    ] o.a.s.SolrTestCaseJ4 ###Ending testClearMetrics
   [junit4]   2> NOTE: reproduce with: ant test  -Dtestcase=SolrMetricManagerTest -Dtests.method=testClearMetrics
-Dtests.seed=69FC2910FF09178E -Dtests.multiplier=3 -Dtests.slow=true -Dtests.locale=pt-BR
-Dtests.timezone=America/Belem -Dtests.asserts=true -Dtests.file.encoding=ISO-8859-1
   [junit4] FAILURE 0.01s J1 | SolrMetricManagerTest.testClearMetrics <<<
   [junit4]    > Throwable #1: java.lang.AssertionError: expected:<80> but was:<81>
   [junit4]    > 	at __randomizedtesting.SeedInfo.seed([69FC2910FF09178E:2D5EAEAF876EEC7E]:0)
   [junit4]    > 	at org.apache.solr.metrics.SolrMetricManagerTest.testClearMetrics(SolrMetricManagerTest.java:148)
   [junit4]    > 	at java.lang.Thread.run(Thread.java:745)
   [junit4]   2> 1735971 INFO  (SUITE-SolrMetricManagerTest-seed#[69FC2910FF09178E]-worker)
[    ] o.a.s.SolrTestCaseJ4 ###deleteCore
   [junit4]   2> NOTE: leaving temporary files on disk at: /home/jenkins/workspace/Lucene-Solr-6.x-Linux/solr/build/solr-core/test/J1/temp/solr.metrics.SolrMetricManagerTest_69FC2910FF09178E-001
   [junit4]   2> NOTE: test params are: codec=Asserting(Lucene62): {}, docValues:{}, maxPointsInLeafNode=478,
maxMBSortInHeap=7.561190613545705, sim=RandomSimilarity(queryNorm=true,coord=crazy): {}, locale=pt-BR,
timezone=America/Belem
   [junit4]   2> NOTE: Linux 4.4.0-53-generic i386/Oracle Corporation 1.8.0_112 (32-bit)/cpus=12,threads=1,free=80841608,total=359919616
   [junit4]   2> NOTE: All tests run in this JVM: [DistributedTermsComponentTest, ConvertedLegacyTest,
TestMacroExpander, TestOverriddenPrefixQueryForCustomFieldType, ConjunctionSolrSpellCheckerTest,
OverseerStatusTest, SpatialFilterTest, TestSearchPerf, CdcrReplicationHandlerTest, SolrInfoMBeanTest,
TestCustomStream, RAMDirectoryFactoryTest, TestUseDocValuesAsStored2, TestConfigReload, TestPivotHelperCode,
TestCloudPivotFacet, WordBreakSolrSpellCheckerTest, AliasIntegrationTest, TestSha256AuthenticationProvider,
TestLeaderElectionZkExpiry, TestDeleteCollectionOnDownNodes, JvmMetricsTest, TestStressVersions,
TestJavabinTupleStreamParser, FileUtilsTest, ClassificationUpdateProcessorIntegrationTest,
BooleanFieldTest, TestSystemIdResolver, PreAnalyzedFieldManagedSchemaCloudTest, TestTrie,
CopyFieldTest, CollectionsAPIDistributedZkTest, TestPartialUpdateDeduplication, BlockCacheTest,
HdfsRestartWhileUpdatingTest, HdfsTlogReplayBufferedWhileIndexingTest, SpellCheckComponentTest,
URLClassifyProcessorTest, TestSolrCloudWithDelegationTokens, SoftAutoCommitTest, SortSpecParsingTest,
SharedFSAutoReplicaFailoverTest, TestSolrIndexConfig, IndexBasedSpellCheckerTest, TestInfoStreamLogging,
DistributedMLTComponentTest, TestSchemaSimilarityResource, DistributedIntervalFacetingTest,
TermVectorComponentTest, TestTestInjection, SchemaVersionSpecificBehaviorTest, TestLuceneMatchVersion,
TestJsonFacets, ExitableDirectoryReaderTest, TermsComponentTest, LoggingHandlerTest, TestSortByMinMaxFunction,
TestCollationFieldDocValues, CollectionsAPIAsyncDistributedZkTest, TestExceedMaxTermLength,
TestSolrCoreSnapshots, TestHashPartitioner, FullHLLTest, TestTolerantUpdateProcessorRandomCloud,
SolrMetricReporterTest, ZkCLITest, CustomCollectionTest, TestMaxScoreQueryParser, SampleTest,
TestDistribIDF, TestSmileRequest, InfoHandlerTest, DistributedSuggestComponentTest, UpdateRequestProcessorFactoryTest,
TestFileDictionaryLookup, ZkControllerTest, SuggestComponentTest, ShardRoutingTest, TestFieldTypeResource,
TestFieldCollectionResource, SegmentsInfoRequestHandlerTest, SSLMigrationTest, SparseHLLTest,
BasicFunctionalityTest, TestSimpleTrackingShardHandler, TestFuzzyAnalyzedSuggestions, BlockJoinFacetRandomTest,
DirectSolrConnectionTest, DocValuesMissingTest, DocExpirationUpdateProcessorFactoryTest, TestAuthenticationFramework,
ZkSolrClientTest, DistributedExpandComponentTest, TolerantUpdateProcessorTest, TestObjectReleaseTracker,
TestWordDelimiterFilterFactory, TestSolrQueryParserDefaultOperatorResource, JsonLoaderTest,
TestBM25SimilarityFactory, TestGraphTermsQParserPlugin, TestClusterProperties, TestQuerySenderListener,
TestLRUStatsCache, TestLMDirichletSimilarityFactory, IndexSchemaTest, TestJettySolrRunner,
TestSegmentSorting, TestExclusionRuleCollectionAccess, SmileWriterTest, TestReloadAndDeleteDocs,
HighlighterMaxOffsetTest, TestFieldCacheWithThreads, ChaosMonkeySafeLeaderTest, BasicDistributedZk2Test,
OpenCloseCoreStressTest, OverseerTest, ClusterStateUpdateTest, TestZkChroot, TestRandomDVFaceting,
ShardRoutingCustomTest, TestDistributedGrouping, TestFaceting, DistributedSpellCheckComponentTest,
TermVectorComponentDistributedTest, TestStressReorder, TestJoin, TestReload, HardAutoCommitTest,
TestCoreContainer, SimpleFacetsTest, SolrCoreTest, SolrCmdDistributorTest, PeerSyncTest, BadIndexSchemaTest,
TestFiltering, TestBadConfig, HighlighterTest, CurrencyFieldOpenExchangeTest, DistributedQueryElevationComponentTest,
SpellCheckCollatorTest, SolrRequestParserTest, TestFoldingMultitermQuery, DocValuesTest, TestReversedWildcardFilterFactory,
TestQueryTypes, RequestHandlersTest, TestIndexingPerformance, RequiredFieldsTest, FastVectorHighlighterTest,
RegexBoostProcessorTest, TestCSVResponseWriter, UniqFieldsUpdateProcessorFactoryTest, TestPHPSerializedResponseWriter,
SearchHandlerTest, HighlighterConfigTest, UpdateParamsTest, TestQuerySenderNoQuery, ResponseLogComponentTest,
SolrIndexConfigTest, BadComponentTest, TestMergePolicyConfig, TestSolrDeletionPolicy2, MultiTermTest,
TestDocSet, TestBinaryField, TestElisionMultitermQuery, TestConfig, ExternalFileFieldSortTest,
NotRequiredUniqueKeyTest, TestPhraseSuggestions, TestCharFilters, EchoParamsTest, TestSweetSpotSimilarityFactory,
TestDFRSimilarityFactory, TestFastWriter, TestJmxMonitoredMap, TimeZoneUtilsTest, ResourceLoaderTest,
TestFastOutputStream, OpenExchangeRatesOrgProviderTest, TestFastLRUCache, DateMathParserTest,
ChaosMonkeyNothingIsSafeTest, CloudExitableDirectoryReaderTest, CollectionReloadTest, CollectionTooManyReplicasTest,
ConcurrentDeleteAndCreateCollectionTest, ConfigSetsAPITest, ConnectionManagerTest, CreateCollectionCleanupTest,
DeleteNodeTest, DeleteStatusTest, DocValuesNotIndexedTest, LeaderElectionContextKeyTest, LeaderInitiatedRecoveryOnCommitTest,
LeaderInitiatedRecoveryOnShardRestartTest, MigrateRouteKeyTest, MultiThreadedOCPTest, OutOfBoxZkACLAndCredentialsProvidersTest,
OverseerCollectionConfigSetProcessorTest, OverseerRolesTest, RecoveryAfterSoftCommitTest,
ReplaceNodeTest, ReplicationFactorTest, RestartWhileUpdatingTest, RollingRestartTest, TestCloudPseudoReturnFields,
TestConfigSetsAPI, TestCryptoKeys, TestLockTree, TestMiniSolrCloudCluster, TestRequestForwarding,
TestShortCircuitedRequests, TestStressLiveNodes, TestTolerantUpdateProcessorCloud, VMParamsZkACLAndCredentialsProvidersTest,
BlobRepositoryCloudTest, TestConfigSetProperties, TestInitParams, TestSolrConfigHandler, RequestLoggingTest,
TestBlobHandler, TestSQLHandlerNonCloud, TestSolrConfigHandlerCloud, TestExpandComponent,
JavabinLoaderTest, TestSlowCompositeReaderWrapper, WrapperMergePolicyFactoryTest, CheckHdfsIndexTest,
SolrMetricManagerTest]
   [junit4] Completed [582/677 (1!)] on J1 in 0.05s, 7 tests, 1 failure <<< FAILURES!

[...truncated 54950 lines...]


Mime
View raw message