lucene-dev mailing list archives

Site index · List index
Message view « Date » · « Thread »
Top « Date » · « Thread »
From Policeman Jenkins Server <jenk...@thetaphi.de>
Subject [JENKINS] Lucene-Solr-6.x-MacOSX (64bit/jdk1.8.0) - Build # 620 - Unstable!
Date Wed, 04 Jan 2017 08:01:16 GMT
Build: https://jenkins.thetaphi.de/job/Lucene-Solr-6.x-MacOSX/620/
Java: 64bit/jdk1.8.0 -XX:-UseCompressedOops -XX:+UseParallelGC

1 tests failed.
FAILED:  org.apache.solr.cloud.PeerSyncReplicationTest.test

Error Message:
PeerSynced node did not become leader expected:<CloudJettyRunner [url=http://127.0.0.1:56095/pxi/collection1]> but was:<CloudJettyRunner [url=http://127.0.0.1:56091/pxi/collection1]>

Stack Trace:
java.lang.AssertionError: PeerSynced node did not become leader expected:<CloudJettyRunner [url=http://127.0.0.1:56095/pxi/collection1]> but was:<CloudJettyRunner [url=http://127.0.0.1:56091/pxi/collection1]>
	at __randomizedtesting.SeedInfo.seed([FDEB62AD9ECD1C2E:75BF5D77303171D6]:0)
	at org.junit.Assert.fail(Assert.java:93)
	at org.junit.Assert.failNotEquals(Assert.java:647)
	at org.junit.Assert.assertEquals(Assert.java:128)
	at org.apache.solr.cloud.PeerSyncReplicationTest.test(PeerSyncReplicationTest.java:157)
	at sun.reflect.NativeMethodAccessorImpl.invoke0(Native Method)
	at sun.reflect.NativeMethodAccessorImpl.invoke(NativeMethodAccessorImpl.java:62)
	at sun.reflect.DelegatingMethodAccessorImpl.invoke(DelegatingMethodAccessorImpl.java:43)
	at java.lang.reflect.Method.invoke(Method.java:498)
	at com.carrotsearch.randomizedtesting.RandomizedRunner.invoke(RandomizedRunner.java:1713)
	at com.carrotsearch.randomizedtesting.RandomizedRunner$8.evaluate(RandomizedRunner.java:907)
	at com.carrotsearch.randomizedtesting.RandomizedRunner$9.evaluate(RandomizedRunner.java:943)
	at com.carrotsearch.randomizedtesting.RandomizedRunner$10.evaluate(RandomizedRunner.java:957)
	at org.apache.solr.BaseDistributedSearchTestCase$ShardsRepeatRule$ShardsFixedStatement.callStatement(BaseDistributedSearchTestCase.java:992)
	at org.apache.solr.BaseDistributedSearchTestCase$ShardsRepeatRule$ShardsStatement.evaluate(BaseDistributedSearchTestCase.java:967)
	at com.carrotsearch.randomizedtesting.rules.SystemPropertiesRestoreRule$1.evaluate(SystemPropertiesRestoreRule.java:57)
	at org.apache.lucene.util.TestRuleSetupTeardownChained$1.evaluate(TestRuleSetupTeardownChained.java:49)
	at org.apache.lucene.util.AbstractBeforeAfterRule$1.evaluate(AbstractBeforeAfterRule.java:45)
	at org.apache.lucene.util.TestRuleThreadAndTestName$1.evaluate(TestRuleThreadAndTestName.java:48)
	at org.apache.lucene.util.TestRuleIgnoreAfterMaxFailures$1.evaluate(TestRuleIgnoreAfterMaxFailures.java:64)
	at org.apache.lucene.util.TestRuleMarkFailure$1.evaluate(TestRuleMarkFailure.java:47)
	at com.carrotsearch.randomizedtesting.rules.StatementAdapter.evaluate(StatementAdapter.java:36)
	at com.carrotsearch.randomizedtesting.ThreadLeakControl$StatementRunner.run(ThreadLeakControl.java:367)
	at com.carrotsearch.randomizedtesting.ThreadLeakControl.forkTimeoutingTask(ThreadLeakControl.java:811)
	at com.carrotsearch.randomizedtesting.ThreadLeakControl$3.evaluate(ThreadLeakControl.java:462)
	at com.carrotsearch.randomizedtesting.RandomizedRunner.runSingleTest(RandomizedRunner.java:916)
	at com.carrotsearch.randomizedtesting.RandomizedRunner$5.evaluate(RandomizedRunner.java:802)
	at com.carrotsearch.randomizedtesting.RandomizedRunner$6.evaluate(RandomizedRunner.java:852)
	at com.carrotsearch.randomizedtesting.RandomizedRunner$7.evaluate(RandomizedRunner.java:863)
	at com.carrotsearch.randomizedtesting.rules.StatementAdapter.evaluate(StatementAdapter.java:36)
	at com.carrotsearch.randomizedtesting.rules.SystemPropertiesRestoreRule$1.evaluate(SystemPropertiesRestoreRule.java:57)
	at org.apache.lucene.util.AbstractBeforeAfterRule$1.evaluate(AbstractBeforeAfterRule.java:45)
	at com.carrotsearch.randomizedtesting.rules.StatementAdapter.evaluate(StatementAdapter.java:36)
	at org.apache.lucene.util.TestRuleStoreClassName$1.evaluate(TestRuleStoreClassName.java:41)
	at com.carrotsearch.randomizedtesting.rules.NoShadowingOrOverridesOnMethodsRule$1.evaluate(NoShadowingOrOverridesOnMethodsRule.java:40)
	at com.carrotsearch.randomizedtesting.rules.NoShadowingOrOverridesOnMethodsRule$1.evaluate(NoShadowingOrOverridesOnMethodsRule.java:40)
	at com.carrotsearch.randomizedtesting.rules.StatementAdapter.evaluate(StatementAdapter.java:36)
	at com.carrotsearch.randomizedtesting.rules.StatementAdapter.evaluate(StatementAdapter.java:36)
	at com.carrotsearch.randomizedtesting.rules.StatementAdapter.evaluate(StatementAdapter.java:36)
	at org.apache.lucene.util.TestRuleAssertionsRequired$1.evaluate(TestRuleAssertionsRequired.java:53)
	at org.apache.lucene.util.TestRuleMarkFailure$1.evaluate(TestRuleMarkFailure.java:47)
	at org.apache.lucene.util.TestRuleIgnoreAfterMaxFailures$1.evaluate(TestRuleIgnoreAfterMaxFailures.java:64)
	at org.apache.lucene.util.TestRuleIgnoreTestSuites$1.evaluate(TestRuleIgnoreTestSuites.java:54)
	at com.carrotsearch.randomizedtesting.rules.StatementAdapter.evaluate(StatementAdapter.java:36)
	at com.carrotsearch.randomizedtesting.ThreadLeakControl$StatementRunner.run(ThreadLeakControl.java:367)
	at java.lang.Thread.run(Thread.java:745)




Build Log:
[...truncated 11398 lines...]
   [junit4] Suite: org.apache.solr.cloud.PeerSyncReplicationTest
   [junit4]   2> Creating dataDir: /Users/jenkins/workspace/Lucene-Solr-6.x-MacOSX/solr/build/solr-core/test/J1/temp/solr.cloud.PeerSyncReplicationTest_FDEB62AD9ECD1C2E-001/init-core-data-001
   [junit4]   2> 1032505 INFO  (SUITE-PeerSyncReplicationTest-seed#[FDEB62AD9ECD1C2E]-worker) [    ] o.a.s.SolrTestCaseJ4 Randomized ssl (false) and clientAuth (false) via: @org.apache.solr.util.RandomizeSSL(reason=, value=NaN, ssl=NaN, clientAuth=NaN) w/ MAC_OS_X supressed clientAuth
   [junit4]   2> 1032506 INFO  (SUITE-PeerSyncReplicationTest-seed#[FDEB62AD9ECD1C2E]-worker) [    ] o.a.s.BaseDistributedSearchTestCase Setting hostContext system property: /pxi/
   [junit4]   2> 1032508 INFO  (TEST-PeerSyncReplicationTest.test-seed#[FDEB62AD9ECD1C2E]) [    ] o.a.s.c.ZkTestServer STARTING ZK TEST SERVER
   [junit4]   2> 1032509 INFO  (Thread-2090) [    ] o.a.s.c.ZkTestServer client port:0.0.0.0/0.0.0.0:0
   [junit4]   2> 1032509 INFO  (Thread-2090) [    ] o.a.s.c.ZkTestServer Starting server
   [junit4]   2> 1032613 INFO  (TEST-PeerSyncReplicationTest.test-seed#[FDEB62AD9ECD1C2E]) [    ] o.a.s.c.ZkTestServer start zk server on port:56083
   [junit4]   2> 1032648 INFO  (TEST-PeerSyncReplicationTest.test-seed#[FDEB62AD9ECD1C2E]) [    ] o.a.s.c.AbstractZkTestCase put /Users/jenkins/workspace/Lucene-Solr-6.x-MacOSX/solr/core/src/test-files/solr/collection1/conf/solrconfig-tlog.xml to /configs/conf1/solrconfig.xml
   [junit4]   2> 1032653 INFO  (TEST-PeerSyncReplicationTest.test-seed#[FDEB62AD9ECD1C2E]) [    ] o.a.s.c.AbstractZkTestCase put /Users/jenkins/workspace/Lucene-Solr-6.x-MacOSX/solr/core/src/test-files/solr/collection1/conf/schema.xml to /configs/conf1/schema.xml
   [junit4]   2> 1032658 INFO  (TEST-PeerSyncReplicationTest.test-seed#[FDEB62AD9ECD1C2E]) [    ] o.a.s.c.AbstractZkTestCase put /Users/jenkins/workspace/Lucene-Solr-6.x-MacOSX/solr/core/src/test-files/solr/collection1/conf/solrconfig.snippet.randomindexconfig.xml to /configs/conf1/solrconfig.snippet.randomindexconfig.xml
   [junit4]   2> 1032662 INFO  (TEST-PeerSyncReplicationTest.test-seed#[FDEB62AD9ECD1C2E]) [    ] o.a.s.c.AbstractZkTestCase put /Users/jenkins/workspace/Lucene-Solr-6.x-MacOSX/solr/core/src/test-files/solr/collection1/conf/stopwords.txt to /configs/conf1/stopwords.txt
   [junit4]   2> 1032665 INFO  (TEST-PeerSyncReplicationTest.test-seed#[FDEB62AD9ECD1C2E]) [    ] o.a.s.c.AbstractZkTestCase put /Users/jenkins/workspace/Lucene-Solr-6.x-MacOSX/solr/core/src/test-files/solr/collection1/conf/protwords.txt to /configs/conf1/protwords.txt
   [junit4]   2> 1032670 INFO  (TEST-PeerSyncReplicationTest.test-seed#[FDEB62AD9ECD1C2E]) [    ] o.a.s.c.AbstractZkTestCase put /Users/jenkins/workspace/Lucene-Solr-6.x-MacOSX/solr/core/src/test-files/solr/collection1/conf/currency.xml to /configs/conf1/currency.xml
   [junit4]   2> 1032681 INFO  (TEST-PeerSyncReplicationTest.test-seed#[FDEB62AD9ECD1C2E]) [    ] o.a.s.c.AbstractZkTestCase put /Users/jenkins/workspace/Lucene-Solr-6.x-MacOSX/solr/core/src/test-files/solr/collection1/conf/enumsConfig.xml to /configs/conf1/enumsConfig.xml
   [junit4]   2> 1032685 INFO  (TEST-PeerSyncReplicationTest.test-seed#[FDEB62AD9ECD1C2E]) [    ] o.a.s.c.AbstractZkTestCase put /Users/jenkins/workspace/Lucene-Solr-6.x-MacOSX/solr/core/src/test-files/solr/collection1/conf/open-exchange-rates.json to /configs/conf1/open-exchange-rates.json
   [junit4]   2> 1032689 INFO  (TEST-PeerSyncReplicationTest.test-seed#[FDEB62AD9ECD1C2E]) [    ] o.a.s.c.AbstractZkTestCase put /Users/jenkins/workspace/Lucene-Solr-6.x-MacOSX/solr/core/src/test-files/solr/collection1/conf/mapping-ISOLatin1Accent.txt to /configs/conf1/mapping-ISOLatin1Accent.txt
   [junit4]   2> 1032692 INFO  (TEST-PeerSyncReplicationTest.test-seed#[FDEB62AD9ECD1C2E]) [    ] o.a.s.c.AbstractZkTestCase put /Users/jenkins/workspace/Lucene-Solr-6.x-MacOSX/solr/core/src/test-files/solr/collection1/conf/old_synonyms.txt to /configs/conf1/old_synonyms.txt
   [junit4]   2> 1032695 INFO  (TEST-PeerSyncReplicationTest.test-seed#[FDEB62AD9ECD1C2E]) [    ] o.a.s.c.AbstractZkTestCase put /Users/jenkins/workspace/Lucene-Solr-6.x-MacOSX/solr/core/src/test-files/solr/collection1/conf/synonyms.txt to /configs/conf1/synonyms.txt
   [junit4]   2> 1035832 INFO  (TEST-PeerSyncReplicationTest.test-seed#[FDEB62AD9ECD1C2E]) [    ] o.a.s.SolrTestCaseJ4 Writing core.properties file to /Users/jenkins/workspace/Lucene-Solr-6.x-MacOSX/solr/build/solr-core/test/J1/temp/solr.cloud.PeerSyncReplicationTest_FDEB62AD9ECD1C2E-001/control-001/cores/collection1
   [junit4]   2> 1035835 INFO  (TEST-PeerSyncReplicationTest.test-seed#[FDEB62AD9ECD1C2E]) [    ] o.e.j.s.Server jetty-9.3.14.v20161028
   [junit4]   2> 1035837 INFO  (TEST-PeerSyncReplicationTest.test-seed#[FDEB62AD9ECD1C2E]) [    ] o.e.j.s.h.ContextHandler Started o.e.j.s.ServletContextHandler@5caf712{/pxi,null,AVAILABLE}
   [junit4]   2> 1035839 INFO  (TEST-PeerSyncReplicationTest.test-seed#[FDEB62AD9ECD1C2E]) [    ] o.e.j.s.AbstractConnector Started ServerConnector@4c7735d2{HTTP/1.1,[http/1.1]}{127.0.0.1:56086}
   [junit4]   2> 1035840 INFO  (TEST-PeerSyncReplicationTest.test-seed#[FDEB62AD9ECD1C2E]) [    ] o.e.j.s.Server Started @1041259ms
   [junit4]   2> 1035840 INFO  (TEST-PeerSyncReplicationTest.test-seed#[FDEB62AD9ECD1C2E]) [    ] o.a.s.c.s.e.JettySolrRunner Jetty properties: {solr.data.dir=/Users/jenkins/workspace/Lucene-Solr-6.x-MacOSX/solr/build/solr-core/test/J1/temp/solr.cloud.PeerSyncReplicationTest_FDEB62AD9ECD1C2E-001/tempDir-001/control/data, hostContext=/pxi, hostPort=56086, coreRootDirectory=/Users/jenkins/workspace/Lucene-Solr-6.x-MacOSX/solr/build/solr-core/test/J1/../../../../../../../../../Users/jenkins/workspace/Lucene-Solr-6.x-MacOSX/solr/build/solr-core/test/J1/temp/solr.cloud.PeerSyncReplicationTest_FDEB62AD9ECD1C2E-001/control-001/cores}
   [junit4]   2> 1035841 ERROR (TEST-PeerSyncReplicationTest.test-seed#[FDEB62AD9ECD1C2E]) [    ] o.a.s.s.StartupLoggingUtils Missing Java Option solr.log.dir. Logging may be missing or incomplete.
   [junit4]   2> 1035841 INFO  (TEST-PeerSyncReplicationTest.test-seed#[FDEB62AD9ECD1C2E]) [    ] o.a.s.s.SolrDispatchFilter  ___      _       Welcome to Apache Solr™ version 6.4.0
   [junit4]   2> 1035841 INFO  (TEST-PeerSyncReplicationTest.test-seed#[FDEB62AD9ECD1C2E]) [    ] o.a.s.s.SolrDispatchFilter / __| ___| |_ _   Starting in cloud mode on port null
   [junit4]   2> 1035841 INFO  (TEST-PeerSyncReplicationTest.test-seed#[FDEB62AD9ECD1C2E]) [    ] o.a.s.s.SolrDispatchFilter \__ \/ _ \ | '_|  Install dir: null
   [junit4]   2> 1035841 INFO  (TEST-PeerSyncReplicationTest.test-seed#[FDEB62AD9ECD1C2E]) [    ] o.a.s.s.SolrDispatchFilter |___/\___/_|_|    Start time: 2017-01-04T07:00:12.361Z
   [junit4]   2> 1035850 INFO  (TEST-PeerSyncReplicationTest.test-seed#[FDEB62AD9ECD1C2E]) [    ] o.a.s.s.SolrDispatchFilter Loading solr.xml from SolrHome (not found in ZooKeeper)
   [junit4]   2> 1035850 INFO  (TEST-PeerSyncReplicationTest.test-seed#[FDEB62AD9ECD1C2E]) [    ] o.a.s.c.SolrXmlConfig Loading container configuration from /Users/jenkins/workspace/Lucene-Solr-6.x-MacOSX/solr/build/solr-core/test/J1/temp/solr.cloud.PeerSyncReplicationTest_FDEB62AD9ECD1C2E-001/control-001/solr.xml
   [junit4]   2> 1035860 INFO  (TEST-PeerSyncReplicationTest.test-seed#[FDEB62AD9ECD1C2E]) [    ] o.a.s.u.UpdateShardHandler Creating UpdateShardHandler HTTP client with params: socketTimeout=340000&connTimeout=45000&retry=true
   [junit4]   2> 1035861 INFO  (TEST-PeerSyncReplicationTest.test-seed#[FDEB62AD9ECD1C2E]) [    ] o.a.s.c.ZkContainer Zookeeper client=127.0.0.1:56083/solr
   [junit4]   2> 1035920 INFO  (TEST-PeerSyncReplicationTest.test-seed#[FDEB62AD9ECD1C2E]) [n:127.0.0.1:56086_pxi    ] o.a.s.c.OverseerElectionContext I am going to be the leader 127.0.0.1:56086_pxi
   [junit4]   2> 1035922 INFO  (TEST-PeerSyncReplicationTest.test-seed#[FDEB62AD9ECD1C2E]) [n:127.0.0.1:56086_pxi    ] o.a.s.c.Overseer Overseer (id=97223521667121156-127.0.0.1:56086_pxi-n_0000000000) starting
   [junit4]   2> 1035941 INFO  (TEST-PeerSyncReplicationTest.test-seed#[FDEB62AD9ECD1C2E]) [n:127.0.0.1:56086_pxi    ] o.a.s.c.ZkController Register node as live in ZooKeeper:/live_nodes/127.0.0.1:56086_pxi
   [junit4]   2> 1035945 INFO  (zkCallback-1522-thread-1-processing-n:127.0.0.1:56086_pxi) [n:127.0.0.1:56086_pxi    ] o.a.s.c.c.ZkStateReader Updated live nodes from ZooKeeper... (0) -> (1)
   [junit4]   2> 1036017 INFO  (TEST-PeerSyncReplicationTest.test-seed#[FDEB62AD9ECD1C2E]) [n:127.0.0.1:56086_pxi    ] o.a.s.c.CorePropertiesLocator Found 1 core definitions underneath /Users/jenkins/workspace/Lucene-Solr-6.x-MacOSX/solr/build/solr-core/test/J1/../../../../../../../../../Users/jenkins/workspace/Lucene-Solr-6.x-MacOSX/solr/build/solr-core/test/J1/temp/solr.cloud.PeerSyncReplicationTest_FDEB62AD9ECD1C2E-001/control-001/cores
   [junit4]   2> 1036018 INFO  (TEST-PeerSyncReplicationTest.test-seed#[FDEB62AD9ECD1C2E]) [n:127.0.0.1:56086_pxi    ] o.a.s.c.CorePropertiesLocator Cores are: [collection1]
   [junit4]   2> 1036027 INFO  (OverseerStateUpdate-97223521667121156-127.0.0.1:56086_pxi-n_0000000000) [n:127.0.0.1:56086_pxi    ] o.a.s.c.o.ReplicaMutator Assigning new node to shard shard=shard1
   [junit4]   2> 1037047 INFO  (coreLoadExecutor-4281-thread-1-processing-n:127.0.0.1:56086_pxi) [n:127.0.0.1:56086_pxi c:control_collection   x:collection1] o.a.s.c.SolrConfig Using Lucene MatchVersion: 6.4.0
   [junit4]   2> 1037062 INFO  (coreLoadExecutor-4281-thread-1-processing-n:127.0.0.1:56086_pxi) [n:127.0.0.1:56086_pxi c:control_collection   x:collection1] o.a.s.s.IndexSchema [collection1] Schema name=test
   [junit4]   2> 1037226 WARN  (coreLoadExecutor-4281-thread-1-processing-n:127.0.0.1:56086_pxi) [n:127.0.0.1:56086_pxi c:control_collection   x:collection1] o.a.s.s.IndexSchema [collection1] default search field in schema is text. WARNING: Deprecated, please use 'df' on request instead.
   [junit4]   2> 1037228 INFO  (coreLoadExecutor-4281-thread-1-processing-n:127.0.0.1:56086_pxi) [n:127.0.0.1:56086_pxi c:control_collection   x:collection1] o.a.s.s.IndexSchema Loaded schema test/1.0 with uniqueid field id
   [junit4]   2> 1037253 INFO  (coreLoadExecutor-4281-thread-1-processing-n:127.0.0.1:56086_pxi) [n:127.0.0.1:56086_pxi c:control_collection   x:collection1] o.a.s.c.CoreContainer Creating SolrCore 'collection1' using configuration from collection control_collection
   [junit4]   2> 1037253 INFO  (coreLoadExecutor-4281-thread-1-processing-n:127.0.0.1:56086_pxi) [n:127.0.0.1:56086_pxi c:control_collection   x:collection1] o.a.s.c.SolrCore [[collection1] ] Opening new SolrCore at [/Users/jenkins/workspace/Lucene-Solr-6.x-MacOSX/solr/build/solr-core/test/J1/temp/solr.cloud.PeerSyncReplicationTest_FDEB62AD9ECD1C2E-001/control-001/cores/collection1], dataDir=[/Users/jenkins/workspace/Lucene-Solr-6.x-MacOSX/solr/build/solr-core/test/J1/../../../../../../../../../Users/jenkins/workspace/Lucene-Solr-6.x-MacOSX/solr/build/solr-core/test/J1/temp/solr.cloud.PeerSyncReplicationTest_FDEB62AD9ECD1C2E-001/control-001/cores/collection1/data/]
   [junit4]   2> 1037253 INFO  (coreLoadExecutor-4281-thread-1-processing-n:127.0.0.1:56086_pxi) [n:127.0.0.1:56086_pxi c:control_collection   x:collection1] o.a.s.c.JmxMonitoredMap JMX monitoring is enabled. Adding Solr mbeans to JMX Server: com.sun.jmx.mbeanserver.JmxMBeanServer@330baf4d
   [junit4]   2> 1037259 INFO  (coreLoadExecutor-4281-thread-1-processing-n:127.0.0.1:56086_pxi) [n:127.0.0.1:56086_pxi c:control_collection   x:collection1] o.a.s.u.RandomMergePolicy RandomMergePolicy wrapping class org.apache.lucene.index.LogByteSizeMergePolicy: [LogByteSizeMergePolicy: minMergeSize=1677721, mergeFactor=28, maxMergeSize=2147483648, maxMergeSizeForForcedMerge=9223372036854775807, calibrateSizeByDeletes=false, maxMergeDocs=2147483647, maxCFSSegmentSizeMB=8.796093022207999E12, noCFSRatio=1.0]
   [junit4]   2> 1037277 WARN  (coreLoadExecutor-4281-thread-1-processing-n:127.0.0.1:56086_pxi) [n:127.0.0.1:56086_pxi c:control_collection   x:collection1] o.a.s.c.RequestHandlers INVALID paramSet a in requestHandler {type = requestHandler,name = /dump,class = DumpRequestHandler,attributes = {initParams=a, name=/dump, class=DumpRequestHandler},args = {defaults={a=A,b=B}}}
   [junit4]   2> 1037304 INFO  (coreLoadExecutor-4281-thread-1-processing-n:127.0.0.1:56086_pxi) [n:127.0.0.1:56086_pxi c:control_collection   x:collection1] o.a.s.u.UpdateHandler Using UpdateLog implementation: org.apache.solr.update.UpdateLog
   [junit4]   2> 1037304 INFO  (coreLoadExecutor-4281-thread-1-processing-n:127.0.0.1:56086_pxi) [n:127.0.0.1:56086_pxi c:control_collection   x:collection1] o.a.s.u.UpdateLog Initializing UpdateLog: dataDir= defaultSyncLevel=FLUSH numRecordsToKeep=1000 maxNumLogsToKeep=10 numVersionBuckets=65536
   [junit4]   2> 1037305 INFO  (coreLoadExecutor-4281-thread-1-processing-n:127.0.0.1:56086_pxi) [n:127.0.0.1:56086_pxi c:control_collection   x:collection1] o.a.s.u.CommitTracker Hard AutoCommit: disabled
   [junit4]   2> 1037305 INFO  (coreLoadExecutor-4281-thread-1-processing-n:127.0.0.1:56086_pxi) [n:127.0.0.1:56086_pxi c:control_collection   x:collection1] o.a.s.u.CommitTracker Soft AutoCommit: disabled
   [junit4]   2> 1037306 INFO  (coreLoadExecutor-4281-thread-1-processing-n:127.0.0.1:56086_pxi) [n:127.0.0.1:56086_pxi c:control_collection   x:collection1] o.a.s.u.RandomMergePolicy RandomMergePolicy wrapping class org.apache.lucene.index.LogDocMergePolicy: [LogDocMergePolicy: minMergeSize=1000, mergeFactor=45, maxMergeSize=9223372036854775807, maxMergeSizeForForcedMerge=9223372036854775807, calibrateSizeByDeletes=false, maxMergeDocs=2147483647, maxCFSSegmentSizeMB=8.796093022207999E12, noCFSRatio=0.0]
   [junit4]   2> 1037309 INFO  (coreLoadExecutor-4281-thread-1-processing-n:127.0.0.1:56086_pxi) [n:127.0.0.1:56086_pxi c:control_collection   x:collection1] o.a.s.s.SolrIndexSearcher Opening [Searcher@27e29ce4[collection1] main]
   [junit4]   2> 1037312 INFO  (coreLoadExecutor-4281-thread-1-processing-n:127.0.0.1:56086_pxi) [n:127.0.0.1:56086_pxi c:control_collection   x:collection1] o.a.s.r.ManagedResourceStorage Configured ZooKeeperStorageIO with znodeBase: /configs/conf1
   [junit4]   2> 1037312 INFO  (coreLoadExecutor-4281-thread-1-processing-n:127.0.0.1:56086_pxi) [n:127.0.0.1:56086_pxi c:control_collection   x:collection1] o.a.s.r.ManagedResourceStorage Loaded null at path _rest_managed.json using ZooKeeperStorageIO:path=/configs/conf1
   [junit4]   2> 1037313 INFO  (coreLoadExecutor-4281-thread-1-processing-n:127.0.0.1:56086_pxi) [n:127.0.0.1:56086_pxi c:control_collection   x:collection1] o.a.s.h.ReplicationHandler Commits will be reserved for  10000
   [junit4]   2> 1037314 INFO  (searcherExecutor-4282-thread-1-processing-n:127.0.0.1:56086_pxi x:collection1 c:control_collection) [n:127.0.0.1:56086_pxi c:control_collection   x:collection1] o.a.s.c.SolrCore [collection1] Registered new searcher Searcher@27e29ce4[collection1] main{ExitableDirectoryReader(UninvertingDirectoryReader())}
   [junit4]   2> 1037314 INFO  (coreLoadExecutor-4281-thread-1-processing-n:127.0.0.1:56086_pxi) [n:127.0.0.1:56086_pxi c:control_collection   x:collection1] o.a.s.u.UpdateLog Could not find max version in index or recent updates, using new clock 1555576351709200384
   [junit4]   2> 1037327 INFO  (coreZkRegister-4274-thread-1-processing-n:127.0.0.1:56086_pxi x:collection1 c:control_collection) [n:127.0.0.1:56086_pxi c:control_collection s:shard1 r:core_node1 x:collection1] o.a.s.c.ShardLeaderElectionContext Enough replicas found to continue.
   [junit4]   2> 1037327 INFO  (coreZkRegister-4274-thread-1-processing-n:127.0.0.1:56086_pxi x:collection1 c:control_collection) [n:127.0.0.1:56086_pxi c:control_collection s:shard1 r:core_node1 x:collection1] o.a.s.c.ShardLeaderElectionContext I may be the new leader - try and sync
   [junit4]   2> 1037327 INFO  (coreZkRegister-4274-thread-1-processing-n:127.0.0.1:56086_pxi x:collection1 c:control_collection) [n:127.0.0.1:56086_pxi c:control_collection s:shard1 r:core_node1 x:collection1] o.a.s.c.SyncStrategy Sync replicas to http://127.0.0.1:56086/pxi/collection1/
   [junit4]   2> 1037327 INFO  (coreZkRegister-4274-thread-1-processing-n:127.0.0.1:56086_pxi x:collection1 c:control_collection) [n:127.0.0.1:56086_pxi c:control_collection s:shard1 r:core_node1 x:collection1] o.a.s.c.SyncStrategy Sync Success - now sync replicas to me
   [junit4]   2> 1037327 INFO  (coreZkRegister-4274-thread-1-processing-n:127.0.0.1:56086_pxi x:collection1 c:control_collection) [n:127.0.0.1:56086_pxi c:control_collection s:shard1 r:core_node1 x:collection1] o.a.s.c.SyncStrategy http://127.0.0.1:56086/pxi/collection1/ has no replicas
   [junit4]   2> 1037339 INFO  (coreZkRegister-4274-thread-1-processing-n:127.0.0.1:56086_pxi x:collection1 c:control_collection) [n:127.0.0.1:56086_pxi c:control_collection s:shard1 r:core_node1 x:collection1] o.a.s.c.ShardLeaderElectionContext I am the new leader: http://127.0.0.1:56086/pxi/collection1/ shard1
   [junit4]   2> 1037504 INFO  (coreZkRegister-4274-thread-1-processing-n:127.0.0.1:56086_pxi x:collection1 c:control_collection) [n:127.0.0.1:56086_pxi c:control_collection s:shard1 r:core_node1 x:collection1] o.a.s.c.ZkController I am the leader, no recovery necessary
   [junit4]   2> 1037821 INFO  (TEST-PeerSyncReplicationTest.test-seed#[FDEB62AD9ECD1C2E]) [    ] o.a.s.c.c.ZkStateReader Updated live nodes from ZooKeeper... (0) -> (1)
   [junit4]   2> 1037824 INFO  (TEST-PeerSyncReplicationTest.test-seed#[FDEB62AD9ECD1C2E]) [    ] o.a.s.c.s.i.ZkClientClusterStateProvider Cluster at 127.0.0.1:56083/solr ready
   [junit4]   2> 1037825 INFO  (TEST-PeerSyncReplicationTest.test-seed#[FDEB62AD9ECD1C2E]) [    ] o.a.s.c.ChaosMonkey monkey: init - expire sessions:false cause connection loss:false
   [junit4]   2> 1038285 INFO  (TEST-PeerSyncReplicationTest.test-seed#[FDEB62AD9ECD1C2E]) [    ] o.a.s.SolrTestCaseJ4 Writing core.properties file to /Users/jenkins/workspace/Lucene-Solr-6.x-MacOSX/solr/build/solr-core/test/J1/temp/solr.cloud.PeerSyncReplicationTest_FDEB62AD9ECD1C2E-001/shard-1-001/cores/collection1
   [junit4]   2> 1038287 INFO  (TEST-PeerSyncReplicationTest.test-seed#[FDEB62AD9ECD1C2E]) [    ] o.a.s.c.AbstractFullDistribZkTestBase create jetty 1 in directory /Users/jenkins/workspace/Lucene-Solr-6.x-MacOSX/solr/build/solr-core/test/J1/temp/solr.cloud.PeerSyncReplicationTest_FDEB62AD9ECD1C2E-001/shard-1-001
   [junit4]   2> 1038288 INFO  (TEST-PeerSyncReplicationTest.test-seed#[FDEB62AD9ECD1C2E]) [    ] o.e.j.s.Server jetty-9.3.14.v20161028
   [junit4]   2> 1038290 INFO  (TEST-PeerSyncReplicationTest.test-seed#[FDEB62AD9ECD1C2E]) [    ] o.e.j.s.h.ContextHandler Started o.e.j.s.ServletContextHandler@ef0f184{/pxi,null,AVAILABLE}
   [junit4]   2> 1038291 INFO  (TEST-PeerSyncReplicationTest.test-seed#[FDEB62AD9ECD1C2E]) [    ] o.e.j.s.AbstractConnector Started ServerConnector@88b973c{HTTP/1.1,[http/1.1]}{127.0.0.1:56091}
   [junit4]   2> 1038291 INFO  (TEST-PeerSyncReplicationTest.test-seed#[FDEB62AD9ECD1C2E]) [    ] o.e.j.s.Server Started @1043710ms
   [junit4]   2> 1038291 INFO  (TEST-PeerSyncReplicationTest.test-seed#[FDEB62AD9ECD1C2E]) [    ] o.a.s.c.s.e.JettySolrRunner Jetty properties: {solr.data.dir=/Users/jenkins/workspace/Lucene-Solr-6.x-MacOSX/solr/build/solr-core/test/J1/temp/solr.cloud.PeerSyncReplicationTest_FDEB62AD9ECD1C2E-001/tempDir-001/jetty1, solrconfig=solrconfig.xml, hostContext=/pxi, hostPort=56091, coreRootDirectory=/Users/jenkins/workspace/Lucene-Solr-6.x-MacOSX/solr/build/solr-core/test/J1/../../../../../../../../../Users/jenkins/workspace/Lucene-Solr-6.x-MacOSX/solr/build/solr-core/test/J1/temp/solr.cloud.PeerSyncReplicationTest_FDEB62AD9ECD1C2E-001/shard-1-001/cores}
   [junit4]   2> 1038292 ERROR (TEST-PeerSyncReplicationTest.test-seed#[FDEB62AD9ECD1C2E]) [    ] o.a.s.s.StartupLoggingUtils Missing Java Option solr.log.dir. Logging may be missing or incomplete.
   [junit4]   2> 1038292 INFO  (TEST-PeerSyncReplicationTest.test-seed#[FDEB62AD9ECD1C2E]) [    ] o.a.s.s.SolrDispatchFilter  ___      _       Welcome to Apache Solr™ version 6.4.0
   [junit4]   2> 1038293 INFO  (TEST-PeerSyncReplicationTest.test-seed#[FDEB62AD9ECD1C2E]) [    ] o.a.s.s.SolrDispatchFilter / __| ___| |_ _   Starting in cloud mode on port null
   [junit4]   2> 1038293 INFO  (TEST-PeerSyncReplicationTest.test-seed#[FDEB62AD9ECD1C2E]) [    ] o.a.s.s.SolrDispatchFilter \__ \/ _ \ | '_|  Install dir: null
   [junit4]   2> 1038293 INFO  (TEST-PeerSyncReplicationTest.test-seed#[FDEB62AD9ECD1C2E]) [    ] o.a.s.s.SolrDispatchFilter |___/\___/_|_|    Start time: 2017-01-04T07:00:14.813Z
   [junit4]   2> 1038298 INFO  (TEST-PeerSyncReplicationTest.test-seed#[FDEB62AD9ECD1C2E]) [    ] o.a.s.s.SolrDispatchFilter Loading solr.xml from SolrHome (not found in ZooKeeper)
   [junit4]   2> 1038298 INFO  (TEST-PeerSyncReplicationTest.test-seed#[FDEB62AD9ECD1C2E]) [    ] o.a.s.c.SolrXmlConfig Loading container configuration from /Users/jenkins/workspace/Lucene-Solr-6.x-MacOSX/solr/build/solr-core/test/J1/temp/solr.cloud.PeerSyncReplicationTest_FDEB62AD9ECD1C2E-001/shard-1-001/solr.xml
   [junit4]   2> 1038314 INFO  (TEST-PeerSyncReplicationTest.test-seed#[FDEB62AD9ECD1C2E]) [    ] o.a.s.u.UpdateShardHandler Creating UpdateShardHandler HTTP client with params: socketTimeout=340000&connTimeout=45000&retry=true
   [junit4]   2> 1038315 INFO  (TEST-PeerSyncReplicationTest.test-seed#[FDEB62AD9ECD1C2E]) [    ] o.a.s.c.ZkContainer Zookeeper client=127.0.0.1:56083/solr
   [junit4]   2> 1038348 INFO  (TEST-PeerSyncReplicationTest.test-seed#[FDEB62AD9ECD1C2E]) [n:127.0.0.1:56091_pxi    ] o.a.s.c.c.ZkStateReader Updated live nodes from ZooKeeper... (0) -> (1)
   [junit4]   2> 1038364 INFO  (TEST-PeerSyncReplicationTest.test-seed#[FDEB62AD9ECD1C2E]) [n:127.0.0.1:56091_pxi    ] o.a.s.c.ZkController Register node as live in ZooKeeper:/live_nodes/127.0.0.1:56091_pxi
   [junit4]   2> 1038370 INFO  (zkCallback-1522-thread-2-processing-n:127.0.0.1:56086_pxi) [n:127.0.0.1:56086_pxi    ] o.a.s.c.c.ZkStateReader Updated live nodes from ZooKeeper... (1) -> (2)
   [junit4]   2> 1038371 INFO  (zkCallback-1526-thread-1) [    ] o.a.s.c.c.ZkStateReader Updated live nodes from ZooKeeper... (1) -> (2)
   [junit4]   2> 1038372 INFO  (zkCallback-1531-thread-1-processing-n:127.0.0.1:56091_pxi) [n:127.0.0.1:56091_pxi    ] o.a.s.c.c.ZkStateReader Updated live nodes from ZooKeeper... (1) -> (2)
   [junit4]   2> 1038645 INFO  (TEST-PeerSyncReplicationTest.test-seed#[FDEB62AD9ECD1C2E]) [n:127.0.0.1:56091_pxi    ] o.a.s.c.CorePropertiesLocator Found 1 core definitions underneath /Users/jenkins/workspace/Lucene-Solr-6.x-MacOSX/solr/build/solr-core/test/J1/../../../../../../../../../Users/jenkins/workspace/Lucene-Solr-6.x-MacOSX/solr/build/solr-core/test/J1/temp/solr.cloud.PeerSyncReplicationTest_FDEB62AD9ECD1C2E-001/shard-1-001/cores
   [junit4]   2> 1038645 INFO  (TEST-PeerSyncReplicationTest.test-seed#[FDEB62AD9ECD1C2E]) [n:127.0.0.1:56091_pxi    ] o.a.s.c.CorePropertiesLocator Cores are: [collection1]
   [junit4]   2> 1038649 INFO  (OverseerStateUpdate-97223521667121156-127.0.0.1:56086_pxi-n_0000000000) [n:127.0.0.1:56086_pxi    ] o.a.s.c.o.ReplicaMutator Assigning new node to shard shard=shard1
   [junit4]   2> 1039677 INFO  (coreLoadExecutor-4292-thread-1-processing-n:127.0.0.1:56091_pxi) [n:127.0.0.1:56091_pxi c:collection1   x:collection1] o.a.s.c.SolrConfig Using Lucene MatchVersion: 6.4.0
   [junit4]   2> 1039693 INFO  (coreLoadExecutor-4292-thread-1-processing-n:127.0.0.1:56091_pxi) [n:127.0.0.1:56091_pxi c:collection1   x:collection1] o.a.s.s.IndexSchema [collection1] Schema name=test
   [junit4]   2> 1039801 WARN  (coreLoadExecutor-4292-thread-1-processing-n:127.0.0.1:56091_pxi) [n:127.0.0.1:56091_pxi c:collection1   x:collection1] o.a.s.s.IndexSchema [collection1] default search field in schema is text. WARNING: Deprecated, please use 'df' on request instead.
   [junit4]   2> 1039803 INFO  (coreLoadExecutor-4292-thread-1-processing-n:127.0.0.1:56091_pxi) [n:127.0.0.1:56091_pxi c:collection1   x:collection1] o.a.s.s.IndexSchema Loaded schema test/1.0 with uniqueid field id
   [junit4]   2> 1039828 INFO  (coreLoadExecutor-4292-thread-1-processing-n:127.0.0.1:56091_pxi) [n:127.0.0.1:56091_pxi c:collection1   x:collection1] o.a.s.c.CoreContainer Creating SolrCore 'collection1' using configuration from collection collection1
   [junit4]   2> 1039828 INFO  (coreLoadExecutor-4292-thread-1-processing-n:127.0.0.1:56091_pxi) [n:127.0.0.1:56091_pxi c:collection1   x:collection1] o.a.s.c.SolrCore [[collection1] ] Opening new SolrCore at [/Users/jenkins/workspace/Lucene-Solr-6.x-MacOSX/solr/build/solr-core/test/J1/temp/solr.cloud.PeerSyncReplicationTest_FDEB62AD9ECD1C2E-001/shard-1-001/cores/collection1], dataDir=[/Users/jenkins/workspace/Lucene-Solr-6.x-MacOSX/solr/build/solr-core/test/J1/../../../../../../../../../Users/jenkins/workspace/Lucene-Solr-6.x-MacOSX/solr/build/solr-core/test/J1/temp/solr.cloud.PeerSyncReplicationTest_FDEB62AD9ECD1C2E-001/shard-1-001/cores/collection1/data/]
   [junit4]   2> 1039828 INFO  (coreLoadExecutor-4292-thread-1-processing-n:127.0.0.1:56091_pxi) [n:127.0.0.1:56091_pxi c:collection1   x:collection1] o.a.s.c.JmxMonitoredMap JMX monitoring is enabled. Adding Solr mbeans to JMX Server: com.sun.jmx.mbeanserver.JmxMBeanServer@330baf4d
   [junit4]   2> 1039832 INFO  (coreLoadExecutor-4292-thread-1-processing-n:127.0.0.1:56091_pxi) [n:127.0.0.1:56091_pxi c:collection1   x:collection1] o.a.s.u.RandomMergePolicy RandomMergePolicy wrapping class org.apache.lucene.index.LogByteSizeMergePolicy: [LogByteSizeMergePolicy: minMergeSize=1677721, mergeFactor=28, maxMergeSize=2147483648, maxMergeSizeForForcedMerge=9223372036854775807, calibrateSizeByDeletes=false, maxMergeDocs=2147483647, maxCFSSegmentSizeMB=8.796093022207999E12, noCFSRatio=1.0]
   [junit4]   2> 1039858 WARN  (coreLoadExecutor-4292-thread-1-processing-n:127.0.0.1:56091_pxi) [n:127.0.0.1:56091_pxi c:collection1   x:collection1] o.a.s.c.RequestHandlers INVALID paramSet a in requestHandler {type = requestHandler,name = /dump,class = DumpRequestHandler,attributes = {initParams=a, name=/dump, class=DumpRequestHandler},args = {defaults={a=A,b=B}}}
   [junit4]   2> 1039875 INFO  (coreLoadExecutor-4292-thread-1-processing-n:127.0.0.1:56091_pxi) [n:127.0.0.1:56091_pxi c:collection1   x:collection1] o.a.s.u.UpdateHandler Using UpdateLog implementation: org.apache.solr.update.UpdateLog
   [junit4]   2> 1039876 INFO  (coreLoadExecutor-4292-thread-1-processing-n:127.0.0.1:56091_pxi) [n:127.0.0.1:56091_pxi c:collection1   x:collection1] o.a.s.u.UpdateLog Initializing UpdateLog: dataDir= defaultSyncLevel=FLUSH numRecordsToKeep=1000 maxNumLogsToKeep=10 numVersionBuckets=65536
   [junit4]   2> 1039877 INFO  (coreLoadExecutor-4292-thread-1-processing-n:127.0.0.1:56091_pxi) [n:127.0.0.1:56091_pxi c:collection1   x:collection1] o.a.s.u.CommitTracker Hard AutoCommit: disabled
   [junit4]   2> 1039877 INFO  (coreLoadExecutor-4292-thread-1-processing-n:127.0.0.1:56091_pxi) [n:127.0.0.1:56091_pxi c:collection1   x:collection1] o.a.s.u.CommitTracker Soft AutoCommit: disabled
   [junit4]   2> 1039878 INFO  (coreLoadExecutor-4292-thread-1-processing-n:127.0.0.1:56091_pxi) [n:127.0.0.1:56091_pxi c:collection1   x:collection1] o.a.s.u.RandomMergePolicy RandomMergePolicy wrapping class org.apache.lucene.index.LogDocMergePolicy: [LogDocMergePolicy: minMergeSize=1000, mergeFactor=45, maxMergeSize=9223372036854775807, maxMergeSizeForForcedMerge=9223372036854775807, calibrateSizeByDeletes=false, maxMergeDocs=2147483647, maxCFSSegmentSizeMB=8.796093022207999E12, noCFSRatio=0.0]
   [junit4]   2> 1039900 INFO  (coreLoadExecutor-4292-thread-1-processing-n:127.0.0.1:56091_pxi) [n:127.0.0.1:56091_pxi c:collection1   x:collection1] o.a.s.s.SolrIndexSearcher Opening [Searcher@6b2affa7[collection1] main]
   [junit4]   2> 1039902 INFO  (coreLoadExecutor-4292-thread-1-processing-n:127.0.0.1:56091_pxi) [n:127.0.0.1:56091_pxi c:collection1   x:collection1] o.a.s.r.ManagedResourceStorage Configured ZooKeeperStorageIO with znodeBase: /configs/conf1
   [junit4]   2> 1039903 INFO  (coreLoadExecutor-4292-thread-1-processing-n:127.0.0.1:56091_pxi) [n:127.0.0.1:56091_pxi c:collection1   x:collection1] o.a.s.r.ManagedResourceStorage Loaded null at path _rest_managed.json using ZooKeeperStorageIO:path=/configs/conf1
   [junit4]   2> 1039903 INFO  (coreLoadExecutor-4292-thread-1-processing-n:127.0.0.1:56091_pxi) [n:127.0.0.1:56091_pxi c:collection1   x:collection1] o.a.s.h.ReplicationHandler Commits will be reserved for  10000
   [junit4]   2> 1039904 INFO  (searcherExecutor-4293-thread-1-processing-n:127.0.0.1:56091_pxi x:collection1 c:collection1) [n:127.0.0.1:56091_pxi c:collection1   x:collection1] o.a.s.c.SolrCore [collection1] Registered new searcher Searcher@6b2affa7[collection1] main{ExitableDirectoryReader(UninvertingDirectoryReader())}
   [junit4]   2> 1039904 INFO  (coreLoadExecutor-4292-thread-1-processing-n:127.0.0.1:56091_pxi) [n:127.0.0.1:56091_pxi c:collection1   x:collection1] o.a.s.u.UpdateLog Could not find max version in index or recent updates, using new clock 1555576354425012224
   [junit4]   2> 1039915 INFO  (coreZkRegister-4287-thread-1-processing-n:127.0.0.1:56091_pxi x:collection1 c:collection1) [n:127.0.0.1:56091_pxi c:collection1 s:shard1 r:core_node1 x:collection1] o.a.s.c.ShardLeaderElectionContext Enough replicas found to continue.
   [junit4]   2> 1039915 INFO  (coreZkRegister-4287-thread-1-processing-n:127.0.0.1:56091_pxi x:collection1 c:collection1) [n:127.0.0.1:56091_pxi c:collection1 s:shard1 r:core_node1 x:collection1] o.a.s.c.ShardLeaderElectionContext I may be the new leader - try and sync
   [junit4]   2> 1039915 INFO  (coreZkRegister-4287-thread-1-processing-n:127.0.0.1:56091_pxi x:collection1 c:collection1) [n:127.0.0.1:56091_pxi c:collection1 s:shard1 r:core_node1 x:collection1] o.a.s.c.SyncStrategy Sync replicas to http://127.0.0.1:56091/pxi/collection1/
   [junit4]   2> 1039915 INFO  (coreZkRegister-4287-thread-1-processing-n:127.0.0.1:56091_pxi x:collection1 c:collection1) [n:127.0.0.1:56091_pxi c:collection1 s:shard1 r:core_node1 x:collection1] o.a.s.c.SyncStrategy Sync Success - now sync replicas to me
   [junit4]   2> 1039915 INFO  (coreZkRegister-4287-thread-1-processing-n:127.0.0.1:56091_pxi x:collection1 c:collection1) [n:127.0.0.1:56091_pxi c:collection1 s:shard1 r:core_node1 x:collection1] o.a.s.c.SyncStrategy http://127.0.0.1:56091/pxi/collection1/ has no replicas
   [junit4]   2> 1039925 INFO  (coreZkRegister-4287-thread-1-processing-n:127.0.0.1:56091_pxi x:collection1 c:collection1) [n:127.0.0.1:56091_pxi c:collection1 s:shard1 r:core_node1 x:collection1] o.a.s.c.ShardLeaderElectionContext I am the new leader: http://127.0.0.1:56091/pxi/collection1/ shard1
   [junit4]   2> 1040079 INFO  (coreZkRegister-4287-thread-1-processing-n:127.0.0.1:56091_pxi x:collection1 c:collection1) [n:127.0.0.1:56091_pxi c:collection1 s:shard1 r:core_node1 x:collection1] o.a.s.c.ZkController I am the leader, no recovery necessary
   [junit4]   2> 1040617 INFO  (TEST-PeerSyncReplicationTest.test-seed#[FDEB62AD9ECD1C2E]) [    ] o.a.s.SolrTestCaseJ4 Writing core.properties file to /Users/jenkins/workspace/Lucene-Solr-6.x-MacOSX/solr/build/solr-core/test/J1/temp/solr.cloud.PeerSyncReplicationTest_FDEB62AD9ECD1C2E-001/shard-2-001/cores/collection1
   [junit4]   2> 1040619 INFO  (TEST-PeerSyncReplicationTest.test-seed#[FDEB62AD9ECD1C2E]) [    ] o.a.s.c.AbstractFullDistribZkTestBase create jetty 2 in directory /Users/jenkins/workspace/Lucene-Solr-6.x-MacOSX/solr/build/solr-core/test/J1/temp/solr.cloud.PeerSyncReplicationTest_FDEB62AD9ECD1C2E-001/shard-2-001
   [junit4]   2> 1040619 INFO  (TEST-PeerSyncReplicationTest.test-seed#[FDEB62AD9ECD1C2E]) [    ] o.e.j.s.Server jetty-9.3.14.v20161028
   [junit4]   2> 1040621 INFO  (TEST-PeerSyncReplicationTest.test-seed#[FDEB62AD9ECD1C2E]) [    ] o.e.j.s.h.ContextHandler Started o.e.j.s.ServletContextHandler@7fa07fc7{/pxi,null,AVAILABLE}
   [junit4]   2> 1040623 INFO  (TEST-PeerSyncReplicationTest.test-seed#[FDEB62AD9ECD1C2E]) [    ] o.e.j.s.AbstractConnector Started ServerConnector@cce27b4{HTTP/1.1,[http/1.1]}{127.0.0.1:56095}
   [junit4]   2> 1040623 INFO  (TEST-PeerSyncReplicationTest.test-seed#[FDEB62AD9ECD1C2E]) [    ] o.e.j.s.Server Started @1046042ms
   [junit4]   2> 1040623 INFO  (TEST-PeerSyncReplicationTest.test-seed#[FDEB62AD9ECD1C2E]) [    ] o.a.s.c.s.e.JettySolrRunner Jetty properties: {solr.data.dir=/Users/jenkins/workspace/Lucene-Solr-6.x-MacOSX/solr/build/solr-core/test/J1/temp/solr.cloud.PeerSyncReplicationTest_FDEB62AD9ECD1C2E-001/tempDir-001/jetty2, solrconfig=solrconfig.xml, hostContext=/pxi, hostPort=56095, coreRootDirectory=/Users/jenkins/workspace/Lucene-Solr-6.x-MacOSX/solr/build/solr-core/test/J1/temp/solr.cloud.PeerSyncReplicationTest_FDEB62AD9ECD1C2E-001/shard-2-001/cores}
   [junit4]   2> 1040623 ERROR (TEST-PeerSyncReplicationTest.test-seed#[FDEB62AD9ECD1C2E]) [    ] o.a.s.s.StartupLoggingUtils Missing Java Option solr.log.dir. Logging may be missing or incomplete.
   [junit4]   2> 1040624 INFO  (TEST-PeerSyncReplicationTest.test-seed#[FDEB62AD9ECD1C2E]) [    ] o.a.s.s.SolrDispatchFilter  ___      _       Welcome to Apache Solr™ version 6.4.0
   [junit4]   2> 1040624 INFO  (TEST-PeerSyncReplicationTest.test-seed#[FDEB62AD9ECD1C2E]) [    ] o.a.s.s.SolrDispatchFilter / __| ___| |_ _   Starting in cloud mode on port null
   [junit4]   2> 1040624 INFO  (TEST-PeerSyncReplicationTest.test-seed#[FDEB62AD9ECD1C2E]) [    ] o.a.s.s.SolrDispatchFilter \__ \/ _ \ | '_|  Install dir: null
   [junit4]   2> 1040624 INFO  (TEST-PeerSyncReplicationTest.test-seed#[FDEB62AD9ECD1C2E]) [    ] o.a.s.s.SolrDispatchFilter |___/\___/_|_|    Start time: 2017-01-04T07:00:17.144Z
   [junit4]   2> 1040629 INFO  (TEST-PeerSyncReplicationTest.test-seed#[FDEB62AD9ECD1C2E]) [    ] o.a.s.s.SolrDispatchFilter Loading solr.xml from SolrHome (not found in ZooKeeper)
   [junit4]   2> 1040629 INFO  (TEST-PeerSyncReplicationTest.test-seed#[FDEB62AD9ECD1C2E]) [    ] o.a.s.c.SolrXmlConfig Loading container configuration from /Users/jenkins/workspace/Lucene-Solr-6.x-MacOSX/solr/build/solr-core/test/J1/temp/solr.cloud.PeerSyncReplicationTest_FDEB62AD9ECD1C2E-001/shard-2-001/solr.xml
   [junit4]   2> 1040661 INFO  (TEST-PeerSyncReplicationTest.test-seed#[FDEB62AD9ECD1C2E]) [    ] o.a.s.u.UpdateShardHandler Creating UpdateShardHandler HTTP client with params: socketTimeout=340000&connTimeout=45000&retry=true
   [junit4]   2> 1040662 INFO  (TEST-PeerSyncReplicationTest.test-seed#[FDEB62AD9ECD1C2E]) [    ] o.a.s.c.ZkContainer Zookeeper client=127.0.0.1:56083/solr
   [junit4]   2> 1040692 INFO  (TEST-PeerSyncReplicationTest.test-seed#[FDEB62AD9ECD1C2E]) [n:127.0.0.1:56095_pxi    ] o.a.s.c.c.ZkStateReader Updated live nodes from ZooKeeper... (0) -> (2)
   [junit4]   2> 1040728 INFO  (TEST-PeerSyncReplicationTest.test-seed#[FDEB62AD9ECD1C2E]) [n:127.0.0.1:56095_pxi    ] o.a.s.c.ZkController Register node as live in ZooKeeper:/live_nodes/127.0.0.1:56095_pxi
   [junit4]   2> 1040733 INFO  (zkCallback-1522-thread-3-processing-n:127.0.0.1:56086_pxi) [n:127.0.0.1:56086_pxi    ] o.a.s.c.c.ZkStateReader Updated live nodes from ZooKeeper... (2) -> (3)
   [junit4]   2> 1040733 INFO  (zkCallback-1526-thread-1) [    ] o.a.s.c.c.ZkStateReader Updated live nodes from ZooKeeper... (2) -> (3)
   [junit4]   2> 1040733 INFO  (zkCallback-1531-thread-1-processing-n:127.0.0.1:56091_pxi) [n:127.0.0.1:56091_pxi    ] o.a.s.c.c.ZkStateReader Updated live nodes from ZooKeeper... (2) -> (3)
   [junit4]   2> 1040734 INFO  (zkCallback-1537-thread-1-processing-n:127.0.0.1:56095_pxi) [n:127.0.0.1:56095_pxi    ] o.a.s.c.c.ZkStateReader Updated live nodes from ZooKeeper... (2) -> (3)
   [junit4]   2> 1040847 INFO  (TEST-PeerSyncReplicationTest.test-seed#[FDEB62AD9ECD1C2E]) [n:127.0.0.1:56095_pxi    ] o.a.s.c.CorePropertiesLocator Found 1 core definitions underneath /Users/jenkins/workspace/Lucene-Solr-6.x-MacOSX/solr/build/solr-core/test/J1/temp/solr.cloud.PeerSyncReplicationTest_FDEB62AD9ECD1C2E-001/shard-2-001/cores
   [junit4]   2> 1040847 INFO  (TEST-PeerSyncReplicationTest.test-seed#[FDEB62AD9ECD1C2E]) [n:127.0.0.1:56095_pxi    ] o.a.s.c.CorePropertiesLocator Cores are: [collection1]
   [junit4]   2> 1040850 INFO  (OverseerStateUpdate-97223521667121156-127.0.0.1:56086_pxi-n_0000000000) [n:127.0.0.1:56086_pxi    ] o.a.s.c.o.ReplicaMutator Assigning new node to shard shard=shard1
   [junit4]   2> 1041873 INFO  (coreLoadExecutor-4303-thread-1-processing-n:127.0.0.1:56095_pxi) [n:127.0.0.1:56095_pxi c:collection1   x:collection1] o.a.s.c.SolrConfig Using Lucene MatchVersion: 6.4.0
   [junit4]   2> 1041894 INFO  (coreLoadExecutor-4303-thread-1-processing-n:127.0.0.1:56095_pxi) [n:127.0.0.1:56095_pxi c:collection1   x:collection1] o.a.s.s.IndexSchema [collection1] Schema name=test
   [junit4]   2> 1042033 WARN  (coreLoadExecutor-4303-thread-1-processing-n:127.0.0.1:56095_pxi) [n:127.0.0.1:56095_pxi c:collection1   x:collection1] o.a.s.s.IndexSchema [collection1] default search field in schema is text. WARNING: Deprecated, please use 'df' on request instead.
   [junit4]   2> 1042040 INFO  (coreLoadExecutor-4303-thread-1-processing-n:127.0.0.1:56095_pxi) [n:127.0.0.1:56095_pxi c:collection1   x:collection1] o.a.s.s.IndexSchema Loaded schema test/1.0 with uniqueid field id
   [junit4]   2> 1042068 INFO  (coreLoadExecutor-4303-thread-1-processing-n:127.0.0.1:56095_pxi) [n:127.0.0.1:56095_pxi c:collection1   x:collection1] o.a.s.c.CoreContainer Creating SolrCore 'collection1' using configuration from collection collection1
   [junit4]   2> 1042068 INFO  (coreLoadExecutor-4303-thread-1-processing-n:127.0.0.1:56095_pxi) [n:127.0.0.1:56095_pxi c:collection1   x:collection1] o.a.s.c.SolrCore [[collection1] ] Opening new SolrCore at [/Users/jenkins/workspace/Lucene-Solr-6.x-MacOSX/solr/build/solr-core/test/J1/temp/solr.cloud.PeerSyncReplicationTest_FDEB62AD9ECD1C2E-001/shard-2-001/cores/collection1], dataDir=[/Users/jenkins/workspace/Lucene-Solr-6.x-MacOSX/solr/build/solr-core/test/J1/temp/solr.cloud.PeerSyncReplicationTest_FDEB62AD9ECD1C2E-001/shard-2-001/cores/collection1/data/]
   [junit4]   2> 1042068 INFO  (coreLoadExecutor-4303-thread-1-processing-n:127.0.0.1:56095_pxi) [n:127.0.0.1:56095_pxi c:collection1   x:collection1] o.a.s.c.JmxMonitoredMap JMX monitoring is enabled. Adding Solr mbeans to JMX Server: com.sun.jmx.mbeanserver.JmxMBeanServer@330baf4d
   [junit4]   2> 1042071 INFO  (coreLoadExecutor-4303-thread-1-processing-n:127.0.0.1:56095_pxi) [n:127.0.0.1:56095_pxi c:collection1   x:collection1] o.a.s.u.RandomMergePolicy RandomMergePolicy wrapping class org.apache.lucene.index.LogByteSizeMergePolicy: [LogByteSizeMergePolicy: minMergeSize=1677721, mergeFactor=28, maxMergeSize=2147483648, maxMergeSizeForForcedMerge=9223372036854775807, calibrateSizeByDeletes=false, maxMergeDocs=2147483647, maxCFSSegmentSizeMB=8.796093022207999E12, noCFSRatio=1.0]
   [junit4]   2> 1042080 WARN  (coreLoadExecutor-4303-thread-1-processing-n:127.0.0.1:56095_pxi) [n:127.0.0.1:56095_pxi c:collection1   x:collection1] o.a.s.c.RequestHandlers INVALID paramSet a in requestHandler {type = requestHandler,name = /dump,class = DumpRequestHandler,attributes = {initParams=a, name=/dump, class=DumpRequestHandler},args = {defaults={a=A,b=B}}}
   [junit4]   2> 1042137 INFO  (coreLoadExecutor-4303-thread-1-processing-n:127.0.0.1:56095_pxi) [n:127.0.0.1:56095_pxi c:collection1   x:collection1] o.a.s.u.UpdateHandler Using UpdateLog implementation: org.apache.solr.update.UpdateLog
   [junit4]   2> 1042137 INFO  (coreLoadExecutor-4303-thread-1-processing-n:127.0.0.1:56095_pxi) [n:127.0.0.1:56095_pxi c:collection1   x:collection1] o.a.s.u.UpdateLog Initializing UpdateLog: dataDir= defaultSyncLevel=FLUSH numRecordsToKeep=1000 maxNumLogsToKeep=10 numVersionBuckets=65536
   [junit4]   2> 1042139 INFO  (coreLoadExecutor-4303-thread-1-processing-n:127.0.0.1:56095_pxi) [n:127.0.0.1:56095_pxi c:collection1   x:collection1] o.a.s.u.CommitTracker Hard AutoCommit: disabled
   [junit4]   2> 1042139 INFO  (coreLoadExecutor-4303-thread-1-processing-n:127.0.0.1:56095_pxi) [n:127.0.0.1:56095_pxi c:collection1   x:collection1] o.a.s.u.CommitTracker Soft AutoCommit: disabled
   [junit4]   2> 1042140 INFO  (coreLoadExecutor-4303-thread-1-processing-n:127.0.0.1:56095_pxi) [n:127.0.0.1:56095_pxi c:collection1   x:collection1] o.a.s.u.RandomMergePolicy RandomMergePolicy wrapping class org.apache.lucene.index.LogDocMergePolicy: [LogDocMergePolicy: minMergeSize=1000, mergeFactor=45, maxMergeSize=9223372036854775807, maxMergeSizeForForcedMerge=9223372036854775807, calibrateSizeByDeletes=false, maxMergeDocs=2147483647, maxCFSSegmentSizeMB=8.796093022207999E12, noCFSRatio=0.0]
   [junit4]   2> 1042162 INFO  (coreLoadExecutor-4303-thread-1-processing-n:127.0.0.1:56095_pxi) [n:127.0.0.1:56095_pxi c:collection1   x:collection1] o.a.s.s.SolrIndexSearcher Opening [Searcher@7592de16[collection1] main]
   [junit4]   2> 1042164 INFO  (coreLoadExecutor-4303-thread-1-processing-n:127.0.0.1:56095_pxi) [n:127.0.0.1:56095_pxi c:collection1   x:collection1] o.a.s.r.ManagedResourceStorage Configured ZooKeeperStorageIO with znodeBase: /configs/conf1
   [junit4]   2> 1042165 INFO  (coreLoadExecutor-4303-thread-1-processing-n:127.0.0.1:56095_pxi) [n:127.0.0.1:56095_pxi c:collection1   x:collection1] o.a.s.r.ManagedResourceStorage Loaded null at path _rest_managed.json using ZooKeeperStorageIO:path=/configs/conf1
   [junit4]   2> 1042165 INFO  (coreLoadExecutor-4303-thread-1-processing-n:127.0.0.1:56095_pxi) [n:127.0.0.1:56095_pxi c:collection1   x:collection1] o.a.s.h.ReplicationHandler Commits will be reserved for  10000
   [junit4]   2> 1042166 INFO  (searcherExecutor-4304-thread-1-processing-n:127.0.0.1:56095_pxi x:collection1 c:collection1) [n:127.0.0.1:56095_pxi c:collection1   x:collection1] o.a.s.c.SolrCore [collection1] Registered new searcher Searcher@7592de16[collection1] main{ExitableDirectoryReader(UninvertingDirectoryReader())}
   [junit4]   2> 1042166 INFO  (coreLoadExecutor-4303-thread-1-processing-n:127.0.0.1:56095_pxi) [n:127.0.0.1:56095_pxi c:collection1   x:collection1] o.a.s.u.UpdateLog Could not find max version in index or recent updates, using new clock 1555576356796891136
   [junit4]   2> 1042173 INFO  (coreZkRegister-4298-thread-1-processing-n:127.0.0.1:56095_pxi x:collection1 c:collection1) [n:127.0.0.1:56095_pxi c:collection1 s:shard1 r:core_node2 x:collection1] o.a.s.c.ZkController Core needs to recover:collection1
   [junit4]   2> 1042173 INFO  (updateExecutor-1534-thread-1-processing-n:127.0.0.1:56095_pxi x:collection1 s:shard1 c:collection1 r:core_node2) [n:127.0.0.1:56095_pxi c:collection1 s:shard1 r:core_node2 x:collection1] o.a.s.u.DefaultSolrCoreState Running recovery
   [junit4]   2> 1042174 INFO  (recoveryExecutor-1535-thread-1-processing-n:127.0.0.1:56095_pxi x:collection1 s:shard1 c:collection1 r:core_node2) [n:127.0.0.1:56095_pxi c:collection1 s:shard1 r:core_node2 x:collection1] o.a.s.c.RecoveryStrategy Starting recovery process. recoveringAfterStartup=true
   [junit4]   2> 1042176 INFO  (recoveryExecutor-1535-thread-1-processing-n:127.0.0.1:56095_pxi x:collection1 s:shard1 c:collection1 r:core_node2) [n:127.0.0.1:56095_pxi c:collection1 s:shard1 r:core_node2 x:collection1] o.a.s.c.RecoveryStrategy ###### startupVersions=[[]]
   [junit4]   2> 1042176 INFO  (recoveryExecutor-1535-thread-1-processing-n:127.0.0.1:56095_pxi x:collection1 s:shard1 c:collection1 r:core_node2) [n:127.0.0.1:56095_pxi c:collection1 s:shard1 r:core_node2 x:collection1] o.a.s.c.RecoveryStrategy Begin buffering updates. core=[collection1]
   [junit4]   2> 1042176 INFO  (recoveryExecutor-1535-thread-1-processing-n:127.0.0.1:56095_pxi x:collection1 s:shard1 c:collection1 r:core_node2) [n:127.0.0.1:56095_pxi c:collection1 s:shard1 r:core_node2 x:collection1] o.a.s.u.UpdateLog Starting to buffer updates. FSUpdateLog{state=ACTIVE, tlog=null}
   [junit4]   2> 1042176 INFO  (recoveryExecutor-1535-thread-1-processing-n:127.0.0.1:56095_pxi x:collection1 s:shard1 c:collection1 r:core_node2) [n:127.0.0.1:56095_pxi c:collection1 s:shard1 r:core_node2 x:collection1] o.a.s.c.RecoveryStrategy Publishing state of core [collection1] as recovering, leader is [http://127.0.0.1:56091/pxi/collection1/] and I am [http://127.0.0.1:56095/pxi/collection1/]
   [junit4]   2> 1042182 INFO  (recoveryExecutor-1535-thread-1-processing-n:127.0.0.1:56095_pxi x:collection1 s:shard1 c:collection1 r:core_node2) [n:127.0.0.1:56095_pxi c:collection1 s:shard1 r:core_node2 x:collection1] o.a.s.c.RecoveryStrategy Sending prep recovery command to [http://127.0.0.1:56091/pxi]; [WaitForState: action=PREPRECOVERY&core=collection1&nodeName=127.0.0.1:56095_pxi&coreNodeName=core_node2&state=recovering&checkLive=true&onlyIfLeader=true&onlyIfLeaderActive=true]
   [junit4]   2> 1042188 INFO  (qtp1804106277-8769) [n:127.0.0.1:56091_pxi    ] o.a.s.h.a.PrepRecoveryOp Going to wait for coreNodeName: core_node2, state: recovering, checkLive: true, onlyIfLeader: true, onlyIfLeaderActive: true
   [junit4]   2> 1042189 INFO  (qtp1804106277-8769) [n:127.0.0.1:56091_pxi    ] o.a.s.h.a.PrepRecoveryOp Will wait a max of 183 seconds to see collection1 (shard1 of collection1) have state: recovering
   [junit4]   2> 1042189 INFO  (qtp1804106277-8769) [n:127.0.0.1:56091_pxi    ] o.a.s.h.a.PrepRecoveryOp In WaitForState(recovering): collection=collection1, shard=shard1, thisCore=collection1, leaderDoesNotNeedRecovery=false, isLeader? true, live=true, checkLive=true, currentState=down, localState=active, nodeName=127.0.0.1:56095_pxi, coreNodeName=core_node2, onlyIfActiveCheckResult=false, nodeProps: core_node2:{"core":"collection1","base_url":"http://127.0.0.1:56095/pxi","node_name":"127.0.0.1:56095_pxi","state":"down"}
   [junit4]   2> 1042991 INFO  (TEST-PeerSyncReplicationTest.test-seed#[FDEB62AD9ECD1C2E]) [    ] o.a.s.SolrTestCaseJ4 Writing core.properties file to /Users/jenkins/workspace/Lucene-Solr-6.x-MacOSX/solr/build/solr-core/test/J1/temp/solr.cloud.PeerSyncReplicationTest_FDEB62AD9ECD1C2E-001/shard-3-001/cores/collection1
   [junit4]   2> 1042992 INFO  (TEST-PeerSyncReplicationTest.test-seed#[FDEB62AD9ECD1C2E]) [    ] o.a.s.c.AbstractFullDistribZkTestBase create jetty 3 in directory /Users/jenkins/workspace/Lucene-Solr-6.x-MacOSX/solr/build/solr-core/test/J1/temp/solr.cloud.PeerSyncReplicationTest_FDEB62AD9ECD1C2E-001/shard-3-001
   [junit4]   2> 1043006 INFO  (TEST-PeerSyncReplicationTest.test-seed#[FDEB62AD9ECD1C2E]) [    ] o.e.j.s.Server jetty-9.3.14.v20161028
   [junit4]   2> 1043014 INFO  (TEST-PeerSyncReplicationTest.test-seed#[FDEB62AD9ECD1C2E]) [    ] o.e.j.s.h.ContextHandler Started o.e.j.s.ServletContextHandler@779d11ef{/pxi,null,AVAILABLE}
   [junit4]   2> 1043015 INFO  (TEST-PeerSyncReplicationTest.test-seed#[FDEB62AD9ECD1C2E]) [    ] o.e.j.s.AbstractConnector Started ServerConnector@6d5e6f6c{HTTP/1.1,[http/1.1]}{127.0.0.1:56100}
   [junit4]   2> 1043015 INFO  (TEST-PeerSyncReplicationTest.test-seed#[FDEB62AD9ECD1C2E]) [    ] o.e.j.s.Server Started @1048434ms
   [junit4]   2> 1043015 INFO  (TEST-PeerSyncReplicationTest.test-seed#[FDEB62AD9ECD1C2E]) [    ] o.a.s.c.s.e.JettySolrRunner Jetty properties: {solr.data.dir=/Users/jenkins/workspace/Lucene-Solr-6.x-MacOSX/solr/build/solr-core/test/J1/temp/solr.cloud.PeerSyncReplicationTest_FDEB62AD9ECD1C2E-001/tempDir-001/jetty3, solrconfig=solrconfig.xml, hostContext=/pxi, hostPort=56100, coreRootDirectory=/Users/jenkins/workspace/Lucene-Solr-6.x-MacOSX/solr/build/solr-core/test/J1/../../../../../../../../../Users/jenkins/workspace/Lucene-Solr-6.x-MacOSX/solr/build/solr-core/test/J1/temp/solr.cloud.PeerSyncReplicationTest_FDEB62AD9ECD1C2E-001/shard-3-001/cores}
   [junit4]   2> 1043015 ERROR (TEST-PeerSyncReplicationTest.test-seed#[FDEB62AD9ECD1C2E]) [    ] o.a.s.s.StartupLoggingUtils Missing Java Option solr.log.dir. Logging may be missing or incomplete.
   [junit4]   2> 1043016 INFO  (TEST-PeerSyncReplicationTest.test-seed#[FDEB62AD9ECD1C2E]) [    ] o.a.s.s.SolrDispatchFilter  ___      _       Welcome to Apache Solr™ version 6.4.0
   [junit4]   2> 1043017 INFO  (TEST-PeerSyncReplicationTest.test-seed#[FDEB62AD9ECD1C2E]) [    ] o.a.s.s.SolrDispatchFilter / __| ___| |_ _   Starting in cloud mode on port null
   [junit4]   2> 1043017 INFO  (TEST-PeerSyncReplicationTest.test-seed#[FDEB62AD9ECD1C2E]) [    ] o.a.s.s.SolrDispatchFilter \__ \/ _ \ | '_|  Install dir: null
   [junit4]   2> 1043017 INFO  (TEST-PeerSyncReplicationTest.test-seed#[FDEB62AD9ECD1C2E]) [    ] o.a.s.s.SolrDispatchFilter |___/\___/_|_|    Start time: 2017-01-04T07:00:19.537Z
   [junit4]   2> 1043026 INFO  (TEST-PeerSyncReplicationTest.test-seed#[FDEB62AD9ECD1C2E]) [    ] o.a.s.s.SolrDispatchFilter Loading solr.xml from SolrHome (not found in ZooKeeper)
   [junit4]   2> 1043026 INFO  (TEST-PeerSyncReplicationTest.test-seed#[FDEB62AD9ECD1C2E]) [    ] o.a.s.c.SolrXmlConfig Loading container configuration from /Users/jenkins/workspace/Lucene-Solr-6.x-MacOSX/solr/build/solr-core/test/J1/temp/solr.cloud.PeerSyncReplicationTest_FDEB62AD9ECD1C2E-001/shard-3-001/solr.xml
   [junit4]   2> 1043047 INFO  (TEST-PeerSyncReplicationTest.test-seed#[FDEB62AD9ECD1C2E]) [    ] o.a.s.u.UpdateShardHandler Creating UpdateShardHandler HTTP client with params: socketTimeout=340000&connTimeout=45000&retry=true
   [junit4]   2> 1043053 INFO  (TEST-PeerSyncReplicationTest.test-seed#[FDEB62AD9ECD1C2E]) [    ] o.a.s.c.ZkContainer Zookeeper client=127.0.0.1:56083/solr
   [junit4]   2> 1043079 INFO  (TEST-PeerSyncReplicationTest.test-seed#[FDEB62AD9ECD1C2E]) [n:127.0.0.1:56100_pxi    ] o.a.s.c.c.ZkStateReader Updated live nodes from ZooKeeper... (0) -> (3)
   [junit4]   2> 1043090 INFO  (TEST-PeerSyncReplicationTest.test-seed#[FDEB62AD9ECD1C2E]) [n:127.0.0.1:56100_pxi    ] o.a.s.c.ZkController Register node as live in ZooKeeper:/live_nodes/127.0.0.1:56100_pxi
   [junit4]   2> 1043096 INFO  (zkCallback-1522-thread-1-processing-n:127.0.0.1:56086_pxi) [n:127.0.0.1:56086_pxi    ] o.a.s.c.c.ZkStateReader Updated live nodes from ZooKeeper... (3) -> (4)
   [junit4]   2> 1043096 INFO  (zkCallback-1537-thread-1-processing-n:127.0.0.1:56095_pxi) [n:127.0.0.1:56095_pxi    ] o.a.s.c.c.ZkStateReader Updated live nodes from ZooKeeper... (3) -> (4)
   [junit4]   2> 1043096 INFO  (zkCallback-1531-thread-1-processing-n:127.0.0.1:56091_pxi) [n:127.0.0.1:56091_pxi    ] o.a.s.c.c.ZkStateReader Updated live nodes from ZooKeeper... (3) -> (4)
   [junit4]   2> 1043096 INFO  (zkCallback-1526-thread-1) [    ] o.a.s.c.c.ZkStateReader Updated live nodes from ZooKeeper... (3) -> (4)
   [junit4]   2> 1043098 INFO  (zkCallback-1544-thread-1-processing-n:127.0.0.1:56100_pxi) [n:127.0.0.1:56100_pxi    ] o.a.s.c.c.ZkStateReader Updated live nodes from ZooKeeper... (3) -> (4)
   [junit4]   2> 1043148 INFO  (TEST-PeerSyncReplicationTest.test-seed#[FDEB62AD9ECD1C2E]) [n:127.0.0.1:56100_pxi    ] o.a.s.c.CorePropertiesLocator Found 1 core definitions underneath /Users/jenkins/workspace/Lucene-Solr-6.x-MacOSX/solr/build/solr-core/test/J1/../../../../../../../../../Users/jenkins/workspace/Lucene-Solr-6.x-MacOSX/solr/build/solr-core/test/J1/temp/solr.cloud.PeerSyncReplicationTest_FDEB62AD9ECD1C2E-001/shard-3-001/cores
   [junit4]   2> 1043148 INFO  (TEST-PeerSyncReplicationTest.test-seed#[FDEB62AD9ECD1C2E]) [n:127.0.0.1:56100_pxi    ] o.a.s.c.CorePropertiesLocator Cores are: [collection1]
   [junit4]   2> 1043152 INFO  (OverseerStateUpdate-97223521667121156-127.0.0.1:56086_pxi-n_0000000000) [n:127.0.0.1:56086_pxi    ] o.a.s.c.o.ReplicaMutator Assigning new node to shard shard=shard1
   [junit4]   2> 1043191 INFO  (qtp1804106277-8769) [n:127.0.0.1:56091_pxi    ] o.a.s.h.a.PrepRecoveryOp In WaitForState(recovering): collection=collection1, shard=shard1, thisCore=collection1, leaderDoesNotNeedRecovery=false, isLeader? true, live=true, checkLive=true, currentState=recovering, localState=active, nodeName=127.0.0.1:56095_pxi, coreNodeName=core_node2, onlyIfActiveCheckResult=false, nodeProps: core_node2:{"core":"collection1","base_url":"http://127.0.0.1:56095/pxi","node_name":"127.0.0.1:56095_pxi","state":"recovering"}
   [junit4]   2> 1043191 INFO  (qtp1804106277-8769) [n:127.0.0.1:56091_pxi    ] o.a.s.h.a.PrepRecoveryOp Waited coreNodeName: core_node2, state: recovering, checkLive: true, onlyIfLeader: true for: 1 seconds.
   [junit4]   2> 1043191 INFO  (qtp1804106277-8769) [n:127.0.0.1:56091_pxi    ] o.a.s.s.HttpSolrCall [admin] webapp=null path=/admin/cores params={nodeName=127.0.0.1:56095_pxi&onlyIfLeaderActive=true&core=collection1&coreNodeName=core_node2&action=PREPRECOVERY&checkLive=true&state=recovering&onlyIfLeader=true&wt=javabin&version=2} status=0 QTime=1002
   [junit4]   2> 1044176 INFO  (coreLoadExecutor-4314-thread-1-processing-n:127.0.0.1:56100_pxi) [n:127.0.0.1:56100_pxi c:collection1   x:collection1] o.a.s.c.SolrConfig Using Lucene MatchVersion: 6.4.0
   [junit4]   2> 1044210 INFO  (coreLoadExecutor-4314-thread-1-processing-n:127.0.0.1:56100_pxi) [n:127.0.0.1:56100_pxi c:collection1   x:collection1] o.a.s.s.IndexSchema [collection1] Schema name=test
   [junit4]   2> 1044353 WARN  (coreLoadExecutor-4314-thread-1-processing-n:127.0.0.1:56100_pxi) [n:127.0.0.1:56100_pxi c:collection1   x:collection1] o.a.s.s.IndexSchema [collection1] default search field in schema is text. WARNING: Deprecated, please use 'df' on request instead.
   [junit4]   2> 1044369 INFO  (coreLoadExecutor-4314-thread-1-processing-n:127.0.0.1:56100_pxi) [n:127.0.0.1:56100_pxi c:collection1   x:collection1] o.a.s.s.IndexSchema Loaded schema test/1.0 with uniqueid field id
   [junit4]   2> 1044426 INFO  (coreLoadExecutor-4314-thread-1-processing-n:127.0.0.1:56100_pxi) [n:127.0.0.1:56100_pxi c:collection1   x:collection1] o.a.s.c.CoreContainer Creating SolrCore 'collection1' using configuration from collection collection1
   [junit4]   2> 1044426 INFO  (coreLoadExecutor-4314-thread-1-processing-n:127.0.0.1:56100_pxi) [n:127.0.0.1:56100_pxi c:collection1   x:collection1] o.a.s.c.SolrCore [[collection1] ] Opening new SolrCore at [/Users/jenkins/workspace/Lucene-Solr-6.x-MacOSX/solr/build/solr-core/test/J1/temp/solr.cloud.PeerSyncReplicationTest_FDEB62AD9ECD1C2E-001/shard-3-001/cores/collection1], dataDir=[/Users/jenkins/workspace/Lucene-Solr-6.x-MacOSX/solr/build/solr-core/test/J1/../../../../../../../../../Users/jenkins/workspace/Lucene-Solr-6.x-MacOSX/solr/build/solr-core/test/J1/temp/solr.cloud.PeerSyncReplicationTest_FDEB62AD9ECD1C2E-001/shard-3-001/cores/collection1/data/]
   [junit4]   2> 1044427 INFO  (coreLoadExecutor-4314-thread-1-processing-n:127.0.0.1:56100_pxi) [n:127.0.0.1:56100_pxi c:collection1   x:collection1] o.a.s.c.JmxMonitoredMap JMX monitoring is enabled. Adding Solr mbeans to JMX Server: com.sun.jmx.mbeanserver.JmxMBeanServer@330baf4d
   [junit4]   2> 1044430 INFO  (coreLoadExecutor-4314-thread-1-processing-n:127.0.0.1:56100_pxi) [n:127.0.0.1:56100_pxi c:collection1   x:collection1] o.a.s.u.RandomMergePolicy RandomMergePolicy wrapping class org.apache.lucene.index.LogByteSizeMergePolicy: [LogByteSizeMergePolicy: minMergeSize=1677721, mergeFactor=28, maxMergeSize=2147483648, maxMergeSizeForForcedMerge=9223372036854775807, calibrateSizeByDeletes=false, maxMergeDocs=2147483647, maxCFSSegmentSizeMB=8.796093022207999E12, noCFSRatio=1.0]
   [junit4]   2> 1044466 WARN  (coreLoadExecutor-4314-thread-1-processing-n:127.0.0.1:56100_pxi) [n:127.0.0.1:56100_pxi c:collection1   x:collection1] o.a.s.c.RequestHandlers INVALID paramSet a in requestHandler {type = requestHandler,name = /dump,class = DumpRequestHandler,attributes = {initParams=a, name=/dump, class=DumpRequestHandler},args = {defaults={a=A,b=B}}}
   [junit4]   2> 1044509 INFO  (coreLoadExecutor-4314-thread-1-processing-n:127.0.0.1:56100_pxi) [n:127.0.0.1:56100_pxi c:collection1   x:collection1] o.a.s.u.UpdateHandler Using UpdateLog implementation: org.apache.solr.update.UpdateLog
   [junit4]   2> 1044509 INFO  (coreLoadExecutor-4314-thread-1-processing-n:127.0.0.1:56100_pxi) [n:127.0.0.1:56100_pxi c:collection1   x:collection1] o.a.s.u.UpdateLog Initializing UpdateLog: dataDir= defaultSyncLevel=FLUSH numRecordsToKeep=1000 maxNumLogsToKeep=10 numVersionBuckets=65536
   [junit4]   2> 1044510 INFO  (coreLoadExecutor-4314-thread-1-processing-n:127.0.0.1:56100_pxi) [n:127.0.0.1:56100_pxi c:collection1   x:collection1] o.a.s.u.CommitTracker Hard AutoCommit: disabled
   [junit4]   2> 1044510 INFO  (coreLoadExecutor-4314-thread-1-processing-n:127.0.0.1:56100_pxi) [n:127.0.0.1:56100_pxi c:collection1   x:collection1] o.a.s.u.CommitTracker Soft AutoCommit: disabled
   [junit4]   2> 1044511 INFO  (coreLoadExecutor-4314-thread-1-processing-n:127.0.0.1:56100_pxi) [n:127.0.0.1:56100_pxi c:collection1   x:collection1] o.a.s.u.RandomMergePolicy RandomMergePolicy wrapping class org.apache.lucene.index.LogDocMergePolicy: [LogDocMergePolicy: minMergeSize=1000, mergeFactor=45, maxMergeSize=9223372036854775807, maxMergeSizeForForcedMerge=9223372036854775807, calibrateSizeByDeletes=false, maxMergeDocs=2147483647, maxCFSSegmentSizeMB=8.796093022207999E12, noCFSRatio=0.0]
   [junit4]   2> 1044524 INFO  (coreLoadExecutor-4314-thread-1-processing-n:127.0.0.1:56100_pxi) [n:127.0.0.1:56100_pxi c:collection1   x:collection1] o.a.s.s.SolrIndexSearcher Opening [Searcher@3afade26[collection1] main]
   [junit4]   2> 1044526 INFO  (coreLoadExecutor-4314-thread-1-processing-n:127.0.0.1:56100_pxi) [n:127.0.0.1:56100_pxi c:collection1   x:collection1] o.a.s.r.ManagedResourceStorage Configured ZooKeeperStorageIO with znodeBase: /configs/conf1
   [junit4]   2> 1044527 INFO  (coreLoadExecutor-4314-thread-1-processing-n:127.0.0.1:56100_pxi) [n:127.0.0.1:56100_pxi c:collection1   x:collection1] o.a.s.r.ManagedResourceStorage Loaded null at path _rest_managed.json using ZooKeeperStorageIO:path=/configs/conf1
   [junit4]   2> 1044527 INFO  (coreLoadExecutor-4314-thread-1-processing-n:127.0.0.1:56100_pxi) [n:127.0.0.1:56100_pxi c:collection1   x:collection1] o.a.s.h.ReplicationHandler Commits will be reserved for  10000
   [junit4]   2> 1044528 INFO  (searcherExecutor-4315-thread-1-processing-n:127.0.0.1:56100_pxi x:collection1 c:collection1) [n:127.0.0.1:56100_pxi c:collection1   x:collection1] o.a.s.c.SolrCore [collection1] Registered new searcher Searcher@3afade26[collection1] main{ExitableDirectoryReader(UninvertingDirectoryReader())}
   [junit4]   2> 1044528 INFO  (coreLoadExecutor-4314-thread-1-processing-n:127.0.0.1:56100_pxi) [n:127.0.0.1:56100_pxi c:collection1   x:collection1] o.a.s.u.UpdateLog Could not find max version in index or recent updates, using new clock 1555576359273627648
   [junit4]   2> 1044536 INFO  (coreZkRegister-4309-thread-1-processing-n:127.0.0.1:56100_pxi x:collection1 c:collection1) [n:127.0.0.1:56100_pxi c:collection1 s:shard1 r:core_node3 x:collection1] o.a.s.c.ZkController Core needs to recover:collection1
   [junit4]   2> 1044537 INFO  (updateExecutor-1541-thread-1-processing-n:127.0.0.1:56100_pxi x:collection1 s:shard1 c:collection1 r:core_node3) [n:127.0.0.1:56100_pxi c:collection1 s:shard1 r:core_node3 x:collection1] o.a.s.u.DefaultSolrCoreState Running recovery
   [junit4]   2> 1044537 INFO  (recoveryExecutor-1542-thread-1-processing-n:127.0.0.1:56100_pxi x:collection1 s:shard1 c:collection1 r:core_node3) [n:127.0.0.1:56100_pxi c:collection1 s:shard1 r:core_node3 x:collection1] o.a.s.c.RecoveryStrategy Starting recovery process. recoveringAfterStartup=true
   [junit4]   2> 1044538 INFO  (recoveryExecutor-1542-thread-1-processing-n:127.0.0.1:56100_pxi x:collection1 s:shard1 c:collection1 r:core_node3) [n:127.0.0.1:56100_pxi c:collection1 s:shard1 r:core_node3 x:collection1] o.a.s.c.RecoveryStrategy ###### startupVersions=[[]]
   [junit4]   2> 1044538 INFO  (recoveryExecutor-1542-thread-1-processing-n:127.0.0.1:56100_pxi x:collection1 s:shard1 c:collection1 r:core_node3) [n:127.0.0.1:56100_pxi c:collection1 s:shard1 r:core_node3 x:collection1] o.a.s.c.RecoveryStrategy Begin buffering updates. core=[collection1]
   [junit4]   2> 1044538 INFO  (recoveryExecutor-1542-thread-1-processing-n:127.0.0.1:56100_pxi x:collection1 s:shard1 c:collection1 r:core_node3) [n:127.0.0.1:56100_pxi c:collection1 s:shard1 r:core_node3 x:collection1] o.a.s.u.UpdateLog Starting to buffer updates. FSUpdateLog{state=ACTIVE, tlog=null}
   [junit4]   2> 1044538 INFO  (recoveryExecutor-1542-thread-1-processing-n:127.0.0.1:56100_pxi x:collection1 s:shard1 c:collection1 r:core_node3) [n:127.0.0.1:56100_pxi c:collection1 s:shard1 r:core_node3 x:collection1] o.a.s.c.RecoveryStrategy Publishing state of core [collection1] as recovering, leader is [http://127.0.0.1:56091/pxi/collection1/] and I am [http://127.0.0.1:56100/pxi/collection1/]
   [junit4]   2> 1044542 INFO  (recoveryExecutor-1542-thread-1-processing-n:127.0.0.1:56100_pxi x:collection1 s:shard1 c:collection1 r:core_node3) [n:127.0.0.1:56100_pxi c:collection1 s:shard1 r:core_node3 x:collection1] o.a.s.c.RecoveryStrategy Sending prep recovery command to [http://127.0.0.1:56091/pxi]; [WaitForState: action=PREPRECOVERY&core=collection1&nodeName=127.0.0.1:56100_pxi&coreNodeName=core_node3&state=recovering&checkLive=true&onlyIfLeader=true&onlyIfLeaderActive=true]
   [junit4]   2> 1044545 INFO  (qtp1804106277-8767) [n:127.0.0.1:56091_pxi    ] o.a.s.h.a.PrepRecoveryOp Going to wait for coreNodeName: core_node3, state: recovering, checkLive: true, onlyIfLeader: true, onlyIfLeaderActive: true
   [junit4]   2> 1044545 INFO  (qtp1804106277-8767) [n:127.0.0.1:56091_pxi    ] o.a.s.h.a.PrepRecoveryOp Will wait a max of 183 seconds to see collection1 (shard1 of collection1) have state: recovering
   [junit4]   2> 1044545 INFO  (qtp1804106277-8767) [n:127.0.0.1:56091_pxi    ] o.a.s.h.a.PrepRecoveryOp In WaitForState(recovering): collection=collection1, shard=shard1, thisCore=collection1, leaderDoesNotNeedRecovery=false, isLeader? true, live=true, checkLive=true, currentState=down, localState=active, nodeName=127.0.0.1:56100_pxi, coreNodeName=core_node3, onlyIfActiveCheckResult=false, nodeProps: core_node3:{"core":"collection1","base_url":"http://127.0.0.1:56100/pxi","node_name":"127.0.0.1:56100_pxi","state":"down"}
   [junit4]   2> 1044988 INFO  (TEST-PeerSyncReplicationTest.test-seed#[FDEB62AD9ECD1C2E]) [    ] o.a.s.SolrTestCaseJ4 ###Starting test
   [junit4]   2> 1044989 INFO  (TEST-PeerSyncReplicationTest.test-seed#[FDEB62AD9ECD1C2E]) [    ] o.a.s.c.AbstractFullDistribZkTestBase Wait for recoveries to finish - wait 30 for each attempt
   [junit4]   2> 1044989 INFO  (TEST-PeerSyncReplicationTest.test-seed#[FDEB62AD9ECD1C2E]) [    ] o.a.s.c.AbstractDistribZkTestBase Wait for recoveries to finish - collection: collection1 failOnTimeout:true timeout (sec):30
   [junit4]   2> 1045548 INFO  (qtp1804106277-8767) [n:127.0.0.1:56091_pxi    ] o.a.s.h.a.PrepRecoveryOp In WaitForState(recovering): collection=collection1, shard=shard1, thisCore=collection1, leaderDoesNotNeedRecovery=false, isLeader? true, live=true, checkLive=true, currentState=recovering, localState=active, nodeName=127.0.0.1:56100_pxi, coreNodeName=core_node3, onlyIfActiveCheckResult=false, nodeProps: core_node3:{"core":"collection1","base_url":"http://127.0.0.1:56100/pxi","node_name":"127.0.0.1:56100_pxi","state":"recovering"}
   [junit4]   2> 1045548 INFO  (qtp1804106277-8767) [n:127.0.0.1:56091_pxi    ] o.a.s.h.a.PrepRecoveryOp Waited coreNodeName: core_node3, state: recovering, checkLive: true, onlyIfLeader: true for: 1 seconds.
   [junit4]   2> 1045548 INFO  (qtp1804106277-8767) [n:127.0.0.1:56091_pxi    ] o.a.s.s.HttpSolrCall [admin] webapp=null path=/admin/cores params={nodeName=127.0.0.1:56100_pxi&onlyIfLeaderActive=true&core=collection1&coreNodeName=core_node3&action=PREPRECOVERY&checkLive=true&state=recovering&onlyIfLeader=true&wt=javabin&version=2} status=0 QTime=1003
   [junit4]   2> 1050195 INFO  (recoveryExecutor-1535-thread-1-processing-n:127.0.0.1:56095_pxi x:collection1 s:shard1 c:collection1 r:core_node2) [n:127.0.0.1:56095_pxi c:collection1 s:shard1 r:core_node2 x:collection1] o.a.s.c.RecoveryStrategy Attempting to PeerSync from [http://127.0.0.1:56091/pxi/collection1/] - recoveringAfterStartup=[true]
   [junit4]   2> 1050195 INFO  (recoveryExecutor-1535-thread-1-processing-n:127.0.0.1:56095_pxi x:collection1 s:shard1 c:collection1 r:core_node2) [n:127.0.0.1:56095_pxi c:collection1 s:shard1 r:core_node2 x:collection1] o.a.s.u.PeerSync PeerSync: core=collection1 url=http://127.0.0.1:56095/pxi START replicas=[http://127.0.0.1:56091/pxi/collection1/] nUpdates=1000
   [junit4]   2> 1050199 INFO  (qtp1804106277-8769) [n:127.0.0.1:56091_pxi c:collection1 s:shard1 r:core_node1 x:collection1] o.a.s.u.IndexFingerprint IndexFingerprint millis:0.0 result:{maxVersionSpecified=9223372036854775807, maxVersionEncountered=0, maxInHash=0, versionsHash=0, numVersions=0, numDocs=0, maxDoc=0}
   [junit4]   2> 1050199 INFO  (qtp1804106277-8769) [n:127.0.0.1:56091_pxi c:collection1 s:shard1 r:core_node1 x:collection1] o.a.s.c.S.Request [collection1]  webapp=/pxi path=/get params={distrib=false&qt=/get&getFingerprint=9223372036854775807&wt=javabin&version=2} status=0 QTime=1
   [junit4]   2> 1050200 INFO  (recoveryExecutor-1535-thread-1-processing-n:127.0.0.1:56095_pxi x:collection1 s:shard1 c:collection1 r:core_node2) [n:127.0.0.1:56095_pxi c:collection1 s:shard1 r:core_node2 x:collection1] o.a.s.u.IndexFingerprint IndexFingerprint millis:0.0 result:{maxVersionSpecified=9223372036854775807, maxVersionEncountered=0, maxInHash=0, versionsHash=0, numVersions=0, numDocs=0, maxDoc=0}
   [junit4]   2> 1050200 INFO  (recoveryExecutor-1535-thread-1-processing-n:127.0.0.1:56095_pxi x:collection1 s:shard1 c:collection1 r:core_node2) [n:127.0.0.1:56095_pxi c:collection1 s:shard1 r:core_node2 x:collection1] o.a.s.u.PeerSync We are already in sync. No need to do a PeerSync 
   [junit4]   2> 1050200 INFO  (recoveryExecutor-1535-thread-1-processing-n:127.0.0.1:56095_pxi x:collection1 s:shard1 c:collection1 r:core_node2) [n:127.0.0.1:56095_pxi c:collection1 s:shard1 r:core_node2 x:collection1] o.a.s.u.DirectUpdateHandler2 start commit{,optimize=false,openSearcher=true,waitSearcher=true,expungeDeletes=false,softCommit=false,prepareCommit=false}
   [junit4]   2> 1050200 INFO  (recoveryExecutor-1535-thread-1-processing-n:127.0.0.1:56095_pxi x:collection1 s:shard1 c:collection1 r:core_node2) [n:127.0.0.1:56095_pxi c:collection1 s:shard1 r:core_node2 x:collection1] o.a.s.u.DirectUpdateHandler2 No uncommitted changes. Skipping IW.commit.
   [junit4]   2> 1050200 INFO  (recoveryExecutor-1535-thread-1-processing-n:127.0.0.1:56095_pxi x:collection1 s:shard1 c:collection1 r:core_node2) [n:127.0.0.1:56095_pxi c:collection1 s:shard1 r:core_node2 x:collection1] o.a.s.u.DirectUpdateHandler2 end_commit_flush
   [junit4]   2> 1050200 INFO  (recoveryExecutor-1535-thread-1-processing-n:127.0.0.1:56095_pxi x:collection1 s:shard1 c:collection1 r:core_node2) [n:127.0.0.1:56095_pxi c:collection1 s:shard1 r:core_node2 x:collection1] o.a.s.c.RecoveryStrategy PeerSync stage of recovery was successful.
   [junit4]   2> 1050200 INFO  (recoveryExecutor-1535-thread-1-processing-n:127.0.0.1:56095_pxi x:collection1 s:shard1 c:collection1 r:core_node2) [n:127.0.0.1:56095_pxi c:collection1 s:shard1 r:core_node2 x:collection1] o.a.s.c.RecoveryStrategy Replaying updates buffered during PeerSync.
   [junit4]   2> 1050201 INFO  (recoveryExecutor-1535-thread-1-processing-n:127.0.0.1:56095_pxi x:collection1 s:shard1 c:collection1 r:core_node2) [n:127.0.0.1:56095_pxi c:collection1 s:shard1 r:core_node2 x:collection1] o.a.s.c.RecoveryStrategy No replay needed.
   [junit4]   2> 1050201 INFO  (recoveryExecutor-1535-thread-1-processing-n:127.0.0.1:56095_pxi x:collection1 s:shard1 c:collection1 r:core_node2) [n:127.0.0.1:56095_pxi c:collection1 s:shard1 r:core_node2 x:collection1] o.a.s.c.RecoveryStrategy Registering as Active after recovery.
   [junit4]   2> 1052555 INFO  (recoveryExecutor-1542-thread-1-processing-n:127.0.0.1:56100_pxi x:collection1 s:shard1 c:collection1 r:core_node3) [n:127.0.0.1:56100_pxi c:collection1 s:shard1 r:core_node3 x:collection1] o.a.s.c.RecoveryStrategy Attempting to PeerSync from [http://127.0.0.1:56091/pxi/collection1/] - recoveringAfterStartup=[true]
   [junit4]   2> 1052555 INFO  (recoveryExecutor-1542-thread-1-processing-n:127.0.0.1:56100_pxi x:collection1 s:shard1 c:collection1 r:core_node3) [n:127.0.0.1:56100_pxi c:collection1 s:shard1 r:core_node3 x:collection1] o.a.s.u.PeerSync PeerSync: core=collection1 url=http://127.0.0.1:56100/pxi START replicas=[http://127.0.0.1:56091/pxi/collection1/] nUpdates=1000
   [junit4]   2> 1052559 INFO  (qtp1804106277-8772) [n:127.0.0.1:56091_pxi c:collection1 s:shard1 r:core_node1 x:collection1] o.a.s.u.IndexFingerprint IndexFingerprint millis:0.0 result:{maxVersionSpecified=9223372036854775807, maxVersionEncountered=0, maxInHash=0, versionsHash=0, numVersions=0, numDocs=0, maxDoc=0}
   [junit4]   2> 1052559 INFO  (qtp1804106277-8772) [n:127.0.0.1:56091_pxi c:collection1 s:shard1 r:core_node1 x:collection1] o.a.s.c.S.Request [collection1]  webapp=/pxi path=/get params={distrib=false&qt=/get&getFingerprint=9223372036854775807&wt=javabin&version=2} status=0 QTime=0
   [junit4]   2> 1052560 INFO  (recoveryExecutor-1542-thread-1-processing-n:127.0.0.1:56100_pxi x:collection1 s:shard1 c:collection1 r:core_node3) [n:127.0.0.1:56100_pxi c:collection1 s:shard1 r:core_node3 x:collection1] o.a.s.u.IndexFingerprint IndexFingerprint millis:0.0 result:{maxVersionSpecified=9223372036854775807, maxVersionEncountered=0, maxInHash=0, versionsHash=0, numVersions=0, numDocs=0, maxDoc=0}
   [junit4]   2> 1052560 INFO  (recoveryExecutor-1542-thread-1-processing-n:127.0.0.1:56100_pxi x:collection1 s:shard1 c:collection1 r:core_node3) [n:127.0.0.1:56100_pxi c:collection1 s:shard1 r:core_node3 x:collection1] o.a.s.u.PeerSync We are already in sync. No need to do a PeerSync 
   [junit4]   2> 1052560 INFO  (recoveryExecutor-1542-thread-1-processing-n:127.0.0.1:56100_pxi x:collection1 s:shard1 c:collection1 r:core_node3) [n:127.0.0.1:56100_pxi c:collection1 s:shard1 r:core_node3 x:collection1] o.a.s.u.DirectUpdateHandler2 start commit{,optimize=false,openSearcher=true,waitSearcher=true,expungeDeletes=false,softCommit=false,prepareCommit=false}
   [junit4]   2> 1052560 INFO  (recoveryExecutor-1542-thread-1-processing-n:127.0.0.1:56100_pxi x:collection1 s:shard1 c:collection1 r:core_node3) [n:127.0.0.1:56100_pxi c:collection1 s:shard1 r:core_node3 x:collection1] o.a.s.u.DirectUpdateHandler2 No uncommitted changes. Skipping IW.commit.
   [junit4]   2> 1052561 INFO  (recoveryExecutor-1542-thread-1-processing-n:127.0.0.1:56100_pxi x:collection1 s:shard1 c:collection1 r:core_node3) [n:127.0.0.1:56100_pxi c:collection1 s:shard1 r:core_node3 x:collection1] o.a.s.u.DirectUpdateHandler2 end_commit_flush
   [junit4]   2> 1052561 INFO  (recoveryExecutor-1542-thread-1-processing-n:127.0.0.1:56100_pxi x:collection1 s:shard1 c:collection1 r:core_node3) [n:127.0.0.1:56100_pxi c:collection1 s:shard1 r:core_node3 x:collection1] o.a.s.c.RecoveryStrategy PeerSync stage of recovery was successful.
   [junit4]   2> 1052561 INFO  (recoveryExecutor-1542-thread-1-processing-n:127.0.0.1:56100_pxi x:collection1 s:shard1 c:collection1 r:core_node3) [n:127.0.0.1:56100_pxi c:collection1 s:shard1 r:core_node3 x:collection1] o.a.s.c.RecoveryStrategy Replaying updates buffered during PeerSync.
   [junit4]   2> 1052561 INFO  (recoveryExecutor-1542-thread-1-processing-n:127.0.0.1:56100_pxi x:collection1 s:shard1 c:collection1 r:core_node3) [n:127.0.0.1:56100_pxi c:collection1 s:shard1 r:core_node3 x:collection1] o.a.s.c.RecoveryStrategy No replay needed.
   [junit4]   2> 1052561 INFO  (recoveryExecutor-1542-thread-1-processing-n:127.0.0.1:56100_pxi x:collection1 s:shard1 c:collection1 r:core_node3) [n:127.0.0.1:56100_pxi c:collection1 s:shard1 r:core_node3 x:collection1] o.a.s.c.RecoveryStrategy Registering as Active after recovery.
   [junit4]   2> 1053009 INFO  (TEST-PeerSyncReplicationTest.test-seed#[FDEB62AD9ECD1C2E]) [    ] o.a.s.c.AbstractDistribZkTestBase Recoveries finished - collection: collection1
   [junit4]   2> 1053012 INFO  (qtp1334974152-8733) [n:127.0.0.1:56086_pxi c:control_collection s:shard1 r:core_node1 x:collection1] o.a.s.u.DirectUpdateHandler2 start commit{,optimize=false,openSearcher=true,waitSearcher=true,expungeDeletes=false,softCommit=false,prepareCommit=false}
   [junit4]   2> 1053012 INFO  (qtp1334974152-8733) [n:127.0.0.1:56086_pxi c:control_collection s:shard1 r:core_node1 x:collection1] o.a.s.u.DirectUpdateHandler2 No uncommitted changes. Skipping IW.commit.
   [junit4]   2> 1053013 INFO  (qtp1334974152-8733) [n:127.0.0.1:56086_pxi c:control_collection s:shard1 r:core_node1 x:collection1] o.a.s.u.DirectUpdateHandler2 end_commit_flush
   [junit4]   2> 1053013 INFO  (qtp1334974152-8733) [n:127.0.0.1:56086_pxi c:control_collection s:shard1 r:core_node1 x:collection1] o.a.s.u.p.LogUpdateProcessorFactory [collection1]  webapp=/pxi path=/update params={waitSearcher=true&commit=true&softCommit=false&wt=javabin&version=2}{commit=} 0 1
   [junit4]   2> 1053019 INFO  (qtp1804106277-8771) [n:127.0.0.1:56091_pxi c:collection1 s:shard1 r:core_node1 x:collection1] o.a.s.u.DirectUpdateHandler2 start commit{,optimize=false,openSearcher=true,waitSearcher=true,expungeDeletes=false,softCommit=false,prepareCommit=false}
   [junit4]   2> 1053021 INFO  (qtp1804106277-8771) [n:127.0.0.1:56091_pxi c:collection1 s:shard1 r:core_node1 x:collection1] o.a.s.u.DirectUpdateHandler2 No uncommitted changes. Skipping IW.commit.
   [junit4]   2> 1053021 INFO  (qtp1001362643-8797) [n:127.0.0.1:56095_pxi c:collection1 s:shard1 r:core_node2 x:collection1] o.a.s.u.DirectUpdateHandler2 start commit{,optimize=false,openSearcher=true,waitSearcher=true,expungeDeletes=false,softCommit=false,prepareCommit=false}
   [junit4]   2> 1053021 INFO  (qtp1001362643-8797) [n:127.0.0.1:56095_pxi c:collection1 s:shard1 r:core_node2 x:collection1] o.a.s.u.DirectUpdateHandler2 No uncommitted changes. Skipping IW.commit.
   [junit4]   2> 1053022 INFO  (qtp1804106277-8771) [n:127.0.0.1:56091_pxi c:collection1 s:shard1 r:core_node1 x:collection1] o.a.s.u.DirectUpdateHandler2 end_commit_flush
   [junit4]   2> 1053022 INFO  (qtp1001362643-8797) [n:127.0.0.1:56095_pxi c:collection1 s:shard1 r:core_node2 x:collection1] o.a.s.u.DirectUpdateHandler2 end_commit_flush
   [junit4]   2> 1053022 INFO  (qtp1295147082-8831) [n:127.0.0.1:56100_pxi c:collection1 s:shard1 r:core_node3 x:collection1] o.a.s.u.DirectUpdateHandler2 start commit{,optimize=false,openSearcher=true,waitSearcher=true,expungeDeletes=false,softCommit=false,prepareCommit=false}
   [junit4]   2> 1053022 INFO  (qtp1295147082-8831) [n:127.0.0.1:56100_pxi c:collection1 s:shard1 r:core_node3 x:collection1] o.a.s.u.DirectUpdateHandler2 No uncommitted changes. Skipping IW.commit.
   [junit4]   2> 1053022 INFO  (qtp1804106277-8771) [n:127.0.0.1:56091_pxi c:collection1 s:shard1 r:core_node1 x:collection1] o.a.s.u.p.LogUpdateProcessorFactory [collection1]  webapp=/pxi path=/update params={update.distrib=FROMLEADER&waitSearcher=true&openSearcher=true&commit=true&softCommit=false&distrib.from=http://127.0.0.1:56091/pxi/collection1/&commit_end_point=true&wt=javabin&version=2&expungeDeletes=false}{commit=} 0 2
   [junit4]   2> 1053022 INFO  (qtp1295147082-8831) [n:127.0.0.1:56100_pxi c:collection1 s:shard1 r:core_node3 x:collection1] o.a.s.u.DirectUpdateHandler2 end_commit_flush
   [junit4]   2> 1053022 INFO  (qtp1001362643-8797) [n:127.0.0.1:56095_pxi c:collection1 s:shard1 r:core_node2 x:collection1] o.a.s.u.p.LogUpdateProcessorFactory [collection1]  webapp=/pxi path=/update params={update.distrib=FROMLEADER&waitSearcher=true&openSearcher=true&commit=true&softCommit=false&distrib.from=http://127.0.0.1:56091/pxi/collection1/&commit_end_point=true&wt=javabin&version=2&expungeDeletes=false}{commit=} 0 1
   [junit4]   2> 1053023 INFO  (qtp1295147082-8831) [n:127.0.0.1:56100_pxi c:collection1 s:shard1 r:core_node3 x:collection1] o.a.s.u.p.LogUpdateProcessorFactory [collection1]  webapp=/pxi path=/update params={update.distrib=FROMLEADER&waitSearcher=true&openSearcher=true&commit=true&softCommit=false&distrib.from=http://127.0.0.1:56091/pxi/collection1/&commit_end_point=true&wt=javabin&version=2&expungeDeletes=false}{commit=} 0 0
   [junit4]   2> 1053023 INFO  (qtp1804106277-8774) [n:127.0.0.1:56091_pxi c:collection1 s:shard1 r:core_node1 x:collection1] o.a.s.u.p.LogUpdateProcessorFactory [collection1]  webapp=/pxi path=/update params={waitSearcher=true&commit=true&softCommit=false&wt=javabin&version=2}{commit=} 0 8
   [junit4]   2> 1053026 INFO  (qtp1804106277-8769) [n:127.0.0.1:56091_pxi c:collection1 s:shard1 r:core_node1 x:collection1] o.a.s.c.S.Request [collection1]  webapp=/pxi path=/select params={q=*:*&distrib=false&tests=checkShardConsistency&rows=0&wt=javabin&version=2} hits=0 status=0 QTime=0
   [junit4]   2> 1053027 INFO  (qtp1001362643-8799) [n:127.0.0.1:56095_pxi c:collection1 s:shard1 r:core_node2 x:collection1] o.a.s.c.S.Request [collection1]  webapp=/pxi path=/select params={q=*:*&distrib=false&tests=checkShardConsistency&rows=0&wt=javabin&version=2} hits=0 status=0 QTime=0
   [junit4]   2> 1053028 INFO  (qtp1295147082-8833) [n:127.0.0.1:56100_pxi c:collection1 s:shard1 r:core_node3 x:collection1] o.a.s.c.S.Request [collection1]  webapp=/pxi path=/select params={q=*:*&distrib=false&tests=checkShardConsistency&rows=0&wt=javabin&version=2} hits=0 status=0 QTime=0
   [junit4]   2> 1055034 INFO  (qtp1334974152-8735) [n:127.0.0.1:56086_pxi c:control_collection s:shard1 r:core_node1 x:collection1] o.a.s.u.p.LogUpdateProcessorFactory [collection1]  webapp=/pxi path=/update params={wt=javabin&version=2}{deleteByQuery=*:* (-1555576370287869952)} 0 2
   [junit4]   2> 1055045 INFO  (qtp1001362643-8800) [n:127.0.0.1:56095_pxi c:collection1 s:shard1 r:core_node2 x:collection1] o.a.s.u.p.LogUpdateProcessorFactory [collection1]  webapp=/pxi path=/update params={update.distrib=FROMLEADER&_version_=-1555576370293112832&distrib.from=http://127.0.0.1:56091/pxi/collection1/&wt=javabin&version=2}{deleteByQuery=*:* (-1555576370293112832)} 0 3
   [junit4]   2> 1055046 INFO  (qtp1295147082-8834) [n:127.0.0.1:56100_pxi c:collection1 s:shard1 r:core_node3 x:collection1] o.a.s.u.p.LogUpdateProcessorFactory [collection1]  webapp=/pxi path=/update params={update.distrib=FROMLEADER&_version_=-1555576370293112832&distrib.from=http://127.0.0.1:56091/pxi/collection1/&wt=javabin&version=2}{deleteByQuery=*:* (-1555576370293112832)} 0 4
   [junit4]   2> 1055046 INFO  (qtp1804106277-8767) [n:127.0.0.1:56091_pxi c:collection1 s:shard1 r:core_node1 x:collection1] o.a.s.u.p.LogUpdateProcessorFactory [collection1]  webapp=/pxi path=/update params={wt=javabin&version=2}{deleteByQuery=*:* (-1555576370293112832)} 0 9
   [junit4]   2> 1055063 INFO  (qtp1001362643-8801) [n:127.0.0.1:56095_pxi c:collection1 s:shard1 r:core_node2 x:collection1] o.a.s.u.p.LogUpdateProcessorFactory [collection1]  webapp=/pxi path=/update params={update.distrib=FROMLEADER&distrib.from=http://127.0.0.1:56091/pxi/collection1/&wt=javabin&version=2}{add=[0 (1555576370309890048)]} 0 2
   [junit4]   2> 1055063 INFO  (qtp1295147082-8835) [n:127.0.0.1:56100_pxi c:collection1 s:shard1 r:core_node3 x:collection1] o.a.s.u.p.LogUpdateProcessorFactory [collection1]  webapp=/pxi path=/update params={update.distrib=FROMLEADER&distrib.from=http://127.0.0.1:56091/pxi/collection1/&wt=javabin&version=2}{add=[0 (1555576370309890048)]} 0 2
   [junit4]   2> 1055064 INFO  (qtp1804106277-8772) [n:127.0.0.1:56091_pxi c:collection1 s:shard1 r:core_node1 x:collection1] o.a.s.u.p.LogUpdateProcessorFactory [collection1]  webapp=/pxi path=/update params={wt=javabin&version=2}{add=[0 (1555576370309890048)]} 0 11
   [junit4]   2> 1055068 INFO  (qtp1295147082-8836) [n:127.0.0.1:56100_pxi c:collection1 s:shard1 r:core_node3 x:collection1] o.a.s.u.p.LogUpdateProcessorFactory [collection1]  webapp=/pxi path=/update params={update.distrib=FROMLEADER&distrib.from=http://127.0.0.1:56091/pxi/collection1/&wt=javabin&version=2}{add=[1 (1555576370323521536)]} 0 0
   [junit4]   2> 1055068 INFO  (qtp1001362643-8802) [n:127.0.0.1:56095_pxi c:collection1 s:shard1 r:core_node2 x:collection1] o.a.s.u.p.LogUpdateProcessorFactory [collection1]  webapp=/pxi path=/update params={update.distrib=FROMLEADER&distrib.from=http://127.0.0.1:56091/pxi/collection1/&wt=javabin&version=2}{add=[1 (1555576370323521536)]} 0 0
   [junit4]   2> 1055069 INFO  (qtp1804106277-8773) [n:127.0.0.1:56091_pxi c:collection1 s:shard1 r:core_node1 x:collection1] o.a.s.u.p.LogUpdateProcessorFactory [collection1]  webapp=/pxi path=/update params={wt=javabin&version=2}{add=[1 (1555576370323521536)]} 0 3
   [junit4]   2> 1055074 INFO  (qtp1295147082-8829) [n:127.0.0.1:56100_pxi c:collection1 s:shard1 r:core_node3 x:collection1] o.a.s.u.p.LogUpdateProcessorFactory [collection1]  webapp=/pxi path=/update params={update.distrib=FROMLEADER&distrib.from=http://127.0.0.1:56091/pxi/collection1/&wt=javabin&version=2}{add=[2 (1555576370328764416)]} 0 0
   [junit4]   2> 1055074 INFO  (qtp1001362643-8795) [n:127.0.0.1:56095_pxi c:collection1 s:shard1 r:core_node2 x:collection1] o.a.s.u.p.LogUpdateProcessorFactory [collection1]  webapp=/pxi path=/update params={update.distrib=FROMLEADER&distrib.from=http://127.0.0.1:56091/pxi/collection1/&wt=javabin&version=2}{add=[2 (1555576370328764416)]} 0 0
   [junit4]   2> 1055074 INFO  (qtp1804106277-8771) [n:127.0.0.1:56091_pxi c:collection1 s:shard1 r:core_node1 x:collection1] o.a.s.u.p.LogUpdateProcessorFactory [collection1]  webapp=/pxi path=/update params={wt=javabin&version=2}{add=[2 (1555576370328764416)]} 0 3
   [junit4]   2> 1055080 INFO  (qtp1295147082-8831) [n:127.0.0.1:56100_pxi c:collection1 s:shard1 r:core_node3 x:collection1] o.a.s.u.p.LogUpdateProcessorFactory [collection1]  webapp=/pxi path=/update params={update.distrib=FROMLEADER&distrib.from=http://127.0.0.1:56091/pxi/collection1/&wt=javabin&version=2}{add=[3 (1555576370335055872)]} 0 0
   [junit4]   2> 1055080 INFO  (qtp1001362643-8797) [n:127.0.0.1:56095_pxi c:collection1 s:shard1 r:core_node2 x:collection1] o.a.s.u.p.LogUpdateProcessorFactory [collection1]  webapp=/pxi path=/update params={update.distrib=FROMLEADER&distrib.from=http://127.0.0.1:56091/pxi/collection1/&wt=javabin&version=2}{add=[3 (1555576370335055872)]} 0 0
   [junit4]   2> 1055081 INFO  (qtp1804106277-8774) [n:127.0.0.1:56091_pxi c:collection1 s:shard1 r:core_node1 x:collection1] o.a.s.u.p.LogUpdateProcessorFactory [collection1]  webapp=/pxi path=/update params={wt=javabin&version=2}{add=[3 (1555576370335055872)]} 0 3
   [junit4]   2> 1055086 INFO  (qtp1295147082-8832) [n:127.0.0.1:56100_pxi c:collection1 s:shard1 r:core_node3 x:collection1] o.a.s.u.p.LogUpdateProcessorFactory [collection1]  webapp=/pxi path=/update params={update.distrib=FROMLEADER&distrib.from=http://127.0.0.1:56091/pxi/collection1/&wt=javabin&version=2}{add=[4 (1555576370341347328)]} 0 0
   [junit4]   2> 1055086 INFO  (qtp1001362643-8798) [n:127.0.0.1:56095_pxi c:collection1 s:shard1 r:core_node2 x:collection1] o.a.s.u.p.LogUpdateProcessorFactory [collection1]  webapp=/pxi path=/update params={update.distrib=FROMLEADER&distrib.from=http://127.0.0.1:56091/pxi/collection1/&wt=javabin&version=2}{add=[4 (1555576370341347328)]} 0 0
   [junit4]   2> 1055086 INFO  (qtp1804106277-8770) [n:127.0.0.1:56091_pxi c:collection1 s:shard1 r:core_node1 x:collection1] o.a.s.u.p.LogUpdateProcessorFactory [collection1]  webapp=/pxi path=/update params={wt=javabin&version=2}{add=[4 (1555576370341347328)]} 0 3
   [junit4]   2> 1055092 INFO  (qtp1001362643-8799) [n:127.0.0.1:56095_pxi c:collection1 s:shard1 r:core_node2 x:collection1] o.a.s.u.p.LogUpdateProcessorFactory [collection1]  webapp=/pxi path=/update params={update.distrib=FROMLEADER&distrib.from=http://127.0.0.1:56091/pxi/collection1/&wt=javabin&version=2}{add=[5 (1555576370347638784)]} 0 0
   [junit4]   2> 1055092 INFO  (qtp1295147082-8833) [n:127.0.0.1:56100_pxi c:collection1 s:shard1 r:core_node3 x:collection1] o.a.s.u.p.LogUpdateProcessorFactory [collection1]  webapp=/pxi path=/update params={update.distrib=FROMLEADER&distrib.from=http://127.0.0.1:56091/pxi/collection1/&wt=javabin&version=2}{add=[5 (1555576370347638784)]} 0 0
   [junit4]   2> 1055092 INFO  (qtp1804106277-8769) [n:127.0.0.1:56091_pxi c:collection1 s:shard1 r:core_node1 x:collection1] o.a.s.u.p.LogUpdateProcessorFactory [collection1]  webapp=/pxi path=/update params={wt=javabin&version=2}{add=[5 (1555576370347638784)]} 0 3
   [junit4]   2> 105

[...truncated too long message...]

lr cannot talk to ZK: [KeeperErrorCode = Session expired for /live_nodes]
   [junit4]   2> 1075801 INFO  (TEST-PeerSyncReplicationTest.test-seed#[FDEB62AD9ECD1C2E]) [    ] o.a.s.m.SolrMetricManager Closing metric reporters for: solr.node
   [junit4]   2> 1075803 INFO  (TEST-PeerSyncReplicationTest.test-seed#[FDEB62AD9ECD1C2E]) [    ] o.e.j.s.AbstractConnector Stopped ServerConnector@4c7735d2{HTTP/1.1,[http/1.1]}{127.0.0.1:0}
   [junit4]   2> 1075803 INFO  (TEST-PeerSyncReplicationTest.test-seed#[FDEB62AD9ECD1C2E]) [    ] o.e.j.s.h.ContextHandler Stopped o.e.j.s.ServletContextHandler@5caf712{/pxi,null,UNAVAILABLE}
   [junit4]   2> 1075805 INFO  (TEST-PeerSyncReplicationTest.test-seed#[FDEB62AD9ECD1C2E]) [    ] o.a.s.c.ChaosMonkey monkey: stop shard! 56091
   [junit4]   2> 1075805 INFO  (TEST-PeerSyncReplicationTest.test-seed#[FDEB62AD9ECD1C2E]) [    ] o.a.s.c.ChaosMonkey monkey: stop shard! 56095
   [junit4]   2> 1075805 INFO  (TEST-PeerSyncReplicationTest.test-seed#[FDEB62AD9ECD1C2E]) [    ] o.a.s.c.CoreContainer Shutting down CoreContainer instance=1641605072
   [junit4]   2> 1075808 INFO  (TEST-PeerSyncReplicationTest.test-seed#[FDEB62AD9ECD1C2E]) [    ] o.a.s.c.Overseer Overseer (id=97223521667121169-127.0.0.1:56095_pxi-n_0000000004) closing
   [junit4]   2> 1075808 INFO  (OverseerStateUpdate-97223521667121169-127.0.0.1:56095_pxi-n_0000000004) [n:127.0.0.1:56095_pxi    ] o.a.s.c.Overseer Overseer Loop exiting : 127.0.0.1:56095_pxi
   [junit4]   2> 1075811 WARN  (zkCallback-1551-thread-3-processing-n:127.0.0.1:56095_pxi) [n:127.0.0.1:56095_pxi    ] o.a.s.c.c.ZkStateReader ZooKeeper watch triggered, but Solr cannot talk to ZK: [KeeperErrorCode = Session expired for /live_nodes]
   [junit4]   2> 1076726 WARN  (zkCallback-1551-thread-2-processing-n:127.0.0.1:56095_pxi) [n:127.0.0.1:56095_pxi c:collection1 s:shard1 r:core_node2 x:collection1] o.a.s.c.SyncStrategy Closed, skipping sync up.
   [junit4]   2> 1076727 INFO  (zkCallback-1551-thread-2-processing-n:127.0.0.1:56095_pxi) [n:127.0.0.1:56095_pxi c:collection1 s:shard1 r:core_node2 x:collection1] o.a.s.c.SolrCore [collection1]  CLOSING SolrCore org.apache.solr.core.SolrCore@1c7484bc
   [junit4]   2> 1076740 INFO  (zkCallback-1551-thread-2-processing-n:127.0.0.1:56095_pxi) [n:127.0.0.1:56095_pxi c:collection1 s:shard1 r:core_node2 x:collection1] o.a.s.m.SolrMetricManager Closing metric reporters for: solr.core.collection1
   [junit4]   2> 1076740 INFO  (TEST-PeerSyncReplicationTest.test-seed#[FDEB62AD9ECD1C2E]) [    ] o.a.s.m.SolrMetricManager Closing metric reporters for: solr.node
   [junit4]   2> 1076741 INFO  (TEST-PeerSyncReplicationTest.test-seed#[FDEB62AD9ECD1C2E]) [    ] o.e.j.s.AbstractConnector Stopped ServerConnector@42354c9d{HTTP/1.1,[http/1.1]}{127.0.0.1:56095}
   [junit4]   2> 1076742 INFO  (TEST-PeerSyncReplicationTest.test-seed#[FDEB62AD9ECD1C2E]) [    ] o.e.j.s.h.ContextHandler Stopped o.e.j.s.ServletContextHandler@1f0cc11f{/pxi,null,UNAVAILABLE}
   [junit4]   2> 1076743 INFO  (TEST-PeerSyncReplicationTest.test-seed#[FDEB62AD9ECD1C2E]) [    ] o.a.s.c.ChaosMonkey monkey: stop shard! 56100
   [junit4]   2> 1076744 INFO  (TEST-PeerSyncReplicationTest.test-seed#[FDEB62AD9ECD1C2E]) [    ] o.a.s.c.ZkTestServer connecting to 127.0.0.1:56083 56083
   [junit4]   2> 1076757 INFO  (Thread-2090) [    ] o.a.s.c.ZkTestServer connecting to 127.0.0.1:56083 56083
   [junit4]   2> 1078925 WARN  (Thread-2090) [    ] o.a.s.c.ZkTestServer Watch limit violations: 
   [junit4]   2> Maximum concurrent create/delete watches above limit:
   [junit4]   2> 
   [junit4]   2> 	6	/solr/aliases.json
   [junit4]   2> 	6	/solr/clusterprops.json
   [junit4]   2> 	5	/solr/security.json
   [junit4]   2> 	5	/solr/configs/conf1
   [junit4]   2> 	4	/solr/collections/collection1/state.json
   [junit4]   2> 
   [junit4]   2> Maximum concurrent data watches above limit:
   [junit4]   2> 
   [junit4]   2> 	6	/solr/clusterstate.json
   [junit4]   2> 	2	/solr/overseer_elect/election/97223521667121160-127.0.0.1:56091_pxi-n_0000000001
   [junit4]   2> 	2	/solr/collections/collection1/leader_elect/shard1/election/97223521667121160-core_node1-n_0000000000
   [junit4]   2> 	2	/solr/overseer_elect/election/97223521667121156-127.0.0.1:56086_pxi-n_0000000000
   [junit4]   2> 
   [junit4]   2> Maximum concurrent children watches above limit:
   [junit4]   2> 
   [junit4]   2> 	40	/solr/overseer/collection-queue-work
   [junit4]   2> 	36	/solr/overseer/queue
   [junit4]   2> 	6	/solr/collections
   [junit4]   2> 	5	/solr/live_nodes
   [junit4]   2> 	5	/solr/overseer/queue-work
   [junit4]   2> 
   [junit4]   2> NOTE: reproduce with: ant test  -Dtestcase=PeerSyncReplicationTest -Dtests.method=test -Dtests.seed=FDEB62AD9ECD1C2E -Dtests.slow=true -Dtests.locale=lv -Dtests.timezone=Navajo -Dtests.asserts=true -Dtests.file.encoding=UTF-8
   [junit4] FAILURE 46.4s J1 | PeerSyncReplicationTest.test <<<
   [junit4]    > Throwable #1: java.lang.AssertionError: PeerSynced node did not become leader expected:<CloudJettyRunner [url=http://127.0.0.1:56095/pxi/collection1]> but was:<CloudJettyRunner [url=http://127.0.0.1:56091/pxi/collection1]>
   [junit4]    > 	at __randomizedtesting.SeedInfo.seed([FDEB62AD9ECD1C2E:75BF5D77303171D6]:0)
   [junit4]    > 	at org.apache.solr.cloud.PeerSyncReplicationTest.test(PeerSyncReplicationTest.java:157)
   [junit4]    > 	at org.apache.solr.BaseDistributedSearchTestCase$ShardsRepeatRule$ShardsFixedStatement.callStatement(BaseDistributedSearchTestCase.java:992)
   [junit4]    > 	at org.apache.solr.BaseDistributedSearchTestCase$ShardsRepeatRule$ShardsStatement.evaluate(BaseDistributedSearchTestCase.java:967)
   [junit4]    > 	at java.lang.Thread.run(Thread.java:745)
   [junit4]   2> 1078929 INFO  (SUITE-PeerSyncReplicationTest-seed#[FDEB62AD9ECD1C2E]-worker) [    ] o.a.s.SolrTestCaseJ4 ###deleteCore
   [junit4]   2> NOTE: leaving temporary files on disk at: /Users/jenkins/workspace/Lucene-Solr-6.x-MacOSX/solr/build/solr-core/test/J1/temp/solr.cloud.PeerSyncReplicationTest_FDEB62AD9ECD1C2E-001
   [junit4]   2> NOTE: test params are: codec=Asserting(Lucene62): {other_tl1=FST50, range_facet_l_dv=PostingsFormat(name=Memory doPackFST= false), rnd_s=FST50, multiDefault=Lucene50(blocksize=128), intDefault=FST50, a_i1=Lucene50(blocksize=128), range_facet_l=Lucene50(blocksize=128), _version_=FST50, a_t=Lucene50(blocksize=128), id=PostingsFormat(name=Memory doPackFST= false), range_facet_i_dv=Lucene50(blocksize=128), text=PostingsFormat(name=Direct), timestamp=Lucene50(blocksize=128)}, docValues:{range_facet_l_dv=DocValuesFormat(name=Memory), range_facet_i_dv=DocValuesFormat(name=Lucene54), timestamp=DocValuesFormat(name=Lucene54)}, maxPointsInLeafNode=185, maxMBSortInHeap=7.090462784427393, sim=RandomSimilarity(queryNorm=false,coord=crazy): {}, locale=lv, timezone=Navajo
   [junit4]   2> NOTE: Mac OS X 10.11.6 x86_64/Oracle Corporation 1.8.0_102 (64-bit)/cpus=3,threads=1,free=263337864,total=417857536
   [junit4]   2> NOTE: All tests run in this JVM: [TestJsonFacetRefinement, ForceLeaderTest, ChaosMonkeySafeLeaderTest, TestManagedResourceStorage, CdcrReplicationHandlerTest, CursorMarkTest, TestDynamicLoading, JsonLoaderTest, TestFilteredDocIdSet, TestDFRSimilarityFactory, TestMiniSolrCloudClusterSSL, BasicAuthIntegrationTest, FieldMutatingUpdateProcessorTest, HLLUtilTest, TestPerFieldSimilarityClassic, TestQueryTypes, TestStressUserVersions, DistributedQueryComponentOptimizationTest, TestCloudPseudoReturnFields, TestCustomDocTransformer, DeleteNodeTest, QueryParsingTest, TestSolrDeletionPolicy2, TestShortCircuitedRequests, ResourceLoaderTest, FileBasedSpellCheckerTest, TestWriterPerf, UUIDFieldTest, TestConfigSetProperties, HdfsBasicDistributedZk2Test, TestLegacyFieldCache, TestRangeQuery, TestFuzzyAnalyzedSuggestions, TestRecoveryHdfs, BasicFunctionalityTest, TestSuggestSpellingConverter, TestQuerySenderNoQuery, DistributedTermsComponentTest, ShufflingReplicaListTransformerTest, AnalyticsMergeStrategyTest, TestDeleteCollectionOnDownNodes, ExternalFileFieldSortTest, ClusterStateTest, TestDistributedMissingSort, TestConfigSetsAPI, TemplateUpdateProcessorTest, TestHashQParserPlugin, RemoteQueryErrorTest, IndexSchemaTest, TestSolrQueryResponse, TestNumericTerms64, DistributedVersionInfoTest, TestLMDirichletSimilarityFactory, TestPivotHelperCode, SuggesterWFSTTest, DistributedExpandComponentTest, ScriptEngineTest, DistributedFacetPivotWhiteBoxTest, UpdateRequestProcessorFactoryTest, SimpleMLTQParserTest, TestCloudSchemaless, TestSolrCloudSnapshots, TestBulkSchemaAPI, SpellPossibilityIteratorTest, FacetPivotSmallTest, SpatialRPTFieldTypeTest, CdcrUpdateLogTest, NotRequiredUniqueKeyTest, ShowFileRequestHandlerTest, TestAddFieldRealTimeGet, TestCopyFieldCollectionResource, RankQueryTest, TestRecovery, LukeRequestHandlerTest, SliceStateTest, ExitableDirectoryReaderTest, TestQueryUtils, TestDistribIDF, TestSolr4Spatial, SuggesterTest, DistanceUnitsTest, DistributedIntervalFacetingTest, SharedFSAutoReplicaFailoverTest, DistributedFacetPivotLargeTest, ParsingFieldUpdateProcessorsTest, SuggestComponentContextFilterQueryTest, SmileWriterTest, TestJoin, TestCloudManagedSchema, TestCloudInspectUtil, TestRawResponseWriter, TestRuleBasedAuthorizationPlugin, TestDelegationWithHadoopAuth, TestDocTermOrds, EchoParamsTest, DefaultValueUpdateProcessorTest, TestTolerantUpdateProcessorRandomCloud, FieldAnalysisRequestHandlerTest, MultiThreadedOCPTest, BlockJoinFacetDistribTest, TestUnifiedSolrHighlighter, CleanupOldIndexTest, SmileWriterTest, TestSSLRandomization, HdfsCollectionsAPIDistributedZkTest, RequestLoggingTest, TestXmlQParser, TestConfigOverlay, DebugComponentTest, DeleteInactiveReplicaTest, TestRandomFaceting, SignatureUpdateProcessorFactoryTest, RollingRestartTest, SaslZkACLProviderTest, SolrInfoMBeanTest, LeaderElectionContextKeyTest, PreAnalyzedFieldTest, PeerSyncReplicationTest]
   [junit4] Completed [210/676 (1!)] on J1 in 46.45s, 1 test, 1 failure <<< FAILURES!

[...truncated 63947 lines...]


Mime
View raw message