lucene-dev mailing list archives

Site index · List index
Message view « Date » · « Thread »
Top « Date » · « Thread »
From Policeman Jenkins Server <jenk...@thetaphi.de>
Subject [JENKINS-EA] Lucene-Solr-6.x-Linux (64bit/jdk-9-ea+147) - Build # 2564 - Unstable!
Date Sun, 01 Jan 2017 15:09:06 GMT
Build: https://jenkins.thetaphi.de/job/Lucene-Solr-6.x-Linux/2564/
Java: 64bit/jdk-9-ea+147 -XX:+UseCompressedOops -XX:+UseSerialGC

1 tests failed.
FAILED:  org.apache.solr.update.processor.TestNamedUpdateProcessors.test

Error Message:
Index 0 out-of-bounds for length 0

Stack Trace:
java.lang.IndexOutOfBoundsException: Index 0 out-of-bounds for length 0
	at __randomizedtesting.SeedInfo.seed([E1C691D968454F20:6992AE03C6B922D8]:0)
	at java.base/jdk.internal.util.Preconditions.outOfBounds(Preconditions.java:64)
	at java.base/jdk.internal.util.Preconditions.outOfBoundsCheckIndex(Preconditions.java:70)
	at java.base/jdk.internal.util.Preconditions.checkIndex(Preconditions.java:248)
	at java.base/java.util.Objects.checkIndex(Objects.java:371)
	at java.base/java.util.ArrayList.get(ArrayList.java:435)
	at org.apache.solr.update.processor.TestNamedUpdateProcessors.test(TestNamedUpdateProcessors.java:128)
	at java.base/jdk.internal.reflect.NativeMethodAccessorImpl.invoke0(Native Method)
	at java.base/jdk.internal.reflect.NativeMethodAccessorImpl.invoke(NativeMethodAccessorImpl.java:62)
	at java.base/jdk.internal.reflect.DelegatingMethodAccessorImpl.invoke(DelegatingMethodAccessorImpl.java:43)
	at java.base/java.lang.reflect.Method.invoke(Method.java:538)
	at com.carrotsearch.randomizedtesting.RandomizedRunner.invoke(RandomizedRunner.java:1713)
	at com.carrotsearch.randomizedtesting.RandomizedRunner$8.evaluate(RandomizedRunner.java:907)
	at com.carrotsearch.randomizedtesting.RandomizedRunner$9.evaluate(RandomizedRunner.java:943)
	at com.carrotsearch.randomizedtesting.RandomizedRunner$10.evaluate(RandomizedRunner.java:957)
	at org.apache.solr.BaseDistributedSearchTestCase$ShardsRepeatRule$ShardsFixedStatement.callStatement(BaseDistributedSearchTestCase.java:992)
	at org.apache.solr.BaseDistributedSearchTestCase$ShardsRepeatRule$ShardsStatement.evaluate(BaseDistributedSearchTestCase.java:967)
	at com.carrotsearch.randomizedtesting.rules.SystemPropertiesRestoreRule$1.evaluate(SystemPropertiesRestoreRule.java:57)
	at org.apache.lucene.util.TestRuleSetupTeardownChained$1.evaluate(TestRuleSetupTeardownChained.java:49)
	at org.apache.lucene.util.AbstractBeforeAfterRule$1.evaluate(AbstractBeforeAfterRule.java:45)
	at org.apache.lucene.util.TestRuleThreadAndTestName$1.evaluate(TestRuleThreadAndTestName.java:48)
	at org.apache.lucene.util.TestRuleIgnoreAfterMaxFailures$1.evaluate(TestRuleIgnoreAfterMaxFailures.java:64)
	at org.apache.lucene.util.TestRuleMarkFailure$1.evaluate(TestRuleMarkFailure.java:47)
	at com.carrotsearch.randomizedtesting.rules.StatementAdapter.evaluate(StatementAdapter.java:36)
	at com.carrotsearch.randomizedtesting.ThreadLeakControl$StatementRunner.run(ThreadLeakControl.java:367)
	at com.carrotsearch.randomizedtesting.ThreadLeakControl.forkTimeoutingTask(ThreadLeakControl.java:811)
	at com.carrotsearch.randomizedtesting.ThreadLeakControl$3.evaluate(ThreadLeakControl.java:462)
	at com.carrotsearch.randomizedtesting.RandomizedRunner.runSingleTest(RandomizedRunner.java:916)
	at com.carrotsearch.randomizedtesting.RandomizedRunner$5.evaluate(RandomizedRunner.java:802)
	at com.carrotsearch.randomizedtesting.RandomizedRunner$6.evaluate(RandomizedRunner.java:852)
	at com.carrotsearch.randomizedtesting.RandomizedRunner$7.evaluate(RandomizedRunner.java:863)
	at com.carrotsearch.randomizedtesting.rules.StatementAdapter.evaluate(StatementAdapter.java:36)
	at com.carrotsearch.randomizedtesting.rules.SystemPropertiesRestoreRule$1.evaluate(SystemPropertiesRestoreRule.java:57)
	at org.apache.lucene.util.AbstractBeforeAfterRule$1.evaluate(AbstractBeforeAfterRule.java:45)
	at com.carrotsearch.randomizedtesting.rules.StatementAdapter.evaluate(StatementAdapter.java:36)
	at org.apache.lucene.util.TestRuleStoreClassName$1.evaluate(TestRuleStoreClassName.java:41)
	at com.carrotsearch.randomizedtesting.rules.NoShadowingOrOverridesOnMethodsRule$1.evaluate(NoShadowingOrOverridesOnMethodsRule.java:40)
	at com.carrotsearch.randomizedtesting.rules.NoShadowingOrOverridesOnMethodsRule$1.evaluate(NoShadowingOrOverridesOnMethodsRule.java:40)
	at com.carrotsearch.randomizedtesting.rules.StatementAdapter.evaluate(StatementAdapter.java:36)
	at com.carrotsearch.randomizedtesting.rules.StatementAdapter.evaluate(StatementAdapter.java:36)
	at org.apache.lucene.util.TestRuleAssertionsRequired$1.evaluate(TestRuleAssertionsRequired.java:53)
	at org.apache.lucene.util.TestRuleMarkFailure$1.evaluate(TestRuleMarkFailure.java:47)
	at org.apache.lucene.util.TestRuleIgnoreAfterMaxFailures$1.evaluate(TestRuleIgnoreAfterMaxFailures.java:64)
	at org.apache.lucene.util.TestRuleIgnoreTestSuites$1.evaluate(TestRuleIgnoreTestSuites.java:54)
	at com.carrotsearch.randomizedtesting.rules.StatementAdapter.evaluate(StatementAdapter.java:36)
	at com.carrotsearch.randomizedtesting.ThreadLeakControl$StatementRunner.run(ThreadLeakControl.java:367)
	at java.base/java.lang.Thread.run(Thread.java:844)




Build Log:
[...truncated 10992 lines...]
   [junit4] Suite: org.apache.solr.update.processor.TestNamedUpdateProcessors
   [junit4]   2> Creating dataDir: /home/jenkins/workspace/Lucene-Solr-6.x-Linux/solr/build/solr-core/test/J1/temp/solr.update.processor.TestNamedUpdateProcessors_E1C691D968454F20-001/init-core-data-001
   [junit4]   2> 122362 INFO  (SUITE-TestNamedUpdateProcessors-seed#[E1C691D968454F20]-worker) [    ] o.a.s.SolrTestCaseJ4 Randomized ssl (false) and clientAuth (true) via: @org.apache.solr.util.RandomizeSSL(reason="", ssl=0.0/0.0, value=0.0/0.0, clientAuth=0.0/0.0)
   [junit4]   2> 122362 INFO  (SUITE-TestNamedUpdateProcessors-seed#[E1C691D968454F20]-worker) [    ] o.a.s.BaseDistributedSearchTestCase Setting hostContext system property: /sn/qc
   [junit4]   2> 122364 INFO  (TEST-TestNamedUpdateProcessors.test-seed#[E1C691D968454F20]) [    ] o.a.s.c.ZkTestServer STARTING ZK TEST SERVER
   [junit4]   2> 122364 INFO  (Thread-288) [    ] o.a.s.c.ZkTestServer client port:0.0.0.0/0.0.0.0:0
   [junit4]   2> 122364 INFO  (Thread-288) [    ] o.a.s.c.ZkTestServer Starting server
   [junit4]   2> 122464 INFO  (TEST-TestNamedUpdateProcessors.test-seed#[E1C691D968454F20]) [    ] o.a.s.c.ZkTestServer start zk server on port:43514
   [junit4]   2> 122475 INFO  (TEST-TestNamedUpdateProcessors.test-seed#[E1C691D968454F20]) [    ] o.a.s.c.AbstractZkTestCase put /home/jenkins/workspace/Lucene-Solr-6.x-Linux/solr/core/src/test-files/solr/collection1/conf/solrconfig-tlog.xml to /configs/conf1/solrconfig.xml
   [junit4]   2> 122478 INFO  (TEST-TestNamedUpdateProcessors.test-seed#[E1C691D968454F20]) [    ] o.a.s.c.AbstractZkTestCase put /home/jenkins/workspace/Lucene-Solr-6.x-Linux/solr/core/src/test-files/solr/collection1/conf/schema.xml to /configs/conf1/schema.xml
   [junit4]   2> 122481 INFO  (TEST-TestNamedUpdateProcessors.test-seed#[E1C691D968454F20]) [    ] o.a.s.c.AbstractZkTestCase put /home/jenkins/workspace/Lucene-Solr-6.x-Linux/solr/core/src/test-files/solr/collection1/conf/solrconfig.snippet.randomindexconfig.xml to /configs/conf1/solrconfig.snippet.randomindexconfig.xml
   [junit4]   2> 122484 INFO  (TEST-TestNamedUpdateProcessors.test-seed#[E1C691D968454F20]) [    ] o.a.s.c.AbstractZkTestCase put /home/jenkins/workspace/Lucene-Solr-6.x-Linux/solr/core/src/test-files/solr/collection1/conf/stopwords.txt to /configs/conf1/stopwords.txt
   [junit4]   2> 122512 INFO  (TEST-TestNamedUpdateProcessors.test-seed#[E1C691D968454F20]) [    ] o.a.s.c.AbstractZkTestCase put /home/jenkins/workspace/Lucene-Solr-6.x-Linux/solr/core/src/test-files/solr/collection1/conf/protwords.txt to /configs/conf1/protwords.txt
   [junit4]   2> 122514 INFO  (TEST-TestNamedUpdateProcessors.test-seed#[E1C691D968454F20]) [    ] o.a.s.c.AbstractZkTestCase put /home/jenkins/workspace/Lucene-Solr-6.x-Linux/solr/core/src/test-files/solr/collection1/conf/currency.xml to /configs/conf1/currency.xml
   [junit4]   2> 122516 INFO  (TEST-TestNamedUpdateProcessors.test-seed#[E1C691D968454F20]) [    ] o.a.s.c.AbstractZkTestCase put /home/jenkins/workspace/Lucene-Solr-6.x-Linux/solr/core/src/test-files/solr/collection1/conf/enumsConfig.xml to /configs/conf1/enumsConfig.xml
   [junit4]   2> 122517 INFO  (TEST-TestNamedUpdateProcessors.test-seed#[E1C691D968454F20]) [    ] o.a.s.c.AbstractZkTestCase put /home/jenkins/workspace/Lucene-Solr-6.x-Linux/solr/core/src/test-files/solr/collection1/conf/open-exchange-rates.json to /configs/conf1/open-exchange-rates.json
   [junit4]   2> 122525 INFO  (TEST-TestNamedUpdateProcessors.test-seed#[E1C691D968454F20]) [    ] o.a.s.c.AbstractZkTestCase put /home/jenkins/workspace/Lucene-Solr-6.x-Linux/solr/core/src/test-files/solr/collection1/conf/mapping-ISOLatin1Accent.txt to /configs/conf1/mapping-ISOLatin1Accent.txt
   [junit4]   2> 122536 INFO  (TEST-TestNamedUpdateProcessors.test-seed#[E1C691D968454F20]) [    ] o.a.s.c.AbstractZkTestCase put /home/jenkins/workspace/Lucene-Solr-6.x-Linux/solr/core/src/test-files/solr/collection1/conf/old_synonyms.txt to /configs/conf1/old_synonyms.txt
   [junit4]   2> 122539 INFO  (TEST-TestNamedUpdateProcessors.test-seed#[E1C691D968454F20]) [    ] o.a.s.c.AbstractZkTestCase put /home/jenkins/workspace/Lucene-Solr-6.x-Linux/solr/core/src/test-files/solr/collection1/conf/synonyms.txt to /configs/conf1/synonyms.txt
   [junit4]   2> 123297 INFO  (TEST-TestNamedUpdateProcessors.test-seed#[E1C691D968454F20]) [    ] o.a.s.SolrTestCaseJ4 Writing core.properties file to /home/jenkins/workspace/Lucene-Solr-6.x-Linux/solr/build/solr-core/test/J1/temp/solr.update.processor.TestNamedUpdateProcessors_E1C691D968454F20-001/control-001/cores/collection1
   [junit4]   2> 123315 INFO  (TEST-TestNamedUpdateProcessors.test-seed#[E1C691D968454F20]) [    ] o.e.j.s.Server jetty-9.3.14.v20161028
   [junit4]   2> 123319 INFO  (TEST-TestNamedUpdateProcessors.test-seed#[E1C691D968454F20]) [    ] o.e.j.s.h.ContextHandler Started o.e.j.s.ServletContextHandler@61680b89{/sn/qc,null,AVAILABLE}
   [junit4]   2> 123321 INFO  (TEST-TestNamedUpdateProcessors.test-seed#[E1C691D968454F20]) [    ] o.e.j.s.AbstractConnector Started ServerConnector@24f854e0{HTTP/1.1,[http/1.1]}{127.0.0.1:41406}
   [junit4]   2> 123321 INFO  (TEST-TestNamedUpdateProcessors.test-seed#[E1C691D968454F20]) [    ] o.e.j.s.Server Started @125215ms
   [junit4]   2> 123321 INFO  (TEST-TestNamedUpdateProcessors.test-seed#[E1C691D968454F20]) [    ] o.a.s.c.s.e.JettySolrRunner Jetty properties: {hostContext=/sn/qc, solr.data.dir=/home/jenkins/workspace/Lucene-Solr-6.x-Linux/solr/build/solr-core/test/J1/temp/solr.update.processor.TestNamedUpdateProcessors_E1C691D968454F20-001/tempDir-001/control/data, hostPort=41406, coreRootDirectory=/home/jenkins/workspace/Lucene-Solr-6.x-Linux/solr/build/solr-core/test/J1/temp/solr.update.processor.TestNamedUpdateProcessors_E1C691D968454F20-001/control-001/cores}
   [junit4]   2> 123321 ERROR (TEST-TestNamedUpdateProcessors.test-seed#[E1C691D968454F20]) [    ] o.a.s.s.StartupLoggingUtils Missing Java Option solr.log.dir. Logging may be missing or incomplete.
   [junit4]   2> 123321 INFO  (TEST-TestNamedUpdateProcessors.test-seed#[E1C691D968454F20]) [    ] o.a.s.s.SolrDispatchFilter  ___      _       Welcome to Apache Solr? version 6.4.0
   [junit4]   2> 123321 INFO  (TEST-TestNamedUpdateProcessors.test-seed#[E1C691D968454F20]) [    ] o.a.s.s.SolrDispatchFilter / __| ___| |_ _   Starting in cloud mode on port null
   [junit4]   2> 123321 INFO  (TEST-TestNamedUpdateProcessors.test-seed#[E1C691D968454F20]) [    ] o.a.s.s.SolrDispatchFilter \__ \/ _ \ | '_|  Install dir: null
   [junit4]   2> 123322 INFO  (TEST-TestNamedUpdateProcessors.test-seed#[E1C691D968454F20]) [    ] o.a.s.s.SolrDispatchFilter |___/\___/_|_|    Start time: 2017-01-01T14:30:31.592011Z
   [junit4]   2> 123324 INFO  (TEST-TestNamedUpdateProcessors.test-seed#[E1C691D968454F20]) [    ] o.a.s.s.SolrDispatchFilter Loading solr.xml from SolrHome (not found in ZooKeeper)
   [junit4]   2> 123324 INFO  (TEST-TestNamedUpdateProcessors.test-seed#[E1C691D968454F20]) [    ] o.a.s.c.SolrXmlConfig Loading container configuration from /home/jenkins/workspace/Lucene-Solr-6.x-Linux/solr/build/solr-core/test/J1/temp/solr.update.processor.TestNamedUpdateProcessors_E1C691D968454F20-001/control-001/solr.xml
   [junit4]   2> 123329 INFO  (TEST-TestNamedUpdateProcessors.test-seed#[E1C691D968454F20]) [    ] o.a.s.u.UpdateShardHandler Creating UpdateShardHandler HTTP client with params: socketTimeout=340000&connTimeout=45000&retry=true
   [junit4]   2> 123331 INFO  (TEST-TestNamedUpdateProcessors.test-seed#[E1C691D968454F20]) [    ] o.a.s.c.ZkContainer Zookeeper client=127.0.0.1:43514/solr
   [junit4]   2> 123343 INFO  (TEST-TestNamedUpdateProcessors.test-seed#[E1C691D968454F20]) [    ] o.a.s.c.OverseerElectionContext I am going to be the leader 127.0.0.1:41406_sn%2Fqc
   [junit4]   2> 123344 INFO  (TEST-TestNamedUpdateProcessors.test-seed#[E1C691D968454F20]) [    ] o.a.s.c.Overseer Overseer (id=97208305623760900-127.0.0.1:41406_sn%2Fqc-n_0000000000) starting
   [junit4]   2> 123349 INFO  (TEST-TestNamedUpdateProcessors.test-seed#[E1C691D968454F20]) [    ] o.a.s.c.ZkController Register node as live in ZooKeeper:/live_nodes/127.0.0.1:41406_sn%2Fqc
   [junit4]   2> 123352 INFO  (OverseerStateUpdate-97208305623760900-127.0.0.1:41406_sn%2Fqc-n_0000000000) [    ] o.a.s.c.c.ZkStateReader Updated live nodes from ZooKeeper... (0) -> (1)
   [junit4]   2> 123374 INFO  (TEST-TestNamedUpdateProcessors.test-seed#[E1C691D968454F20]) [    ] o.a.s.c.CorePropertiesLocator Found 1 core definitions underneath /home/jenkins/workspace/Lucene-Solr-6.x-Linux/solr/build/solr-core/test/J1/temp/solr.update.processor.TestNamedUpdateProcessors_E1C691D968454F20-001/control-001/cores
   [junit4]   2> 123374 INFO  (TEST-TestNamedUpdateProcessors.test-seed#[E1C691D968454F20]) [    ] o.a.s.c.CorePropertiesLocator Cores are: [collection1]
   [junit4]   2> 123377 INFO  (OverseerStateUpdate-97208305623760900-127.0.0.1:41406_sn%2Fqc-n_0000000000) [    ] o.a.s.c.o.ReplicaMutator Assigning new node to shard shard=shard1
   [junit4]   2> 124384 INFO  (coreLoadExecutor-409-thread-1) [    ] o.a.s.c.SolrConfig Using Lucene MatchVersion: 6.4.0
   [junit4]   2> 124392 INFO  (coreLoadExecutor-409-thread-1) [    ] o.a.s.s.IndexSchema [collection1] Schema name=test
   [junit4]   2> 124449 WARN  (coreLoadExecutor-409-thread-1) [    ] o.a.s.s.IndexSchema [collection1] default search field in schema is text. WARNING: Deprecated, please use 'df' on request instead.
   [junit4]   2> 124451 INFO  (coreLoadExecutor-409-thread-1) [    ] o.a.s.s.IndexSchema Loaded schema test/1.0 with uniqueid field id
   [junit4]   2> 124458 INFO  (coreLoadExecutor-409-thread-1) [    ] o.a.s.c.CoreContainer Creating SolrCore 'collection1' using configuration from collection control_collection
   [junit4]   2> 124458 INFO  (coreLoadExecutor-409-thread-1) [    ] o.a.s.c.SolrCore [[collection1] ] Opening new SolrCore at [/home/jenkins/workspace/Lucene-Solr-6.x-Linux/solr/build/solr-core/test/J1/temp/solr.update.processor.TestNamedUpdateProcessors_E1C691D968454F20-001/control-001/cores/collection1], dataDir=[/home/jenkins/workspace/Lucene-Solr-6.x-Linux/solr/build/solr-core/test/J1/temp/solr.update.processor.TestNamedUpdateProcessors_E1C691D968454F20-001/control-001/cores/collection1/data/]
   [junit4]   2> 124458 INFO  (coreLoadExecutor-409-thread-1) [    ] o.a.s.c.JmxMonitoredMap JMX monitoring is enabled. Adding Solr mbeans to JMX Server: com.sun.jmx.mbeanserver.JmxMBeanServer@b084c2d
   [junit4]   2> 124460 INFO  (coreLoadExecutor-409-thread-1) [    ] o.a.s.u.RandomMergePolicy RandomMergePolicy wrapping class org.apache.lucene.index.LogByteSizeMergePolicy: [LogByteSizeMergePolicy: minMergeSize=1677721, mergeFactor=20, maxMergeSize=2147483648, maxMergeSizeForForcedMerge=9223372036854775807, calibrateSizeByDeletes=false, maxMergeDocs=2147483647, maxCFSSegmentSizeMB=8.796093022207999E12, noCFSRatio=1.0]
   [junit4]   2> 124476 WARN  (coreLoadExecutor-409-thread-1) [    ] o.a.s.c.RequestHandlers INVALID paramSet a in requestHandler {type = requestHandler,name = /dump,class = DumpRequestHandler,attributes = {initParams=a, name=/dump, class=DumpRequestHandler},args = {defaults={a=A,b=B}}}
   [junit4]   2> 124483 INFO  (coreLoadExecutor-409-thread-1) [    ] o.a.s.u.UpdateHandler Using UpdateLog implementation: org.apache.solr.update.UpdateLog
   [junit4]   2> 124483 INFO  (coreLoadExecutor-409-thread-1) [    ] o.a.s.u.UpdateLog Initializing UpdateLog: dataDir= defaultSyncLevel=FLUSH numRecordsToKeep=100 maxNumLogsToKeep=10 numVersionBuckets=65536
   [junit4]   2> 124484 INFO  (coreLoadExecutor-409-thread-1) [    ] o.a.s.u.CommitTracker Hard AutoCommit: disabled
   [junit4]   2> 124484 INFO  (coreLoadExecutor-409-thread-1) [    ] o.a.s.u.CommitTracker Soft AutoCommit: disabled
   [junit4]   2> 124484 INFO  (coreLoadExecutor-409-thread-1) [    ] o.a.s.u.RandomMergePolicy RandomMergePolicy wrapping class org.apache.lucene.index.LogByteSizeMergePolicy: [LogByteSizeMergePolicy: minMergeSize=1677721, mergeFactor=45, maxMergeSize=2147483648, maxMergeSizeForForcedMerge=9223372036854775807, calibrateSizeByDeletes=false, maxMergeDocs=2147483647, maxCFSSegmentSizeMB=8.796093022207999E12, noCFSRatio=1.0]
   [junit4]   2> 124489 INFO  (coreLoadExecutor-409-thread-1) [    ] o.a.s.s.SolrIndexSearcher Opening [Searcher@5d55995b[collection1] main]
   [junit4]   2> 124489 INFO  (coreLoadExecutor-409-thread-1) [    ] o.a.s.r.ManagedResourceStorage Configured ZooKeeperStorageIO with znodeBase: /configs/conf1
   [junit4]   2> 124490 INFO  (coreLoadExecutor-409-thread-1) [    ] o.a.s.r.ManagedResourceStorage Loaded null at path _rest_managed.json using ZooKeeperStorageIO:path=/configs/conf1
   [junit4]   2> 124490 INFO  (coreLoadExecutor-409-thread-1) [    ] o.a.s.h.ReplicationHandler Commits will be reserved for  10000
   [junit4]   2> 124490 INFO  (coreLoadExecutor-409-thread-1) [    ] o.a.s.u.UpdateLog Could not find max version in index or recent updates, using new clock 1555332892207349760
   [junit4]   2> 124491 INFO  (searcherExecutor-410-thread-1) [    ] o.a.s.c.SolrCore [collection1] Registered new searcher Searcher@5d55995b[collection1] main{ExitableDirectoryReader(UninvertingDirectoryReader())}
   [junit4]   2> 124495 INFO  (coreZkRegister-402-thread-1) [    ] o.a.s.c.ShardLeaderElectionContext Enough replicas found to continue.
   [junit4]   2> 124495 INFO  (coreZkRegister-402-thread-1) [    ] o.a.s.c.ShardLeaderElectionContext I may be the new leader - try and sync
   [junit4]   2> 124495 INFO  (coreZkRegister-402-thread-1) [    ] o.a.s.c.SyncStrategy Sync replicas to http://127.0.0.1:41406/sn/qc/collection1/
   [junit4]   2> 124495 INFO  (coreZkRegister-402-thread-1) [    ] o.a.s.c.SyncStrategy Sync Success - now sync replicas to me
   [junit4]   2> 124495 INFO  (coreZkRegister-402-thread-1) [    ] o.a.s.c.SyncStrategy http://127.0.0.1:41406/sn/qc/collection1/ has no replicas
   [junit4]   2> 124497 INFO  (coreZkRegister-402-thread-1) [    ] o.a.s.c.ShardLeaderElectionContext I am the new leader: http://127.0.0.1:41406/sn/qc/collection1/ shard1
   [junit4]   2> 124648 INFO  (coreZkRegister-402-thread-1) [    ] o.a.s.c.ZkController I am the leader, no recovery necessary
   [junit4]   2> 124914 INFO  (TEST-TestNamedUpdateProcessors.test-seed#[E1C691D968454F20]) [    ] o.a.s.c.c.ZkStateReader Updated live nodes from ZooKeeper... (0) -> (1)
   [junit4]   2> 124915 INFO  (TEST-TestNamedUpdateProcessors.test-seed#[E1C691D968454F20]) [    ] o.a.s.c.s.i.ZkClientClusterStateProvider Cluster at 127.0.0.1:43514/solr ready
   [junit4]   2> 124915 INFO  (TEST-TestNamedUpdateProcessors.test-seed#[E1C691D968454F20]) [    ] o.a.s.c.ChaosMonkey monkey: init - expire sessions:false cause connection loss:false
   [junit4]   2> 124915 INFO  (TEST-TestNamedUpdateProcessors.test-seed#[E1C691D968454F20]) [    ] o.a.s.c.AbstractFullDistribZkTestBase Creating collection1 with stateFormat=2
   [junit4]   2> 125847 INFO  (TEST-TestNamedUpdateProcessors.test-seed#[E1C691D968454F20]) [    ] o.a.s.SolrTestCaseJ4 Writing core.properties file to /home/jenkins/workspace/Lucene-Solr-6.x-Linux/solr/build/solr-core/test/J1/temp/solr.update.processor.TestNamedUpdateProcessors_E1C691D968454F20-001/shard-1-001/cores/collection1
   [junit4]   2> 125848 INFO  (TEST-TestNamedUpdateProcessors.test-seed#[E1C691D968454F20]) [    ] o.a.s.c.AbstractFullDistribZkTestBase create jetty 1 in directory /home/jenkins/workspace/Lucene-Solr-6.x-Linux/solr/build/solr-core/test/J1/temp/solr.update.processor.TestNamedUpdateProcessors_E1C691D968454F20-001/shard-1-001
   [junit4]   2> 125848 INFO  (TEST-TestNamedUpdateProcessors.test-seed#[E1C691D968454F20]) [    ] o.e.j.s.Server jetty-9.3.14.v20161028
   [junit4]   2> 125850 INFO  (TEST-TestNamedUpdateProcessors.test-seed#[E1C691D968454F20]) [    ] o.e.j.s.h.ContextHandler Started o.e.j.s.ServletContextHandler@509c456c{/sn/qc,null,AVAILABLE}
   [junit4]   2> 125851 INFO  (TEST-TestNamedUpdateProcessors.test-seed#[E1C691D968454F20]) [    ] o.e.j.s.AbstractConnector Started ServerConnector@7c230cc0{HTTP/1.1,[http/1.1]}{127.0.0.1:37370}
   [junit4]   2> 125851 INFO  (TEST-TestNamedUpdateProcessors.test-seed#[E1C691D968454F20]) [    ] o.e.j.s.Server Started @127745ms
   [junit4]   2> 125851 INFO  (TEST-TestNamedUpdateProcessors.test-seed#[E1C691D968454F20]) [    ] o.a.s.c.s.e.JettySolrRunner Jetty properties: {hostContext=/sn/qc, solrconfig=solrconfig.xml, solr.data.dir=/home/jenkins/workspace/Lucene-Solr-6.x-Linux/solr/build/solr-core/test/J1/temp/solr.update.processor.TestNamedUpdateProcessors_E1C691D968454F20-001/tempDir-001/jetty1, hostPort=37370, coreRootDirectory=/home/jenkins/workspace/Lucene-Solr-6.x-Linux/solr/build/solr-core/test/J1/temp/solr.update.processor.TestNamedUpdateProcessors_E1C691D968454F20-001/shard-1-001/cores}
   [junit4]   2> 125851 ERROR (TEST-TestNamedUpdateProcessors.test-seed#[E1C691D968454F20]) [    ] o.a.s.s.StartupLoggingUtils Missing Java Option solr.log.dir. Logging may be missing or incomplete.
   [junit4]   2> 125851 INFO  (TEST-TestNamedUpdateProcessors.test-seed#[E1C691D968454F20]) [    ] o.a.s.s.SolrDispatchFilter  ___      _       Welcome to Apache Solr? version 6.4.0
   [junit4]   2> 125851 INFO  (TEST-TestNamedUpdateProcessors.test-seed#[E1C691D968454F20]) [    ] o.a.s.s.SolrDispatchFilter / __| ___| |_ _   Starting in cloud mode on port null
   [junit4]   2> 125851 INFO  (TEST-TestNamedUpdateProcessors.test-seed#[E1C691D968454F20]) [    ] o.a.s.s.SolrDispatchFilter \__ \/ _ \ | '_|  Install dir: null
   [junit4]   2> 125851 INFO  (TEST-TestNamedUpdateProcessors.test-seed#[E1C691D968454F20]) [    ] o.a.s.s.SolrDispatchFilter |___/\___/_|_|    Start time: 2017-01-01T14:30:34.121921Z
   [junit4]   2> 125854 INFO  (TEST-TestNamedUpdateProcessors.test-seed#[E1C691D968454F20]) [    ] o.a.s.s.SolrDispatchFilter Loading solr.xml from SolrHome (not found in ZooKeeper)
   [junit4]   2> 125854 INFO  (TEST-TestNamedUpdateProcessors.test-seed#[E1C691D968454F20]) [    ] o.a.s.c.SolrXmlConfig Loading container configuration from /home/jenkins/workspace/Lucene-Solr-6.x-Linux/solr/build/solr-core/test/J1/temp/solr.update.processor.TestNamedUpdateProcessors_E1C691D968454F20-001/shard-1-001/solr.xml
   [junit4]   2> 125859 INFO  (TEST-TestNamedUpdateProcessors.test-seed#[E1C691D968454F20]) [    ] o.a.s.u.UpdateShardHandler Creating UpdateShardHandler HTTP client with params: socketTimeout=340000&connTimeout=45000&retry=true
   [junit4]   2> 125860 INFO  (TEST-TestNamedUpdateProcessors.test-seed#[E1C691D968454F20]) [    ] o.a.s.c.ZkContainer Zookeeper client=127.0.0.1:43514/solr
   [junit4]   2> 125880 INFO  (TEST-TestNamedUpdateProcessors.test-seed#[E1C691D968454F20]) [    ] o.a.s.c.c.ZkStateReader Updated live nodes from ZooKeeper... (0) -> (1)
   [junit4]   2> 125882 INFO  (TEST-TestNamedUpdateProcessors.test-seed#[E1C691D968454F20]) [    ] o.a.s.c.ZkController Register node as live in ZooKeeper:/live_nodes/127.0.0.1:37370_sn%2Fqc
   [junit4]   2> 125883 INFO  (zkCallback-155-thread-1) [    ] o.a.s.c.c.ZkStateReader Updated live nodes from ZooKeeper... (1) -> (2)
   [junit4]   2> 125883 INFO  (zkCallback-145-thread-2) [    ] o.a.s.c.c.ZkStateReader Updated live nodes from ZooKeeper... (1) -> (2)
   [junit4]   2> 125884 INFO  (zkCallback-149-thread-1) [    ] o.a.s.c.c.ZkStateReader Updated live nodes from ZooKeeper... (1) -> (2)
   [junit4]   2> 125925 INFO  (TEST-TestNamedUpdateProcessors.test-seed#[E1C691D968454F20]) [    ] o.a.s.c.CorePropertiesLocator Found 1 core definitions underneath /home/jenkins/workspace/Lucene-Solr-6.x-Linux/solr/build/solr-core/test/J1/temp/solr.update.processor.TestNamedUpdateProcessors_E1C691D968454F20-001/shard-1-001/cores
   [junit4]   2> 125925 INFO  (TEST-TestNamedUpdateProcessors.test-seed#[E1C691D968454F20]) [    ] o.a.s.c.CorePropertiesLocator Cores are: [collection1]
   [junit4]   2> 125927 INFO  (OverseerStateUpdate-97208305623760900-127.0.0.1:41406_sn%2Fqc-n_0000000000) [    ] o.a.s.c.o.ReplicaMutator Assigning new node to shard shard=shard2
   [junit4]   2> 126029 INFO  (zkCallback-155-thread-1) [    ] o.a.s.c.c.ZkStateReader A cluster state change: [WatchedEvent state:SyncConnected type:NodeDataChanged path:/collections/collection1/state.json] for collection [collection1] has occurred - updating... (live nodes size: [2])
   [junit4]   2> 126934 INFO  (coreLoadExecutor-420-thread-1) [    ] o.a.s.c.SolrConfig Using Lucene MatchVersion: 6.4.0
   [junit4]   2> 126953 INFO  (coreLoadExecutor-420-thread-1) [    ] o.a.s.s.IndexSchema [collection1] Schema name=test
   [junit4]   2> 127003 WARN  (coreLoadExecutor-420-thread-1) [    ] o.a.s.s.IndexSchema [collection1] default search field in schema is text. WARNING: Deprecated, please use 'df' on request instead.
   [junit4]   2> 127004 INFO  (coreLoadExecutor-420-thread-1) [    ] o.a.s.s.IndexSchema Loaded schema test/1.0 with uniqueid field id
   [junit4]   2> 127012 INFO  (coreLoadExecutor-420-thread-1) [    ] o.a.s.c.CoreContainer Creating SolrCore 'collection1' using configuration from collection collection1
   [junit4]   2> 127012 INFO  (coreLoadExecutor-420-thread-1) [    ] o.a.s.c.SolrCore [[collection1] ] Opening new SolrCore at [/home/jenkins/workspace/Lucene-Solr-6.x-Linux/solr/build/solr-core/test/J1/temp/solr.update.processor.TestNamedUpdateProcessors_E1C691D968454F20-001/shard-1-001/cores/collection1], dataDir=[/home/jenkins/workspace/Lucene-Solr-6.x-Linux/solr/build/solr-core/test/J1/temp/solr.update.processor.TestNamedUpdateProcessors_E1C691D968454F20-001/shard-1-001/cores/collection1/data/]
   [junit4]   2> 127012 INFO  (coreLoadExecutor-420-thread-1) [    ] o.a.s.c.JmxMonitoredMap JMX monitoring is enabled. Adding Solr mbeans to JMX Server: com.sun.jmx.mbeanserver.JmxMBeanServer@b084c2d
   [junit4]   2> 127016 INFO  (coreLoadExecutor-420-thread-1) [    ] o.a.s.u.RandomMergePolicy RandomMergePolicy wrapping class org.apache.lucene.index.LogByteSizeMergePolicy: [LogByteSizeMergePolicy: minMergeSize=1677721, mergeFactor=20, maxMergeSize=2147483648, maxMergeSizeForForcedMerge=9223372036854775807, calibrateSizeByDeletes=false, maxMergeDocs=2147483647, maxCFSSegmentSizeMB=8.796093022207999E12, noCFSRatio=1.0]
   [junit4]   2> 127059 WARN  (coreLoadExecutor-420-thread-1) [    ] o.a.s.c.RequestHandlers INVALID paramSet a in requestHandler {type = requestHandler,name = /dump,class = DumpRequestHandler,attributes = {initParams=a, name=/dump, class=DumpRequestHandler},args = {defaults={a=A,b=B}}}
   [junit4]   2> 127071 INFO  (coreLoadExecutor-420-thread-1) [    ] o.a.s.u.UpdateHandler Using UpdateLog implementation: org.apache.solr.update.UpdateLog
   [junit4]   2> 127071 INFO  (coreLoadExecutor-420-thread-1) [    ] o.a.s.u.UpdateLog Initializing UpdateLog: dataDir= defaultSyncLevel=FLUSH numRecordsToKeep=100 maxNumLogsToKeep=10 numVersionBuckets=65536
   [junit4]   2> 127072 INFO  (coreLoadExecutor-420-thread-1) [    ] o.a.s.u.CommitTracker Hard AutoCommit: disabled
   [junit4]   2> 127072 INFO  (coreLoadExecutor-420-thread-1) [    ] o.a.s.u.CommitTracker Soft AutoCommit: disabled
   [junit4]   2> 127073 INFO  (coreLoadExecutor-420-thread-1) [    ] o.a.s.u.RandomMergePolicy RandomMergePolicy wrapping class org.apache.lucene.index.LogByteSizeMergePolicy: [LogByteSizeMergePolicy: minMergeSize=1677721, mergeFactor=45, maxMergeSize=2147483648, maxMergeSizeForForcedMerge=9223372036854775807, calibrateSizeByDeletes=false, maxMergeDocs=2147483647, maxCFSSegmentSizeMB=8.796093022207999E12, noCFSRatio=1.0]
   [junit4]   2> 127076 INFO  (coreLoadExecutor-420-thread-1) [    ] o.a.s.s.SolrIndexSearcher Opening [Searcher@295fce03[collection1] main]
   [junit4]   2> 127077 INFO  (coreLoadExecutor-420-thread-1) [    ] o.a.s.r.ManagedResourceStorage Configured ZooKeeperStorageIO with znodeBase: /configs/conf1
   [junit4]   2> 127077 INFO  (coreLoadExecutor-420-thread-1) [    ] o.a.s.r.ManagedResourceStorage Loaded null at path _rest_managed.json using ZooKeeperStorageIO:path=/configs/conf1
   [junit4]   2> 127077 INFO  (coreLoadExecutor-420-thread-1) [    ] o.a.s.h.ReplicationHandler Commits will be reserved for  10000
   [junit4]   2> 127077 INFO  (coreLoadExecutor-420-thread-1) [    ] o.a.s.u.UpdateLog Could not find max version in index or recent updates, using new clock 1555332894920015872
   [junit4]   2> 127078 INFO  (searcherExecutor-421-thread-1) [    ] o.a.s.c.SolrCore [collection1] Registered new searcher Searcher@295fce03[collection1] main{ExitableDirectoryReader(UninvertingDirectoryReader())}
   [junit4]   2> 127082 INFO  (coreZkRegister-415-thread-1) [    ] o.a.s.c.ShardLeaderElectionContext Enough replicas found to continue.
   [junit4]   2> 127082 INFO  (coreZkRegister-415-thread-1) [    ] o.a.s.c.ShardLeaderElectionContext I may be the new leader - try and sync
   [junit4]   2> 127082 INFO  (coreZkRegister-415-thread-1) [    ] o.a.s.c.SyncStrategy Sync replicas to http://127.0.0.1:37370/sn/qc/collection1/
   [junit4]   2> 127082 INFO  (coreZkRegister-415-thread-1) [    ] o.a.s.c.SyncStrategy Sync Success - now sync replicas to me
   [junit4]   2> 127082 INFO  (coreZkRegister-415-thread-1) [    ] o.a.s.c.SyncStrategy http://127.0.0.1:37370/sn/qc/collection1/ has no replicas
   [junit4]   2> 127086 INFO  (coreZkRegister-415-thread-1) [    ] o.a.s.c.ShardLeaderElectionContext I am the new leader: http://127.0.0.1:37370/sn/qc/collection1/ shard2
   [junit4]   2> 127189 INFO  (zkCallback-155-thread-1) [    ] o.a.s.c.c.ZkStateReader A cluster state change: [WatchedEvent state:SyncConnected type:NodeDataChanged path:/collections/collection1/state.json] for collection [collection1] has occurred - updating... (live nodes size: [2])
   [junit4]   2> 127238 INFO  (coreZkRegister-415-thread-1) [    ] o.a.s.c.ZkController I am the leader, no recovery necessary
   [junit4]   2> 127341 INFO  (zkCallback-155-thread-1) [    ] o.a.s.c.c.ZkStateReader A cluster state change: [WatchedEvent state:SyncConnected type:NodeDataChanged path:/collections/collection1/state.json] for collection [collection1] has occurred - updating... (live nodes size: [2])
   [junit4]   2> 128568 INFO  (TEST-TestNamedUpdateProcessors.test-seed#[E1C691D968454F20]) [    ] o.a.s.SolrTestCaseJ4 Writing core.properties file to /home/jenkins/workspace/Lucene-Solr-6.x-Linux/solr/build/solr-core/test/J1/temp/solr.update.processor.TestNamedUpdateProcessors_E1C691D968454F20-001/shard-2-001/cores/collection1
   [junit4]   2> 128569 INFO  (TEST-TestNamedUpdateProcessors.test-seed#[E1C691D968454F20]) [    ] o.a.s.c.AbstractFullDistribZkTestBase create jetty 2 in directory /home/jenkins/workspace/Lucene-Solr-6.x-Linux/solr/build/solr-core/test/J1/temp/solr.update.processor.TestNamedUpdateProcessors_E1C691D968454F20-001/shard-2-001
   [junit4]   2> 128570 INFO  (TEST-TestNamedUpdateProcessors.test-seed#[E1C691D968454F20]) [    ] o.e.j.s.Server jetty-9.3.14.v20161028
   [junit4]   2> 128571 INFO  (TEST-TestNamedUpdateProcessors.test-seed#[E1C691D968454F20]) [    ] o.e.j.s.h.ContextHandler Started o.e.j.s.ServletContextHandler@4b4503fe{/sn/qc,null,AVAILABLE}
   [junit4]   2> 128571 INFO  (TEST-TestNamedUpdateProcessors.test-seed#[E1C691D968454F20]) [    ] o.e.j.s.AbstractConnector Started ServerConnector@3d02e2eb{HTTP/1.1,[http/1.1]}{127.0.0.1:35231}
   [junit4]   2> 128571 INFO  (TEST-TestNamedUpdateProcessors.test-seed#[E1C691D968454F20]) [    ] o.e.j.s.Server Started @130466ms
   [junit4]   2> 128571 INFO  (TEST-TestNamedUpdateProcessors.test-seed#[E1C691D968454F20]) [    ] o.a.s.c.s.e.JettySolrRunner Jetty properties: {hostContext=/sn/qc, solrconfig=solrconfig.xml, solr.data.dir=/home/jenkins/workspace/Lucene-Solr-6.x-Linux/solr/build/solr-core/test/J1/temp/solr.update.processor.TestNamedUpdateProcessors_E1C691D968454F20-001/tempDir-001/jetty2, hostPort=35231, coreRootDirectory=/home/jenkins/workspace/Lucene-Solr-6.x-Linux/solr/build/solr-core/test/J1/../../../../../../../../../home/jenkins/workspace/Lucene-Solr-6.x-Linux/solr/build/solr-core/test/J1/temp/solr.update.processor.TestNamedUpdateProcessors_E1C691D968454F20-001/shard-2-001/cores}
   [junit4]   2> 128572 ERROR (TEST-TestNamedUpdateProcessors.test-seed#[E1C691D968454F20]) [    ] o.a.s.s.StartupLoggingUtils Missing Java Option solr.log.dir. Logging may be missing or incomplete.
   [junit4]   2> 128572 INFO  (TEST-TestNamedUpdateProcessors.test-seed#[E1C691D968454F20]) [    ] o.a.s.s.SolrDispatchFilter  ___      _       Welcome to Apache Solr? version 6.4.0
   [junit4]   2> 128572 INFO  (TEST-TestNamedUpdateProcessors.test-seed#[E1C691D968454F20]) [    ] o.a.s.s.SolrDispatchFilter / __| ___| |_ _   Starting in cloud mode on port null
   [junit4]   2> 128572 INFO  (TEST-TestNamedUpdateProcessors.test-seed#[E1C691D968454F20]) [    ] o.a.s.s.SolrDispatchFilter \__ \/ _ \ | '_|  Install dir: null
   [junit4]   2> 128572 INFO  (TEST-TestNamedUpdateProcessors.test-seed#[E1C691D968454F20]) [    ] o.a.s.s.SolrDispatchFilter |___/\___/_|_|    Start time: 2017-01-01T14:30:36.842789Z
   [junit4]   2> 128576 INFO  (TEST-TestNamedUpdateProcessors.test-seed#[E1C691D968454F20]) [    ] o.a.s.s.SolrDispatchFilter Loading solr.xml from SolrHome (not found in ZooKeeper)
   [junit4]   2> 128577 INFO  (TEST-TestNamedUpdateProcessors.test-seed#[E1C691D968454F20]) [    ] o.a.s.c.SolrXmlConfig Loading container configuration from /home/jenkins/workspace/Lucene-Solr-6.x-Linux/solr/build/solr-core/test/J1/temp/solr.update.processor.TestNamedUpdateProcessors_E1C691D968454F20-001/shard-2-001/solr.xml
   [junit4]   2> 128584 INFO  (TEST-TestNamedUpdateProcessors.test-seed#[E1C691D968454F20]) [    ] o.a.s.u.UpdateShardHandler Creating UpdateShardHandler HTTP client with params: socketTimeout=340000&connTimeout=45000&retry=true
   [junit4]   2> 128587 INFO  (TEST-TestNamedUpdateProcessors.test-seed#[E1C691D968454F20]) [    ] o.a.s.c.ZkContainer Zookeeper client=127.0.0.1:43514/solr
   [junit4]   2> 128602 INFO  (TEST-TestNamedUpdateProcessors.test-seed#[E1C691D968454F20]) [    ] o.a.s.c.c.ZkStateReader Updated live nodes from ZooKeeper... (0) -> (2)
   [junit4]   2> 128607 INFO  (TEST-TestNamedUpdateProcessors.test-seed#[E1C691D968454F20]) [    ] o.a.s.c.ZkController Register node as live in ZooKeeper:/live_nodes/127.0.0.1:35231_sn%2Fqc
   [junit4]   2> 128614 INFO  (zkCallback-149-thread-1) [    ] o.a.s.c.c.ZkStateReader Updated live nodes from ZooKeeper... (2) -> (3)
   [junit4]   2> 128614 INFO  (zkCallback-155-thread-1) [    ] o.a.s.c.c.ZkStateReader Updated live nodes from ZooKeeper... (2) -> (3)
   [junit4]   2> 128614 INFO  (zkCallback-161-thread-1) [    ] o.a.s.c.c.ZkStateReader Updated live nodes from ZooKeeper... (2) -> (3)
   [junit4]   2> 128614 INFO  (zkCallback-145-thread-3) [    ] o.a.s.c.c.ZkStateReader Updated live nodes from ZooKeeper... (2) -> (3)
   [junit4]   2> 128658 INFO  (TEST-TestNamedUpdateProcessors.test-seed#[E1C691D968454F20]) [    ] o.a.s.c.CorePropertiesLocator Found 1 core definitions underneath /home/jenkins/workspace/Lucene-Solr-6.x-Linux/solr/build/solr-core/test/J1/../../../../../../../../../home/jenkins/workspace/Lucene-Solr-6.x-Linux/solr/build/solr-core/test/J1/temp/solr.update.processor.TestNamedUpdateProcessors_E1C691D968454F20-001/shard-2-001/cores
   [junit4]   2> 128659 INFO  (TEST-TestNamedUpdateProcessors.test-seed#[E1C691D968454F20]) [    ] o.a.s.c.CorePropertiesLocator Cores are: [collection1]
   [junit4]   2> 128664 INFO  (OverseerStateUpdate-97208305623760900-127.0.0.1:41406_sn%2Fqc-n_0000000000) [    ] o.a.s.c.o.ReplicaMutator Assigning new node to shard shard=shard1
   [junit4]   2> 128781 INFO  (zkCallback-161-thread-1) [    ] o.a.s.c.c.ZkStateReader A cluster state change: [WatchedEvent state:SyncConnected type:NodeDataChanged path:/collections/collection1/state.json] for collection [collection1] has occurred - updating... (live nodes size: [3])
   [junit4]   2> 128781 INFO  (zkCallback-155-thread-1) [    ] o.a.s.c.c.ZkStateReader A cluster state change: [WatchedEvent state:SyncConnected type:NodeDataChanged path:/collections/collection1/state.json] for collection [collection1] has occurred - updating... (live nodes size: [3])
   [junit4]   2> 129671 INFO  (coreLoadExecutor-431-thread-1) [    ] o.a.s.c.SolrConfig Using Lucene MatchVersion: 6.4.0
   [junit4]   2> 129685 INFO  (coreLoadExecutor-431-thread-1) [    ] o.a.s.s.IndexSchema [collection1] Schema name=test
   [junit4]   2> 129783 WARN  (coreLoadExecutor-431-thread-1) [    ] o.a.s.s.IndexSchema [collection1] default search field in schema is text. WARNING: Deprecated, please use 'df' on request instead.
   [junit4]   2> 129785 INFO  (coreLoadExecutor-431-thread-1) [    ] o.a.s.s.IndexSchema Loaded schema test/1.0 with uniqueid field id
   [junit4]   2> 129799 INFO  (coreLoadExecutor-431-thread-1) [    ] o.a.s.c.CoreContainer Creating SolrCore 'collection1' using configuration from collection collection1
   [junit4]   2> 129799 INFO  (coreLoadExecutor-431-thread-1) [    ] o.a.s.c.SolrCore [[collection1] ] Opening new SolrCore at [/home/jenkins/workspace/Lucene-Solr-6.x-Linux/solr/build/solr-core/test/J1/temp/solr.update.processor.TestNamedUpdateProcessors_E1C691D968454F20-001/shard-2-001/cores/collection1], dataDir=[/home/jenkins/workspace/Lucene-Solr-6.x-Linux/solr/build/solr-core/test/J1/../../../../../../../../../home/jenkins/workspace/Lucene-Solr-6.x-Linux/solr/build/solr-core/test/J1/temp/solr.update.processor.TestNamedUpdateProcessors_E1C691D968454F20-001/shard-2-001/cores/collection1/data/]
   [junit4]   2> 129800 INFO  (coreLoadExecutor-431-thread-1) [    ] o.a.s.c.JmxMonitoredMap JMX monitoring is enabled. Adding Solr mbeans to JMX Server: com.sun.jmx.mbeanserver.JmxMBeanServer@b084c2d
   [junit4]   2> 129801 INFO  (coreLoadExecutor-431-thread-1) [    ] o.a.s.u.RandomMergePolicy RandomMergePolicy wrapping class org.apache.lucene.index.LogByteSizeMergePolicy: [LogByteSizeMergePolicy: minMergeSize=1677721, mergeFactor=20, maxMergeSize=2147483648, maxMergeSizeForForcedMerge=9223372036854775807, calibrateSizeByDeletes=false, maxMergeDocs=2147483647, maxCFSSegmentSizeMB=8.796093022207999E12, noCFSRatio=1.0]
   [junit4]   2> 129822 WARN  (coreLoadExecutor-431-thread-1) [    ] o.a.s.c.RequestHandlers INVALID paramSet a in requestHandler {type = requestHandler,name = /dump,class = DumpRequestHandler,attributes = {initParams=a, name=/dump, class=DumpRequestHandler},args = {defaults={a=A,b=B}}}
   [junit4]   2> 129831 INFO  (coreLoadExecutor-431-thread-1) [    ] o.a.s.u.UpdateHandler Using UpdateLog implementation: org.apache.solr.update.UpdateLog
   [junit4]   2> 129831 INFO  (coreLoadExecutor-431-thread-1) [    ] o.a.s.u.UpdateLog Initializing UpdateLog: dataDir= defaultSyncLevel=FLUSH numRecordsToKeep=100 maxNumLogsToKeep=10 numVersionBuckets=65536
   [junit4]   2> 129832 INFO  (coreLoadExecutor-431-thread-1) [    ] o.a.s.u.CommitTracker Hard AutoCommit: disabled
   [junit4]   2> 129832 INFO  (coreLoadExecutor-431-thread-1) [    ] o.a.s.u.CommitTracker Soft AutoCommit: disabled
   [junit4]   2> 129832 INFO  (coreLoadExecutor-431-thread-1) [    ] o.a.s.u.RandomMergePolicy RandomMergePolicy wrapping class org.apache.lucene.index.LogByteSizeMergePolicy: [LogByteSizeMergePolicy: minMergeSize=1677721, mergeFactor=45, maxMergeSize=2147483648, maxMergeSizeForForcedMerge=9223372036854775807, calibrateSizeByDeletes=false, maxMergeDocs=2147483647, maxCFSSegmentSizeMB=8.796093022207999E12, noCFSRatio=1.0]
   [junit4]   2> 129835 INFO  (coreLoadExecutor-431-thread-1) [    ] o.a.s.s.SolrIndexSearcher Opening [Searcher@282e1558[collection1] main]
   [junit4]   2> 129836 INFO  (coreLoadExecutor-431-thread-1) [    ] o.a.s.r.ManagedResourceStorage Configured ZooKeeperStorageIO with znodeBase: /configs/conf1
   [junit4]   2> 129836 INFO  (coreLoadExecutor-431-thread-1) [    ] o.a.s.r.ManagedResourceStorage Loaded null at path _rest_managed.json using ZooKeeperStorageIO:path=/configs/conf1
   [junit4]   2> 129836 INFO  (coreLoadExecutor-431-thread-1) [    ] o.a.s.h.ReplicationHandler Commits will be reserved for  10000
   [junit4]   2> 129837 INFO  (searcherExecutor-432-thread-1) [    ] o.a.s.c.SolrCore [collection1] Registered new searcher Searcher@282e1558[collection1] main{ExitableDirectoryReader(UninvertingDirectoryReader())}
   [junit4]   2> 129837 INFO  (coreLoadExecutor-431-thread-1) [    ] o.a.s.u.UpdateLog Could not find max version in index or recent updates, using new clock 1555332897814085632
   [junit4]   2> 129841 INFO  (coreZkRegister-426-thread-1) [    ] o.a.s.c.ShardLeaderElectionContext Enough replicas found to continue.
   [junit4]   2> 129842 INFO  (coreZkRegister-426-thread-1) [    ] o.a.s.c.ShardLeaderElectionContext I may be the new leader - try and sync
   [junit4]   2> 129842 INFO  (coreZkRegister-426-thread-1) [    ] o.a.s.c.SyncStrategy Sync replicas to http://127.0.0.1:35231/sn/qc/collection1/
   [junit4]   2> 129842 INFO  (coreZkRegister-426-thread-1) [    ] o.a.s.c.SyncStrategy Sync Success - now sync replicas to me
   [junit4]   2> 129842 INFO  (coreZkRegister-426-thread-1) [    ] o.a.s.c.SyncStrategy http://127.0.0.1:35231/sn/qc/collection1/ has no replicas
   [junit4]   2> 129844 INFO  (coreZkRegister-426-thread-1) [    ] o.a.s.c.ShardLeaderElectionContext I am the new leader: http://127.0.0.1:35231/sn/qc/collection1/ shard1
   [junit4]   2> 129947 INFO  (zkCallback-155-thread-1) [    ] o.a.s.c.c.ZkStateReader A cluster state change: [WatchedEvent state:SyncConnected type:NodeDataChanged path:/collections/collection1/state.json] for collection [collection1] has occurred - updating... (live nodes size: [3])
   [junit4]   2> 129947 INFO  (zkCallback-161-thread-1) [    ] o.a.s.c.c.ZkStateReader A cluster state change: [WatchedEvent state:SyncConnected type:NodeDataChanged path:/collections/collection1/state.json] for collection [collection1] has occurred - updating... (live nodes size: [3])
   [junit4]   2> 129995 INFO  (coreZkRegister-426-thread-1) [    ] o.a.s.c.ZkController I am the leader, no recovery necessary
   [junit4]   2> 130098 INFO  (zkCallback-155-thread-1) [    ] o.a.s.c.c.ZkStateReader A cluster state change: [WatchedEvent state:SyncConnected type:NodeDataChanged path:/collections/collection1/state.json] for collection [collection1] has occurred - updating... (live nodes size: [3])
   [junit4]   2> 130098 INFO  (zkCallback-161-thread-1) [    ] o.a.s.c.c.ZkStateReader A cluster state change: [WatchedEvent state:SyncConnected type:NodeDataChanged path:/collections/collection1/state.json] for collection [collection1] has occurred - updating... (live nodes size: [3])
   [junit4]   2> 131184 INFO  (TEST-TestNamedUpdateProcessors.test-seed#[E1C691D968454F20]) [    ] o.a.s.SolrTestCaseJ4 Writing core.properties file to /home/jenkins/workspace/Lucene-Solr-6.x-Linux/solr/build/solr-core/test/J1/temp/solr.update.processor.TestNamedUpdateProcessors_E1C691D968454F20-001/shard-3-001/cores/collection1
   [junit4]   2> 131184 INFO  (TEST-TestNamedUpdateProcessors.test-seed#[E1C691D968454F20]) [    ] o.a.s.c.AbstractFullDistribZkTestBase create jetty 3 in directory /home/jenkins/workspace/Lucene-Solr-6.x-Linux/solr/build/solr-core/test/J1/temp/solr.update.processor.TestNamedUpdateProcessors_E1C691D968454F20-001/shard-3-001
   [junit4]   2> 131185 INFO  (TEST-TestNamedUpdateProcessors.test-seed#[E1C691D968454F20]) [    ] o.e.j.s.Server jetty-9.3.14.v20161028
   [junit4]   2> 131186 INFO  (TEST-TestNamedUpdateProcessors.test-seed#[E1C691D968454F20]) [    ] o.e.j.s.h.ContextHandler Started o.e.j.s.ServletContextHandler@755de8b5{/sn/qc,null,AVAILABLE}
   [junit4]   2> 131186 INFO  (TEST-TestNamedUpdateProcessors.test-seed#[E1C691D968454F20]) [    ] o.e.j.s.AbstractConnector Started ServerConnector@6d578795{HTTP/1.1,[http/1.1]}{127.0.0.1:34846}
   [junit4]   2> 131186 INFO  (TEST-TestNamedUpdateProcessors.test-seed#[E1C691D968454F20]) [    ] o.e.j.s.Server Started @133081ms
   [junit4]   2> 131186 INFO  (TEST-TestNamedUpdateProcessors.test-seed#[E1C691D968454F20]) [    ] o.a.s.c.s.e.JettySolrRunner Jetty properties: {hostContext=/sn/qc, solrconfig=solrconfig.xml, solr.data.dir=/home/jenkins/workspace/Lucene-Solr-6.x-Linux/solr/build/solr-core/test/J1/temp/solr.update.processor.TestNamedUpdateProcessors_E1C691D968454F20-001/tempDir-001/jetty3, hostPort=34846, coreRootDirectory=/home/jenkins/workspace/Lucene-Solr-6.x-Linux/solr/build/solr-core/test/J1/../../../../../../../../../home/jenkins/workspace/Lucene-Solr-6.x-Linux/solr/build/solr-core/test/J1/temp/solr.update.processor.TestNamedUpdateProcessors_E1C691D968454F20-001/shard-3-001/cores}
   [junit4]   2> 131187 ERROR (TEST-TestNamedUpdateProcessors.test-seed#[E1C691D968454F20]) [    ] o.a.s.s.StartupLoggingUtils Missing Java Option solr.log.dir. Logging may be missing or incomplete.
   [junit4]   2> 131187 INFO  (TEST-TestNamedUpdateProcessors.test-seed#[E1C691D968454F20]) [    ] o.a.s.s.SolrDispatchFilter  ___      _       Welcome to Apache Solr? version 6.4.0
   [junit4]   2> 131187 INFO  (TEST-TestNamedUpdateProcessors.test-seed#[E1C691D968454F20]) [    ] o.a.s.s.SolrDispatchFilter / __| ___| |_ _   Starting in cloud mode on port null
   [junit4]   2> 131187 INFO  (TEST-TestNamedUpdateProcessors.test-seed#[E1C691D968454F20]) [    ] o.a.s.s.SolrDispatchFilter \__ \/ _ \ | '_|  Install dir: null
   [junit4]   2> 131187 INFO  (TEST-TestNamedUpdateProcessors.test-seed#[E1C691D968454F20]) [    ] o.a.s.s.SolrDispatchFilter |___/\___/_|_|    Start time: 2017-01-01T14:30:39.457517Z
   [junit4]   2> 131190 INFO  (TEST-TestNamedUpdateProcessors.test-seed#[E1C691D968454F20]) [    ] o.a.s.s.SolrDispatchFilter Loading solr.xml from SolrHome (not found in ZooKeeper)
   [junit4]   2> 131190 INFO  (TEST-TestNamedUpdateProcessors.test-seed#[E1C691D968454F20]) [    ] o.a.s.c.SolrXmlConfig Loading container configuration from /home/jenkins/workspace/Lucene-Solr-6.x-Linux/solr/build/solr-core/test/J1/temp/solr.update.processor.TestNamedUpdateProcessors_E1C691D968454F20-001/shard-3-001/solr.xml
   [junit4]   2> 131195 INFO  (TEST-TestNamedUpdateProcessors.test-seed#[E1C691D968454F20]) [    ] o.a.s.u.UpdateShardHandler Creating UpdateShardHandler HTTP client with params: socketTimeout=340000&connTimeout=45000&retry=true
   [junit4]   2> 131196 INFO  (TEST-TestNamedUpdateProcessors.test-seed#[E1C691D968454F20]) [    ] o.a.s.c.ZkContainer Zookeeper client=127.0.0.1:43514/solr
   [junit4]   2> 131202 INFO  (TEST-TestNamedUpdateProcessors.test-seed#[E1C691D968454F20]) [    ] o.a.s.c.c.ZkStateReader Updated live nodes from ZooKeeper... (0) -> (3)
   [junit4]   2> 131204 INFO  (TEST-TestNamedUpdateProcessors.test-seed#[E1C691D968454F20]) [    ] o.a.s.c.ZkController Register node as live in ZooKeeper:/live_nodes/127.0.0.1:34846_sn%2Fqc
   [junit4]   2> 131205 INFO  (zkCallback-155-thread-1) [    ] o.a.s.c.c.ZkStateReader Updated live nodes from ZooKeeper... (3) -> (4)
   [junit4]   2> 131205 INFO  (zkCallback-145-thread-3) [    ] o.a.s.c.c.ZkStateReader Updated live nodes from ZooKeeper... (3) -> (4)
   [junit4]   2> 131205 INFO  (zkCallback-161-thread-1) [    ] o.a.s.c.c.ZkStateReader Updated live nodes from ZooKeeper... (3) -> (4)
   [junit4]   2> 131205 INFO  (zkCallback-167-thread-1) [    ] o.a.s.c.c.ZkStateReader Updated live nodes from ZooKeeper... (3) -> (4)
   [junit4]   2> 131205 INFO  (zkCallback-149-thread-1) [    ] o.a.s.c.c.ZkStateReader Updated live nodes from ZooKeeper... (3) -> (4)
   [junit4]   2> 131239 INFO  (TEST-TestNamedUpdateProcessors.test-seed#[E1C691D968454F20]) [    ] o.a.s.c.CorePropertiesLocator Found 1 core definitions underneath /home/jenkins/workspace/Lucene-Solr-6.x-Linux/solr/build/solr-core/test/J1/../../../../../../../../../home/jenkins/workspace/Lucene-Solr-6.x-Linux/solr/build/solr-core/test/J1/temp/solr.update.processor.TestNamedUpdateProcessors_E1C691D968454F20-001/shard-3-001/cores
   [junit4]   2> 131239 INFO  (TEST-TestNamedUpdateProcessors.test-seed#[E1C691D968454F20]) [    ] o.a.s.c.CorePropertiesLocator Cores are: [collection1]
   [junit4]   2> 131242 INFO  (OverseerStateUpdate-97208305623760900-127.0.0.1:41406_sn%2Fqc-n_0000000000) [    ] o.a.s.c.o.ReplicaMutator Assigning new node to shard shard=shard2
   [junit4]   2> 131343 INFO  (zkCallback-161-thread-1) [    ] o.a.s.c.c.ZkStateReader A cluster state change: [WatchedEvent state:SyncConnected type:NodeDataChanged path:/collections/collection1/state.json] for collection [collection1] has occurred - updating... (live nodes size: [4])
   [junit4]   2> 131343 INFO  (zkCallback-167-thread-1) [    ] o.a.s.c.c.ZkStateReader A cluster state change: [WatchedEvent state:SyncConnected type:NodeDataChanged path:/collections/collection1/state.json] for collection [collection1] has occurred - updating... (live nodes size: [4])
   [junit4]   2> 131343 INFO  (zkCallback-155-thread-1) [    ] o.a.s.c.c.ZkStateReader A cluster state change: [WatchedEvent state:SyncConnected type:NodeDataChanged path:/collections/collection1/state.json] for collection [collection1] has occurred - updating... (live nodes size: [4])
   [junit4]   2> 132252 INFO  (coreLoadExecutor-442-thread-1) [    ] o.a.s.c.SolrConfig Using Lucene MatchVersion: 6.4.0
   [junit4]   2> 132292 INFO  (coreLoadExecutor-442-thread-1) [    ] o.a.s.s.IndexSchema [collection1] Schema name=test
   [junit4]   2> 132373 WARN  (coreLoadExecutor-442-thread-1) [    ] o.a.s.s.IndexSchema [collection1] default search field in schema is text. WARNING: Deprecated, please use 'df' on request instead.
   [junit4]   2> 132375 INFO  (coreLoadExecutor-442-thread-1) [    ] o.a.s.s.IndexSchema Loaded schema test/1.0 with uniqueid field id
   [junit4]   2> 132401 INFO  (coreLoadExecutor-442-thread-1) [    ] o.a.s.c.CoreContainer Creating SolrCore 'collection1' using configuration from collection collection1
   [junit4]   2> 132402 INFO  (coreLoadExecutor-442-thread-1) [    ] o.a.s.c.SolrCore [[collection1] ] Opening new SolrCore at [/home/jenkins/workspace/Lucene-Solr-6.x-Linux/solr/build/solr-core/test/J1/temp/solr.update.processor.TestNamedUpdateProcessors_E1C691D968454F20-001/shard-3-001/cores/collection1], dataDir=[/home/jenkins/workspace/Lucene-Solr-6.x-Linux/solr/build/solr-core/test/J1/../../../../../../../../../home/jenkins/workspace/Lucene-Solr-6.x-Linux/solr/build/solr-core/test/J1/temp/solr.update.processor.TestNamedUpdateProcessors_E1C691D968454F20-001/shard-3-001/cores/collection1/data/]
   [junit4]   2> 132402 INFO  (coreLoadExecutor-442-thread-1) [    ] o.a.s.c.JmxMonitoredMap JMX monitoring is enabled. Adding Solr mbeans to JMX Server: com.sun.jmx.mbeanserver.JmxMBeanServer@b084c2d
   [junit4]   2> 132428 INFO  (coreLoadExecutor-442-thread-1) [    ] o.a.s.u.RandomMergePolicy RandomMergePolicy wrapping class org.apache.lucene.index.LogByteSizeMergePolicy: [LogByteSizeMergePolicy: minMergeSize=1677721, mergeFactor=20, maxMergeSize=2147483648, maxMergeSizeForForcedMerge=9223372036854775807, calibrateSizeByDeletes=false, maxMergeDocs=2147483647, maxCFSSegmentSizeMB=8.796093022207999E12, noCFSRatio=1.0]
   [junit4]   2> 132517 WARN  (coreLoadExecutor-442-thread-1) [    ] o.a.s.c.RequestHandlers INVALID paramSet a in requestHandler {type = requestHandler,name = /dump,class = DumpRequestHandler,attributes = {initParams=a, name=/dump, class=DumpRequestHandler},args = {defaults={a=A,b=B}}}
   [junit4]   2> 132533 INFO  (coreLoadExecutor-442-thread-1) [    ] o.a.s.u.UpdateHandler Using UpdateLog implementation: org.apache.solr.update.UpdateLog
   [junit4]   2> 132533 INFO  (coreLoadExecutor-442-thread-1) [    ] o.a.s.u.UpdateLog Initializing UpdateLog: dataDir= defaultSyncLevel=FLUSH numRecordsToKeep=100 maxNumLogsToKeep=10 numVersionBuckets=65536
   [junit4]   2> 132535 INFO  (coreLoadExecutor-442-thread-1) [    ] o.a.s.u.CommitTracker Hard AutoCommit: disabled
   [junit4]   2> 132535 INFO  (coreLoadExecutor-442-thread-1) [    ] o.a.s.u.CommitTracker Soft AutoCommit: disabled
   [junit4]   2> 132536 INFO  (coreLoadExecutor-442-thread-1) [    ] o.a.s.u.RandomMergePolicy RandomMergePolicy wrapping class org.apache.lucene.index.LogByteSizeMergePolicy: [LogByteSizeMergePolicy: minMergeSize=1677721, mergeFactor=45, maxMergeSize=2147483648, maxMergeSizeForForcedMerge=9223372036854775807, calibrateSizeByDeletes=false, maxMergeDocs=2147483647, maxCFSSegmentSizeMB=8.796093022207999E12, noCFSRatio=1.0]
   [junit4]   2> 132538 INFO  (coreLoadExecutor-442-thread-1) [    ] o.a.s.s.SolrIndexSearcher Opening [Searcher@56a33dd5[collection1] main]
   [junit4]   2> 132539 INFO  (coreLoadExecutor-442-thread-1) [    ] o.a.s.r.ManagedResourceStorage Configured ZooKeeperStorageIO with znodeBase: /configs/conf1
   [junit4]   2> 132540 INFO  (coreLoadExecutor-442-thread-1) [    ] o.a.s.r.ManagedResourceStorage Loaded null at path _rest_managed.json using ZooKeeperStorageIO:path=/configs/conf1
   [junit4]   2> 132540 INFO  (coreLoadExecutor-442-thread-1) [    ] o.a.s.h.ReplicationHandler Commits will be reserved for  10000
   [junit4]   2> 132541 INFO  (searcherExecutor-443-thread-1) [    ] o.a.s.c.SolrCore [collection1] Registered new searcher Searcher@56a33dd5[collection1] main{ExitableDirectoryReader(UninvertingDirectoryReader())}
   [junit4]   2> 132541 INFO  (coreLoadExecutor-442-thread-1) [    ] o.a.s.u.UpdateLog Could not find max version in index or recent updates, using new clock 1555332900649435136
   [junit4]   2> 132547 INFO  (coreZkRegister-437-thread-1) [    ] o.a.s.c.ZkController Core needs to recover:collection1
   [junit4]   2> 132547 INFO  (updateExecutor-164-thread-1) [    ] o.a.s.u.DefaultSolrCoreState Running recovery
   [junit4]   2> 132547 INFO  (recoveryExecutor-165-thread-1) [    ] o.a.s.c.RecoveryStrategy Starting recovery process. recoveringAfterStartup=true
   [junit4]   2> 132547 INFO  (recoveryExecutor-165-thread-1) [    ] o.a.s.c.RecoveryStrategy ###### startupVersions=[[]]
   [junit4]   2> 132548 INFO  (recoveryExecutor-165-thread-1) [    ] o.a.s.c.RecoveryStrategy Begin buffering updates. core=[collection1]
   [junit4]   2> 132548 INFO  (recoveryExecutor-165-thread-1) [    ] o.a.s.u.UpdateLog Starting to buffer updates. FSUpdateLog{state=ACTIVE, tlog=null}
   [junit4]   2> 132548 INFO  (recoveryExecutor-165-thread-1) [    ] o.a.s.c.RecoveryStrategy Publishing state of core [collection1] as recovering, leader is [http://127.0.0.1:37370/sn/qc/collection1/] and I am [http://127.0.0.1:34846/sn/qc/collection1/]
   [junit4]   2> 132552 INFO  (recoveryExecutor-165-thread-1) [    ] o.a.s.c.RecoveryStrategy Sending prep recovery command to [http://127.0.0.1:37370/sn/qc]; [WaitForState: action=PREPRECOVERY&core=collection1&nodeName=127.0.0.1:34846_sn%252Fqc&coreNodeName=core_node3&state=recovering&checkLive=true&onlyIfLeader=true&onlyIfLeaderActive=true]
   [junit4]   2> 132557 INFO  (qtp897229987-1021) [    ] o.a.s.h.a.PrepRecoveryOp Going to wait for coreNodeName: core_node3, state: recovering, checkLive: true, onlyIfLeader: true, onlyIfLeaderActive: true
   [junit4]   2> 132560 INFO  (qtp897229987-1021) [    ] o.a.s.h.a.PrepRecoveryOp Will wait a max of 183 seconds to see collection1 (shard2 of collection1) have state: recovering
   [junit4]   2> 132560 INFO  (qtp897229987-1021) [    ] o.a.s.h.a.PrepRecoveryOp In WaitForState(recovering): collection=collection1, shard=shard2, thisCore=collection1, leaderDoesNotNeedRecovery=false, isLeader? true, live=true, checkLive=true, currentState=down, localState=active, nodeName=127.0.0.1:34846_sn%2Fqc, coreNodeName=core_node3, onlyIfActiveCheckResult=false, nodeProps: core_node3:{"core":"collection1","base_url":"http://127.0.0.1:34846/sn/qc","node_name":"127.0.0.1:34846_sn%2Fqc","state":"down"}
   [junit4]   2> 132651 INFO  (zkCallback-155-thread-1) [    ] o.a.s.c.c.ZkStateReader A cluster state change: [WatchedEvent state:SyncConnected type:NodeDataChanged path:/collections/collection1/state.json] for collection [collection1] has occurred - updating... (live nodes size: [4])
   [junit4]   2> 132651 INFO  (zkCallback-161-thread-1) [    ] o.a.s.c.c.ZkStateReader A cluster state change: [WatchedEvent state:SyncConnected type:NodeDataChanged path:/collections/collection1/state.json] for collection [collection1] has occurred - updating... (live nodes size: [4])
   [junit4]   2> 132651 INFO  (zkCallback-167-thread-1) [    ] o.a.s.c.c.ZkStateReader A cluster state change: [WatchedEvent state:SyncConnected type:NodeDataChanged path:/collections/collection1/state.json] for collection [collection1] has occurred - updating... (live nodes size: [4])
   [junit4]   2> 133560 INFO  (qtp897229987-1021) [    ] o.a.s.h.a.PrepRecoveryOp In WaitForState(recovering): collection=collection1, shard=shard2, thisCore=collection1, leaderDoesNotNeedRecovery=false, isLeader? true, live=true, checkLive=true, currentState=recovering, localState=active, nodeName=127.0.0.1:34846_sn%2Fqc, coreNodeName=core_node3, onlyIfActiveCheckResult=false, nodeProps: core_node3:{"core":"collection1","base_url":"http://127.0.0.1:34846/sn/qc","node_name":"127.0.0.1:34846_sn%2Fqc","state":"recovering"}
   [junit4]   2> 133560 INFO  (qtp897229987-1021) [    ] o.a.s.h.a.PrepRecoveryOp Waited coreNodeName: core_node3, state: recovering, checkLive: true, onlyIfLeader: true for: 1 seconds.
   [junit4]   2> 133560 INFO  (qtp897229987-1021) [    ] o.a.s.s.HttpSolrCall [admin] webapp=null path=/admin/cores params={nodeName=127.0.0.1:34846_sn%252Fqc&onlyIfLeaderActive=true&core=collection1&coreNodeName=core_node3&action=PREPRECOVERY&checkLive=true&state=recovering&onlyIfLeader=true&wt=javabin&version=2} status=0 QTime=1003
   [junit4]   2> 133738 INFO  (TEST-TestNamedUpdateProcessors.test-seed#[E1C691D968454F20]) [    ] o.a.s.SolrTestCaseJ4 Writing core.properties file to /home/jenkins/workspace/Lucene-Solr-6.x-Linux/solr/build/solr-core/test/J1/temp/solr.update.processor.TestNamedUpdateProcessors_E1C691D968454F20-001/shard-4-001/cores/collection1
   [junit4]   2> 133738 INFO  (TEST-TestNamedUpdateProcessors.test-seed#[E1C691D968454F20]) [    ] o.a.s.c.AbstractFullDistribZkTestBase create jetty 4 in directory /home/jenkins/workspace/Lucene-Solr-6.x-Linux/solr/build/solr-core/test/J1/temp/solr.update.processor.TestNamedUpdateProcessors_E1C691D968454F20-001/shard-4-001
   [junit4]   2> 133739 INFO  (TEST-TestNamedUpdateProcessors.test-seed#[E1C691D968454F20]) [    ] o.e.j.s.Server jetty-9.3.14.v20161028
   [junit4]   2> 133740 INFO  (TEST-TestNamedUpdateProcessors.test-seed#[E1C691D968454F20]) [    ] o.e.j.s.h.ContextHandler Started o.e.j.s.ServletContextHandler@63a96bfd{/sn/qc,null,AVAILABLE}
   [junit4]   2> 133740 INFO  (TEST-TestNamedUpdateProcessors.test-seed#[E1C691D968454F20]) [    ] o.e.j.s.AbstractConnector Started ServerConnector@5c6b3965{HTTP/1.1,[http/1.1]}{127.0.0.1:36021}
   [junit4]   2> 133740 INFO  (TEST-TestNamedUpdateProcessors.test-seed#[E1C691D968454F20]) [    ] o.e.j.s.Server Started @135634ms
   [junit4]   2> 133740 INFO  (TEST-TestNamedUpdateProcessors.test-seed#[E1C691D968454F20]) [    ] o.a.s.c.s.e.JettySolrRunner Jetty properties: {hostContext=/sn/qc, solrconfig=solrconfig.xml, solr.data.dir=/home/jenkins/workspace/Lucene-Solr-6.x-Linux/solr/build/solr-core/test/J1/temp/solr.update.processor.TestNamedUpdateProcessors_E1C691D968454F20-001/tempDir-001/jetty4, hostPort=36021, coreRootDirectory=/home/jenkins/workspace/Lucene-Solr-6.x-Linux/solr/build/solr-core/test/J1/temp/solr.update.processor.TestNamedUpdateProcessors_E1C691D968454F20-001/shard-4-001/cores}
   [junit4]   2> 133741 ERROR (TEST-TestNamedUpdateProcessors.test-seed#[E1C691D968454F20]) [    ] o.a.s.s.StartupLoggingUtils Missing Java Option solr.log.dir. Logging may be missing or incomplete.
   [junit4]   2> 133741 INFO  (TEST-TestNamedUpdateProcessors.test-seed#[E1C691D968454F20]) [    ] o.a.s.s.SolrDispatchFilter  ___      _       Welcome to Apache Solr? version 6.4.0
   [junit4]   2> 133741 INFO  (TEST-TestNamedUpdateProcessors.test-seed#[E1C691D968454F20]) [    ] o.a.s.s.SolrDispatchFilter / __| ___| |_ _   Starting in cloud mode on port null
   [junit4]   2> 133741 INFO  (TEST-TestNamedUpdateProcessors.test-seed#[E1C691D968454F20]) [    ] o.a.s.s.SolrDispatchFilter \__ \/ _ \ | '_|  Install dir: null
   [junit4]   2> 133741 INFO  (TEST-TestNamedUpdateProcessors.test-seed#[E1C691D968454F20]) [    ] o.a.s.s.SolrDispatchFilter |___/\___/_|_|    Start time: 2017-01-01T14:30:42.011493Z
   [junit4]   2> 133743 INFO  (TEST-TestNamedUpdateProcessors.test-seed#[E1C691D968454F20]) [    ] o.a.s.s.SolrDispatchFilter Loading solr.xml from SolrHome (not found in ZooKeeper)
   [junit4]   2> 133744 INFO  (TEST-TestNamedUpdateProcessors.test-seed#[E1C691D968454F20]) [    ] o.a.s.c.SolrXmlConfig Loading container configuration from /home/jenkins/workspace/Lucene-Solr-6.x-Linux/solr/build/solr-core/test/J1/temp/solr.update.processor.TestNamedUpdateProcessors_E1C691D968454F20-001/shard-4-001/solr.xml
   [junit4]   2> 133749 INFO  (TEST-TestNamedUpdateProcessors.test-seed#[E1C691D968454F20]) [    ] o.a.s.u.UpdateShardHandler Creating UpdateShardHandler HTTP client with params: socketTimeout=340000&connTimeout=45000&retry=true
   [junit4]   2> 133750 INFO  (TEST-TestNamedUpdateProcessors.test-seed#[E1C691D968454F20]) [    ] o.a.s.c.ZkContainer Zookeeper client=127.0.0.1:43514/solr
   [junit4]   2> 133758 INFO  (TEST-TestNamedUpdateProcessors.test-seed#[E1C691D968454F20]) [    ] o.a.s.c.c.ZkStateReader Updated live nodes from ZooKeeper... (0) -> (4)
   [junit4]   2> 133774 INFO  (TEST-TestNamedUpdateProcessors.test-seed#[E1C691D968454F20]) [    ] o.a.s.c.ZkController Register node as live in ZooKeeper:/live_nodes/127.0.0.1:36021_sn%2Fqc
   [junit4]   2> 133775 INFO  (zkCallback-155-thread-1) [    ] o.a.s.c.c.ZkStateReader Updated live nodes from ZooKeeper... (4) -> (5)
   [junit4]   2> 133776 INFO  (zkCallback-145-thread-3) [    ] o.a.s.c.c.ZkStateReader Updated live nodes from ZooKeeper... (4) -> (5)
   [junit4]   2> 133776 INFO  (zkCallback-149-thread-1) [    ] o.a.s.c.c.ZkStateReader Updated live nodes from ZooKeeper... (4) -> (5)
   [junit4]   2> 133776 INFO  (zkCallback-161-thread-1) [    ] o.a.s.c.c.ZkStateReader Updated live nodes from ZooKeeper... (4) -> (5)
   [junit4]   2> 133776 INFO  (zkCallback-167-thread-1) [    ] o.a.s.c.c.ZkStateReader Updated live nodes from ZooKeeper... (4) -> (5)
   [junit4]   2> 133776 INFO  (zkCallback-174-thread-1) [    ] o.a.s.c.c.ZkStateReader Updated live nodes from ZooKeeper... (4) -> (5)
   [junit4]   2> 133814 INFO  (TEST-TestNamedUpdateProcessors.test-seed#[E1C691D968454F20]) [    ] o.a.s.c.CorePropertiesLocator Found 1 core definitions underneath /home/jenkins/workspace/Lucene-Solr-6.x-Linux/solr/build/solr-core/test/J1/temp/solr.update.processor.TestNamedUpdateProcessors_E1C691D968454F20-001/shard-4-001/cores
   [junit4]   2> 133814 INFO  (TEST-TestNamedUpdateProcessors.test-seed#[E1C691D968454F20]) [    ] o.a.s.c.CorePropertiesLocator Cores are: [collection1]
   [junit4]   2> 133818 INFO  (OverseerStateUpdate-97208305623760900-127.0.0.1:41406_sn%2Fqc-n_0000000000) [    ] o.a.s.c.o.ReplicaMutator Assigning new node to shard shard=shard1
   [junit4]   2> 133920 INFO  (zkCallback-174-thread-1) [    ] o.a.s.c.c.ZkStateReader A cluster state change: [WatchedEvent state:SyncConnected type:NodeDataChanged path:/collections/collection1/state.json] for collection [collection1] has occurred - updating... (live nodes size: [5])
   [junit4]   2> 133920 INFO  (zkCallback-155-thread-1) [    ] o.a.s.c.c.ZkStateReader A cluster state change: [WatchedEvent state:SyncConnected type:NodeDataChanged path:/collections/collection1/state.json] for collection [collection1] has occurred - updating... (live nodes size: [5])
   [junit4]   2> 133920 INFO  (zkCallback-161-thread-1) [    ] o.a.s.c.c.ZkStateReader A cluster state change: [WatchedEvent state:SyncConnected type:NodeDataChanged path:/collections/collection1/state.json] for collection [collection1] has occurred - updating... (live nodes size: [5])
   [junit4]   2> 133920 INFO  (zkCallback-167-thread-1) [    ] o.a.s.c.c.ZkStateReader A cluster state change: [WatchedEvent state:SyncConnected type:NodeDataChanged path:/collections/collection1/state.json] for collection [collection1] has occurred - updating... (live nodes size: [5])
   [junit4]   2> 134829 INFO  (coreLoadExecutor-453-thread-1) [    ] o.a.s.c.SolrConfig Using Lucene MatchVersion: 6.4.0
   [junit4]   2> 134844 INFO  (coreLoadExecutor-453-thread-1) [    ] o.a.s.s.IndexSchema [collection1] Schema name=test
   [junit4]   2> 134939 WARN  (coreLoadExecutor-453-thread-1) [    ] o.a.s.s.IndexSchema [collection1] default search field in schema is text. WARNING: Deprecated, please use 'df' on request instead.
   [junit4]   2> 134941 INFO  (coreLoadExecutor-453-thread-1) [    ] o.a.s.s.IndexSchema Loaded schema test/1.0 with uniqueid field id
   [junit4]   2> 134949 INFO  (coreLoadExecutor-453-thread-1) [    ] o.a.s.c.CoreContainer Creating SolrCore 'collection1' using configuration from collection collection1
   [junit4]   2> 134950 INFO  (coreLoadExecutor-453-thread-1) [    ] o.a.s.c.SolrCore [[collection1] ] Opening new SolrCore at [/home/jenkins/workspace/Lucene-Solr-6.x-Linux/solr/build/solr-core/test/J1/temp/solr.update.processor.TestNamedUpdateProcessors_E1C691D968454F20-001/shard-4-001/cores/collection1], dataDir=[/home/jenkins/workspace/Lucene-Solr-6.x-Linux/solr/build/solr-core/test/J1/temp/solr.update.processor.TestNamedUpdateProcessors_E1C691D968454F20-001/shard-4-001/cores/collection1/data/]
   [junit4]   2> 134950 INFO  (coreLoadExecutor-453-thread-1) [    ] o.a.s.c.JmxMonitoredMap JMX monitoring is enabled. Adding Solr mbeans to JMX Server: com.sun.jmx.mbeanserver.JmxMBeanServer@b084c2d
   [junit4]   2> 134952 INFO  (coreLoadExecutor-453-thread-1) [    ] o.a.s.u.RandomMergePolicy RandomMergePolicy wrapping class org.apache.lucene.index.LogByteSizeMergePolicy: [LogByteSizeMergePolicy: minMergeSize=1677721, mergeFactor=20, maxMergeSize=2147483648, maxMergeSizeForForcedMerge=9223372036854775807, calibrateSizeByDeletes=false, maxMergeDocs=2147483647, maxCFSSegmentSizeMB=8.796093022207999E12, noCFSRatio=1.0]
   [junit4]   2> 134973 WARN  (coreLoadExecutor-453-thread-1) [    ] o.a.s.c.RequestHandlers INVALID paramSet a in requestHandler {type = requestHandler,name = /dump,class = DumpRequestHandler,attributes = {initParams=a, name=/dump, class=DumpRequestHandler},args = {defaults={a=A,b=B}}}
   [junit4]   2> 134987 INFO  (coreLoadExecutor-453-thread-1) [    ] o.a.s.u.UpdateHandler Using UpdateLog implementation: org.apache.solr.update.UpdateLog
   [junit4]   2> 134988 INFO  (coreLoadExecutor-453-thread-1) [    ] o.a.s.u.UpdateLog Initializing UpdateLog: dataDir= defaultSyncLevel=FLUSH numRecordsToKeep=100 maxNumLogsToKeep=10 numVersionBuckets=65536
   [junit4]   2> 134989 INFO  (coreLoadExecutor-453-thread-1) [    ] o.a.s.u.CommitTracker Hard AutoCommit: disabled
   [junit4]   2> 134989 INFO  (coreLoadExecutor-453-thread-1) [    ] o.a.s.u.CommitTracker Soft AutoCommit: disabled
   [junit4]   2> 134990 INFO  (coreLoadExecutor-453-thread-1) [    ] o.a.s.u.RandomMergePolicy RandomMergePolicy wrapping class org.apache.lucene.index.LogByteSizeMergePolicy: [LogByteSizeMergePolicy: minMergeSize=1677721, mergeFactor=45, maxMergeSize=2147483648, maxMergeSizeForForcedMerge=9223372036854775807, calibrateSizeByDeletes=false, maxMergeDocs=2147483647, maxCFSSegmentSizeMB=8.796093022207999E12, noCFSRatio=1.0]
   [junit4]   2> 134992 INFO  (coreLoadExecutor-453-thread-1) [    ] o.a.s.s.SolrIndexSearcher Opening [Searcher@5d6b7740[collection1] main]
   [junit4]   2> 134994 INFO  (coreLoadExecutor-453-thread-1) [    ] o.a.s.r.ManagedResourceStorage Configured ZooKeeperStorageIO with znodeBase: /configs/conf1
   [junit4]   2> 134994 INFO  (coreLoadExecutor-453-thread-1) [    ] o.a.s.r.ManagedResourceStorage Loaded null at path _rest_managed.json using ZooKeeperStorageIO:path=/configs/conf1
   [junit4]   2> 134995 INFO  (coreLoadExecutor-453-thread-1) [    ] o.a.s.h.ReplicationHandler Commits will be reserved for  10000
   [junit4]   2> 134995 INFO  (coreLoadExecutor-453-thread-1) [    ] o.a.s.u.UpdateLog Could not find max version in index or recent updates, using new clock 1555332903222640640
   [junit4]   2> 134998 INFO  (searcherExecutor-454-thread-1) [    ] o.a.s.c.SolrCore [collection1] Registered new searcher Searcher@5d6b7740[collection1] main{ExitableDirectoryReader(UninvertingDirectoryReader())}
   [junit4]   2> 134999 INFO  (coreZkRegister-448-thread-1) [    ] o.a.s.c.ZkController Core needs to recover:collection1
   [junit4]   2> 134999 INFO  (updateExecutor-171-thread-1) [    ] o.a.s.u.DefaultSolrCoreState Running recovery
   [junit4]   2> 134999 INFO  (recoveryExecutor-172-thread-1) [    ] o.a.s.c.RecoveryStrategy Starting recovery process. recoveringAfterStartup=true
   [junit4]   2> 135000 INFO  (recoveryExecutor-172-thread-1) [    ] o.a.s.c.RecoveryStrategy ###### startupVersions=[[]]
   [junit4]   2> 135000 INFO  (recoveryExecutor-172-thread-1) [    ] o.a.s.c.RecoveryStrategy Begin buffering updates. core=[collection1]
   [junit4]   2> 135000 INFO  (recoveryExecutor-172-thread-1) [    ] o.a.s.u.UpdateLog Starting to buffer updates. FSUpdateLog{state=ACTIVE, tlog=null}
   [junit4]   2> 135000 INFO  (recoveryExecutor-172-thread-1) [    ] o.a.s.c.RecoveryStrategy Publishing state of core [collection1] as recovering, leader is [http://127.0.0.1:35231/sn/qc/collection1/] and I am [http://127.0.0.1:36021/sn/qc/collection1/]
   [junit4]   2> 135003 INFO  (recoveryExecutor-172-thread-1) [    ] o.a.s.c.RecoveryStrategy Sending prep recovery command to [http://127.0.0.1:35231/sn/qc]; [WaitForState: action=PREPRECOVERY&core=collection1&nodeName=127.0.0.1:36021_sn%252Fqc&coreNodeName=core_node4&state=recovering&checkLive=true&onlyIfLeader=true&onlyIfLeaderActive=true]
   [junit4]   2> 135007 INFO  (qtp1357873107-1049) [    ] o.a.s.h.a.PrepRecoveryOp Going to wait for coreNodeName: core_node4, state: recovering, checkLive: true, onlyIfLeader: true, onlyIfLeaderActive: true
   [junit4]   2> 135017 INFO  (qtp1357873107-1049) [    ] o.a.s.h.a.PrepRecoveryOp Will wait a max of 183 seconds to see collection1 (shard1 of collection1) have state: recovering
   [junit4]   2> 135018 INFO  (qtp1357873107-1049) [    ] o.a.s.h.a.PrepRecoveryOp In WaitForState(recovering): collection=collection1, shard=shard1, thisCore=collection1, leaderDoesNotNeedRecovery=false, isLeader? true, live=true, checkLive=true, currentState=down, localState=active, nodeName=127.0.0.1:36021_sn%2Fqc, coreNodeName=core_node4, onlyIfActiveCheckResult=false, nodeProps: core_node4:{"core":"collection1","base_url":"http://127.0.0.1:36021/sn/qc","node_name":"127.0.0.1:36021_sn%2Fqc","state":"down"}
   [junit4]   2> 135119 INFO  (zkCallback-161-thread-1) [    ] o.a.s.c.c.ZkStateReader A cluster state change: [WatchedEvent state:SyncConnected type:NodeDataChanged path:/collections/collection1/state.json] for collection [collection1] has occurred - updating... (live nodes size: [5])
   [junit4]   2> 135119 INFO  (zkCallback-167-thread-1) [    ] o.a.s.c.c.ZkStateReader A cluster state change: [WatchedEvent state:SyncConnected type:NodeDataChanged path:/collections/collection1/state.json] for collection [collection1] has occurred - updating... (live nodes size: [5])
   [junit4]   2> 135119 INFO  (zkCallback-155-thread-1) [    ] o.a.s.c.c.ZkStateReader A cluster state change: [WatchedEvent state:SyncConnected type:NodeDataChanged path:/collections/collection1/state.json] for collection [collection1] has occurred - updating... (live nodes size: [5])
   [junit4]   2> 135119 INFO  (zkCallback-174-thread-1) [    ] o.a.s.c.c.ZkStateReader A cluster state change: [WatchedEvent state:SyncConnected type:NodeDataChanged path:/collections/collection1/state.json] for collection [collection1] has occurred - updating... (live nodes size: [5])
   [junit4]   2> 135368 INFO  (TEST-TestNamedUpdateProcessors.test-seed#[E1C691D968454F20]) [    ] o.a.s.SolrTestCaseJ4 ###Starting test
   [junit4]   2> 135371 INFO  (qtp1357873107-1051) [    ] o.a.s.h.a.CollectionsHandler Invoked Collection Action :create with params replicationFactor=2&name=.system&action=CREATE&numShards=1&wt=javabin&version=2 and sendToOCPQueue=true
   [junit4]   2> 135379 INFO  (OverseerThreadFactory-407-thread-1) [    ] o.a.s.c.CreateCollectionCmd Create collection .system
   [junit4]   2> 135620 INFO  (qtp897229987-1017) [    ] o.a.s.h.a.CoreAdminOperation core create command qt=/admin/cores&collection.configName=.system&newCollection=true&name=.system_shard1_replica2&action=CREATE&numShards=1&collection=.system&shard=shard1&wt=javabin&version=2
   [junit4]   2> 135627 INFO  (qtp373815192-1077) [    ] o.a.s.h.a.CoreAdminOperation core create command qt=/admin/cores&collection.configName=.system&newCollection=true&name=.system_shard1_replica1&action=CREATE&numShards=1&collection=.system&shard=shard1&wt=javabin&version=2
   [junit4]   2> 135731 INFO  (zkCallback-167-thread-1) [    ] o.a.s.c.c.ZkStateReader A cluster state change: [WatchedEvent state:SyncConnected type:NodeDataChanged path:/collections/.system/state.json] for collection [.system] has occurred - updating... (live nodes size: [5])
   [junit4]   2> 135733 INFO  (zkCallback-155-thread-1) [    ] o.a.s.c.c.ZkStateReader A cluster state change: [WatchedEvent state:SyncConnected type:NodeDataChanged path:/collections/.system/state.json] for collection [.system] has occurred - updating... (live nodes size: [5])
   [junit4]   2> 136018 INFO  (qtp1357873107-1049) [    ] o.a.s.h.a.PrepRecoveryOp In WaitForState(recovering): collection=collection1, shard=shard1, thisCore=collection1, leaderDoesNotNeedRecovery=false, isLeader? true, live=true, checkLive=true, currentState=recovering, localState=active, nodeName=127.0.0.1:36021_sn%2Fqc, coreNodeName=core_node4, onlyIfActiveCheckResult=false, nodeProps: core_node4:{"core":"collection1","base_url":"http://127.0.0.1:36021/sn/qc","node_name":"127.0.0.1:36021_sn%2Fqc","state":"recovering"}
   [junit4]   2> 136018 INFO  (qtp1357873107-1049) [    ] o.a.s.h.a.PrepRecoveryOp Waited coreNodeName: core_node4, state: recovering, checkLive: true, onlyIfLeader: true for: 1 seconds.
   [junit4]   2> 136018 INFO  (qtp1357873107-1049) [    ] o.a.s.s.HttpSolrCall [admin] webapp=null path=/admin/cores params={nodeName=127.0.0.1:36021_sn%252Fqc&onlyIfLeaderActive=true&core=collection1&coreNodeName=core_node4&action=PREPRECOVERY&checkLive=true&state=recovering&onlyIfLeader=true&wt=javabin&version=2} status=0 QTime=1011
   [junit4]   2> 136631 INFO  (qtp897229987-1017) [    ] o.a.s.c.SolrConfig Using Lucene MatchVersion: 6.4.0
   [junit4]   2> 136636 INFO  (qtp373815192-1077) [    ] o.a.s.c.SolrConfig Using Lucene MatchVersion: 6.4.0
   [junit4]   2> 136639 INFO  (qtp897229987-1017) [    ] o.a.s.s.ManagedIndexSchemaFactory The schema is configured as managed, but managed schema resource managed-schema not found - loading non-managed schema schema.xml instead
   [junit4]   2> 136667 INFO  (qtp373815192-1077) [    ] o.a.s.s.ManagedIndexSchemaFactory The schema is configured as managed, but managed schema resource managed-schema not found - loading non-managed schema schema.xml instead
   [junit4]   2> 136667 INFO  (qtp897229987-1017) [    ] o.a.s.s.IndexSchema [.system_shard1_replica2] Schema name=_system collection or core
   [junit4]   2> 136670 INFO  (qtp373815192-1077) [    ] o.a.s.s.IndexSchema [.system_shard1_replica1] Schema name=_system collection or core
   [junit4]   2> 136670 INFO  (qtp897229987-1017) [    ] o.a.s.s.IndexSchema Loaded schema _system collection or core/1.1 with uniqueid field id
   [junit4]   2> 136671 INFO  (qtp897229987-1017) [    ] o.a.s.s.ManagedIndexSchema Created and persisted managed schema znode at /configs/.system/managed-schema
   [junit4]   2> 136673 INFO  (qtp897229987-1017) [    ] o.a.s.s.ManagedIndexSchemaFactory After upgrading to managed schema in ZooKeeper, renamed the non-managed schema /configs/.system/schema.xml to /configs/.system/schema.xml.bak
   [junit4]   2> 136674 INFO  (qtp897229987-1017) [    ] o.a.s.c.CoreContainer Creating SolrCore '.system_shard1_replica2' using configuration from collection .system
   [junit4]   2> 136675 INFO  (qtp897229987-1017) [    ] o.a.s.c.SolrCore [[.system_shard1_replica2] ] Opening new SolrCore at [/home/jenkins/workspace/Lucene-Solr-6.x-Linux/solr/build/solr-core/test/J1/temp/solr.update.processor.TestNamedUpdateProcessors_E1C691D968454F20-001/shard-1-001/cores/.system_shard1_replica2], dataDir=[/home/jenkins/workspace/Lucene-Solr-6.x-Linux/solr/build/solr-core/test/J1/temp/solr.update.processor.TestNamedUpdateProcessors_E1C691D968454F20-001/shard-1-001/cores/.system_shard1_replica2/data/]
   [junit4]   2> 136675 INFO  (qtp373815192-1077) [    ] o.a.s.s.IndexSchema Loaded schema _system collection or core/1.1 with uniqueid field id
   [junit4]   2> 136690 INFO  (qtp373815192-1077) [    ] o.a.s.s.ManagedIndexSchema Managed schema znode at /configs/.system/managed-schema already exists - no need to create it
   [junit4]   2> 136691 INFO  (qtp373815192-1077) [    ] o.a.s.s.ManagedIndexSchemaFactory After upgrading to managed schema in ZooKeeper, the non-managed schema /configs/.system/schema.xml no longer exists.
   [junit4]   2> 136691 INFO  (qtp373815192-1077) [    ] o.a.s.c.CoreContainer Creating SolrCore '.system_shard1_replica1' using configuration from collection .system
   [junit4]   2> 136692 INFO  (qtp373815192-1077) [    ] o.a.s.c.SolrCore [[.system_shard1_replica1] ] Opening new SolrCore at [/home/jenkins/workspace/Lucene-Solr-6.x-Linux/solr/build/solr-core/test/J1/temp/solr.update.processor.TestNamedUpdateProcessors_E1C691D968454F20-001/shard-3-001/cores/.system_shard1_replica1], dataDir=[/home/jenkins/workspace/Lucene-Solr-6.x-Linux/solr/build/solr-core/test/J1/../../../../../../../../../home/jenkins/workspace/Lucene-Solr-6.x-Linux/solr/build/solr-core/test/J1/temp/solr.update.processor.TestNamedUpdateProcessors_E1C691D968454F20-001/shard-3-001/cores/.system_shard1_replica1/data/]
   [junit4]   2> 136730 INFO  (qtp897229987-1017) [    ] o.a.s.u.UpdateHandler Using UpdateLog implementation: org.apache.solr.update.UpdateLog
   [junit4]   2> 136730 INFO  (qtp897229987-1017) [    ] o.a.s.u.UpdateLog Initializing UpdateLog: dataDir= defaultSyncLevel=FLUSH numRecordsToKeep=100 maxNumLogsToKeep=10 numVersionBuckets=65536
   [junit4]   2> 136732 INFO  (qtp897229987-1017) [    ] o.a.s.u.CommitTracker Hard AutoCommit: if 1 uncommited docs 
   [junit4]   2> 136732 INFO  (qtp897229987-1017) [    ] o.a.s.u.CommitTracker Soft AutoCommit: disabled
   [junit4]   2> 136735 INFO  (qtp897229987-1017) [    ] o.a.s.s.SolrIndexSearcher Opening [Searcher@1eb04c1f[.system_shard1_replica2] main]
   [junit4]   2> 136735 INFO  (qtp897229987-1017) [    ] o.a.s.r.ManagedResourceStorage Configured ZooKeeperStorageIO with znodeBase: /configs/.system
   [junit4]   2> 136736 INFO  (qtp897229987-1017) [    ] o.a.s.r.ManagedResourceStorage Loaded null at path _rest_managed.json using ZooKeeperStorageIO:path=/configs/.system
   [junit4]   2> 136736 INFO  (qtp897229987-1017) [    ] o.a.s.s.ZkIndexSchemaReader Creating ZooKeeper watch for the managed schema at /configs/.system/managed-schema
   [junit4]   2> 136736 INFO  (qtp897229987-1017) [    ] o.a.s.s.ZkIndexSchemaReader Current schema version 0 is already the latest
   [junit4]   2> 136737 INFO  (qtp897229987-1017) [    ] o.a.s.h.ReplicationHandler Commits will be reserved for  10000
   [junit4]   2> 136737 INFO  (searcherExecutor-459-thread-1) [    ] o.a.s.c.SolrCore [.system_shard1_replica2] Registered new searcher Searcher@1eb04c1f[.system_shard1_replica2] main{ExitableDirectoryReader(UninvertingDirectoryReader())}
   [junit4]   2> 136737 INFO  (qtp897229987-1017) [    ] o.a.s.u.UpdateLog Could not find max version in index or recent updates, using new clock 1555332905049260032
   [junit4]   2> 136742 INFO  (qtp897229987-1017) [    ] o.a.s.c.ShardLeaderElectionContext Waiting until we see more replicas up for shard shard1: total=2 found=1 timeoutin=9999ms
   [junit4]   2> 136742 INFO  (qtp373815192-1077) [    ] o.a.s.u.UpdateHandler Using UpdateLog implementation: org.apache.solr.update.UpdateLog
   [junit4]   2> 136742 INFO  (qtp373815192-1077) [    ] o.a.s.u.UpdateLog Initializing UpdateLog: dataDir= defaultSyncLevel=FLUSH numRecordsToKeep=100 maxNumLogsToKeep=10 numVersionBuckets=65536
   [junit4]   2> 136744 INFO  (qtp373815192-1077) [    ] o.a.s.u.CommitTracker Hard AutoCommit: if 1 uncommited docs 
   [junit4]   2> 136744 INFO  (qtp373815192-1077) [    ] o.a.s.u.CommitTracker Soft AutoCommit: disabled
   [junit4]   2> 136747 INFO  (qtp373815192-1077) [    ] o.a.s.s.SolrIndexSearcher Opening [Searcher@1a0691f6[.system_shard1_replica1] main]
   [junit4]   2> 136748 INFO  (qtp373815192-1077) [    ] o.a.s.r.ManagedResourceStorage Configured ZooKeeperStorageIO with znodeBase: /configs/.system
   [junit4]   2> 136748 INFO  (qtp373815192-1077) [    ] o.a.s.r.ManagedResourceStorage Loaded null at path _rest_managed.json using ZooKeeperStorageIO:path=/configs/.system
   [junit4]   2> 136748 INFO  (qtp373815192-1077) [    ] o.a.s.s.ZkIndexSchemaReader Creating ZooKeeper watch for the managed schema at /configs/.system/managed-schema
   [junit4]   2> 136748 INFO  (qtp373815192-1077) [    ] o.a.s.s.ZkIndexSchemaReader Retrieved schema version 0 from ZooKeeper
   [junit4]   2> 136750 INFO  (qtp373815192-1077) [    ] o.a.s.s.IndexSchema [.system_shard1_replica1] Schema name=_system collection or core
   [junit4]   2> 136752 INFO  (qtp373815192-1077) [    ] o.a.s.s.IndexSchema Loaded schema _system collection or core/1.1 with uniqueid field id
   [junit4]   2> 136752 INFO  (qtp373815192-1077) [    ] o.a.s.s.ZkIndexSchemaReader Finished refreshing schema in 3 ms
   [junit4]   2> 136752 INFO  (qtp373815192-1077) [    ] o.a.s.h.ReplicationHandler Commits will be reserved for  10000
   [junit4]   2> 136752 INFO  (searcherExecutor-460-thread-1) [    ] o.a.s.c.SolrCore [.system_shard1_replica1] Registered new searcher Searcher@1a0691f6[.system_shard1_replica1] main{ExitableDirectoryReader(UninvertingDirectoryReader())}
   [junit4]   2> 136752 INFO  (qtp373815192-1077) [    ] o.a.s.u.UpdateLog Could not find max version in index or recent updates, using new clock 1555332905064988672
   [junit4]   2> 136843 INFO  (zkCallback-167-thread-1) [    ] o.a.s.c.c.ZkStateReader A cluster state change: [WatchedEvent state:SyncConnected type:NodeDataChanged path:/collections/.system/state.json] for collection [.system] has occurred - updating... (live nodes size: [5])
   [junit4]   2> 136843 INFO  (zkCallback-155-thread-1) [    ] o.a.s.c.c.ZkStateReader A cluster state change: [WatchedEvent state:SyncConnected type:NodeDataChanged path:/collections/.system/state.json] for collection [.system] has occurred - updating... (live nodes size: [5])
   [junit4]   2> 137242 INFO  (qtp897229987-1017) [    ] o.a.s.c.ShardLeaderElectionContext Enough replicas found to continue.
   [junit4]   2> 137242 INFO  (qtp897229987-1017) [    ] o.a.s.c.ShardLeaderElectionContext I may be the new leader - try and sync
   [junit4]   2> 137242 INFO  (qtp897229987-1017) [    ] o.a.s.c.SyncStrategy Sync replicas to http://127.0.0.1:37370/sn/qc/.system_shard1_replica2/
   [junit4]   2> 137242 INFO  (qtp897229987-1017) [    ] o.a.s.u.PeerSync PeerSync: core=.system_shard1_replica2 url=http://127.0.0.1:37370/sn/qc START replicas=[http://127.0.0.1:34846/sn/qc/.system_shard1_replica1/] nUpdates=100
   [junit4]   2> 137243 INFO  (qtp897229987-1017) [    ] o.a.s.u.PeerSync PeerSync: core=.system_shard1_replica2 url=http://127.0.0.1:37370/sn/qc DONE.  We have no versions.  sync failed.
   [junit4]   2> 137245 INFO  (qtp373815192-1073) [    ] o.a.s.c.S.Request [.system_shard1_replica1]  webapp=/sn/qc path=/get params={distrib=false&qt=/get&fingerprint=false&getVersions=100&wt=javabin&version=2} status=0 QTime=0
   [junit4]   2> 137246 INFO  (qtp897229987-1017) [    ] o.a.s.c.SyncStrategy Leader's attempt to sync with shard failed, moving to the next candidate
   [junit4]   2> 137246 INFO  (qtp897229987-1017) [    ] o.a.s.c.ShardLeaderElectionContext We failed sync, but we have no versions - we can't sync in that case - we were active before, so become leader anyway
   [junit4]   2> 137248 INFO  (qtp897229987-1017) [    ] o.a.s.c.ShardLeaderElectionContext I am the new leader: http://127.0.0.1:37370/sn/qc/.system_shard1_replica2/ shard1
   [junit4]   2> 137351 INFO  (zkCallback-155-thread-1) [    ] o.a.s.c.c.ZkStateReader A cluster state change: [WatchedEvent state:SyncConnected type:NodeDataChanged path:/collections/.system/state.json] for collection [.system] has occurred - updating... (live nodes size: [5])
   [junit4]   2> 137351 INFO  (zkCallback-167-thread-1) [    ] o.a.s.c.c.ZkStateReader A cluster state change: [WatchedEvent state:SyncConnected type:NodeDataChanged path:/collections/.system/state.json] for collection [.system] has occurred - updating... (live nodes size: [5])
   [junit4]   2> 137401 INFO  (qtp897229987-1017) [    ] o.a.s.c.ZkController I am the leader, no recovery necessary
   [junit4]   2> 137403 INFO  (qtp897229987-1017) [    ] o.a.s.s.HttpSolrCall [admin] webapp=null path=/admin/cores params={qt=/admin/cores&collection.configName=.system&newCollection=true&name=.system_shard1_replica2&action=CREATE&numShards=1&collection=.system&shard=shard1&wt=javabin&version=2} status=0 QTime=1783
   [junit4]   2> 137504 INFO  (zkCallback-155-thread-1) [    ] o.a.s.c.c.ZkStateReader A cluster state change: [WatchedEvent state:SyncConnected type:NodeDataChanged path:/collections/.system/state.json] for collection [.system] has occurred - updating... (live nodes size: [5])
   [junit4]   2> 137504 INFO  (zkCallback-167-thread-1) [    ] o.a.s.c.c.ZkStateReader A cluster state change: [WatchedEvent state:SyncConnected type:NodeDataChanged path:/collections/.system/state.json] for collection [.system] has occurred - updating... (live nodes size: [5])
   [junit4]   2> 137758 INFO  (qtp373815192-1077) [    ] o.a.s.s.HttpSolrCall [admin] webapp=null path=/admin/cores params={qt=/admin/cores&collection.configName=.system&newCollection=true&name=.system_shard1_replica1&action=CREATE&numShards=1&collection=.system&shard=shard1&wt=javabin&version=2} status=0 QTime=2130
   [junit4]   2> 137761 INFO  (qtp1357873107-1051) [    ] o.a.s.h.a.CollectionsHandler Wait for new collection to be active for at most 30 seconds. Check all shard replicas
   [junit4]   2> 137859 INFO  (zkCallback-155-thread-1) [    ] o.a.s.c.c.ZkStateReader A cluster state change: [WatchedEvent state:SyncConnected type:NodeDataChanged path:/collections/.system/state.json] for collection [.system] has occurred - updating... (live nodes size: [5])
   [junit4]   2> 137859 INFO  (zkCallback-167-thread-1) [    ] o.a.s.c.c.ZkStateReader A cluster state change: [WatchedEvent state:SyncConnected type:NodeDataChanged path:/collections/.system/state.json] for collection [.system] has occurred - updating... (live nodes size: [5])
   [junit4]   2> 138762 INFO  (qtp1357873107-1051) [    ] o.a.s.s.HttpSolrCall [admin] webapp=null path=/admin/collections params={replicationFactor=2&name=.system&action=CREATE&numShards=1&wt=javabin&version=2} status=0 QTime=3390
   [junit4]   2> 138763 INFO  (TEST-TestNamedUpdateProcessors.test-seed#[E1C691D968454F20]) [    ] o.a.s.c.AbstractDistribZkTestBase Wait for recoveries to finish - collection: .system failOnTimeout:true timeout (sec):330
   [junit4]   1> -
   [junit4]   1> replica:core_node1 rstate:active live:true
   [junit4]   1> replica:core_node2 rstate:active live:true
   [junit4]   1> no one is recoverying
   [junit4]   2> 138763 INFO  (TEST-TestNamedUpdateProcessors.test-seed#[E1C691D968454F20]) [    ] o.a.s.c.AbstractDistribZkTestBase Recoveries finished - collection: .system
   [junit4]   2> 138876 INFO  (qtp897229987-1021) [    ] o.a.s.h.BlobHandler inserting new blob colltest/1 ,size 1223, md5 66a318fd66269d403292ebfb68057dcb
   [junit4]   2> 138876 INFO  (qtp897229987-1021) [    ] o.a.s.h.BlobHandler Adding doc: {id=colltest/1, md5=66a318fd66269d403292ebfb68057dcb, blobName=colltest, version=1, timestamp=Sun Jan 01 11:00:47 NST 2017, size=1223, blob=java.nio.HeapByteBuffer[pos=0 lim=1223 cap=2048]}
   [junit4]   2> 139383 INFO  (OverseerCollectionConfigSetProcessor-97208305623760900-127.0.0.1:41406_sn%2Fqc-n_0000000000) [    ] o.a.s.c.OverseerTaskQueue Response ZK path: /overseer/collection-queue-work/qnr-0000000000 doesn't exist.  Requestor may have disconnected from ZooKeeper
   [junit4]   2> 139813 INFO  (qtp897229987-1021) [    ] o.a.s.h.BlobHandler committing doc: {id=colltest/1, md5=66a318fd66269d403292ebfb68057dcb, blobName=colltest, version=1, timestamp=Sun Jan 01 11:00:47 NST 2017, size=1223, blob=java.nio.HeapByteBuffer[pos=0 lim=1223 cap=2048]}
   [junit4]   2> 139820 INFO  (qtp37381

[...truncated too long message...]

... (live nodes size: [1])
   [junit4]   2> 144559 WARN  (OverseerStateUpdate-97208305623760914-127.0.0.1:36021_sn%2Fqc-n_0000000004) [    ] o.a.s.c.Overseer Bad version writing to ZK using compare-and-set, will force refresh cluster state: KeeperErrorCode = BadVersion for /collections/collection1/state.json
   [junit4]   2> 144562 INFO  (zkCallback-174-thread-5) [    ] o.a.s.c.c.ZkStateReader A cluster state change: [WatchedEvent state:SyncConnected type:NodeDataChanged path:/collections/collection1/state.json] for collection [collection1] has occurred - updating... (live nodes size: [1])
   [junit4]   2> 145917 WARN  (zkCallback-167-thread-4) [    ] o.a.s.c.c.ZkStateReader ZooKeeper watch triggered, but Solr cannot talk to ZK: [KeeperErrorCode = Session expired for /clusterstate.json]
   [junit4]   2> 145918 WARN  (zkCallback-167-thread-5) [    ] o.a.s.c.c.ZkStateReader ZooKeeper watch triggered, but Solr cannot talk to ZK: [KeeperErrorCode = Session expired for /collections/collection1/state.json]
   [junit4]   2> 145929 WARN  (zkCallback-167-thread-2) [    ] o.a.s.c.c.ZkStateReader ZooKeeper watch triggered, but Solr cannot talk to ZK: [KeeperErrorCode = Session expired for /live_nodes]
   [junit4]   2> 146855 WARN  (zkCallback-167-thread-1) [    ] o.a.s.c.SyncStrategy Closed, skipping sync up.
   [junit4]   2> 146856 INFO  (zkCallback-167-thread-1) [    ] o.a.s.c.ShardLeaderElectionContext We failed sync, but we have no versions - we can't sync in that case - we were active before, so become leader anyway
   [junit4]   2> 146856 INFO  (zkCallback-167-thread-1) [    ] o.a.s.c.SolrCore [collection1]  CLOSING SolrCore org.apache.solr.core.SolrCore@28b60aa0
   [junit4]   2> 146865 INFO  (zkCallback-167-thread-1) [    ] o.a.s.m.SolrMetricManager Closing metric reporters for: solr.core.collection1
   [junit4]   2> 146867 WARN  (zkCallback-167-thread-3) [    ] o.a.s.c.SyncStrategy Closed, skipping sync up.
   [junit4]   2> 146867 INFO  (zkCallback-167-thread-3) [    ] o.a.s.c.SolrCore [.system_shard1_replica1]  CLOSING SolrCore org.apache.solr.core.SolrCore@25bf32fc
   [junit4]   2> 146868 INFO  (zkCallback-167-thread-3) [    ] o.a.s.m.SolrMetricManager Closing metric reporters for: solr.core..system.shard1.replica1
   [junit4]   2> 146869 INFO  (TEST-TestNamedUpdateProcessors.test-seed#[E1C691D968454F20]) [    ] o.a.s.m.SolrMetricManager Closing metric reporters for: solr.node
   [junit4]   2> 146869 INFO  (TEST-TestNamedUpdateProcessors.test-seed#[E1C691D968454F20]) [    ] o.e.j.s.AbstractConnector Stopped ServerConnector@6d578795{HTTP/1.1,[http/1.1]}{127.0.0.1:0}
   [junit4]   2> 146870 INFO  (TEST-TestNamedUpdateProcessors.test-seed#[E1C691D968454F20]) [    ] o.e.j.s.h.ContextHandler Stopped o.e.j.s.ServletContextHandler@755de8b5{/sn/qc,null,UNAVAILABLE}
   [junit4]   2> 146870 INFO  (TEST-TestNamedUpdateProcessors.test-seed#[E1C691D968454F20]) [    ] o.a.s.c.ChaosMonkey monkey: stop shard! 36021
   [junit4]   2> 146870 INFO  (TEST-TestNamedUpdateProcessors.test-seed#[E1C691D968454F20]) [    ] o.a.s.c.CoreContainer Shutting down CoreContainer instance=674278381
   [junit4]   2> 146873 INFO  (TEST-TestNamedUpdateProcessors.test-seed#[E1C691D968454F20]) [    ] o.a.s.c.Overseer Overseer (id=97208305623760914-127.0.0.1:36021_sn%2Fqc-n_0000000004) closing
   [junit4]   2> 146878 INFO  (OverseerStateUpdate-97208305623760914-127.0.0.1:36021_sn%2Fqc-n_0000000004) [    ] o.a.s.c.Overseer Overseer Loop exiting : 127.0.0.1:36021_sn%2Fqc
   [junit4]   2> 146887 WARN  (zkCallback-174-thread-1) [    ] o.a.s.c.SyncStrategy Closed, skipping sync up.
   [junit4]   2> 146888 INFO  (zkCallback-174-thread-1) [    ] o.a.s.c.SolrCore [collection1]  CLOSING SolrCore org.apache.solr.core.SolrCore@286f9ac3
   [junit4]   2> 146890 INFO  (zkCallback-174-thread-1) [    ] o.a.s.m.SolrMetricManager Closing metric reporters for: solr.core.collection1
   [junit4]   2> 148378 WARN  (zkCallback-174-thread-5) [    ] o.a.s.c.c.ZkStateReader ZooKeeper watch triggered, but Solr cannot talk to ZK: [KeeperErrorCode = Session expired for /live_nodes]
   [junit4]   2> 148379 INFO  (TEST-TestNamedUpdateProcessors.test-seed#[E1C691D968454F20]) [    ] o.a.s.m.SolrMetricManager Closing metric reporters for: solr.node
   [junit4]   2> 148379 INFO  (TEST-TestNamedUpdateProcessors.test-seed#[E1C691D968454F20]) [    ] o.e.j.s.AbstractConnector Stopped ServerConnector@5c6b3965{HTTP/1.1,[http/1.1]}{127.0.0.1:0}
   [junit4]   2> 148379 INFO  (TEST-TestNamedUpdateProcessors.test-seed#[E1C691D968454F20]) [    ] o.e.j.s.h.ContextHandler Stopped o.e.j.s.ServletContextHandler@63a96bfd{/sn/qc,null,UNAVAILABLE}
   [junit4]   2> 148380 INFO  (TEST-TestNamedUpdateProcessors.test-seed#[E1C691D968454F20]) [    ] o.a.s.c.ZkTestServer connecting to 127.0.0.1:43514 43514
   [junit4]   2> 148482 INFO  (Thread-288) [    ] o.a.s.c.ZkTestServer connecting to 127.0.0.1:43514 43514
   [junit4]   2> 148483 WARN  (Thread-288) [    ] o.a.s.c.ZkTestServer Watch limit violations: 
   [junit4]   2> Maximum concurrent create/delete watches above limit:
   [junit4]   2> 
   [junit4]   2> 	15	/solr/configs/conf1
   [junit4]   2> 	6	/solr/aliases.json
   [junit4]   2> 	6	/solr/clusterprops.json
   [junit4]   2> 	5	/solr/security.json
   [junit4]   2> 	2	/solr/configs/.system
   [junit4]   2> 	2	/solr/configs/.system/managed-schema
   [junit4]   2> 
   [junit4]   2> Maximum concurrent data watches above limit:
   [junit4]   2> 
   [junit4]   2> 	6	/solr/clusterstate.json
   [junit4]   2> 	4	/solr/collections/collection1/state.json
   [junit4]   2> 	2	/solr/collections/.system/state.json
   [junit4]   2> 
   [junit4]   2> Maximum concurrent children watches above limit:
   [junit4]   2> 
   [junit4]   2> 	30	/solr/overseer/queue
   [junit4]   2> 	21	/solr/overseer/collection-queue-work
   [junit4]   2> 	15	/solr/overseer/queue-work
   [junit4]   2> 	6	/solr/live_nodes
   [junit4]   2> 	6	/solr/collections
   [junit4]   2> 
   [junit4]   2> NOTE: reproduce with: ant test  -Dtestcase=TestNamedUpdateProcessors -Dtests.method=test -Dtests.seed=E1C691D968454F20 -Dtests.multiplier=3 -Dtests.slow=true -Dtests.locale=kab -Dtests.timezone=CNT -Dtests.asserts=true -Dtests.file.encoding=ISO-8859-1
   [junit4] ERROR   26.1s J1 | TestNamedUpdateProcessors.test <<<
   [junit4]    > Throwable #1: java.lang.IndexOutOfBoundsException: Index 0 out-of-bounds for length 0
   [junit4]    > 	at __randomizedtesting.SeedInfo.seed([E1C691D968454F20:6992AE03C6B922D8]:0)
   [junit4]    > 	at java.base/jdk.internal.util.Preconditions.outOfBounds(Preconditions.java:64)
   [junit4]    > 	at java.base/jdk.internal.util.Preconditions.outOfBoundsCheckIndex(Preconditions.java:70)
   [junit4]    > 	at java.base/jdk.internal.util.Preconditions.checkIndex(Preconditions.java:248)
   [junit4]    > 	at java.base/java.util.Objects.checkIndex(Objects.java:371)
   [junit4]    > 	at java.base/java.util.ArrayList.get(ArrayList.java:435)
   [junit4]    > 	at org.apache.solr.update.processor.TestNamedUpdateProcessors.test(TestNamedUpdateProcessors.java:128)
   [junit4]    > 	at java.base/jdk.internal.reflect.NativeMethodAccessorImpl.invoke0(Native Method)
   [junit4]    > 	at java.base/jdk.internal.reflect.NativeMethodAccessorImpl.invoke(NativeMethodAccessorImpl.java:62)
   [junit4]    > 	at java.base/jdk.internal.reflect.DelegatingMethodAccessorImpl.invoke(DelegatingMethodAccessorImpl.java:43)
   [junit4]    > 	at java.base/java.lang.reflect.Method.invoke(Method.java:538)
   [junit4]    > 	at org.apache.solr.BaseDistributedSearchTestCase$ShardsRepeatRule$ShardsFixedStatement.callStatement(BaseDistributedSearchTestCase.java:992)
   [junit4]    > 	at org.apache.solr.BaseDistributedSearchTestCase$ShardsRepeatRule$ShardsStatement.evaluate(BaseDistributedSearchTestCase.java:967)
   [junit4]    > 	at java.base/java.lang.Thread.run(Thread.java:844)
   [junit4]   2> 148485 INFO  (SUITE-TestNamedUpdateProcessors-seed#[E1C691D968454F20]-worker) [    ] o.a.s.SolrTestCaseJ4 ###deleteCore
   [junit4]   2> NOTE: leaving temporary files on disk at: /home/jenkins/workspace/Lucene-Solr-6.x-Linux/solr/build/solr-core/test/J1/temp/solr.update.processor.TestNamedUpdateProcessors_E1C691D968454F20-001
   [junit4]   2> Jan 01, 2017 2:30:56 PM com.carrotsearch.randomizedtesting.ThreadLeakControl checkThreadLeaks
   [junit4]   2> WARNING: Will linger awaiting termination of 1 leaked thread(s).
   [junit4]   2> NOTE: test params are: codec=Asserting(Lucene62): {blobName=PostingsFormat(name=Direct), range_facet_l_dv=FSTOrd50, processors_s=FST50, multiDefault=PostingsFormat(name=Direct), intDefault=PostingsFormat(name=LuceneVarGapFixedInterval), version=PostingsFormat(name=LuceneVarGapFixedInterval), mul_s=PostingsFormat(name=LuceneVarGapFixedInterval), range_facet_l=PostingsFormat(name=Direct), test_s=PostingsFormat(name=LuceneVarGapFixedInterval), size=FST50, _version_=PostingsFormat(name=LuceneVarGapFixedInterval), id=FSTOrd50, range_facet_i_dv=PostingsFormat(name=Direct), md5=PostingsFormat(name=Direct), timestamp=PostingsFormat(name=Direct)}, docValues:{range_facet_l_dv=DocValuesFormat(name=Lucene54), range_facet_i_dv=DocValuesFormat(name=Lucene54), timestamp=DocValuesFormat(name=Lucene54)}, maxPointsInLeafNode=703, maxMBSortInHeap=6.392806443221566, sim=RandomSimilarity(queryNorm=false,coord=crazy): {}, locale=kab, timezone=CNT
   [junit4]   2> NOTE: Linux 4.4.0-53-generic amd64/Oracle Corporation 9-ea (64-bit)/cpus=12,threads=1,free=289574400,total=508952576
   [junit4]   2> NOTE: All tests run in this JVM: [TestMinMaxOnMultiValuedField, CoreAdminCreateDiscoverTest, TestStressCloudBlindAtomicUpdates, TestCustomStream, TestElisionMultitermQuery, TestSolrQueryParserDefaultOperatorResource, DistributedFacetPivotLongTailTest, TestSurroundQueryParser, SearchHandlerTest, BlockJoinFacetSimpleTest, TestBM25SimilarityFactory, TestNamedUpdateProcessors]
   [junit4] Completed [26/675 (1!)] on J1 in 26.42s, 1 test, 1 error <<< FAILURES!

[...truncated 53621 lines...]


Mime
View raw message