lucene-dev mailing list archives

Site index · List index
Message view « Date » · « Thread »
Top « Date » · « Thread »
From Policeman Jenkins Server <jenk...@thetaphi.de>
Subject [JENKINS] Lucene-Solr-master-Solaris (64bit/jdk1.8.0) - Build # 1058 - Still Unstable!
Date Thu, 05 Jan 2017 15:17:01 GMT
Build: https://jenkins.thetaphi.de/job/Lucene-Solr-master-Solaris/1058/
Java: 64bit/jdk1.8.0 -XX:-UseCompressedOops -XX:+UseParallelGC

1 tests failed.
FAILED:  org.apache.solr.update.SolrIndexMetricsTest.testIndexMetrics

Error Message:
minorMerge: 3 expected:<4> but was:<3>

Stack Trace:
java.lang.AssertionError: minorMerge: 3 expected:<4> but was:<3>
	at __randomizedtesting.SeedInfo.seed([27DF473435018129:EB0F7A88F58F7A12]:0)
	at org.junit.Assert.fail(Assert.java:93)
	at org.junit.Assert.failNotEquals(Assert.java:647)
	at org.junit.Assert.assertEquals(Assert.java:128)
	at org.junit.Assert.assertEquals(Assert.java:472)
	at org.apache.solr.update.SolrIndexMetricsTest.testIndexMetrics(SolrIndexMetricsTest.java:70)
	at sun.reflect.NativeMethodAccessorImpl.invoke0(Native Method)
	at sun.reflect.NativeMethodAccessorImpl.invoke(NativeMethodAccessorImpl.java:62)
	at sun.reflect.DelegatingMethodAccessorImpl.invoke(DelegatingMethodAccessorImpl.java:43)
	at java.lang.reflect.Method.invoke(Method.java:498)
	at com.carrotsearch.randomizedtesting.RandomizedRunner.invoke(RandomizedRunner.java:1713)
	at com.carrotsearch.randomizedtesting.RandomizedRunner$8.evaluate(RandomizedRunner.java:907)
	at com.carrotsearch.randomizedtesting.RandomizedRunner$9.evaluate(RandomizedRunner.java:943)
	at com.carrotsearch.randomizedtesting.RandomizedRunner$10.evaluate(RandomizedRunner.java:957)
	at com.carrotsearch.randomizedtesting.rules.SystemPropertiesRestoreRule$1.evaluate(SystemPropertiesRestoreRule.java:57)
	at org.apache.lucene.util.TestRuleSetupTeardownChained$1.evaluate(TestRuleSetupTeardownChained.java:49)
	at org.apache.lucene.util.AbstractBeforeAfterRule$1.evaluate(AbstractBeforeAfterRule.java:45)
	at org.apache.lucene.util.TestRuleThreadAndTestName$1.evaluate(TestRuleThreadAndTestName.java:48)
	at org.apache.lucene.util.TestRuleIgnoreAfterMaxFailures$1.evaluate(TestRuleIgnoreAfterMaxFailures.java:64)
	at org.apache.lucene.util.TestRuleMarkFailure$1.evaluate(TestRuleMarkFailure.java:47)
	at com.carrotsearch.randomizedtesting.rules.StatementAdapter.evaluate(StatementAdapter.java:36)
	at com.carrotsearch.randomizedtesting.ThreadLeakControl$StatementRunner.run(ThreadLeakControl.java:367)
	at com.carrotsearch.randomizedtesting.ThreadLeakControl.forkTimeoutingTask(ThreadLeakControl.java:811)
	at com.carrotsearch.randomizedtesting.ThreadLeakControl$3.evaluate(ThreadLeakControl.java:462)
	at com.carrotsearch.randomizedtesting.RandomizedRunner.runSingleTest(RandomizedRunner.java:916)
	at com.carrotsearch.randomizedtesting.RandomizedRunner$5.evaluate(RandomizedRunner.java:802)
	at com.carrotsearch.randomizedtesting.RandomizedRunner$6.evaluate(RandomizedRunner.java:852)
	at com.carrotsearch.randomizedtesting.RandomizedRunner$7.evaluate(RandomizedRunner.java:863)
	at com.carrotsearch.randomizedtesting.rules.StatementAdapter.evaluate(StatementAdapter.java:36)
	at com.carrotsearch.randomizedtesting.rules.SystemPropertiesRestoreRule$1.evaluate(SystemPropertiesRestoreRule.java:57)
	at org.apache.lucene.util.AbstractBeforeAfterRule$1.evaluate(AbstractBeforeAfterRule.java:45)
	at com.carrotsearch.randomizedtesting.rules.StatementAdapter.evaluate(StatementAdapter.java:36)
	at org.apache.lucene.util.TestRuleStoreClassName$1.evaluate(TestRuleStoreClassName.java:41)
	at com.carrotsearch.randomizedtesting.rules.NoShadowingOrOverridesOnMethodsRule$1.evaluate(NoShadowingOrOverridesOnMethodsRule.java:40)
	at com.carrotsearch.randomizedtesting.rules.NoShadowingOrOverridesOnMethodsRule$1.evaluate(NoShadowingOrOverridesOnMethodsRule.java:40)
	at com.carrotsearch.randomizedtesting.rules.StatementAdapter.evaluate(StatementAdapter.java:36)
	at com.carrotsearch.randomizedtesting.rules.StatementAdapter.evaluate(StatementAdapter.java:36)
	at com.carrotsearch.randomizedtesting.rules.StatementAdapter.evaluate(StatementAdapter.java:36)
	at org.apache.lucene.util.TestRuleAssertionsRequired$1.evaluate(TestRuleAssertionsRequired.java:53)
	at org.apache.lucene.util.TestRuleMarkFailure$1.evaluate(TestRuleMarkFailure.java:47)
	at org.apache.lucene.util.TestRuleIgnoreAfterMaxFailures$1.evaluate(TestRuleIgnoreAfterMaxFailures.java:64)
	at org.apache.lucene.util.TestRuleIgnoreTestSuites$1.evaluate(TestRuleIgnoreTestSuites.java:54)
	at com.carrotsearch.randomizedtesting.rules.StatementAdapter.evaluate(StatementAdapter.java:36)
	at com.carrotsearch.randomizedtesting.ThreadLeakControl$StatementRunner.run(ThreadLeakControl.java:367)
	at java.lang.Thread.run(Thread.java:745)




Build Log:
[...truncated 11282 lines...]
   [junit4] Suite: org.apache.solr.update.SolrIndexMetricsTest
   [junit4]   2> Creating dataDir: /export/home/jenkins/workspace/Lucene-Solr-master-Solaris/solr/build/solr-core/test/J1/temp/solr.update.SolrIndexMetricsTest_27DF473435018129-001/init-core-data-001
   [junit4]   2> 914368 INFO  (SUITE-SolrIndexMetricsTest-seed#[27DF473435018129]-worker)
[    ] o.a.s.SolrTestCaseJ4 Randomized ssl (false) and clientAuth (false) via: @org.apache.solr.util.RandomizeSSL(reason=,
value=NaN, ssl=NaN, clientAuth=NaN)
   [junit4]   2> 914368 INFO  (SUITE-SolrIndexMetricsTest-seed#[27DF473435018129]-worker)
[    ] o.a.s.SolrTestCaseJ4 ####initCore
   [junit4]   2> 914369 INFO  (SUITE-SolrIndexMetricsTest-seed#[27DF473435018129]-worker)
[    ] o.a.s.c.SolrResourceLoader [null] Added 2 libs to classloader, from paths: [/export/home/jenkins/workspace/Lucene-Solr-master-Solaris/solr/core/src/test-files/solr/collection1/lib,
/export/home/jenkins/workspace/Lucene-Solr-master-Solaris/solr/core/src/test-files/solr/collection1/lib/classes]
   [junit4]   2> 914435 WARN  (SUITE-SolrIndexMetricsTest-seed#[27DF473435018129]-worker)
[    ] o.a.s.c.Config Beginning with Solr 5.5, <mergePolicy> is deprecated, use <mergePolicyFactory>
instead.
   [junit4]   2> 914435 WARN  (SUITE-SolrIndexMetricsTest-seed#[27DF473435018129]-worker)
[    ] o.a.s.c.Config Beginning with Solr 5.5, <mergeFactor> is deprecated, configure
it on the relevant <mergePolicyFactory> instead.
   [junit4]   2> 914435 INFO  (SUITE-SolrIndexMetricsTest-seed#[27DF473435018129]-worker)
[    ] o.a.s.c.SolrConfig Using Lucene MatchVersion: 7.0.0
   [junit4]   2> 914475 INFO  (SUITE-SolrIndexMetricsTest-seed#[27DF473435018129]-worker)
[    ] o.a.s.s.IndexSchema [null] Schema name=test
   [junit4]   2> 914725 WARN  (SUITE-SolrIndexMetricsTest-seed#[27DF473435018129]-worker)
[    ] o.a.s.s.IndexSchema [null] default search field in schema is text. WARNING: Deprecated,
please use 'df' on request instead.
   [junit4]   2> 914727 INFO  (SUITE-SolrIndexMetricsTest-seed#[27DF473435018129]-worker)
[    ] o.a.s.s.IndexSchema Loaded schema test/1.0 with uniqueid field id
   [junit4]   2> 914748 WARN  (SUITE-SolrIndexMetricsTest-seed#[27DF473435018129]-worker)
[    ] o.a.s.m.r.SolrJmxReporter No serviceUrl or agentId was configured, using first MBeanServer.
   [junit4]   2> 914749 INFO  (SUITE-SolrIndexMetricsTest-seed#[27DF473435018129]-worker)
[    ] o.a.s.m.r.SolrJmxReporter JMX monitoring enabled at server: com.sun.jmx.mbeanserver.JmxMBeanServer@36008cde
   [junit4]   2> 914749 WARN  (SUITE-SolrIndexMetricsTest-seed#[27DF473435018129]-worker)
[    ] o.a.s.m.r.SolrJmxReporter No serviceUrl or agentId was configured, using first MBeanServer.
   [junit4]   2> 914752 INFO  (SUITE-SolrIndexMetricsTest-seed#[27DF473435018129]-worker)
[    ] o.a.s.m.r.SolrJmxReporter JMX monitoring enabled at server: com.sun.jmx.mbeanserver.JmxMBeanServer@36008cde
   [junit4]   2> 914752 WARN  (SUITE-SolrIndexMetricsTest-seed#[27DF473435018129]-worker)
[    ] o.a.s.m.r.SolrJmxReporter No serviceUrl or agentId was configured, using first MBeanServer.
   [junit4]   2> 914752 INFO  (SUITE-SolrIndexMetricsTest-seed#[27DF473435018129]-worker)
[    ] o.a.s.m.r.SolrJmxReporter JMX monitoring enabled at server: com.sun.jmx.mbeanserver.JmxMBeanServer@36008cde
   [junit4]   2> 914752 WARN  (SUITE-SolrIndexMetricsTest-seed#[27DF473435018129]-worker)
[    ] o.a.s.m.r.SolrJmxReporter No serviceUrl or agentId was configured, using first MBeanServer.
   [junit4]   2> 914753 INFO  (SUITE-SolrIndexMetricsTest-seed#[27DF473435018129]-worker)
[    ] o.a.s.m.r.SolrJmxReporter JMX monitoring enabled at server: com.sun.jmx.mbeanserver.JmxMBeanServer@36008cde
   [junit4]   2> 914755 INFO  (coreLoadExecutor-3003-thread-1) [    x:collection1] o.a.s.c.SolrResourceLoader
[null] Added 2 libs to classloader, from paths: [/export/home/jenkins/workspace/Lucene-Solr-master-Solaris/solr/core/src/test-files/solr/collection1/lib,
/export/home/jenkins/workspace/Lucene-Solr-master-Solaris/solr/core/src/test-files/solr/collection1/lib/classes]
   [junit4]   2> 914773 WARN  (coreLoadExecutor-3003-thread-1) [    x:collection1] o.a.s.c.Config
Beginning with Solr 5.5, <mergePolicy> is deprecated, use <mergePolicyFactory>
instead.
   [junit4]   2> 914773 WARN  (coreLoadExecutor-3003-thread-1) [    x:collection1] o.a.s.c.Config
Beginning with Solr 5.5, <mergeFactor> is deprecated, configure it on the relevant <mergePolicyFactory>
instead.
   [junit4]   2> 914773 INFO  (coreLoadExecutor-3003-thread-1) [    x:collection1] o.a.s.c.SolrConfig
Using Lucene MatchVersion: 7.0.0
   [junit4]   2> 914781 INFO  (coreLoadExecutor-3003-thread-1) [    x:collection1] o.a.s.s.IndexSchema
[collection1] Schema name=test
   [junit4]   2> 914846 WARN  (coreLoadExecutor-3003-thread-1) [    x:collection1] o.a.s.s.IndexSchema
[collection1] default search field in schema is text. WARNING: Deprecated, please use 'df'
on request instead.
   [junit4]   2> 914848 INFO  (coreLoadExecutor-3003-thread-1) [    x:collection1] o.a.s.s.IndexSchema
Loaded schema test/1.0 with uniqueid field id
   [junit4]   2> 914854 INFO  (coreLoadExecutor-3003-thread-1) [    x:collection1] o.a.s.c.CoreContainer
Creating SolrCore 'collection1' using configuration from instancedir /export/home/jenkins/workspace/Lucene-Solr-master-Solaris/solr/core/src/test-files/solr/collection1
   [junit4]   2> 914854 WARN  (coreLoadExecutor-3003-thread-1) [    x:collection1] o.a.s.m.r.SolrJmxReporter
No serviceUrl or agentId was configured, using first MBeanServer.
   [junit4]   2> 914854 INFO  (coreLoadExecutor-3003-thread-1) [    x:collection1] o.a.s.m.r.SolrJmxReporter
JMX monitoring enabled at server: com.sun.jmx.mbeanserver.JmxMBeanServer@36008cde
   [junit4]   2> 914854 INFO  (coreLoadExecutor-3003-thread-1) [    x:collection1] o.a.s.c.SolrCore
[[collection1] ] Opening new SolrCore at [/export/home/jenkins/workspace/Lucene-Solr-master-Solaris/solr/core/src/test-files/solr/collection1],
dataDir=[/export/home/jenkins/workspace/Lucene-Solr-master-Solaris/solr/build/solr-core/test/J1/temp/solr.update.SolrIndexMetricsTest_27DF473435018129-001/init-core-data-001/]
   [junit4]   2> 914874 INFO  (coreLoadExecutor-3003-thread-1) [    x:collection1] o.a.s.u.CommitTracker
Hard AutoCommit: disabled
   [junit4]   2> 914874 INFO  (coreLoadExecutor-3003-thread-1) [    x:collection1] o.a.s.u.CommitTracker
Soft AutoCommit: disabled
   [junit4]   2> 914878 INFO  (coreLoadExecutor-3003-thread-1) [    x:collection1] o.a.s.s.SolrIndexSearcher
Opening [Searcher@5c5c1192[collection1] main]
   [junit4]   2> 914878 WARN  (coreLoadExecutor-3003-thread-1) [    x:collection1] o.a.s.r.ManagedResourceStorage
Cannot write to config directory /export/home/jenkins/workspace/Lucene-Solr-master-Solaris/solr/core/src/test-files/solr/collection1/conf;
switching to use InMemory storage instead.
   [junit4]   2> 914878 INFO  (coreLoadExecutor-3003-thread-1) [    x:collection1] o.a.s.h.ReplicationHandler
Commits will be reserved for  10000
   [junit4]   2> 914879 INFO  (searcherExecutor-3004-thread-1-processing-x:collection1)
[    x:collection1] o.a.s.c.SolrCore [collection1] Registered new searcher Searcher@5c5c1192[collection1]
main{ExitableDirectoryReader(UninvertingDirectoryReader())}
   [junit4]   2> 914879 INFO  (SUITE-SolrIndexMetricsTest-seed#[27DF473435018129]-worker)
[    ] o.a.s.SolrTestCaseJ4 ####initCore end
   [junit4]   2> 914883 INFO  (TEST-SolrIndexMetricsTest.testIndexMetrics-seed#[27DF473435018129])
[    ] o.a.s.SolrTestCaseJ4 ###Starting testIndexMetrics
   [junit4]   2> 915714 INFO  (TEST-SolrIndexMetricsTest.testIndexMetrics-seed#[27DF473435018129])
[    ] o.a.s.u.DirectUpdateHandler2 start commit{,optimize=false,openSearcher=true,waitSearcher=true,expungeDeletes=false,softCommit=false,prepareCommit=false}
   [junit4]   2> 915714 INFO  (TEST-SolrIndexMetricsTest.testIndexMetrics-seed#[27DF473435018129])
[    ] o.a.s.u.SolrIndexWriter Calling setCommitData with IW:org.apache.solr.update.SolrIndexWriter@238c70e2
   [junit4]   2> 915791 INFO  (TEST-SolrIndexMetricsTest.testIndexMetrics-seed#[27DF473435018129])
[    ] o.a.s.s.SolrIndexSearcher Opening [Searcher@6819d49e[collection1] main]
   [junit4]   2> 915792 INFO  (TEST-SolrIndexMetricsTest.testIndexMetrics-seed#[27DF473435018129])
[    ] o.a.s.u.DirectUpdateHandler2 end_commit_flush
   [junit4]   2> 915792 INFO  (searcherExecutor-3004-thread-1) [    ] o.a.s.c.SolrCore
[collection1] Registered new searcher Searcher@6819d49e[collection1] main{ExitableDirectoryReader(UninvertingDirectoryReader(Uninverting(_4(7.0.0):C300)
Uninverting(_3(7.0.0):C100) Uninverting(_5(7.0.0):C100) Uninverting(_6(7.0.0):C100) Uninverting(_7(7.0.0):C100)
Uninverting(_9(7.0.0):C100) Uninverting(_a(7.0.0):C100) Uninverting(_b(7.0.0):C100)))}
   [junit4]   2> 915792 INFO  (TEST-SolrIndexMetricsTest.testIndexMetrics-seed#[27DF473435018129])
[    ] o.a.s.c.SolrResourceLoader [null] Added 2 libs to classloader, from paths: [/export/home/jenkins/workspace/Lucene-Solr-master-Solaris/solr/core/src/test-files/solr/collection1/lib,
/export/home/jenkins/workspace/Lucene-Solr-master-Solaris/solr/core/src/test-files/solr/collection1/lib/classes]
   [junit4]   2> 915817 WARN  (TEST-SolrIndexMetricsTest.testIndexMetrics-seed#[27DF473435018129])
[    ] o.a.s.c.Config Beginning with Solr 5.5, <mergePolicy> is deprecated, use <mergePolicyFactory>
instead.
   [junit4]   2> 915817 WARN  (TEST-SolrIndexMetricsTest.testIndexMetrics-seed#[27DF473435018129])
[    ] o.a.s.c.Config Beginning with Solr 5.5, <mergeFactor> is deprecated, configure
it on the relevant <mergePolicyFactory> instead.
   [junit4]   2> 915817 INFO  (TEST-SolrIndexMetricsTest.testIndexMetrics-seed#[27DF473435018129])
[    ] o.a.s.c.SolrConfig Using Lucene MatchVersion: 7.0.0
   [junit4]   2> 915825 INFO  (TEST-SolrIndexMetricsTest.testIndexMetrics-seed#[27DF473435018129])
[    ] o.a.s.s.IndexSchema [collection1] Schema name=test
   [junit4]   2> 915908 WARN  (TEST-SolrIndexMetricsTest.testIndexMetrics-seed#[27DF473435018129])
[    ] o.a.s.s.IndexSchema [collection1] default search field in schema is text. WARNING:
Deprecated, please use 'df' on request instead.
   [junit4]   2> 915910 INFO  (TEST-SolrIndexMetricsTest.testIndexMetrics-seed#[27DF473435018129])
[    ] o.a.s.s.IndexSchema Loaded schema test/1.0 with uniqueid field id
   [junit4]   2> 915917 INFO  (TEST-SolrIndexMetricsTest.testIndexMetrics-seed#[27DF473435018129])
[    ] o.a.s.c.CoreContainer Reloading SolrCore 'collection1' using configuration from instancedir
/export/home/jenkins/workspace/Lucene-Solr-master-Solaris/solr/core/src/test-files/solr/collection1
   [junit4]   2> 915918 WARN  (TEST-SolrIndexMetricsTest.testIndexMetrics-seed#[27DF473435018129])
[    x:collection1] o.a.s.m.r.SolrJmxReporter No serviceUrl or agentId was configured, using
first MBeanServer.
   [junit4]   2> 915927 INFO  (TEST-SolrIndexMetricsTest.testIndexMetrics-seed#[27DF473435018129])
[    x:collection1] o.a.s.m.r.SolrJmxReporter JMX monitoring enabled at server: com.sun.jmx.mbeanserver.JmxMBeanServer@36008cde
   [junit4]   2> 915928 INFO  (TEST-SolrIndexMetricsTest.testIndexMetrics-seed#[27DF473435018129])
[    x:collection1] o.a.s.m.SolrMetricManager Replacing existing reporter 'default' in registry
'solr.core.collection1': [org.apache.solr.metrics.reporters.SolrJmxReporter@40f8c8a9: domain
= solr.core.collection1, service url = null, agent id = null]
   [junit4]   2> 915930 INFO  (TEST-SolrIndexMetricsTest.testIndexMetrics-seed#[27DF473435018129])
[    x:collection1] o.a.s.c.SolrCore [[collection1] ] Opening new SolrCore at [/export/home/jenkins/workspace/Lucene-Solr-master-Solaris/solr/core/src/test-files/solr/collection1],
dataDir=[/export/home/jenkins/workspace/Lucene-Solr-master-Solaris/solr/build/solr-core/test/J1/temp/solr.update.SolrIndexMetricsTest_27DF473435018129-001/init-core-data-001/]
   [junit4]   2> 915941 INFO  (TEST-SolrIndexMetricsTest.testIndexMetrics-seed#[27DF473435018129])
[    x:collection1] o.a.s.u.CommitTracker Hard AutoCommit: disabled
   [junit4]   2> 915941 INFO  (TEST-SolrIndexMetricsTest.testIndexMetrics-seed#[27DF473435018129])
[    x:collection1] o.a.s.u.CommitTracker Soft AutoCommit: disabled
   [junit4]   2> 915942 INFO  (TEST-SolrIndexMetricsTest.testIndexMetrics-seed#[27DF473435018129])
[    x:collection1] o.a.s.s.SolrIndexSearcher Opening [Searcher@b20e1e2[collection1] main]
   [junit4]   2> 915942 WARN  (TEST-SolrIndexMetricsTest.testIndexMetrics-seed#[27DF473435018129])
[    x:collection1] o.a.s.r.ManagedResourceStorage Cannot write to config directory /export/home/jenkins/workspace/Lucene-Solr-master-Solaris/solr/core/src/test-files/solr/collection1/conf;
switching to use InMemory storage instead.
   [junit4]   2> 915942 INFO  (TEST-SolrIndexMetricsTest.testIndexMetrics-seed#[27DF473435018129])
[    x:collection1] o.a.s.h.ReplicationHandler Commits will be reserved for  10000
   [junit4]   2> 915943 INFO  (searcherExecutor-3008-thread-1-processing-x:collection1)
[    x:collection1] o.a.s.c.SolrCore [collection1] Registered new searcher Searcher@b20e1e2[collection1]
main{ExitableDirectoryReader(UninvertingDirectoryReader(Uninverting(_4(7.0.0):C300) Uninverting(_3(7.0.0):C100)
Uninverting(_5(7.0.0):C100) Uninverting(_6(7.0.0):C100) Uninverting(_7(7.0.0):C100) Uninverting(_9(7.0.0):C100)
Uninverting(_a(7.0.0):C100) Uninverting(_b(7.0.0):C100)))}
   [junit4]   2> 916114 INFO  (TEST-SolrIndexMetricsTest.testIndexMetrics-seed#[27DF473435018129])
[    x:collection1] o.a.s.u.DefaultSolrCoreState New IndexWriter is ready to be used.
   [junit4]   2> 916167 INFO  (TEST-SolrIndexMetricsTest.testIndexMetrics-seed#[27DF473435018129])
[    x:collection1] o.a.s.s.SolrIndexSearcher Opening [Searcher@45a8e9e1[collection1] main]
   [junit4]   2> 916168 INFO  (TEST-SolrIndexMetricsTest.testIndexMetrics-seed#[27DF473435018129])
[    x:collection1] o.a.s.c.SolrCore [collection1]  CLOSING SolrCore org.apache.solr.core.SolrCore@6a89c537
   [junit4]   2> 916168 INFO  (searcherExecutor-3008-thread-1-processing-x:collection1)
[    x:collection1] o.a.s.c.SolrCore [collection1] Registered new searcher Searcher@45a8e9e1[collection1]
main{ExitableDirectoryReader(UninvertingDirectoryReader(Uninverting(_4(7.0.0):C300) Uninverting(_8(7.0.0):C300)
Uninverting(_c(7.0.0):C300) Uninverting(_b(7.0.0):C100)))}
   [junit4]   2> 916168 INFO  (TEST-SolrIndexMetricsTest.testIndexMetrics-seed#[27DF473435018129])
[    x:collection1] o.a.s.m.SolrMetricManager Closing metric reporters for: solr.core.collection1
   [junit4]   2> 916173 INFO  (TEST-SolrIndexMetricsTest.testIndexMetrics-seed#[27DF473435018129])
[    x:collection1] o.a.s.SolrTestCaseJ4 ###Ending testIndexMetrics
   [junit4]   2> NOTE: reproduce with: ant test  -Dtestcase=SolrIndexMetricsTest -Dtests.method=testIndexMetrics
-Dtests.seed=27DF473435018129 -Dtests.slow=true -Dtests.locale=be -Dtests.timezone=America/Creston
-Dtests.asserts=true -Dtests.file.encoding=ISO-8859-1
   [junit4] FAILURE 1.30s J1 | SolrIndexMetricsTest.testIndexMetrics <<<
   [junit4]    > Throwable #1: java.lang.AssertionError: minorMerge: 3 expected:<4>
but was:<3>
   [junit4]    > 	at __randomizedtesting.SeedInfo.seed([27DF473435018129:EB0F7A88F58F7A12]:0)
   [junit4]    > 	at org.apache.solr.update.SolrIndexMetricsTest.testIndexMetrics(SolrIndexMetricsTest.java:70)
   [junit4]    > 	at java.lang.Thread.run(Thread.java:745)
   [junit4]   2> 916175 INFO  (SUITE-SolrIndexMetricsTest-seed#[27DF473435018129]-worker)
[    x:collection1] o.a.s.SolrTestCaseJ4 ###deleteCore
   [junit4]   2> 916175 INFO  (SUITE-SolrIndexMetricsTest-seed#[27DF473435018129]-worker)
[    x:collection1] o.a.s.c.CoreContainer Shutting down CoreContainer instance=1108253673
   [junit4]   2> 916175 INFO  (coreCloseExecutor-3012-thread-1-processing-x:collection1)
[    x:collection1] o.a.s.c.SolrCore [collection1]  CLOSING SolrCore org.apache.solr.core.SolrCore@7decd4db
   [junit4]   2> 916178 INFO  (coreCloseExecutor-3012-thread-1-processing-x:collection1)
[    x:collection1] o.a.s.m.SolrMetricManager Closing metric reporters for: solr.core.collection1
   [junit4]   2> 916179 INFO  (SUITE-SolrIndexMetricsTest-seed#[27DF473435018129]-worker)
[    x:collection1] o.a.s.m.SolrMetricManager Closing metric reporters for: solr.node
   [junit4]   2> NOTE: leaving temporary files on disk at: /export/home/jenkins/workspace/Lucene-Solr-master-Solaris/solr/build/solr-core/test/J1/temp/solr.update.SolrIndexMetricsTest_27DF473435018129-001
   [junit4]   2> NOTE: test params are: codec=Asserting(Lucene70): {range_facet_l_dv=Lucene50(blocksize=128),
multiDefault=Lucene50(blocksize=128), intDefault=PostingsFormat(name=MockRandom), foo_s=Lucene50(blocksize=128),
id=Lucene50(blocksize=128), range_facet_i_dv=Lucene50(blocksize=128), range_facet_l=Lucene50(blocksize=128),
timestamp=Lucene50(blocksize=128)}, docValues:{range_facet_l_dv=DocValuesFormat(name=Memory),
multiDefault=DocValuesFormat(name=Direct), intDefault=DocValuesFormat(name=Asserting), range_facet_i_dv=DocValuesFormat(name=Direct),
id=DocValuesFormat(name=Memory), foo_s=DocValuesFormat(name=Direct), timestamp=DocValuesFormat(name=Direct),
range_facet_l=DocValuesFormat(name=Direct)}, maxPointsInLeafNode=1741, maxMBSortInHeap=6.0788926320161245,
sim=RandomSimilarity(queryNorm=false): {}, locale=be, timezone=America/Creston
   [junit4]   2> NOTE: SunOS 5.11 amd64/Oracle Corporation 1.8.0_112 (64-bit)/cpus=3,threads=1,free=67665592,total=423624704
   [junit4]   2> NOTE: All tests run in this JVM: [TestFieldCacheSortRandom, BooleanFieldTest,
SortByFunctionTest, ConnectionReuseTest, HttpSolrCallGetCoreTest, TestRandomCollapseQParserPlugin,
TestSolrCloudSnapshots, TestRawTransformer, SuggestComponentContextFilterQueryTest, LeaderFailureAfterFreshStartTest,
DirectUpdateHandlerOptimizeTest, TestPHPSerializedResponseWriter, PKIAuthenticationIntegrationTest,
QueryParsingTest, DebugComponentTest, TestPushWriter, PreAnalyzedUpdateProcessorTest, SolrCmdDistributorTest,
TestBinaryResponseWriter, SolrCoreCheckLockOnStartupTest, JsonLoaderTest, TestSchemaResource,
TestSuggestSpellingConverter, URLClassifyProcessorTest, SolrInfoMBeanTest, TestConfigSetsAPI,
TestSolrCLIRunExample, SaslZkACLProviderTest, ShardRoutingCustomTest, DistributedFacetPivotWhiteBoxTest,
OpenCloseCoreStressTest, TestDistributedMissingSort, ReturnFieldsTest, FieldMutatingUpdateProcessorTest,
TestSolrQueryParserDefaultOperatorResource, FieldAnalysisRequestHandlerTest, TestStressRecovery,
TestCorePropertiesReload, TestRebalanceLeaders, TestUniqueKeyFieldResource, TestRangeQuery,
PreAnalyzedFieldManagedSchemaCloudTest, DistributedFacetPivotLargeTest, TestPivotHelperCode,
TestInfoStreamLogging, TestLMJelinekMercerSimilarityFactory, ReplicationFactorTest, OverriddenZkACLAndCredentialsProvidersTest,
NoCacheHeaderTest, AnalyticsQueryTest, TestDistribIDF, TestChildDocTransformer, TestFieldCacheWithThreads,
ChaosMonkeySafeLeaderTest, TestFieldCache, SortSpecParsingTest, JavabinLoaderTest, TestUnifiedSolrHighlighter,
CdcrBootstrapTest, TestZkChroot, ExitableDirectoryReaderTest, ShowFileRequestHandlerTest,
ClassificationUpdateProcessorIntegrationTest, TestTolerantUpdateProcessorRandomCloud, TestAuthenticationFramework,
CollectionsAPISolrJTest, TestRealTimeGet, CloneFieldUpdateProcessorFactoryTest, CloudMLTQParserTest,
RegexBoostProcessorTest, TestImpersonationWithHadoopAuth, TestGraphMLResponseWriter, HighlighterConfigTest,
BigEndianAscendingWordSerializerTest, VersionInfoTest, CollectionReloadTest, TestStressLiveNodes,
TestRestManager, TestTrieFacet, TestCodecSupport, TestUtils, TestDistributedStatsComponentCardinality,
TestMiniSolrCloudClusterSSL, TestOverriddenPrefixQueryForCustomFieldType, TestShortCircuitedRequests,
TestLuceneMatchVersion, SpellCheckCollatorTest, SolrIndexMetricsTest]
   [junit4] Completed [210/675 (1!)] on J1 in 1.84s, 1 test, 1 failure <<< FAILURES!

[...truncated 63960 lines...]


Mime
View raw message