lucene-dev mailing list archives

Site index · List index
Message view « Date » · « Thread »
Top « Date » · « Thread »
From Policeman Jenkins Server <jenk...@thetaphi.de>
Subject [JENKINS] Lucene-Solr-6.x-Solaris (64bit/jdk1.8.0) - Build # 625 - Failure!
Date Sat, 21 Jan 2017 20:34:41 GMT
Build: https://jenkins.thetaphi.de/job/Lucene-Solr-6.x-Solaris/625/
Java: 64bit/jdk1.8.0 -XX:-UseCompressedOops -XX:+UseSerialGC

1 tests failed.
FAILED:  junit.framework.TestSuite.org.apache.solr.cloud.TestSolrCloudWithSecureImpersonation

Error Message:
2 threads leaked from SUITE scope at org.apache.solr.cloud.TestSolrCloudWithSecureImpersonation:     1) Thread[id=3618, name=jetty-launcher-567-thread-2-EventThread, state=TIMED_WAITING, group=TGRP-TestSolrCloudWithSecureImpersonation]         at sun.misc.Unsafe.park(Native Method)         at java.util.concurrent.locks.LockSupport.parkNanos(LockSupport.java:215)         at java.util.concurrent.locks.AbstractQueuedSynchronizer.doAcquireSharedNanos(AbstractQueuedSynchronizer.java:1037)         at java.util.concurrent.locks.AbstractQueuedSynchronizer.tryAcquireSharedNanos(AbstractQueuedSynchronizer.java:1328)         at java.util.concurrent.CountDownLatch.await(CountDownLatch.java:277)         at org.apache.curator.CuratorZookeeperClient.internalBlockUntilConnectedOrTimedOut(CuratorZookeeperClient.java:323)         at org.apache.curator.RetryLoop.callWithRetry(RetryLoop.java:105)         at org.apache.curator.framework.imps.GetDataBuilderImpl.pathInForeground(GetDataBuilderImpl.java:288)         at org.apache.curator.framework.imps.GetDataBuilderImpl.forPath(GetDataBuilderImpl.java:279)         at org.apache.curator.framework.imps.GetDataBuilderImpl.forPath(GetDataBuilderImpl.java:41)         at org.apache.curator.framework.recipes.shared.SharedValue.readValue(SharedValue.java:244)         at org.apache.curator.framework.recipes.shared.SharedValue.access$100(SharedValue.java:44)         at org.apache.curator.framework.recipes.shared.SharedValue$1.process(SharedValue.java:61)         at org.apache.curator.framework.imps.NamespaceWatcher.process(NamespaceWatcher.java:67)         at org.apache.zookeeper.ClientCnxn$EventThread.processEvent(ClientCnxn.java:522)         at org.apache.zookeeper.ClientCnxn$EventThread.run(ClientCnxn.java:498)    2) Thread[id=3630, name=jetty-launcher-567-thread-1-EventThread, state=TIMED_WAITING, group=TGRP-TestSolrCloudWithSecureImpersonation]         at sun.misc.Unsafe.park(Native Method)         at java.util.concurrent.locks.LockSupport.parkNanos(LockSupport.java:215)         at java.util.concurrent.locks.AbstractQueuedSynchronizer.doAcquireSharedNanos(AbstractQueuedSynchronizer.java:1037)         at java.util.concurrent.locks.AbstractQueuedSynchronizer.tryAcquireSharedNanos(AbstractQueuedSynchronizer.java:1328)         at java.util.concurrent.CountDownLatch.await(CountDownLatch.java:277)         at org.apache.curator.CuratorZookeeperClient.internalBlockUntilConnectedOrTimedOut(CuratorZookeeperClient.java:323)         at org.apache.curator.RetryLoop.callWithRetry(RetryLoop.java:105)         at org.apache.curator.framework.imps.GetDataBuilderImpl.pathInForeground(GetDataBuilderImpl.java:288)         at org.apache.curator.framework.imps.GetDataBuilderImpl.forPath(GetDataBuilderImpl.java:279)         at org.apache.curator.framework.imps.GetDataBuilderImpl.forPath(GetDataBuilderImpl.java:41)         at org.apache.curator.framework.recipes.shared.SharedValue.readValue(SharedValue.java:244)         at org.apache.curator.framework.recipes.shared.SharedValue.access$100(SharedValue.java:44)         at org.apache.curator.framework.recipes.shared.SharedValue$1.process(SharedValue.java:61)         at org.apache.curator.framework.imps.NamespaceWatcher.process(NamespaceWatcher.java:67)         at org.apache.zookeeper.ClientCnxn$EventThread.processEvent(ClientCnxn.java:522)         at org.apache.zookeeper.ClientCnxn$EventThread.run(ClientCnxn.java:498)

Stack Trace:
com.carrotsearch.randomizedtesting.ThreadLeakError: 2 threads leaked from SUITE scope at org.apache.solr.cloud.TestSolrCloudWithSecureImpersonation: 
   1) Thread[id=3618, name=jetty-launcher-567-thread-2-EventThread, state=TIMED_WAITING, group=TGRP-TestSolrCloudWithSecureImpersonation]
        at sun.misc.Unsafe.park(Native Method)
        at java.util.concurrent.locks.LockSupport.parkNanos(LockSupport.java:215)
        at java.util.concurrent.locks.AbstractQueuedSynchronizer.doAcquireSharedNanos(AbstractQueuedSynchronizer.java:1037)
        at java.util.concurrent.locks.AbstractQueuedSynchronizer.tryAcquireSharedNanos(AbstractQueuedSynchronizer.java:1328)
        at java.util.concurrent.CountDownLatch.await(CountDownLatch.java:277)
        at org.apache.curator.CuratorZookeeperClient.internalBlockUntilConnectedOrTimedOut(CuratorZookeeperClient.java:323)
        at org.apache.curator.RetryLoop.callWithRetry(RetryLoop.java:105)
        at org.apache.curator.framework.imps.GetDataBuilderImpl.pathInForeground(GetDataBuilderImpl.java:288)
        at org.apache.curator.framework.imps.GetDataBuilderImpl.forPath(GetDataBuilderImpl.java:279)
        at org.apache.curator.framework.imps.GetDataBuilderImpl.forPath(GetDataBuilderImpl.java:41)
        at org.apache.curator.framework.recipes.shared.SharedValue.readValue(SharedValue.java:244)
        at org.apache.curator.framework.recipes.shared.SharedValue.access$100(SharedValue.java:44)
        at org.apache.curator.framework.recipes.shared.SharedValue$1.process(SharedValue.java:61)
        at org.apache.curator.framework.imps.NamespaceWatcher.process(NamespaceWatcher.java:67)
        at org.apache.zookeeper.ClientCnxn$EventThread.processEvent(ClientCnxn.java:522)
        at org.apache.zookeeper.ClientCnxn$EventThread.run(ClientCnxn.java:498)
   2) Thread[id=3630, name=jetty-launcher-567-thread-1-EventThread, state=TIMED_WAITING, group=TGRP-TestSolrCloudWithSecureImpersonation]
        at sun.misc.Unsafe.park(Native Method)
        at java.util.concurrent.locks.LockSupport.parkNanos(LockSupport.java:215)
        at java.util.concurrent.locks.AbstractQueuedSynchronizer.doAcquireSharedNanos(AbstractQueuedSynchronizer.java:1037)
        at java.util.concurrent.locks.AbstractQueuedSynchronizer.tryAcquireSharedNanos(AbstractQueuedSynchronizer.java:1328)
        at java.util.concurrent.CountDownLatch.await(CountDownLatch.java:277)
        at org.apache.curator.CuratorZookeeperClient.internalBlockUntilConnectedOrTimedOut(CuratorZookeeperClient.java:323)
        at org.apache.curator.RetryLoop.callWithRetry(RetryLoop.java:105)
        at org.apache.curator.framework.imps.GetDataBuilderImpl.pathInForeground(GetDataBuilderImpl.java:288)
        at org.apache.curator.framework.imps.GetDataBuilderImpl.forPath(GetDataBuilderImpl.java:279)
        at org.apache.curator.framework.imps.GetDataBuilderImpl.forPath(GetDataBuilderImpl.java:41)
        at org.apache.curator.framework.recipes.shared.SharedValue.readValue(SharedValue.java:244)
        at org.apache.curator.framework.recipes.shared.SharedValue.access$100(SharedValue.java:44)
        at org.apache.curator.framework.recipes.shared.SharedValue$1.process(SharedValue.java:61)
        at org.apache.curator.framework.imps.NamespaceWatcher.process(NamespaceWatcher.java:67)
        at org.apache.zookeeper.ClientCnxn$EventThread.processEvent(ClientCnxn.java:522)
        at org.apache.zookeeper.ClientCnxn$EventThread.run(ClientCnxn.java:498)
	at __randomizedtesting.SeedInfo.seed([68C5999D345EE6BE]:0)




Build Log:
[...truncated 11067 lines...]
   [junit4] Suite: org.apache.solr.cloud.TestSolrCloudWithSecureImpersonation
   [junit4]   2> Creating dataDir: /export/home/jenkins/workspace/Lucene-Solr-6.x-Solaris/solr/build/solr-core/test/J0/temp/solr.cloud.TestSolrCloudWithSecureImpersonation_68C5999D345EE6BE-001/init-core-data-001
   [junit4]   2> 516965 INFO  (SUITE-TestSolrCloudWithSecureImpersonation-seed#[68C5999D345EE6BE]-worker) [    ] o.a.s.SolrTestCaseJ4 Randomized ssl (false) and clientAuth (false) via: @org.apache.solr.util.RandomizeSSL(reason=, value=NaN, ssl=NaN, clientAuth=NaN)
   [junit4]   2> 517008 INFO  (SUITE-TestSolrCloudWithSecureImpersonation-seed#[68C5999D345EE6BE]-worker) [    ] o.a.s.c.MiniSolrCloudCluster Starting cluster of 2 servers in /export/home/jenkins/workspace/Lucene-Solr-6.x-Solaris/solr/build/solr-core/test/J0/temp/solr.cloud.TestSolrCloudWithSecureImpersonation_68C5999D345EE6BE-001/tempDir-001
   [junit4]   2> 517008 INFO  (SUITE-TestSolrCloudWithSecureImpersonation-seed#[68C5999D345EE6BE]-worker) [    ] o.a.s.c.ZkTestServer STARTING ZK TEST SERVER
   [junit4]   2> 517008 INFO  (Thread-888) [    ] o.a.s.c.ZkTestServer client port:0.0.0.0/0.0.0.0:0
   [junit4]   2> 517008 INFO  (Thread-888) [    ] o.a.s.c.ZkTestServer Starting server
   [junit4]   2> 517108 INFO  (SUITE-TestSolrCloudWithSecureImpersonation-seed#[68C5999D345EE6BE]-worker) [    ] o.a.s.c.ZkTestServer start zk server on port:45760
   [junit4]   2> 517119 INFO  (jetty-launcher-567-thread-1) [    ] o.e.j.s.Server jetty-9.3.14.v20161028
   [junit4]   2> 517120 INFO  (jetty-launcher-567-thread-1) [    ] o.e.j.s.h.ContextHandler Started o.e.j.s.ServletContextHandler@7265d62{/solr,null,AVAILABLE}
   [junit4]   2> 517123 INFO  (jetty-launcher-567-thread-2) [    ] o.e.j.s.Server jetty-9.3.14.v20161028
   [junit4]   2> 517125 INFO  (jetty-launcher-567-thread-2) [    ] o.e.j.s.h.ContextHandler Started o.e.j.s.ServletContextHandler@7a666517{/solr,null,AVAILABLE}
   [junit4]   2> 517129 INFO  (jetty-launcher-567-thread-1) [    ] o.e.j.s.AbstractConnector Started ServerConnector@1af525ed{HTTP/1.1,[http/1.1]}{127.0.0.1:58761}
   [junit4]   2> 517129 INFO  (jetty-launcher-567-thread-1) [    ] o.e.j.s.Server Started @520672ms
   [junit4]   2> 517129 INFO  (jetty-launcher-567-thread-1) [    ] o.a.s.c.s.e.JettySolrRunner Jetty properties: {hostContext=/solr, hostPort=58761}
   [junit4]   2> 517132 ERROR (jetty-launcher-567-thread-1) [    ] o.a.s.s.StartupLoggingUtils Missing Java Option solr.log.dir. Logging may be missing or incomplete.
   [junit4]   2> 517132 INFO  (jetty-launcher-567-thread-1) [    ] o.a.s.s.SolrDispatchFilter  ___      _       Welcome to Apache Solr? version 6.5.0
   [junit4]   2> 517132 INFO  (jetty-launcher-567-thread-1) [    ] o.a.s.s.SolrDispatchFilter / __| ___| |_ _   Starting in cloud mode on port null
   [junit4]   2> 517132 INFO  (jetty-launcher-567-thread-1) [    ] o.a.s.s.SolrDispatchFilter \__ \/ _ \ | '_|  Install dir: null
   [junit4]   2> 517132 INFO  (jetty-launcher-567-thread-1) [    ] o.a.s.s.SolrDispatchFilter |___/\___/_|_|    Start time: 2017-01-21T19:30:43.408Z
   [junit4]   2> 517134 INFO  (jetty-launcher-567-thread-2) [    ] o.e.j.s.AbstractConnector Started ServerConnector@b9e9c9e{HTTP/1.1,[http/1.1]}{127.0.0.1:37734}
   [junit4]   2> 517134 INFO  (jetty-launcher-567-thread-2) [    ] o.e.j.s.Server Started @520677ms
   [junit4]   2> 517134 INFO  (jetty-launcher-567-thread-2) [    ] o.a.s.c.s.e.JettySolrRunner Jetty properties: {hostContext=/solr, hostPort=37734}
   [junit4]   2> 517134 ERROR (jetty-launcher-567-thread-2) [    ] o.a.s.s.StartupLoggingUtils Missing Java Option solr.log.dir. Logging may be missing or incomplete.
   [junit4]   2> 517134 INFO  (jetty-launcher-567-thread-2) [    ] o.a.s.s.SolrDispatchFilter  ___      _       Welcome to Apache Solr? version 6.5.0
   [junit4]   2> 517134 INFO  (jetty-launcher-567-thread-2) [    ] o.a.s.s.SolrDispatchFilter / __| ___| |_ _   Starting in cloud mode on port null
   [junit4]   2> 517134 INFO  (jetty-launcher-567-thread-2) [    ] o.a.s.s.SolrDispatchFilter \__ \/ _ \ | '_|  Install dir: null
   [junit4]   2> 517134 INFO  (jetty-launcher-567-thread-2) [    ] o.a.s.s.SolrDispatchFilter |___/\___/_|_|    Start time: 2017-01-21T19:30:43.410Z
   [junit4]   2> 517142 INFO  (jetty-launcher-567-thread-1) [    ] o.a.s.s.SolrDispatchFilter solr.xml found in ZooKeeper. Loading...
   [junit4]   2> 517147 INFO  (jetty-launcher-567-thread-2) [    ] o.a.s.s.SolrDispatchFilter solr.xml found in ZooKeeper. Loading...
   [junit4]   2> 517161 INFO  (jetty-launcher-567-thread-2) [    ] o.a.s.u.UpdateShardHandler Creating UpdateShardHandler HTTP client with params: socketTimeout=340000&connTimeout=45000&retry=true
   [junit4]   2> 517162 INFO  (jetty-launcher-567-thread-2) [    ] o.a.s.c.ZkContainer Zookeeper client=127.0.0.1:45760/solr
   [junit4]   2> 517168 INFO  (jetty-launcher-567-thread-1) [    ] o.a.s.u.UpdateShardHandler Creating UpdateShardHandler HTTP client with params: socketTimeout=340000&connTimeout=45000&retry=true
   [junit4]   2> 517169 INFO  (jetty-launcher-567-thread-1) [    ] o.a.s.c.ZkContainer Zookeeper client=127.0.0.1:45760/solr
   [junit4]   2> 517187 WARN  (NIOServerCxn.Factory:0.0.0.0/0.0.0.0:0) [    ] o.a.z.s.NIOServerCnxn caught end of stream exception
   [junit4]   2> EndOfStreamException: Unable to read additional data from client sessionid 0x159c28267d60004, likely client has closed socket
   [junit4]   2> 	at org.apache.zookeeper.server.NIOServerCnxn.doIO(NIOServerCnxn.java:228)
   [junit4]   2> 	at org.apache.zookeeper.server.NIOServerCnxnFactory.run(NIOServerCnxnFactory.java:208)
   [junit4]   2> 	at java.lang.Thread.run(Thread.java:745)
   [junit4]   2> 517241 INFO  (jetty-launcher-567-thread-1) [n:127.0.0.1:58761_solr    ] o.a.s.c.OverseerElectionContext I am going to be the leader 127.0.0.1:58761_solr
   [junit4]   2> 517243 INFO  (jetty-launcher-567-thread-1) [n:127.0.0.1:58761_solr    ] o.a.s.c.Overseer Overseer (id=97322732308791302-127.0.0.1:58761_solr-n_0000000000) starting
   [junit4]   2> 517251 INFO  (jetty-launcher-567-thread-1) [n:127.0.0.1:58761_solr    ] o.a.s.c.ZkController Register node as live in ZooKeeper:/live_nodes/127.0.0.1:58761_solr
   [junit4]   2> 517261 INFO  (jetty-launcher-567-thread-2) [n:127.0.0.1:37734_solr    ] o.a.s.c.c.ZkStateReader Updated live nodes from ZooKeeper... (0) -> (1)
   [junit4]   2> 517271 INFO  (jetty-launcher-567-thread-2) [n:127.0.0.1:37734_solr    ] o.a.s.c.ZkController Register node as live in ZooKeeper:/live_nodes/127.0.0.1:37734_solr
   [junit4]   2> 517306 INFO  (zkCallback-577-thread-1-processing-n:127.0.0.1:37734_solr) [n:127.0.0.1:37734_solr    ] o.a.s.c.c.ZkStateReader Updated live nodes from ZooKeeper... (1) -> (2)
   [junit4]   2> 517310 INFO  (OverseerStateUpdate-97322732308791302-127.0.0.1:58761_solr-n_0000000000) [n:127.0.0.1:58761_solr    ] o.a.s.c.c.ZkStateReader Updated live nodes from ZooKeeper... (0) -> (2)
   [junit4]   2> 517331 INFO  (jetty-launcher-567-thread-2) [n:127.0.0.1:37734_solr    ] o.a.s.c.CoreContainer Authentication plugin class obtained from system property 'authenticationPlugin': org.apache.solr.security.HttpParamDelegationTokenPlugin
   [junit4]   2> 517331 INFO  (jetty-launcher-567-thread-2) [n:127.0.0.1:37734_solr    ] o.a.s.s.KerberosPlugin Params: {solr.kerberos.impersonator.user.noGroups.hosts=*, solr.kerberos.impersonator.user.bogusGroup.groups=__some_bogus_group, token.valid=30, cookie.domain=127.0.0.1, solr.kerberos.impersonator.user.anyHostAnyUser.groups=*, solr.kerberos.impersonator.user.bogusGroup.hosts=*, solr.kerberos.impersonator.user.anyHostAnyUser.hosts=*, token.validity=36000, solr.kerberos.impersonator.user.noHosts.groups=*, type=kerberos, solr.kerberos.impersonator.user.localHostAnyGroup.groups=*, delegation-token.token-kind=solr-dt, solr.kerberos.impersonator.user.wrongHost.hosts=1.1.1.1.1.1, cookie.path=/, zk-dt-secret-manager.znodeWorkingPath=solr/security/zkdtsm, solr.kerberos.impersonator.user.localHostAnyGroup.hosts=solaris-vm,localhost,127.0.0.1, signer.secret.provider.zookeeper.path=/token, solr.kerberos.impersonator.user.anyHostUsersGroup.groups=staff, zk-dt-secret-manager.enable=true, solr.kerberos.impersonator.user.wrongHost.groups=*, kerberos.name.rules=DEFAULT, signer.secret.provider=zookeeper, solr.kerberos.impersonator.user.anyHostUsersGroup.hosts=*}
   [junit4]   2> 517332 INFO  (jetty-launcher-567-thread-2) [n:127.0.0.1:37734_solr    ] o.a.c.f.i.CuratorFrameworkImpl Starting
   [junit4]   2> 517336 INFO  (jetty-launcher-567-thread-2-EventThread) [n:127.0.0.1:37734_solr    ] o.a.c.f.s.ConnectionStateManager State change: CONNECTED
   [junit4]   2> 517446 INFO  (jetty-launcher-567-thread-2) [n:127.0.0.1:37734_solr    ] o.a.s.h.c.HttpShardHandlerFactory Reconfiguring the default client with: org.apache.solr.security.HttpParamDelegationTokenPlugin$2@8a95a8d
   [junit4]   2> 517446 INFO  (jetty-launcher-567-thread-2) [n:127.0.0.1:37734_solr    ] o.a.s.u.UpdateShardHandler Reconfiguring the default client with: org.apache.solr.security.HttpParamDelegationTokenPlugin$2@8a95a8d
   [junit4]   2> 517452 INFO  (jetty-launcher-567-thread-2) [n:127.0.0.1:37734_solr    ] o.a.s.c.CorePropertiesLocator Found 0 core definitions underneath /export/home/jenkins/workspace/Lucene-Solr-6.x-Solaris/solr/build/solr-core/test/J0/temp/solr.cloud.TestSolrCloudWithSecureImpersonation_68C5999D345EE6BE-001/tempDir-001/node2/.
   [junit4]   2> 517459 INFO  (jetty-launcher-567-thread-1) [n:127.0.0.1:58761_solr    ] o.a.s.c.CoreContainer Authentication plugin class obtained from system property 'authenticationPlugin': org.apache.solr.security.HttpParamDelegationTokenPlugin
   [junit4]   2> 517460 INFO  (jetty-launcher-567-thread-1) [n:127.0.0.1:58761_solr    ] o.a.s.s.KerberosPlugin Params: {solr.kerberos.impersonator.user.noGroups.hosts=*, solr.kerberos.impersonator.user.bogusGroup.groups=__some_bogus_group, token.valid=30, cookie.domain=127.0.0.1, solr.kerberos.impersonator.user.anyHostAnyUser.groups=*, solr.kerberos.impersonator.user.bogusGroup.hosts=*, solr.kerberos.impersonator.user.anyHostAnyUser.hosts=*, token.validity=36000, solr.kerberos.impersonator.user.noHosts.groups=*, type=kerberos, solr.kerberos.impersonator.user.localHostAnyGroup.groups=*, delegation-token.token-kind=solr-dt, solr.kerberos.impersonator.user.wrongHost.hosts=1.1.1.1.1.1, cookie.path=/, zk-dt-secret-manager.znodeWorkingPath=solr/security/zkdtsm, solr.kerberos.impersonator.user.localHostAnyGroup.hosts=solaris-vm,localhost,127.0.0.1, signer.secret.provider.zookeeper.path=/token, solr.kerberos.impersonator.user.anyHostUsersGroup.groups=staff, zk-dt-secret-manager.enable=true, solr.kerberos.impersonator.user.wrongHost.groups=*, kerberos.name.rules=DEFAULT, signer.secret.provider=zookeeper, solr.kerberos.impersonator.user.anyHostUsersGroup.hosts=*}
   [junit4]   2> 517466 INFO  (jetty-launcher-567-thread-1) [n:127.0.0.1:58761_solr    ] o.a.c.f.i.CuratorFrameworkImpl Starting
   [junit4]   2> 517481 INFO  (jetty-launcher-567-thread-1-EventThread) [n:127.0.0.1:58761_solr    ] o.a.c.f.s.ConnectionStateManager State change: CONNECTED
   [junit4]   2> 517534 INFO  (jetty-launcher-567-thread-1) [n:127.0.0.1:58761_solr    ] o.a.s.h.c.HttpShardHandlerFactory Reconfiguring the default client with: org.apache.solr.security.HttpParamDelegationTokenPlugin$2@1b12095b
   [junit4]   2> 517534 INFO  (jetty-launcher-567-thread-1) [n:127.0.0.1:58761_solr    ] o.a.s.u.UpdateShardHandler Reconfiguring the default client with: org.apache.solr.security.HttpParamDelegationTokenPlugin$2@1b12095b
   [junit4]   2> 517534 INFO  (jetty-launcher-567-thread-1) [n:127.0.0.1:58761_solr    ] o.a.s.c.CorePropertiesLocator Found 0 core definitions underneath /export/home/jenkins/workspace/Lucene-Solr-6.x-Solaris/solr/build/solr-core/test/J0/temp/solr.cloud.TestSolrCloudWithSecureImpersonation_68C5999D345EE6BE-001/tempDir-001/node1/.
   [junit4]   2> 518181 INFO  (TEST-TestSolrCloudWithSecureImpersonation.testProxyValidateAnyHostAnyUser-seed#[68C5999D345EE6BE]) [    ] o.a.s.SolrTestCaseJ4 ###Starting testProxyValidateAnyHostAnyUser
   [junit4]   2> 518189 INFO  (qtp376110393-3583) [n:127.0.0.1:37734_solr    ] o.a.s.h.a.CollectionsHandler Invoked Collection Action :list with params doAs=bar&action=LIST&wt=javabin&version=2 and sendToOCPQueue=true
   [junit4]   2> 518189 INFO  (qtp376110393-3583) [n:127.0.0.1:37734_solr    ] o.a.s.s.HttpSolrCall [admin] webapp=null path=/admin/collections params={doAs=bar&action=LIST&wt=javabin&version=2} status=0 QTime=0
   [junit4]   2> 518190 WARN  (TEST-TestSolrCloudWithSecureImpersonation.testProxyValidateAnyHostAnyUser-seed#[68C5999D345EE6BE]) [    ] o.a.h.c.p.ResponseProcessCookies Invalid cookie header: "Set-Cookie: hadoop.auth="u=anyHostAnyUser&p=anyHostAnyUser&t=test&e=1485063044460&s=B/H9wd1vakZt/xKmD9JDk9jRbHY="; Path=/; Domain=127.0.0.1; Expires=dom, 22-ene-2017 05:30:44 GMT; HttpOnly". Invalid 'expires' attribute: dom, 22-ene-2017 05:30:44 GMT
   [junit4]   2> 518190 INFO  (TEST-TestSolrCloudWithSecureImpersonation.testProxyValidateAnyHostAnyUser-seed#[68C5999D345EE6BE]) [    ] o.a.s.SolrTestCaseJ4 ###Ending testProxyValidateAnyHostAnyUser
   [junit4]   2> 518209 INFO  (TEST-TestSolrCloudWithSecureImpersonation.testProxyWrongHost-seed#[68C5999D345EE6BE]) [    ] o.a.s.SolrTestCaseJ4 ###Starting testProxyWrongHost
   [junit4]   2> 518226 WARN  (TEST-TestSolrCloudWithSecureImpersonation.testProxyWrongHost-seed#[68C5999D345EE6BE]) [    ] o.a.h.c.p.ResponseProcessCookies Invalid cookie header: "Set-Cookie: hadoop.auth="u=wrongHost&p=wrongHost&t=test&e=1485063044487&s=uYPrNmjFUnwxOEH9Kme+nVHaFLQ="; Path=/; Domain=127.0.0.1; Expires=dom, 22-ene-2017 05:30:44 GMT; HttpOnly". Invalid 'expires' attribute: dom, 22-ene-2017 05:30:44 GMT
   [junit4]   2> 518227 INFO  (TEST-TestSolrCloudWithSecureImpersonation.testProxyWrongHost-seed#[68C5999D345EE6BE]) [    ] o.a.s.SolrTestCaseJ4 ###Ending testProxyWrongHost
   [junit4]   2> 518247 INFO  (TEST-TestSolrCloudWithSecureImpersonation.testProxyInvalidProxyUser-seed#[68C5999D345EE6BE]) [    ] o.a.s.SolrTestCaseJ4 ###Starting testProxyInvalidProxyUser
   [junit4]   2> 518252 WARN  (TEST-TestSolrCloudWithSecureImpersonation.testProxyInvalidProxyUser-seed#[68C5999D345EE6BE]) [    ] o.a.h.c.p.ResponseProcessCookies Invalid cookie header: "Set-Cookie: hadoop.auth="u=bar&p=bar&t=test&e=1485063044525&s=N+k4Sp+aaNpPbW5bSQqtnP/iCi4="; Path=/; Domain=127.0.0.1; Expires=dom, 22-ene-2017 05:30:44 GMT; HttpOnly". Invalid 'expires' attribute: dom, 22-ene-2017 05:30:44 GMT
   [junit4]   2> 518252 INFO  (TEST-TestSolrCloudWithSecureImpersonation.testProxyInvalidProxyUser-seed#[68C5999D345EE6BE]) [    ] o.a.s.SolrTestCaseJ4 ###Ending testProxyInvalidProxyUser
   [junit4]   2> 518289 INFO  (TEST-TestSolrCloudWithSecureImpersonation.testProxyNoConfigHosts-seed#[68C5999D345EE6BE]) [    ] o.a.s.SolrTestCaseJ4 ###Starting testProxyNoConfigHosts
   [junit4]   2> 518293 WARN  (TEST-TestSolrCloudWithSecureImpersonation.testProxyNoConfigHosts-seed#[68C5999D345EE6BE]) [    ] o.a.h.c.p.ResponseProcessCookies Invalid cookie header: "Set-Cookie: hadoop.auth="u=noHosts&p=noHosts&t=test&e=1485063044567&s=vXndza0HygDfxyfFNWcxZEL/jRw="; Path=/; Domain=127.0.0.1; Expires=dom, 22-ene-2017 05:30:44 GMT; HttpOnly". Invalid 'expires' attribute: dom, 22-ene-2017 05:30:44 GMT
   [junit4]   2> 518293 INFO  (TEST-TestSolrCloudWithSecureImpersonation.testProxyNoConfigHosts-seed#[68C5999D345EE6BE]) [    ] o.a.s.SolrTestCaseJ4 ###Ending testProxyNoConfigHosts
   [junit4]   2> 518313 INFO  (TEST-TestSolrCloudWithSecureImpersonation.testForwarding-seed#[68C5999D345EE6BE]) [    ] o.a.s.SolrTestCaseJ4 ###Starting testForwarding
   [junit4]   2> 519090 INFO  (TEST-TestSolrCloudWithSecureImpersonation.testForwarding-seed#[68C5999D345EE6BE]) [    ] o.a.s.c.c.ZkStateReader Updated live nodes from ZooKeeper... (0) -> (2)
   [junit4]   2> 519091 INFO  (TEST-TestSolrCloudWithSecureImpersonation.testForwarding-seed#[68C5999D345EE6BE]) [    ] o.a.s.c.s.i.ZkClientClusterStateProvider Cluster at 127.0.0.1:45760/solr ready
   [junit4]   2> 519096 INFO  (qtp1074759124-3575) [n:127.0.0.1:58761_solr    ] o.a.s.h.a.CollectionsHandler Invoked Collection Action :create with params replicationFactor=1&collection.configName=conf1&maxShardsPerNode=1&name=forwardingCollection&action=CREATE&numShards=1&wt=javabin&version=2 and sendToOCPQueue=true
   [junit4]   2> 519101 INFO  (OverseerThreadFactory-2043-thread-1-processing-n:127.0.0.1:58761_solr) [n:127.0.0.1:58761_solr    ] o.a.s.c.CreateCollectionCmd Create collection forwardingCollection
   [junit4]   2> 519212 INFO  (qtp1074759124-3570) [n:127.0.0.1:58761_solr    ] o.a.s.h.a.CoreAdminOperation core create command qt=/admin/cores&collection.configName=conf1&newCollection=true&name=forwardingCollection_shard1_replica1&action=CREATE&numShards=1&collection=forwardingCollection&shard=shard1&wt=javabin&version=2
   [junit4]   2> 519323 INFO  (zkCallback-578-thread-2-processing-n:127.0.0.1:58761_solr) [n:127.0.0.1:58761_solr    ] o.a.s.c.c.ZkStateReader A cluster state change: [WatchedEvent state:SyncConnected type:NodeDataChanged path:/collections/forwardingCollection/state.json] for collection [forwardingCollection] has occurred - updating... (live nodes size: [2])
   [junit4]   2> 520235 INFO  (qtp1074759124-3570) [n:127.0.0.1:58761_solr c:forwardingCollection s:shard1  x:forwardingCollection_shard1_replica1] o.a.s.c.SolrConfig Using Lucene MatchVersion: 6.5.0
   [junit4]   2> 520254 INFO  (qtp1074759124-3570) [n:127.0.0.1:58761_solr c:forwardingCollection s:shard1  x:forwardingCollection_shard1_replica1] o.a.s.s.IndexSchema [forwardingCollection_shard1_replica1] Schema name=test
   [junit4]   2> 520337 WARN  (qtp1074759124-3570) [n:127.0.0.1:58761_solr c:forwardingCollection s:shard1  x:forwardingCollection_shard1_replica1] o.a.s.s.IndexSchema [forwardingCollection_shard1_replica1] default search field in schema is text. WARNING: Deprecated, please use 'df' on request instead.
   [junit4]   2> 520338 INFO  (qtp1074759124-3570) [n:127.0.0.1:58761_solr c:forwardingCollection s:shard1  x:forwardingCollection_shard1_replica1] o.a.s.s.IndexSchema Loaded schema test/1.0 with uniqueid field id
   [junit4]   2> 520357 INFO  (qtp1074759124-3570) [n:127.0.0.1:58761_solr c:forwardingCollection s:shard1  x:forwardingCollection_shard1_replica1] o.a.s.c.CoreContainer Creating SolrCore 'forwardingCollection_shard1_replica1' using configuration from collection forwardingCollection
   [junit4]   2> 520358 INFO  (qtp1074759124-3570) [n:127.0.0.1:58761_solr c:forwardingCollection s:shard1  x:forwardingCollection_shard1_replica1] o.a.s.c.SolrCore [[forwardingCollection_shard1_replica1] ] Opening new SolrCore at [/export/home/jenkins/workspace/Lucene-Solr-6.x-Solaris/solr/build/solr-core/test/J0/temp/solr.cloud.TestSolrCloudWithSecureImpersonation_68C5999D345EE6BE-001/tempDir-001/node1/forwardingCollection_shard1_replica1], dataDir=[/export/home/jenkins/workspace/Lucene-Solr-6.x-Solaris/solr/build/solr-core/test/J0/temp/solr.cloud.TestSolrCloudWithSecureImpersonation_68C5999D345EE6BE-001/tempDir-001/node1/./forwardingCollection_shard1_replica1/data/]
   [junit4]   2> 520358 INFO  (qtp1074759124-3570) [n:127.0.0.1:58761_solr c:forwardingCollection s:shard1  x:forwardingCollection_shard1_replica1] o.a.s.c.JmxMonitoredMap JMX monitoring is enabled. Adding Solr mbeans to JMX Server: com.sun.jmx.mbeanserver.JmxMBeanServer@26a7148c
   [junit4]   2> 520360 INFO  (qtp1074759124-3570) [n:127.0.0.1:58761_solr c:forwardingCollection s:shard1  x:forwardingCollection_shard1_replica1] o.a.s.u.RandomMergePolicy RandomMergePolicy wrapping class org.apache.lucene.index.TieredMergePolicy: [TieredMergePolicy: maxMergeAtOnce=23, maxMergeAtOnceExplicit=22, maxMergedSegmentMB=42.833984375, floorSegmentMB=1.0185546875, forceMergeDeletesPctAllowed=13.628526306747252, segmentsPerTier=37.0, maxCFSSegmentSizeMB=8.796093022207999E12, noCFSRatio=0.0
   [junit4]   2> 520381 INFO  (qtp1074759124-3570) [n:127.0.0.1:58761_solr c:forwardingCollection s:shard1  x:forwardingCollection_shard1_replica1] o.a.s.u.UpdateHandler Using UpdateLog implementation: org.apache.solr.update.UpdateLog
   [junit4]   2> 520382 INFO  (qtp1074759124-3570) [n:127.0.0.1:58761_solr c:forwardingCollection s:shard1  x:forwardingCollection_shard1_replica1] o.a.s.u.UpdateLog Initializing UpdateLog: dataDir= defaultSyncLevel=FLUSH numRecordsToKeep=100 maxNumLogsToKeep=10 numVersionBuckets=65536
   [junit4]   2> 520382 INFO  (qtp1074759124-3570) [n:127.0.0.1:58761_solr c:forwardingCollection s:shard1  x:forwardingCollection_shard1_replica1] o.a.s.u.CommitTracker Hard AutoCommit: disabled
   [junit4]   2> 520383 INFO  (qtp1074759124-3570) [n:127.0.0.1:58761_solr c:forwardingCollection s:shard1  x:forwardingCollection_shard1_replica1] o.a.s.u.CommitTracker Soft AutoCommit: disabled
   [junit4]   2> 520383 INFO  (qtp1074759124-3570) [n:127.0.0.1:58761_solr c:forwardingCollection s:shard1  x:forwardingCollection_shard1_replica1] o.a.s.u.RandomMergePolicy RandomMergePolicy wrapping class org.apache.lucene.index.LogDocMergePolicy: [LogDocMergePolicy: minMergeSize=1000, mergeFactor=49, maxMergeSize=9223372036854775807, maxMergeSizeForForcedMerge=9223372036854775807, calibrateSizeByDeletes=true, maxMergeDocs=2147483647, maxCFSSegmentSizeMB=8.796093022207999E12, noCFSRatio=0.8333802682325848]
   [junit4]   2> 520384 INFO  (qtp1074759124-3570) [n:127.0.0.1:58761_solr c:forwardingCollection s:shard1  x:forwardingCollection_shard1_replica1] o.a.s.s.SolrIndexSearcher Opening [Searcher@6076c3cf[forwardingCollection_shard1_replica1] main]
   [junit4]   2> 520385 INFO  (qtp1074759124-3570) [n:127.0.0.1:58761_solr c:forwardingCollection s:shard1  x:forwardingCollection_shard1_replica1] o.a.s.h.c.SpellCheckComponent Initializing spell checkers
   [junit4]   2> 520388 INFO  (qtp1074759124-3570) [n:127.0.0.1:58761_solr c:forwardingCollection s:shard1  x:forwardingCollection_shard1_replica1] o.a.s.s.DirectSolrSpellChecker init: {name=direct,classname=DirectSolrSpellChecker,field=lowerfilt,minQueryLength=3}
   [junit4]   2> 520404 INFO  (qtp1074759124-3570) [n:127.0.0.1:58761_solr c:forwardingCollection s:shard1  x:forwardingCollection_shard1_replica1] o.a.s.h.ReplicationHandler Commits will be reserved for  10000
   [junit4]   2> 520404 INFO  (searcherExecutor-2048-thread-1-processing-n:127.0.0.1:58761_solr x:forwardingCollection_shard1_replica1 s:shard1 c:forwardingCollection) [n:127.0.0.1:58761_solr c:forwardingCollection s:shard1  x:forwardingCollection_shard1_replica1] o.a.s.h.c.SpellCheckComponent Loading spell index for spellchecker: default
   [junit4]   2> 520405 INFO  (searcherExecutor-2048-thread-1-processing-n:127.0.0.1:58761_solr x:forwardingCollection_shard1_replica1 s:shard1 c:forwardingCollection) [n:127.0.0.1:58761_solr c:forwardingCollection s:shard1  x:forwardingCollection_shard1_replica1] o.a.s.h.c.SpellCheckComponent Loading spell index for spellchecker: direct
   [junit4]   2> 520405 INFO  (searcherExecutor-2048-thread-1-processing-n:127.0.0.1:58761_solr x:forwardingCollection_shard1_replica1 s:shard1 c:forwardingCollection) [n:127.0.0.1:58761_solr c:forwardingCollection s:shard1  x:forwardingCollection_shard1_replica1] o.a.s.h.c.SpellCheckComponent Loading spell index for spellchecker: wordbreak
   [junit4]   2> 520405 INFO  (searcherExecutor-2048-thread-1-processing-n:127.0.0.1:58761_solr x:forwardingCollection_shard1_replica1 s:shard1 c:forwardingCollection) [n:127.0.0.1:58761_solr c:forwardingCollection s:shard1  x:forwardingCollection_shard1_replica1] o.a.s.h.c.SpellCheckComponent Loading spell index for spellchecker: multipleFields
   [junit4]   2> 520405 INFO  (searcherExecutor-2048-thread-1-processing-n:127.0.0.1:58761_solr x:forwardingCollection_shard1_replica1 s:shard1 c:forwardingCollection) [n:127.0.0.1:58761_solr c:forwardingCollection s:shard1  x:forwardingCollection_shard1_replica1] o.a.s.h.c.SpellCheckComponent Loading spell index for spellchecker: jarowinkler
   [junit4]   2> 520406 INFO  (qtp1074759124-3570) [n:127.0.0.1:58761_solr c:forwardingCollection s:shard1  x:forwardingCollection_shard1_replica1] o.a.s.u.UpdateLog Could not find max version in index or recent updates, using new clock 1557163720501624832
   [junit4]   2> 520406 INFO  (searcherExecutor-2048-thread-1-processing-n:127.0.0.1:58761_solr x:forwardingCollection_shard1_replica1 s:shard1 c:forwardingCollection) [n:127.0.0.1:58761_solr c:forwardingCollection s:shard1  x:forwardingCollection_shard1_replica1] o.a.s.h.c.SpellCheckComponent Loading spell index for spellchecker: external
   [junit4]   2> 520406 INFO  (searcherExecutor-2048-thread-1-processing-n:127.0.0.1:58761_solr x:forwardingCollection_shard1_replica1 s:shard1 c:forwardingCollection) [n:127.0.0.1:58761_solr c:forwardingCollection s:shard1  x:forwardingCollection_shard1_replica1] o.a.s.h.c.SpellCheckComponent Loading spell index for spellchecker: freq
   [junit4]   2> 520407 INFO  (searcherExecutor-2048-thread-1-processing-n:127.0.0.1:58761_solr x:forwardingCollection_shard1_replica1 s:shard1 c:forwardingCollection) [n:127.0.0.1:58761_solr c:forwardingCollection s:shard1  x:forwardingCollection_shard1_replica1] o.a.s.h.c.SpellCheckComponent Loading spell index for spellchecker: fqcn
   [junit4]   2> 520407 INFO  (searcherExecutor-2048-thread-1-processing-n:127.0.0.1:58761_solr x:forwardingCollection_shard1_replica1 s:shard1 c:forwardingCollection) [n:127.0.0.1:58761_solr c:forwardingCollection s:shard1  x:forwardingCollection_shard1_replica1] o.a.s.h.c.SpellCheckComponent Loading spell index for spellchecker: perDict
   [junit4]   2> 520408 INFO  (searcherExecutor-2048-thread-1-processing-n:127.0.0.1:58761_solr x:forwardingCollection_shard1_replica1 s:shard1 c:forwardingCollection) [n:127.0.0.1:58761_solr c:forwardingCollection s:shard1  x:forwardingCollection_shard1_replica1] o.a.s.c.SolrCore [forwardingCollection_shard1_replica1] Registered new searcher Searcher@6076c3cf[forwardingCollection_shard1_replica1] main{ExitableDirectoryReader(UninvertingDirectoryReader())}
   [junit4]   2> 520416 INFO  (qtp1074759124-3570) [n:127.0.0.1:58761_solr c:forwardingCollection s:shard1  x:forwardingCollection_shard1_replica1] o.a.s.c.ShardLeaderElectionContext Enough replicas found to continue.
   [junit4]   2> 520416 INFO  (qtp1074759124-3570) [n:127.0.0.1:58761_solr c:forwardingCollection s:shard1  x:forwardingCollection_shard1_replica1] o.a.s.c.ShardLeaderElectionContext I may be the new leader - try and sync
   [junit4]   2> 520416 INFO  (qtp1074759124-3570) [n:127.0.0.1:58761_solr c:forwardingCollection s:shard1  x:forwardingCollection_shard1_replica1] o.a.s.c.SyncStrategy Sync replicas to http://127.0.0.1:58761/solr/forwardingCollection_shard1_replica1/
   [junit4]   2> 520417 INFO  (qtp1074759124-3570) [n:127.0.0.1:58761_solr c:forwardingCollection s:shard1  x:forwardingCollection_shard1_replica1] o.a.s.c.SyncStrategy Sync Success - now sync replicas to me
   [junit4]   2> 520417 INFO  (qtp1074759124-3570) [n:127.0.0.1:58761_solr c:forwardingCollection s:shard1  x:forwardingCollection_shard1_replica1] o.a.s.c.SyncStrategy http://127.0.0.1:58761/solr/forwardingCollection_shard1_replica1/ has no replicas
   [junit4]   2> 520424 INFO  (qtp1074759124-3570) [n:127.0.0.1:58761_solr c:forwardingCollection s:shard1  x:forwardingCollection_shard1_replica1] o.a.s.c.ShardLeaderElectionContext I am the new leader: http://127.0.0.1:58761/solr/forwardingCollection_shard1_replica1/ shard1
   [junit4]   2> 520529 INFO  (zkCallback-578-thread-3-processing-n:127.0.0.1:58761_solr) [n:127.0.0.1:58761_solr    ] o.a.s.c.c.ZkStateReader A cluster state change: [WatchedEvent state:SyncConnected type:NodeDataChanged path:/collections/forwardingCollection/state.json] for collection [forwardingCollection] has occurred - updating... (live nodes size: [2])
   [junit4]   2> 520576 INFO  (qtp1074759124-3570) [n:127.0.0.1:58761_solr c:forwardingCollection s:shard1  x:forwardingCollection_shard1_replica1] o.a.s.c.ZkController I am the leader, no recovery necessary
   [junit4]   2> 520586 INFO  (qtp1074759124-3570) [n:127.0.0.1:58761_solr c:forwardingCollection s:shard1  x:forwardingCollection_shard1_replica1] o.a.s.s.HttpSolrCall [admin] webapp=null path=/admin/cores params={qt=/admin/cores&collection.configName=conf1&newCollection=true&name=forwardingCollection_shard1_replica1&action=CREATE&numShards=1&collection=forwardingCollection&shard=shard1&wt=javabin&version=2} status=0 QTime=1373
   [junit4]   2> 520586 WARN  (httpShardExecutor-2041-thread-1-processing-n:127.0.0.1:58761_solr [http:////127.0.0.1:58761//solr] http:////127.0.0.1:58761//solr) [n:127.0.0.1:58761_solr    ] o.a.h.c.p.ResponseProcessCookies Invalid cookie header: "Set-Cookie: hadoop.auth="u=$&p=$&t=test&e=1485063045487&s=RwFuMWpEEFqnxhmRHSRDMEI259s="; Path=/; Domain=127.0.0.1; Expires=dom, 22-ene-2017 05:30:45 GMT; HttpOnly". Invalid 'expires' attribute: dom, 22-ene-2017 05:30:45 GMT
   [junit4]   2> 520596 INFO  (qtp1074759124-3575) [n:127.0.0.1:58761_solr    ] o.a.s.h.a.CollectionsHandler Wait for new collection to be active for at most 30 seconds. Check all shard replicas
   [junit4]   2> 520686 INFO  (zkCallback-578-thread-2-processing-n:127.0.0.1:58761_solr) [n:127.0.0.1:58761_solr    ] o.a.s.c.c.ZkStateReader A cluster state change: [WatchedEvent state:SyncConnected type:NodeDataChanged path:/collections/forwardingCollection/state.json] for collection [forwardingCollection] has occurred - updating... (live nodes size: [2])
   [junit4]   2> 521106 INFO  (OverseerCollectionConfigSetProcessor-97322732308791302-127.0.0.1:58761_solr-n_0000000000) [n:127.0.0.1:58761_solr    ] o.a.s.c.OverseerTaskQueue Response ZK path: /overseer/collection-queue-work/qnr-0000000000 doesn't exist.  Requestor may have disconnected from ZooKeeper
   [junit4]   2> 521597 INFO  (qtp1074759124-3575) [n:127.0.0.1:58761_solr    ] o.a.s.s.HttpSolrCall [admin] webapp=null path=/admin/collections params={replicationFactor=1&collection.configName=conf1&maxShardsPerNode=1&name=forwardingCollection&action=CREATE&numShards=1&wt=javabin&version=2} status=0 QTime=2502
   [junit4]   2> 521598 WARN  (TEST-TestSolrCloudWithSecureImpersonation.testForwarding-seed#[68C5999D345EE6BE]) [    ] o.a.h.c.p.ResponseProcessCookies Invalid cookie header: "Set-Cookie: hadoop.auth="u=user&p=user&t=test&e=1485063045371&s=l0QsGd7cAM63iuZjnsbdRU1B8xg="; Path=/; Domain=127.0.0.1; Expires=dom, 22-ene-2017 05:30:45 GMT; HttpOnly". Invalid 'expires' attribute: dom, 22-ene-2017 05:30:45 GMT
   [junit4]   2> 521598 INFO  (TEST-TestSolrCloudWithSecureImpersonation.testForwarding-seed#[68C5999D345EE6BE]) [    ] o.a.s.c.AbstractDistribZkTestBase Wait for recoveries to finish - collection: forwardingCollection failOnTimeout:true timeout (sec):100
   [junit4]   2> 521599 INFO  (TEST-TestSolrCloudWithSecureImpersonation.testForwarding-seed#[68C5999D345EE6BE]) [    ] o.a.s.c.AbstractDistribZkTestBase Recoveries finished - collection: forwardingCollection
   [junit4]   2> 521605 INFO  (qtp1074759124-3571) [n:127.0.0.1:58761_solr c:forwardingCollection s:shard1 r:core_node1 x:forwardingCollection_shard1_replica1] o.a.s.c.S.Request [forwardingCollection_shard1_replica1]  webapp=/solr path=/select params={q=*:*&wt=javabin&version=2} hits=0 status=0 QTime=0
   [junit4]   2> 521606 WARN  (qtp376110393-3586) [n:127.0.0.1:37734_solr    ] o.a.h.c.p.ResponseProcessCookies Invalid cookie header: "Set-Cookie: hadoop.auth="u=$&p=$&t=test&e=1485063047881&s=rK7WZMIpctFKe8Tsy58sU/vRkcc="; Path=/; Domain=127.0.0.1; Expires=dom, 22-ene-2017 05:30:47 GMT; HttpOnly". Invalid 'expires' attribute: dom, 22-ene-2017 05:30:47 GMT
   [junit4]   2> 521613 WARN  (TEST-TestSolrCloudWithSecureImpersonation.testForwarding-seed#[68C5999D345EE6BE]) [    ] o.a.h.c.p.ResponseProcessCookies Invalid cookie header: "Set-Cookie: hadoop.auth="u=user&p=user&t=test&e=1485063047877&s=AmPt5/iTCsdfigNBb+6eBDnugEU="; Path=/; Domain=127.0.0.1; Expires=dom, 22-ene-2017 05:30:47 GMT; HttpOnly". Invalid 'expires' attribute: dom, 22-ene-2017 05:30:47 GMT
   [junit4]   2> 521613 WARN  (TEST-TestSolrCloudWithSecureImpersonation.testForwarding-seed#[68C5999D345EE6BE]) [    ] o.a.h.c.p.ResponseProcessCookies Invalid cookie header: "Set-Cookie: hadoop.auth="u=$&p=$&t=test&e=1485063047881&s=rK7WZMIpctFKe8Tsy58sU/vRkcc="; Path=/; Domain=127.0.0.1; Expires=dom, 22-ene-2017 05:30:47 GMT; HttpOnly". Invalid 'expires' attribute: dom, 22-ene-2017 05:30:47 GMT
   [junit4]   2> 521623 INFO  (qtp1074759124-3574) [n:127.0.0.1:58761_solr c:forwardingCollection s:shard1 r:core_node1 x:forwardingCollection_shard1_replica1] o.a.s.c.S.Request [forwardingCollection_shard1_replica1]  webapp=/solr path=/select params={q=*:*&wt=javabin&version=2} hits=0 status=0 QTime=0
   [junit4]   2> 521624 WARN  (TEST-TestSolrCloudWithSecureImpersonation.testForwarding-seed#[68C5999D345EE6BE]) [    ] o.a.h.c.p.ResponseProcessCookies Invalid cookie header: "Set-Cookie: hadoop.auth="u=user&p=user&t=test&e=1485063047899&s=lglYX2TlI0N2lj9jZzs31xbZz54="; Path=/; Domain=127.0.0.1; Expires=dom, 22-ene-2017 05:30:47 GMT; HttpOnly". Invalid 'expires' attribute: dom, 22-ene-2017 05:30:47 GMT
   [junit4]   2> 521624 INFO  (TEST-TestSolrCloudWithSecureImpersonation.testForwarding-seed#[68C5999D345EE6BE]) [    ] o.a.s.SolrTestCaseJ4 ###Ending testForwarding
   [junit4]   2> 521647 INFO  (TEST-TestSolrCloudWithSecureImpersonation.testProxyInvalidRemote-seed#[68C5999D345EE6BE]) [    ] o.a.s.SolrTestCaseJ4 ###Starting testProxyInvalidRemote
   [junit4]   2> 521655 WARN  (TEST-TestSolrCloudWithSecureImpersonation.testProxyInvalidRemote-seed#[68C5999D345EE6BE]) [    ] o.a.h.c.p.ResponseProcessCookies Invalid cookie header: "Set-Cookie: hadoop.auth="u=localHostAnyGroup&p=localHostAnyGroup&t=test&e=1485063047925&s=FOjZZj39xz1nO4EgfsLW8YdMB08="; Path=/; Domain=127.0.0.1; Expires=dom, 22-ene-2017 05:30:47 GMT; HttpOnly". Invalid 'expires' attribute: dom, 22-ene-2017 05:30:47 GMT
   [junit4]   2> 521655 INFO  (TEST-TestSolrCloudWithSecureImpersonation.testProxyInvalidRemote-seed#[68C5999D345EE6BE]) [    ] o.a.s.SolrTestCaseJ4 ###Ending testProxyInvalidRemote
   [junit4]   2> 521676 INFO  (TEST-TestSolrCloudWithSecureImpersonation.testProxyNoConfigGroups-seed#[68C5999D345EE6BE]) [    ] o.a.s.SolrTestCaseJ4 ###Starting testProxyNoConfigGroups
   [junit4]   2> 521700 WARN  (TEST-TestSolrCloudWithSecureImpersonation.testProxyNoConfigGroups-seed#[68C5999D345EE6BE]) [    ] o.a.h.c.p.ResponseProcessCookies Invalid cookie header: "Set-Cookie: hadoop.auth="u=noGroups&p=noGroups&t=test&e=1485063047962&s=DCTMrQvz00Trf6XISiz1+NABzWA="; Path=/; Domain=127.0.0.1; Expires=dom, 22-ene-2017 05:30:47 GMT; HttpOnly". Invalid 'expires' attribute: dom, 22-ene-2017 05:30:47 GMT
   [junit4]   2> 521700 INFO  (TEST-TestSolrCloudWithSecureImpersonation.testProxyNoConfigGroups-seed#[68C5999D345EE6BE]) [    ] o.a.s.SolrTestCaseJ4 ###Ending testProxyNoConfigGroups
   [junit4]   2> 521723 INFO  (TEST-TestSolrCloudWithSecureImpersonation.testProxyValidateGroup-seed#[68C5999D345EE6BE]) [    ] o.a.s.SolrTestCaseJ4 ###Starting testProxyValidateGroup
   [junit4]   2> 521759 INFO  (qtp376110393-3585) [n:127.0.0.1:37734_solr    ] o.a.s.h.a.CollectionsHandler Invoked Collection Action :list with params doAs=jenkins&action=LIST&wt=javabin&version=2 and sendToOCPQueue=true
   [junit4]   2> 521766 INFO  (qtp376110393-3585) [n:127.0.0.1:37734_solr    ] o.a.s.s.HttpSolrCall [admin] webapp=null path=/admin/collections params={doAs=jenkins&action=LIST&wt=javabin&version=2} status=0 QTime=7
   [junit4]   2> 521766 WARN  (TEST-TestSolrCloudWithSecureImpersonation.testProxyValidateGroup-seed#[68C5999D345EE6BE]) [    ] o.a.h.c.p.ResponseProcessCookies Invalid cookie header: "Set-Cookie: hadoop.auth="u=anyHostUsersGroup&p=anyHostUsersGroup&t=test&e=1485063048002&s=kVIskLCNbQjox9PGO/rH2l2Ws88="; Path=/; Domain=127.0.0.1; Expires=dom, 22-ene-2017 05:30:48 GMT; HttpOnly". Invalid 'expires' attribute: dom, 22-ene-2017 05:30:48 GMT
   [junit4]   2> 521766 INFO  (TEST-TestSolrCloudWithSecureImpersonation.testProxyValidateGroup-seed#[68C5999D345EE6BE]) [    ] o.a.s.SolrTestCaseJ4 ###Ending testProxyValidateGroup
   [junit4]   2> 521788 INFO  (TEST-TestSolrCloudWithSecureImpersonation.testProxyUnknownRemote-seed#[68C5999D345EE6BE]) [    ] o.a.s.SolrTestCaseJ4 ###Starting testProxyUnknownRemote
   [junit4]   2> 546983 WARN  (TEST-TestSolrCloudWithSecureImpersonation.testProxyUnknownRemote-seed#[68C5999D345EE6BE]) [    ] o.a.h.c.p.ResponseProcessCookies Invalid cookie header: "Set-Cookie: hadoop.auth="u=localHostAnyGroup&p=localHostAnyGroup&t=test&e=1485063048066&s=IPHFndtuOsxBSxLS1vD9+wiAP6c="; Path=/; Domain=127.0.0.1; Expires=dom, 22-ene-2017 05:30:48 GMT; HttpOnly". Invalid 'expires' attribute: dom, 22-ene-2017 05:30:48 GMT
   [junit4]   2> 546983 INFO  (TEST-TestSolrCloudWithSecureImpersonation.testProxyUnknownRemote-seed#[68C5999D345EE6BE]) [    ] o.a.s.SolrTestCaseJ4 ###Ending testProxyUnknownRemote
   [junit4]   2> 547008 INFO  (TEST-TestSolrCloudWithSecureImpersonation.testProxyValidateHost-seed#[68C5999D345EE6BE]) [    ] o.a.s.SolrTestCaseJ4 ###Starting testProxyValidateHost
   [junit4]   2> 547011 INFO  (qtp376110393-3582) [n:127.0.0.1:37734_solr    ] o.a.s.h.a.CollectionsHandler Invoked Collection Action :list with params doAs=bar&action=LIST&wt=javabin&version=2 and sendToOCPQueue=true
   [junit4]   2> 547083 WARN  (zkCallback-585-thread-1) [    ] o.a.s.c.c.ConnectionManager Watcher org.apache.solr.common.cloud.ConnectionManager@70c10e74 name: ZooKeeperConnection Watcher:127.0.0.1:45760/solr got event WatchedEvent state:Disconnected type:None path:null path: null type: None
   [junit4]   2> 547083 WARN  (zkCallback-585-thread-1) [    ] o.a.s.c.c.ConnectionManager zkClient has disconnected
   [junit4]   2> 547084 WARN  (zkCallback-578-thread-2-processing-n:127.0.0.1:58761_solr) [n:127.0.0.1:58761_solr    ] o.a.s.c.c.ConnectionManager Watcher org.apache.solr.common.cloud.ConnectionManager@6a75d862 name: ZooKeeperConnection Watcher:127.0.0.1:45760/solr got event WatchedEvent state:Disconnected type:None path:null path: null type: None
   [junit4]   2> 547084 WARN  (zkCallback-578-thread-2-processing-n:127.0.0.1:58761_solr) [n:127.0.0.1:58761_solr    ] o.a.s.c.c.ConnectionManager zkClient has disconnected
   [junit4]   2> 547085 WARN  (zkCallback-577-thread-1-processing-n:127.0.0.1:37734_solr) [n:127.0.0.1:37734_solr    ] o.a.s.c.c.ConnectionManager Watcher org.apache.solr.common.cloud.ConnectionManager@3991074e name: ZooKeeperConnection Watcher:127.0.0.1:45760/solr got event WatchedEvent state:Disconnected type:None path:null path: null type: None
   [junit4]   2> 547085 WARN  (zkCallback-577-thread-1-processing-n:127.0.0.1:37734_solr) [n:127.0.0.1:37734_solr    ] o.a.s.c.c.ConnectionManager zkClient has disconnected
   [junit4]   2> 548254 WARN  (zkCallback-578-thread-5-processing-n:127.0.0.1:58761_solr) [n:127.0.0.1:58761_solr    ] o.a.s.c.c.ConnectionManager Watcher org.apache.solr.common.cloud.ConnectionManager@6a75d862 name: ZooKeeperConnection Watcher:127.0.0.1:45760/solr got event WatchedEvent state:Expired type:None path:null path: null type: None
   [junit4]   2> 548255 WARN  (zkCallback-578-thread-5-processing-n:127.0.0.1:58761_solr) [n:127.0.0.1:58761_solr    ] o.a.s.c.c.ConnectionManager Our previous ZooKeeper session was expired. Attempting to reconnect to recover relationship with ZooKeeper...
   [junit4]   2> 548255 WARN  (OverseerStateUpdate-97322732308791302-127.0.0.1:58761_solr-n_0000000000) [n:127.0.0.1:58761_solr    ] o.a.s.c.Overseer Solr cannot talk to ZK, exiting Overseer main queue loop
   [junit4]   2> org.apache.zookeeper.KeeperException$SessionExpiredException: KeeperErrorCode = Session expired for /overseer/queue
   [junit4]   2> 	at org.apache.zookeeper.KeeperException.create(KeeperException.java:127)
   [junit4]   2> 	at org.apache.zookeeper.KeeperException.create(KeeperException.java:51)
   [junit4]   2> 	at org.apache.zookeeper.ZooKeeper.getChildren(ZooKeeper.java:1472)
   [junit4]   2> 	at org.apache.solr.common.cloud.SolrZkClient$6.execute(SolrZkClient.java:339)
   [junit4]   2> 	at org.apache.solr.common.cloud.SolrZkClient$6.execute(SolrZkClient.java:336)
   [junit4]   2> 	at org.apache.solr.common.cloud.ZkCmdExecutor.retryOperation(ZkCmdExecutor.java:60)
   [junit4]   2> 	at org.apache.solr.common.cloud.SolrZkClient.getChildren(SolrZkClient.java:336)
   [junit4]   2> 	at org.apache.solr.cloud.DistributedQueue.fetchZkChildren(DistributedQueue.java:299)
   [junit4]   2> 	at org.apache.solr.cloud.DistributedQueue.firstChild(DistributedQueue.java:279)
   [junit4]   2> 	at org.apache.solr.cloud.DistributedQueue.firstElement(DistributedQueue.java:384)
   [junit4]   2> 	at org.apache.solr.cloud.DistributedQueue.peek(DistributedQueue.java:160)
   [junit4]   2> 	at org.apache.solr.cloud.DistributedQueue.peek(DistributedQueue.java:138)
   [junit4]   2> 	at org.apache.solr.cloud.Overseer$ClusterStateUpdater.run(Overseer.java:179)
   [junit4]   2> 	at java.lang.Thread.run(Thread.java:745)
   [junit4]   2> 548255 INFO  (OverseerStateUpdate-97322732308791302-127.0.0.1:58761_solr-n_0000000000) [n:127.0.0.1:58761_solr    ] o.a.s.c.Overseer Overseer Loop exiting : 127.0.0.1:58761_solr
   [junit4]   2> 548256 INFO  (zkCallback-578-thread-5-processing-n:127.0.0.1:58761_solr) [n:127.0.0.1:58761_solr    ] o.a.s.c.Overseer Overseer (id=97322732308791302-127.0.0.1:58761_solr-n_0000000000) closing
   [junit4]   2> 548258 WARN  (zkCallback-578-thread-5-processing-n:127.0.0.1:58761_solr) [n:127.0.0.1:58761_solr    ] o.a.s.c.c.DefaultConnectionStrategy Connection expired - starting a new one...
   [junit4]   2> 548258 ERROR (OverseerExitThread) [n:127.0.0.1:58761_solr    ] o.a.s.c.Overseer could not read the data
   [junit4]   2> org.apache.zookeeper.KeeperException$SessionExpiredException: KeeperErrorCode = Session expired for /overseer_elect/leader
   [junit4]   2> 	at org.apache.zookeeper.KeeperException.create(KeeperException.java:127)
   [junit4]   2> 	at org.apache.zookeeper.KeeperException.create(KeeperException.java:51)
   [junit4]   2> 	at org.apache.zookeeper.ZooKeeper.getData(ZooKeeper.java:1155)
   [junit4]   2> 	at org.apache.solr.common.cloud.SolrZkClient$7.execute(SolrZkClient.java:356)
   [junit4]   2> 	at org.apache.solr.common.cloud.SolrZkClient$7.execute(SolrZkClient.java:353)
   [junit4]   2> 	at org.apache.solr.common.cloud.ZkCmdExecutor.retryOperation(ZkCmdExecutor.java:60)
   [junit4]   2> 	at org.apache.solr.common.cloud.SolrZkClient.getData(SolrZkClient.java:353)
   [junit4]   2> 	at org.apache.solr.cloud.Overseer$ClusterStateUpdater.checkIfIamStillLeader(Overseer.java:286)
   [junit4]   2> 	at java.lang.Thread.run(Thread.java:745)
   [junit4]   2> 548260 INFO  (zkCallback-578-thread-5-processing-n:127.0.0.1:58761_solr) [n:127.0.0.1:58761_solr    ] o.a.s.c.c.ConnectionManager Connection with ZooKeeper reestablished.
   [junit4]   2> 548260 INFO  (zkCallback-578-thread-5-processing-n:127.0.0.1:58761_solr) [n:127.0.0.1:58761_solr    ] o.a.s.c.ZkController ZooKeeper session re-connected ... refreshing core states after session expiration.
   [junit4]   2> 548262 INFO  (zkCallback-578-thread-5-processing-n:127.0.0.1:58761_solr) [n:127.0.0.1:58761_solr    ] o.a.s.c.c.ZkStateReader Updated live nodes from ZooKeeper... (2) -> (0)
   [junit4]   2> 548268 INFO  (zkCallback-578-thread-5-processing-n:127.0.0.1:58761_solr) [n:127.0.0.1:58761_solr    ] o.a.s.c.OverseerElectionContext I am going to be the leader 127.0.0.1:58761_solr
   [junit4]   2> 548271 INFO  (zkCallback-578-thread-5-processing-n:127.0.0.1:58761_solr) [n:127.0.0.1:58761_solr    ] o.a.s.c.Overseer Overseer (id=97322732308791308-127.0.0.1:58761_solr-n_0000000002) starting
   [junit4]   2> 548283 INFO  (zkCallback-578-thread-5-processing-n:127.0.0.1:58761_solr) [n:127.0.0.1:58761_solr    ] o.a.s.c.ZkController Register node as live in ZooKeeper:/live_nodes/127.0.0.1:58761_solr
   [junit4]   2> 548286 INFO  (zkCallback-578-thread-2-processing-n:127.0.0.1:58761_solr) [n:127.0.0.1:58761_solr    ] o.a.s.c.c.ZkStateReader Updated live nodes from ZooKeeper... (0) -> (1)
   [junit4]   2> 548288 INFO  (coreZkRegister-2034-thread-1-processing-n:127.0.0.1:58761_solr) [n:127.0.0.1:58761_solr    ] o.a.s.c.ZkController Registering core forwardingCollection_shard1_replica1 afterExpiration? true
   [junit4]   2> 548288 INFO  (zkCallback-578-thread-5-processing-n:127.0.0.1:58761_solr) [n:127.0.0.1:58761_solr    ] o.a.s.c.c.DefaultConnectionStrategy Reconnected to ZooKeeper
   [junit4]   2> 548288 INFO  (zkCallback-578-thread-5-processing-n:127.0.0.1:58761_solr) [n:127.0.0.1:58761_solr    ] o.a.s.c.c.ConnectionManager Connected:true
   [junit4]   2> 548288 INFO  (zkCallback-578-thread-5-processing-n:127.0.0.1:58761_solr) [n:127.0.0.1:58761_solr    ] o.a.s.c.c.ZkStateReader A cluster state change: [WatchedEvent state:SyncConnected type:NodeDataChanged path:/collections/forwardingCollection/state.json] for collection [forwardingCollection] has occurred - updating... (live nodes size: [1])
   [junit4]   2> 548290 INFO  (Thread-914) [n:127.0.0.1:58761_solr    ] o.a.s.c.SolrCore config update listener called for core forwardingCollection_shard1_replica1
   [junit4]   2> 548290 INFO  (coreZkRegister-2034-thread-1-processing-n:127.0.0.1:58761_solr) [n:127.0.0.1:58761_solr c:forwardingCollection s:shard1 r:core_node1 x:forwardingCollection_shard1_replica1] o.a.s.c.ActionThrottle The last leader attempt started 27882ms ago.
   [junit4]   2> 548292 INFO  (coreZkRegister-2034-thread-1-processing-n:127.0.0.1:58761_solr) [n:127.0.0.1:58761_solr c:forwardingCollection s:shard1 r:core_node1 x:forwardingCollection_shard1_replica1] o.a.s.c.ShardLeaderElectionContext Enough replicas found to continue.
   [junit4]   2> 548292 INFO  (coreZkRegister-2034-thread-1-processing-n:127.0.0.1:58761_solr) [n:127.0.0.1:58761_solr c:forwardingCollection s:shard1 r:core_node1 x:forwardingCollection_shard1_replica1] o.a.s.c.ShardLeaderElectionContext I may be the new leader - try and sync
   [junit4]   2> 548292 INFO  (coreZkRegister-2034-thread-1-processing-n:127.0.0.1:58761_solr) [n:127.0.0.1:58761_solr c:forwardingCollection s:shard1 r:core_node1 x:forwardingCollection_shard1_replica1] o.a.s.c.SyncStrategy Sync replicas to http://127.0.0.1:58761/solr/forwardingCollection_shard1_replica1/
   [junit4]   2> 548292 INFO  (coreZkRegister-2034-thread-1-processing-n:127.0.0.1:58761_solr) [n:127.0.0.1:58761_solr c:forwardingCollection s:shard1 r:core_node1 x:forwardingCollection_shard1_replica1] o.a.s.c.SyncStrategy Sync Success - now sync replicas to me
   [junit4]   2> 548292 INFO  (coreZkRegister-2034-thread-1-processing-n:127.0.0.1:58761_solr) [n:127.0.0.1:58761_solr c:forwardingCollection s:shard1 r:core_node1 x:forwardingCollection_shard1_replica1] o.a.s.c.SyncStrategy http://127.0.0.1:58761/solr/forwardingCollection_shard1_replica1/ has no replicas
   [junit4]   2> 548296 INFO  (coreZkRegister-2034-thread-1-processing-n:127.0.0.1:58761_solr) [n:127.0.0.1:58761_solr c:forwardingCollection s:shard1 r:core_node1 x:forwardingCollection_shard1_replica1] o.a.s.c.ShardLeaderElectionContext I am the new leader: http://127.0.0.1:58761/solr/forwardingCollection_shard1_replica1/ shard1
   [junit4]   2> 548297 INFO  (coreZkRegister-2034-thread-1-processing-n:127.0.0.1:58761_solr) [n:127.0.0.1:58761_solr c:forwardingCollection s:shard1 r:core_node1 x:forwardingCollection_shard1_replica1] o.a.s.c.ZkController I am the leader, no recovery necessary
   [junit4]   2> 548409 INFO  (zkCallback-578-thread-5-processing-n:127.0.0.1:58761_solr) [n:127.0.0.1:58761_solr    ] o.a.s.c.c.ZkStateReader A cluster state change: [WatchedEvent state:SyncConnected type:NodeDataChanged path:/collections/forwardingCollection/state.json] for collection [forwardingCollection] has occurred - updating... (live nodes size: [1])
   [junit4]   2> 548489 WARN  (zkCallback-577-thread-2-processing-n:127.0.0.1:37734_solr) [n:127.0.0.1:37734_solr    ] o.a.s.c.c.ConnectionManager Watcher org.apache.solr.common.cloud.ConnectionManager@3991074e name: ZooKeeperConnection Watcher:127.0.0.1:45760/solr got event WatchedEvent state:Expired type:None path:null path: null type: None
   [junit4]   2> 548489 WARN  (zkCallback-577-thread-2-processing-n:127.0.0.1:37734_solr) [n:127.0.0.1:37734_solr    ] o.a.s.c.c.ConnectionManager Our previous ZooKeeper session was expired. Attempting to reconnect to recover relationship with ZooKeeper...
   [junit4]   2> 548490 WARN  (zkCallback-577-thread-2-processing-n:127.0.0.1:37734_solr) [n:127.0.0.1:37734_solr    ] o.a.s.c.c.DefaultConnectionStrategy Connection expired - starting a new one...
   [junit4]   2> 548491 INFO  (zkCallback-577-thread-2-processing-n:127.0.0.1:37734_solr) [n:127.0.0.1:37734_solr    ] o.a.s.c.c.ConnectionManager Connection with ZooKeeper reestablished.
   [junit4]   2> 548492 INFO  (zkCallback-577-thread-2-processing-n:127.0.0.1:37734_solr) [n:127.0.0.1:37734_solr    ] o.a.s.c.ZkController ZooKeeper session re-connected ... refreshing core states after session expiration.
   [junit4]   2> 548495 INFO  (zkCallback-577-thread-2-processing-n:127.0.0.1:37734_solr) [n:127.0.0.1:37734_solr    ] o.a.s.c.c.ZkStateReader Updated live nodes from ZooKeeper... (2) -> (1)
   [junit4]   2> 548502 INFO  (zkCallback-577-thread-2-processing-n:127.0.0.1:37734_solr) [n:127.0.0.1:37734_solr    ] o.a.s.c.ZkController Register node as live in ZooKeeper:/live_nodes/127.0.0.1:37734_solr
   [junit4]   2> 548505 INFO  (zkCallback-577-thread-5-processing-n:127.0.0.1:37734_solr) [n:127.0.0.1:37734_solr    ] o.a.s.c.c.ZkStateReader Updated live nodes from ZooKeeper... (1) -> (2)
   [junit4]   2> 548505 INFO  (zkCallback-578-thread-2-processing-n:127.0.0.1:58761_solr) [n:127.0.0.1:58761_solr    ] o.a.s.c.c.ZkStateReader Updated live nodes from ZooKeeper... (1) -> (2)
   [junit4]   2> 548505 INFO  (zkCallback-577-thread-2-processing-n:127.0.0.1:37734_solr) [n:127.0.0.1:37734_solr    ] o.a.s.c.c.DefaultConnectionStrategy Reconnected to ZooKeeper
   [junit4]   2> 548518 INFO  (zkCallback-577-thread-2-processing-n:127.0.0.1:37734_solr) [n:127.0.0.1:37734_solr    ] o.a.s.c.c.ConnectionManager Connected:true
   [junit4]   2> 548584 INFO  (qtp376110393-3582) [n:127.0.0.1:37734_solr    ] o.a.s.s.HttpSolrCall [admin] webapp=null path=/admin/collections params={doAs=bar&action=LIST&wt=javabin&version=2} status=0 QTime=1572
   [junit4]   2> 548584 WARN  (TEST-TestSolrCloudWithSecureImpersonation.testProxyValidateHost-seed#[68C5999D345EE6BE]) [    ] o.a.h.c.p.ResponseProcessCookies Invalid cookie header: "Set-Cookie: hadoop.auth="u=localHostAnyGroup&p=localHostAnyGroup&t=test&e=1485063073287&s=k8MqWUlD7wn8y47o1CRouZ9nDqw="; Path=/; Domain=127.0.0.1; Expires=dom, 22-ene-2017 05:31:13 GMT; HttpOnly". Invalid 'expires' attribute: dom, 22-ene-2017 05:31:13 GMT
   [junit4]   2> 548584 INFO  (TEST-TestSolrCloudWithSecureImpersonation.testProxyValidateHost-seed#[68C5999D345EE6BE]) [    ] o.a.s.SolrTestCaseJ4 ###Ending testProxyValidateHost
   [junit4]   2> 548613 INFO  (TEST-TestSolrCloudWithSecureImpersonation.testProxyNullProxyUser-seed#[68C5999D345EE6BE]) [    ] o.a.s.SolrTestCaseJ4 ###Starting testProxyNullProxyUser
   [junit4]   2> 548615 INFO  (qtp376110393-3589) [    ] o.a.s.s.SolrDispatchFilter Error authenticating
   [junit4]   2> java.lang.IllegalArgumentException: userName is NULL, empty or contains a '&'
   [junit4]   2> 	at org.apache.hadoop.security.authentication.util.AuthToken.checkForIllegalArgument(AuthToken.java:87)
   [junit4]   2> 	at org.apache.hadoop.security.authentication.util.AuthToken.<init>(AuthToken.java:70)
   [junit4]   2> 	at org.apache.hadoop.security.authentication.server.AuthenticationToken.<init>(AuthenticationToken.java:58)
   [junit4]   2> 	at org.apache.solr.security.HttpParamDelegationTokenPlugin$HttpParamDelegationTokenAuthenticationHandler$HttpParamAuthenticationHandler.authenticate(HttpParamDelegationTokenPlugin.java:220)
   [junit4]   2> 	at org.apache.hadoop.security.token.delegation.web.DelegationTokenAuthenticationHandler.authenticate(DelegationTokenAuthenticationHandler.java:348)
   [junit4]   2> 	at org.apache.solr.security.RequestContinuesRecorderAuthenticationHandler.authenticate(RequestContinuesRecorderAuthenticationHandler.java:69)
   [junit4]   2> 	at org.apache.hadoop.security.authentication.server.AuthenticationFilter.doFilter(AuthenticationFilter.java:519)
   [junit4]   2> 	at org.apache.solr.security.DelegationTokenKerberosFilter.doFilter(DelegationTokenKerberosFilter.java:128)
   [junit4]   2> 	at org.apache.solr.security.HttpParamDelegationTokenPlugin$HttpParamToRequestFilter.doFilter(HttpParamDelegationTokenPlugin.java:252)
   [junit4]   2> 	at org.apache.solr.security.KerberosPlugin.doAuthenticate(KerberosPlugin.java:248)
   [junit4]   2> 	at org.apache.solr.servlet.SolrDispatchFilter.authenticateRequest(SolrDispatchFilter.java:404)
   [junit4]   2> 	at org.apache.solr.servlet.SolrDispatchFilter.doFilter(SolrDispatchFilter.java:310)
   [junit4]   2> 	at org.apache.solr.servlet.SolrDispatchFilter.doFilter(SolrDispatchFilter.java:296)
   [junit4]   2> 	at org.eclipse.jetty.servlet.ServletHandler$CachedChain.doFilter(ServletHandler.java:1699)
   [junit4]   2> 	at org.apache.solr.client.solrj.embedded.JettySolrRunner$DebugFilter.doFilter(JettySolrRunner.java:110)
   [junit4]   2> 	at org.eclipse.jetty.servlet.ServletHandler$CachedChain.doFilter(ServletHandler.java:1699)
   [junit4]   2> 	at org.eclipse.jetty.servlet.ServletHandler.doHandle(ServletHandler.java:582)
   [junit4]   2> 	at org.eclipse.jetty.server.session.SessionHandler.doHandle(SessionHandler.java:224)
   [junit4]   2> 	at org.eclipse.jetty.server.handler.ContextHandler.doHandle(ContextHandler.java:1180)
   [junit4]   2> 	at org.eclipse.jetty.servlet.ServletHandler.doScope(ServletHandler.java:512)
   [junit4]   2> 	at org.eclipse.jetty.server.session.SessionHandler.doScope(SessionHandler.java:185)
   [junit4]   2> 	at org.eclipse.jetty.server.handler.ContextHandler.doScope(ContextHandler.java:1112)
   [junit4]   2> 	at org.eclipse.jetty.server.handler.ScopedHandler.handle(ScopedHandler.java:141)
   [junit4]   2> 	at org.eclipse.jetty.server.handler.gzip.GzipHandler.handle(GzipHandler.java:462)
   [junit4]   2> 	at org.eclipse.jetty.server.handler.HandlerWrapper.handle(HandlerWrapper.java:134)
   [junit4]   2> 	at org.eclipse.jetty.server.Server.handle(Server.java:534)
   [junit4]   2> 	at org.eclipse.jetty.server.HttpChannel.handle(HttpChannel.java:320)
   [junit4]   2> 	at org.eclipse.jetty.server.HttpConnection.onFillable(HttpConnection.java:251)
   [junit4]   2> 	at org.eclipse.jetty.io.AbstractConnection$ReadCallback.succeeded(AbstractConnection.java:273)
   [junit4]   2> 	at org.eclipse.jetty.io.FillInterest.fillable(FillInterest.java:95)
   [junit4]   2> 	at org.eclipse.jetty.io.SelectChannelEndPoint$2.run(SelectChannelEndPoint.java:93)
   [junit4]   2> 	at org.eclipse.jetty.util.thread.strategy.ExecuteProduceConsume.executeProduceConsume(ExecuteProduceConsume.java:303)
   [junit4]   2> 	at org.eclipse.jetty.util.thread.strategy.ExecuteProduceConsume.produceConsume(ExecuteProduceConsume.java:148)
   [junit4]   2> 	at org.eclipse.jetty.util.thread.strategy.ExecuteProduceConsume.run(ExecuteProduceConsume.java:136)
   [junit4]   2> 	at org.eclipse.jetty.util.thread.QueuedThreadPool.runJob(QueuedThreadPool.java:671)
   [junit4]   2> 	at org.eclipse.jetty.util.thread.QueuedThreadPool$2.run(QueuedThreadPool.java:589)
   [junit4]   2> 	at java.lang.Thread.run(Thread.java:745)
   [junit4]   2> 548616 WARN  (qtp376110393-3589) [    ] o.e.j.s.ServletHandler /solr/admin/collections
   [junit4]   2> org.apache.solr.common.SolrException: Error during request authentication, 
   [junit4]   2> 	at org.apache.solr.servlet.SolrDispatchFilter.authenticateRequest(SolrDispatchFilter.java:410)
   [junit4]   2> 	at org.apache.solr.servlet.SolrDispatchFilter.doFilter(SolrDispatchFilter.java:310)
   [junit4]   2> 	at org.apache.solr.servlet.SolrDispatchFilter.doFilter(SolrDispatchFilter.java:296)
   [junit4]   2> 	at org.eclipse.jetty.servlet.ServletHandler$CachedChain.doFilter(ServletHandler.java:1699)
   [junit4]   2> 	at org.apache.solr.client.solrj.embedded.JettySolrRunner$DebugFilter.doFilter(JettySolrRunner.java:110)
   [junit4]   2> 	at org.eclipse.jetty.servlet.ServletHandler$CachedChain.doFilter(ServletHandler.java:1699)
   [junit4]   2> 	at org.eclipse.jetty.servlet.ServletHandler.doHandle(ServletHandler.java:582)
   [junit4]   2> 	at org.eclipse.jetty.server.session.SessionHandler.doHandle(SessionHandler.java:224)
   [junit4]   2> 	at org.eclipse.jetty.server.handler.ContextHandler.doHandle(ContextHandler.java:1180)
   [junit4]   2> 	at org.eclipse.jetty.servlet.ServletHandler.doScope(ServletHandler.java:512)
   [junit4]   2> 	at org.eclipse.jetty.server.session.SessionHandler.doScope(SessionHandler.java:185)
   [junit4]   2> 	at org.eclipse.jetty.server.handler.ContextHandler.doScope(ContextHandler.java:1112)
   [junit4]   2> 	at org.eclipse.jetty.server.handler.ScopedHandler.handle(ScopedHandler.java:141)
   [junit4]   2> 	at org.eclipse.jetty.server.handler.gzip.GzipHandler.handle(GzipHandler.java:462)
   [junit4]   2> 	at org.eclipse.jetty.server.handler.HandlerWrapper.handle(HandlerWrapper.java:134)
   [junit4]   2> 	at org.eclipse.jetty.server.Server.handle(Server.java:534)
   [junit4]   2> 	at org.eclipse.jetty.server.HttpChannel.handle(HttpChannel.java:320)
   [junit4]   2> 	at org.eclipse.jetty.server.HttpConnection.onFillable(HttpConnection.java:251)
   [junit4]   2> 	at org.eclipse.jetty.io.AbstractConnection$ReadCallback.succeeded(AbstractConnection.java:273)
   [junit4]   2> 	at org.eclipse.jetty.io.FillInterest.fillable(FillInterest.java:95)
   [junit4]   2> 	at org.eclipse.jetty.io.SelectChannelEndPoint$2.run(SelectChannelEndPoint.java:93)
   [junit4]   2> 	at org.eclipse.jetty.util.thread.strategy.ExecuteProduceConsume.executeProduceConsume(ExecuteProduceConsume.java:303)
   [junit4]   2> 	at org.eclipse.jetty.util.thread.strategy.ExecuteProduceConsume.produceConsume(ExecuteProduceConsume.java:148)
   [junit4]   2> 	at org.eclipse.jetty.util.thread.strategy.ExecuteProduceConsume.run(ExecuteProduceConsume.java:136)
   [junit4]   2> 	at org.eclipse.jetty.util.thread.QueuedThreadPool.runJob(QueuedThreadPool.java:671)
   [junit4]   2> 	at org.eclipse.jetty.util.thread.QueuedThreadPool$2.run(QueuedThreadPool.java:589)
   [junit4]   2> 	at java.lang.Thread.run(Thread.java:745)
   [junit4]   2> Caused by: java.lang.IllegalArgumentException: userName is NULL, empty or contains a '&'
   [junit4]   2> 	at org.apache.hadoop.security.authentication.util.AuthToken.checkForIllegalArgument(AuthToken.java:87)
   [junit4]   2> 	at org.apache.hadoop.security.authentication.util.AuthToken.<init>(AuthToken.java:70)
   [junit4]   2> 	at org.apache.hadoop.security.authentication.server.AuthenticationToken.<init>(AuthenticationToken.java:58)
   [junit4]   2> 	at org.apache.solr.security.HttpParamDelegationTokenPlugin$HttpParamDelegationTokenAuthenticationHandler$HttpParamAuthenticationHandler.authenticate(HttpParamDelegationTokenPlugin.java:220)
   [junit4]   2> 	at org.apache.hadoop.security.token.delegation.web.DelegationTokenAuthenticationHandler.authenticate(DelegationTokenAuthenticationHandler.java:348)
   [junit4]   2> 	at org.apache.solr.security.RequestContinuesRecorderAuthenticationHandler.authenticate(RequestContinuesRecorderAuthenticationHandler.java:69)
   [junit4]   2> 	at org.apache.hadoop.security.authentication.server.AuthenticationFilter.doFilter(AuthenticationFilter.java:519)
   [junit4]   2> 	at org.apache.solr.security.DelegationTokenKerberosFilter.doFilter(DelegationTokenKerberosFilter.java:128)
   [junit4]   2> 	at org.apache.solr.security.HttpParamDelegationTokenPlugin$HttpParamToRequestFilter.doFilter(HttpParamDelegationTokenPlugin.java:252)
   [junit4]   2> 	at org.apache.solr.security.KerberosPlugin.doAuthenticate(KerberosPlugin.java:248)
   [junit4]   2> 	at org.apache.solr.servlet.SolrDispatchFilter.authenticateRequest(SolrDispatchFilter.java:404)
   [junit4]   2> 	... 26 more
   [junit4]   2> 548620 INFO  (TEST-TestSolrCloudWithSecureImpersonation.testProxyNullProxyUser-seed#[68C5999D345EE6BE]) [    ] o.a.s.SolrTestCaseJ4 ###Ending testProxyNullProxyUser
   [junit4]   2> 548622 INFO  (zkCallback-578-thread-2-processing-n:127.0.0.1:58761_solr) [n:127.0.0.1:58761_solr    ] o.a.s.c.c.ZkStateReader A cluster state change: [WatchedEvent state:SyncConnected type:NodeDataChanged path:/collections/forwardingCollection/state.json] for collection [forwardingCollection] has occurred - updating... (live nodes size: [2])
   [junit4]   2> 548652 INFO  (TEST-TestSolrCloudWithSecureImpersonation.testProxyInvalidGroup-seed#[68C5999D345EE6BE]) [    ] o.a.s.SolrTestCaseJ4 ###Starting testProxyInvalidGroup
   [junit4]   2> 548670 WARN  (qtp376110393-3584) [    ] o.a.h.s.ShellBasedUnixGroupsMapping got exception trying to get groups for user bar: id: invalid user name: "bar"
   [junit4]   2> 
   [junit4]   2> 548670 WARN  (qtp376110393-3584) [    ] o.a.h.s.UserGroupInformation No groups available for user bar
   [junit4]   2> 548672 WARN  (TEST-TestSolrCloudWithSecureImpersonation.testProxyInvalidGroup-seed#[68C5999D345EE6BE]) [    ] o.a.h.c.p.ResponseProcessCookies Invalid cookie header: "Set-Cookie: hadoop.auth="u=bogusGroup&p=bogusGroup&t=test&e=1485063074930&s=wmTBvLpPUfnydLxjNhO5S9D7XYI="; Path=/; Domain=127.0.0.1; Expires=dom, 22-ene-2017 05:31:14 GMT; HttpOnly". Invalid 'expires' attribute: dom, 22-ene-2017 05:31:14 GMT
   [junit4]   2> 548672 INFO  (TEST-TestSolrCloudWithSecureImpersonation.testProxyInvalidGroup-seed#[68C5999D345EE6BE]) [    ] o.a.s.SolrTestCaseJ4 ###Ending testProxyInvalidGroup
   [junit4]   2> 549073 WARN  (zkCallback-585-thread-3) [    ] o.a.s.c.c.ConnectionManager Watcher org.apache.solr.common.cloud.ConnectionManager@70c10e74 name: ZooKeeperConnection Watcher:127.0.0.1:45760/solr got event WatchedEvent state:Expired type:None path:null path: null type: None
   [junit4]   2> 549074 WARN  (zkCallback-585-thread-3) [    ] o.a.s.c.c.ConnectionManager Our previous ZooKeeper session was expired. Attempting to reconnect to recover relationship with ZooKeeper...
   [junit4]   2> 549074 WARN  (zkCallback-585-thread-3) [    ] o.a.s.c.c.DefaultConnectionStrategy Connection expired - starting a new one...
   [junit4]   2> 549076 INFO  (zkCallback-585-thread-3) [    ] o.a.s.c.c.ConnectionManager Connection with ZooKeeper reestablished.
   [junit4]   2> 549175 ERROR (zkCallback-585-thread-3) [    ] o.a.s.c.c.ZkStateReader A ZK error has occurred
   [junit4]   2> org.apache.zookeeper.KeeperException$SessionExpiredException: KeeperErrorCode = Session expired for /clusterstate.json
   [junit4]   2> 	at org.apache.zookeeper.KeeperException.create(KeeperException.java:127)
   [junit4]   2> 	at org.apache.zookeeper.KeeperException.create(KeeperException.java:51)
   [junit4]   2> 	at org.apache.zookeeper.ZooKeeper.exists(ZooKeeper.java:1045)
   [junit4]   2> 	at org.apache.solr.common.cloud.SolrZkClient$5.execute(SolrZkClient.java:322)
   [junit4]   2> 	at org.apache.solr.common.cloud.SolrZkClient$5.execute(SolrZkClient.java:319)
   [junit4]   2> 	at org.apache.solr.common.cloud.ZkCmdExecutor.retryOperation(ZkCmdExecutor.java:60)
   [junit4]   2> 	at org.apache.solr.common.cloud.SolrZkClient.exists(SolrZkClient.java:319)
   [junit4]   2> 	at org.apache.solr.common.cloud.ZkStateReader.createClusterStateWatchersAndUpdate(ZkStateReader.java:374)
   [junit4]   2> 	at org.apache.solr.common.cloud.ZkStateReader$1.command(ZkStateReader.java:232)
   [junit4]   2> 	at org.apache.solr.common.cloud.ConnectionManager$1.update(ConnectionManager.java:168)
   [junit4]   2> 	at org.apache.solr.common.cloud.DefaultConnectionStrategy.reconnect(DefaultConnectionStrategy.java:57)
   [junit4]   2> 	at org.apache.solr.common.cloud.ConnectionManager.process(ConnectionManager.java:142)
   [junit4]   2> 	at org.apache.solr.common.cloud.SolrZkClient$3.lambda$process$0(SolrZkClient.java:268)
   [junit4]   2> 	at java.util.concurrent.Executors$RunnableAdapter.call(Executors.java:511)
   [junit4]   2> 	at java.util.concurrent.FutureTask.run(FutureTask.java:266)
   [junit4]   2> 	at org.apache.solr.common.util.ExecutorUtil$MDCAwareThreadPoolExecutor.lambda$execute$0(ExecutorUtil.java:229)
   [junit4]   2> 	at java.util.concurrent.ThreadPoolExecutor.runWorker(ThreadPoolExecutor.java:1142)
   [junit4]   2> 	at java.util.concurrent.ThreadPoolExecutor$Worker.run(ThreadPoolExecutor.java:617)
   [junit4]   2> 	at java.lang.Thread.run(Thread.java:745)
   [junit4]   2> 549175 ERROR (zkCallback-585-thread-3) [    ] o.a.s.c.c.DefaultConnectionStrategy Reconnect to ZooKeeper failed:org.apache.solr.common.cloud.ZooKeeperException: A ZK error has occurred
   [junit4]   2> 	at org.apache.solr.common.cloud.ZkStateReader$1.command(ZkStateReader.java:235)
   [junit4]   2> 	at org.apache.solr.common.cloud.ConnectionManager$1.update(ConnectionManager.java:168)
   [junit4]   2> 	at org.apache.solr.common.cloud.DefaultConnectionStrategy.reconnect(DefaultConnectionStrategy.java:57)
   [junit4]   2> 	at org.apache.solr.common.cloud.ConnectionManager.process(ConnectionManager.java:142)
   [junit4]   2> 	at org.apache.solr.common.cloud.SolrZkClient$3.lambda$process$0(SolrZkClient.java:268)
   [junit4]   2> 	at java.util.concurrent.Executors$RunnableAdapter.call(Executors.java:511)
   [junit4]   2> 	at java.util.concurrent.FutureTask.run(FutureTask.java:266)
   [junit4]   2> 	at org.apache.solr.common.util.ExecutorUtil$MDCAwareThreadPoolExecutor.lambda$execute$0(ExecutorUtil.java:229)
   [junit4]   2> 	at java.util.concurrent.ThreadPoolExecutor.runWorker(ThreadPoolExecutor.java:1142)
   [junit4]   2> 	at java.util.concurrent.ThreadPoolExecutor$Worker.run(ThreadPoolExecutor.java:617)
   [junit4]   2> 	at java.lang.Thread.run(Thread.java:745)
   [junit4]   2> Caused by: org.apache.zookeeper.KeeperException$SessionExpiredException: KeeperErrorCode = Session expired for /clusterstate.json
   [junit4]   2> 	at org.apache.zookeeper.KeeperException.create(KeeperException.java:127)
   [junit4]   2> 	at org.apache.zookeeper.KeeperException.create(KeeperException.java:51)
   [junit4]   2> 	at org.apache.zookeeper.ZooKeeper.exists(ZooKeeper.java:1045)
   [junit4]   2> 	at org.apache.solr.common.cloud.SolrZkClient$5.execute(SolrZkClient.java:322)
   [junit4]   2> 	at org.apache.solr.common.cloud.SolrZkClient$5.execute(SolrZkClient.java:319)
   [junit4]   2> 	at org.apache.solr.common.cloud.ZkCmdExecutor.retryOperation(ZkCmdExecutor.java:60)
   [junit4]   2> 	at org.apache.solr.common.cloud.SolrZkClient.exists(SolrZkClient.java:319)
   [junit4]   2> 	at org.apache.solr.common.cloud.ZkStateReader.createClusterStateWatchersAndUpdate(ZkStateReader.java:374)
   [junit4]   2> 	at org.apache.solr.common.cloud.ZkStateReader$1.command(ZkStateReader.java:232)
   [junit4]   2> 	... 10 more
   [junit4]   2> 
   [junit4]   2> 549176 WARN  (zkCallback-585-thread-3) [    ] o.a.s.c.c.DefaultConnectionStrategy Reconnect to ZooKeeper failed
   [junit4]   2> 549176 INFO  (zkCallback-585-thread-3) [    ] o.a.s.c.c.ConnectionManager Connected:true
   [junit4]   2> 549177 INFO  (jetty-launcher-567-thread-2) [    ] o.e.j.s.AbstractConnector Stopped ServerConnector@1af525ed{HTTP/1.1,[http/1.1]}{127.0.0.1:0}
   [junit4]   2> 549177 INFO  (jetty-launcher-567-thread-1) [    ] o.e.j.s.AbstractConnector Stopped ServerConnector@b9e9c9e{HTTP/1.1,[http/1.1]}{127.0.0.1:0}
   [junit4]   2> 549178 INFO  (jetty-launcher-567-thread-2) [    ] o.a.s.c.CoreContainer Shutting down CoreContainer instance=1041910312
   [junit4]   2> 549178 INFO  (jetty-launcher-567-thread-1) [    ] o.a.s.c.CoreContainer Shutting down CoreContainer instance=2107528452
   [junit4]   2> 549183 INFO  (coreCloseExecutor-2055-thread-1) [n:127.0.0.1:58761_solr c:forwardingCollection s:shard1 r:core_node1 x:forwardingCollection_shard1_replica1] o.a.s.c.SolrCore [forwardingCollection_shard1_replica1]  CLOSING SolrCore org.apache.solr.core.SolrCore@4dd4a675
   [junit4]   2> 549197 INFO  (zkCallback-578-thread-1-processing-n:127.0.0.1:58761_solr) [n:127.0.0.1:58761_solr    ] o.a.s.c.c.ZkStateReader Updated live nodes from ZooKeeper... (2) -> (1)
   [junit4]   2> 549207 INFO  (coreCloseExecutor-2055-thread-1) [n:127.0.0.1:58761_solr c:forwardingCollection s:shard1 r:core_node1 x:forwardingCollection_shard1_replica1] o.a.s.m.SolrMetricManager Closing metric reporters for: solr.core.forwardingCollection.shard1.replica1
   [junit4]   2> 549209 INFO  (jetty-launcher-567-thread-2) [    ] o.a.s.c.Overseer Overseer (id=97322732308791308-127.0.0.1:58761_solr-n_0000000002) closing
   [junit4]   2> 549209 INFO  (OverseerStateUpdate-97322732308791308-127.0.0.1:58761_solr-n_0000000002) [n:127.0.0.1:58761_solr    ] o.a.s.c.Overseer Overseer Loop exiting : 127.0.0.1:58761_solr
   [junit4]   2> 549214 INFO  (jetty-launcher-567-thread-2) [    ] o.a.s.m.SolrMetricManager Closing metric reporters for: solr.node
   [junit4]   2> 549214 ERROR (Thread[Thread-910,5,TGRP-TestSolrCloudWithSecureImpersonation]) [n:127.0.0.1:58761_solr    ] o.a.h.s.t.d.AbstractDelegationTokenSecretManager ExpiredTokenRemover received java.lang.InterruptedException: sleep interrupted
   [junit4]   2> 549219 INFO  (jetty-launcher-567-thread-2) [    ] o.e.j.s.h.ContextHandler Stopped o.e.j.s.ServletContextHandler@7265d62{/solr,null,UNAVAILABLE}
   [junit4]   2> 550688 WARN  (zkCallback-577-thread-2-processing-n:127.0.0.1:37734_solr) [n:127.0.0.1:37734_solr    ] o.a.s.c.c.ZkStateReader ZooKeeper watch triggered, but Solr cannot talk to ZK: [KeeperErrorCode = Session expired for /live_nodes]
   [junit4]   2> 550688 INFO  (jetty-launcher-567-thread-1) [    ] o.a.s.m.SolrMetricManager Closing metric reporters for: solr.node
   [junit4]   2> 550689 ERROR (Thread[Thread-907,5,TGRP-TestSolrCloudWithSecureImpersonation]) [n:127.0.0.1:37734_solr    ] o.a.h.s.t.d.AbstractDelegationTokenSecretManager ExpiredTokenRemover received java.lang.InterruptedException: sleep interrupted
   [junit4]   2> 550692 INFO  (jetty-launcher-567-thread-1) [    ] o.e.j.s.h.ContextHandler Stopped o.e.j.s.ServletContextHandler@7a666517{/solr,null,UNAVAILABLE}
   [junit4]   2> 550695 INFO  (SUITE-TestSolrCloudWithSecureImpersonation-seed#[68C5999D345EE6BE]-worker) [    ] o.a.s.c.ZkTestServer connecting to 127.0.0.1:45760 45760
   [junit4]   2> 555737 INFO  (Thread-888) [    ] o.a.s.c.ZkTestServer connecting to 127.0.0.1:45760 45760
   [junit4]   2> 555738 WARN  (Thread-888) [    ] o.a.s.c.ZkTestServer Watch limit violations: 
   [junit4]   2> Maximum concurrent create/delete watches above limit:
   [junit4]   2> 
   [junit4]   2> 	5	/solr/aliases.json
   [junit4]   2> 	5	/solr/clusterprops.json
   [junit4]   2> 	4	/solr/security.json
   [junit4]   2> 	2	/solr/configs/conf1
   [junit4]   2> 
   [junit4]   2> Maximum concurrent data watches above limit:
   [junit4]   2> 
   [junit4]   2> 	5	/solr/clusterstate.json
   [junit4]   2> 	2	/solr/security/zkdtsm/ZKDTSMRoot/ZKDTSMKeyIdRoot
   [junit4]   2> 	2	/solr/security/zkdtsm/ZKDTSMRoot/ZKDTSMMasterKeyRoot/DK_1
   [junit4]   2> 	2	/solr/security/zkdtsm/ZKDTSMRoot/ZKDTSMMasterKeyRoot/DK_3
   [junit4]   2> 	2	/solr/security/zkdtsm/ZKDTSMRoot/ZKDTSMMasterKeyRoot/DK_2
   [junit4]   2> 	2	/solr/security/zkdtsm/ZKDTSMRoot/ZKDTSMMasterKeyRoot/DK_4
   [junit4]   2> 	2	/solr/security/zkdtsm/ZKDTSMRoot/ZKDTSMSeqNumRoot
   [junit4]   2> 	2	/solr/collections/forwardingCollection/state.json
   [junit4]   2> 
   [junit4]   2> Maximum concurrent children watches above limit:
   [junit4]   2> 
   [junit4]   2> 	15	/solr/overseer/queue
   [junit4]   2> 	5	/solr/collections
   [junit4]   2> 	4	/solr/overseer/collection-queue-work
   [junit4]   2> 	3	/solr/live_nodes
   [junit4]   2> 	3	/solr/overseer/queue-work
   [junit4]   2> 	2	/solr/security/zkdtsm/ZKDTSMRoot/ZKDTSMMasterKeyRoot
   [junit4]   2> 	2	/solr/security/zkdtsm/ZKDTSMRoot/ZKDTSMTokensRoot
   [junit4]   2> 
   [junit4]   2> 555769 INFO  (SUITE-TestSolrCloudWithSecureImpersonation-seed#[68C5999D345EE6BE]-worker) [    ] o.a.s.SolrTestCaseJ4 ###deleteCore
   [junit4]   2> Jan 21, 2017 7:31:22 PM com.carrotsearch.randomizedtesting.ThreadLeakControl checkThreadLeaks
   [junit4]   2> WARNING: Will linger awaiting termination of 2 leaked thread(s).
   [junit4]   2> Jan 21, 2017 7:31:42 PM com.carrotsearch.randomizedtesting.ThreadLeakControl checkThreadLeaks
   [junit4]   2> SEVERE: 2 threads leaked from SUITE scope at org.apache.solr.cloud.TestSolrCloudWithSecureImpersonation: 
   [junit4]   2>    1) Thread[id=3618, name=jetty-launcher-567-thread-2-EventThread, state=TIMED_WAITING, group=TGRP-TestSolrCloudWithSecureImpersonation]
   [junit4]   2>         at sun.misc.Unsafe.park(Native Method)
   [junit4]   2>         at java.util.concurrent.locks.LockSupport.parkNanos(LockSupport.java:215)
   [junit4]   2>         at java.util.concurrent.locks.AbstractQueuedSynchronizer.doAcquireSharedNanos(AbstractQueuedSynchronizer.java:1037)
   [junit4]   2>         at java.util.concurrent.locks.AbstractQueuedSynchronizer.tryAcquireSharedNanos(AbstractQueuedSynchronizer.java:1328)
   [junit4]   2>         at java.util.concurrent.CountDownLatch.await(CountDownLatch.java:277)
   [junit4]   2>         at org.apache.curator.CuratorZookeeperClient.internalBlockUntilConnectedOrTimedOut(CuratorZookeeperClient.java:323)
   [junit4]   2>         at org.apache.curator.RetryLoop.callWithRetry(RetryLoop.java:105)
   [junit4]   2>         at org.apache.curator.framework.imps.GetDataBuilderImpl.pathInForeground(GetDataBuilderImpl.java:288)
   [junit4]   2>         at org.apache.curator.framework.imps.GetDataBuilderImpl.forPath(GetDataBuilderImpl.java:279)
   [junit4]   2>         at org.apache.curator.framework.imps.GetDataBuilderImpl.forPath(GetDataBuilderImpl.java:41)
   [junit4]   2>         at org.apache.curator.framework.recipes.shared.SharedValue.readValue(SharedValue.java:244)
   [junit4]   2>         at org.apache.curator.framework.recipes.shared.SharedValue.access$100(SharedValue.java:44)
   [junit4]   2>         at org.apache.curator.framework.recipes.shared.SharedValue$1.process(SharedValue.java:61)
   [junit4]   2>         at org.apache.curator.framework.imps.NamespaceWatcher.process(NamespaceWatcher.java:67)
   [junit4]   2>         at org.apache.zookeeper.ClientCnxn$EventThread.processEvent(ClientCnxn.java:522)
   [junit4]   2>         at org.apache.zookeeper.ClientCnxn$EventThread.run(ClientCnxn.java:498)
   [junit4]   2>    2) Thread[id=3630, name=jetty-launcher-567-thread-1-EventThread, state=TIMED_WAITING, group=TGRP-TestSolrCloudWithSecureImpersonation]
   [junit4]   2>         at sun.misc.Unsafe.park(Native Method)
   [junit4]   2>         at java.util.concurrent.locks.LockSupport.parkNanos(LockSupport.java:215)
   [junit4]   2>         at java.util.concurrent.locks.AbstractQueuedSynchronizer.doAcquireSharedNanos(AbstractQueuedSynchronizer.java:1037)
   [junit4]   2>         at java.util.concurrent.locks.AbstractQueuedSynchronizer.tryAcquireSharedNanos(AbstractQueuedSynchronizer.java:1328)
   [junit4]   2>         at java.util.concurrent.CountDownLatch.await(CountDownLatch.java:277)
   [junit4]   2>         at org.apache.curator.CuratorZookeeperClient.internalBlockUntilConnectedOrTimedOut(CuratorZookeeperClient.java:323)
   [junit4]   2>         at org.apache.curator.RetryLoop.callWithRetry(RetryLoop.java:105)
   [junit4]   2>         at org.apache.curator.framework.imps.GetDataBuilderImpl.pathInForeground(GetDataBuilderImpl.java:288)
   [junit4]   2>         at org.apache.curator.framework.imps.GetDataBuilderImpl.forPath(GetDataBuilderImpl.java:279)
   [junit4]   2>         at org.apache.curator.framework.imps.GetDataBuilderImpl.forPath(GetDataBuilderImpl.java:41)
   [junit4]   2>         at org.apache.curator.framework.recipes.shared.SharedValue.readValue(SharedValue.java:244)
   [junit4]   2>         at org.apache.curator.framework.recipes.shared.SharedValue.access$100(SharedValue.java:44)
   [junit4]   2>         at org.apache.curator.framework.recipes.shared.SharedValue$1.process(SharedValue.java:61)
   [junit4]   2>         at org.apache.curator.framework.imps.NamespaceWatcher.process(NamespaceWatcher.java:67)
   [junit4]   2>         at org.apache.zookeeper.ClientCnxn$EventThread.processEvent(ClientCnxn.java:522)
   [junit4]   2>         at org.apache.zookeeper.ClientCnxn$EventThread.run(ClientCnxn.java:498)
   [junit4]   2> Jan 21, 2017 7:31:42 PM com.carrotsearch.randomizedtesting.ThreadLeakControl tryToInterruptAll
   [junit4]   2> INFO: Starting to interrupt leaked threads:
   [junit4]   2>    1) Thread[id=3618, name=jetty-launcher-567-thread-2-EventThread, state=TIMED_WAITING, group=TGRP-TestSolrCloudWithSecureImpersonation]
   [junit4]   2>    2) Thread[id=3630, name=jetty-launcher-567-thread-1-EventThread, state=TIMED_WAITING, group=TGRP-TestSolrCloudWithSecureImpersonation]
   [junit4]   2> 575923 ERROR (jetty-launcher-567-thread-2-EventThread) [n:127.0.0.1:37734_solr    ] o.a.c.f.i.CuratorFrameworkImpl Watcher exception
   [junit4]   2> java.lang.InterruptedException
   [junit4]   2> 	at java.util.concurrent.locks.AbstractQueuedSynchronizer.doAcquireSharedNanos(AbstractQueuedSynchronizer.java:1039)
   [junit4]   2> 	at java.util.concurrent.locks.AbstractQueuedSynchronizer.tryAcquireSharedNanos(AbstractQueuedSynchronizer.java:1328)
   [junit4]   2> 	at java.util.concurrent.CountDownLatch.await(CountDownLatch.java:277)
   [junit4]   2> 	at org.apache.curator.CuratorZookeeperClient.internalBlockUntilConnectedOrTimedOut(CuratorZookeeperClient.java:323)
   [junit4]   2> 	at org.apache.curator.RetryLoop.callWithRetry(RetryLoop.java:105)
   [junit4]   2> 	at org.apache.curator.framework.imps.GetDataBuilderImpl.pathInForeground(GetDataBuilderImpl.java:288)
   [junit4]   2> 	at org.apache.curator.framework.imps.GetDataBuilderImpl.forPath(GetDataBuilderImpl.java:279)
   [junit4]   2> 	at org.apache.curator.framework.imps.GetDataBuilderImpl.forPath(GetDataBuilderImpl.java:41)
   [junit4]   2> 	at org.apache.curator.framework.recipes.shared.SharedValue.readValue(SharedValue.java:244)
   [junit4]   2> 	at org.apache.curator.framework.recipes.shared.SharedValue.access$100(SharedValue.java:44)
   [junit4]   2> 	at org.apache.curator.framework.recipes.shared.SharedValue$1.process(SharedValue.java:61)
   [junit4]   2> 	at org.apache.curator.framework.imps.NamespaceWatcher.process(NamespaceWatcher.java:67)
   [junit4]   2> 	at org.apache.zookeeper.ClientCnxn$EventThread.processEvent(ClientCnxn.java:522)
   [junit4]   2> 	at org.apache.zookeeper.ClientCnxn$EventThread.run(ClientCnxn.java:498)
   [junit4]   2> 575923 ERROR (jetty-launcher-567-thread-1-EventThread) [n:127.0.0.1:58761_solr    ] o.a.c.f.i.CuratorFrameworkImpl Watcher exception
   [junit4]   2> java.lang.InterruptedException
   [junit4]   2> 	at java.util.concurrent.locks.AbstractQueuedSynchronizer.doAcquireSharedNanos(AbstractQueuedSynchronizer.java:1039)
   [junit4]   2> 	at java.util.concurrent.locks.AbstractQueuedSynchronizer.tryAcquireSharedNanos(AbstractQueuedSynchronizer.java:1328)
   [junit4]   2> 	at java.util.concurrent.CountDownLatch.await(CountDownLatch.java:277)
   [junit4]   2> 	at org.apache.curator.CuratorZookeeperClient.internalBlockUntilConnectedOrTimedOut(CuratorZookeeperClient.java:323)
   [junit4]   2> 	at org.apache.curator.RetryLoop.callWithRetry(RetryLoop.java:105)
   [junit4]   2> 	at org.apache.curator.framework.imps.GetDataBuilderImpl.pathInForeground(GetDataBuilderImpl.java:288)
   [junit4]   2> 	at org.apache.curator.framework.imps.GetDataBuilderImpl.forPath(GetDataBuilderImpl.java:279)
   [junit4]   2> 	at org.apache.curator.framework.imps.GetDataBuilderImpl.forPath(GetDataBuilderImpl.java:41)
   [junit4]   2> 	at org.apache.curator.framework.recipes.shared.SharedValue.readValue(SharedValue.java:244)
   [junit4]   2> 	at org.apache.curator.framework.recipes.shared.SharedValue.access$100(SharedValue.java:44)
   [junit4]   2> 	at org.apache.curator.framework.recipes.shared.SharedValue$1.process(SharedValue.java:61)
   [junit4]   2> 	at org.apache.curator.framework.imps.NamespaceWatcher.process(NamespaceWatcher.java:67)
   [junit4]   2> 	at org.apache.zookeeper.ClientCnxn$EventThread.processEvent(ClientCnxn.java:522)
   [junit4]   2> 	at org.apache.zookeeper.ClientCnxn$EventThread.run(ClientCnxn.java:498)
   [junit4]   2> 575924 WARN  (jetty-launcher-567-thread-2-EventThread) [n:127.0.0.1:37734_solr    ] o.a.c.ConnectionState Session expired event received
   [junit4]   2> 575925 WARN  (jetty-launcher-567-thread-1-EventThread) [n:127.0.0.1:58761_solr    ] o.a.c.ConnectionState Session expired event received
   [junit4]   2> 575926 WARN  (jetty-launcher-567-thread-2-SendThread(127.0.0.1:45760)) [n:127.0.0.1:37734_solr    ] o.a.z.ClientCnxn Session 0x0 for server null, unexpected error, closing socket connection and attempting reconnect
   [junit4]   2> java.net.ConnectException: Connection refused
   [junit4]   2> 	at sun.nio.ch.SocketChannelImpl.checkConnect(Native Method)
   [junit4]   2> 	at sun.nio.ch.SocketChannelImpl.finishConnect(SocketChannelImpl.java:717)
   [junit4]   2> 	at org.apache.zookeeper.ClientCnxnSocketNIO.doTransport(ClientCnxnSocketNIO.java:361)
   [junit4]   2> 	at org.apache.zookeeper.ClientCnxn$SendThread.run(ClientCnxn.java:1081)
   [junit4]   2> Jan 21, 2017 7:31:42 PM com.carrotsearch.randomizedtesting.ThreadLeakControl tryToInterruptAll
   [junit4]   2> INFO: All leaked threads terminated.
   [junit4]   2> 575927 WARN  (jetty-launcher-567-thread-1-SendThread(127.0.0.1:45760)) [n:127.0.0.1:58761_solr    ] o.a.z.ClientCnxn Session 0x0 for server null, unexpected error, closing socket connection and attempting reconnect
   [junit4]   2> java.net.ConnectException: Connection refused
   [junit4]   2> 	at sun.nio.ch.SocketChannelImpl.checkConnect(Native Method)
   [junit4]   2> 	at sun.nio.ch.SocketChannelImpl.finishConnect(SocketChannelImpl.java:717)
   [junit4]   2> 	at org.apache.zookeeper.ClientCnxnSocketNIO.doTransport(ClientCnxnSocketNIO.java:361)
   [junit4]   2> 	at org.apache.zookeeper.ClientCnxn$SendThread.run(ClientCnxn.java:1081)
   [junit4]   2> NOTE: test params are: codec=Asserting(Lucene62): {}, docValues:{}, maxPointsInLeafNode=272, maxMBSortInHeap=5.926819229781003, sim=RandomSimilarity(queryNorm=true,coord=crazy): {}, locale=es-VE, timezone=America/Sao_Paulo
   [junit4]   2> NOTE: SunOS 5.11 amd64/Oracle Corporation 1.8.0_121 (64-bit)/cpus=3,threads=5,free=183604536,total=446029824
   [junit4]   2> NOTE: All tests run in this JVM: [TestCopyFieldCollectionResource, TestStressRecovery, DocValuesNotIndexedTest, ChangedSchemaMergeTest, AlternateDirectoryTest, StandardRequestHandlerTest, TestFaceting, SolrCoreTest, TriLevelCompositeIdRoutingTest, HdfsThreadLeakTest, TestIntervalFaceting, TestSmileRequest, TermsComponentTest, SchemaVersionSpecificBehaviorTest, TestCustomSort, DistributedQueryComponentOptimizationTest, VersionInfoTest, NumericFieldsTest, HdfsBasicDistributedZk2Test, QueryEqualityTest, TestCloudPseudoReturnFields, TestMaxScoreQueryParser, TestComplexPhraseLeadingWildcard, DistributedSpellCheckComponentTest, DeleteLastCustomShardedReplicaTest, CdcrRequestHandlerTest, SimpleCollectionCreateDeleteTest, DataDrivenBlockJoinTest, TestSweetSpotSimilarityFactory, TestHighlightDedupGrouping, TestStressReorder, DistributedQueueTest, RequiredFieldsTest, TestManagedSchemaThreadSafety, TestDefaultStatsCache, TestSolrDeletionPolicy1, ClusterStateUpdateTest, PeerSyncReplicationTest, TestManagedSchema, TestPseudoReturnFields, TestMacros, TestScoreJoinQPScore, TestSolrCloudWithDelegationTokens, SolrGangliaReporterTest, DistribDocExpirationUpdateProcessorTest, CustomCollectionTest, HdfsUnloadDistributedZkTest, IgnoreCommitOptimizeUpdateProcessorFactoryTest, BufferStoreTest, ConcurrentDeleteAndCreateCollectionTest, LeaderInitiatedRecoveryOnCommitTest, TestCSVLoader, AnalysisAfterCoreReloadTest, TestConfigSetProperties, BadComponentTest, DistributedMLTComponentTest, TestSolrCloudWithSecureImpersonation]
   [junit4]   2> NOTE: reproduce with: ant test  -Dtestcase=TestSolrCloudWithSecureImpersonation -Dtests.seed=68C5999D345EE6BE -Dtests.slow=true -Dtests.locale=es-VE -Dtests.timezone=America/Sao_Paulo -Dtests.asserts=true -Dtests.file.encoding=US-ASCII
   [junit4] ERROR   0.00s J0 | TestSolrCloudWithSecureImpersonation (suite) <<<
   [junit4]    > Throwable #1: com.carrotsearch.randomizedtesting.ThreadLeakError: 2 threads leaked from SUITE scope at org.apache.solr.cloud.TestSolrCloudWithSecureImpersonation: 
   [junit4]    >    1) Thread[id=3618, name=jetty-launcher-567-thread-2-EventThread, state=TIMED_WAITING, group=TGRP-TestSolrCloudWithSecureImpersonation]
   [junit4]    >         at sun.misc.Unsafe.park(Native Method)
   [junit4]    >         at java.util.concurrent.locks.LockSupport.parkNanos(LockSupport.java:215)
   [junit4]    >         at java.util.concurrent.locks.AbstractQueuedSynchronizer.doAcquireSharedNanos(AbstractQueuedSynchronizer.java:1037)
   [junit4]    >         at java.util.concurrent.locks.AbstractQueuedSynchronizer.tryAcquireSharedNanos(AbstractQueuedSynchronizer.java:1328)
   [junit4]    >         at java.util.concurrent.CountDownLatch.await(CountDownLatch.java:277)
   [junit4]    >         at org.apache.curator.CuratorZookeeperClient.internalBlockUntilConnectedOrTimedOut(CuratorZookeeperClient.java:323)
   [junit4]    >         at org.apache.curator.RetryLoop.callWithRetry(RetryLoop.java:105)
   [junit4]    >         at org.apache.curator.framework.imps.GetDataBuilderImpl.pathInForeground(GetDataBuilderImpl.java:288)
   [junit4]    >         at org.apache.curator.framework.imps.GetDataBuilderImpl.forPath(GetDataBuilderImpl.java:279)
   [junit4]    >         at org.apache.curator.framework.imps.GetDataBuilderImpl.forPath(GetDataBuilderImpl.java:41)
   [junit4]    >         at org.apache.curator.framework.recipes.shared.SharedValue.readValue(SharedValue.java:244)
   [junit4]    >         at org.apache.curator.framework.recipes.shared.SharedValue.access$100(SharedValue.java:44)
   [junit4]    >         at org.apache.curator.framework.recipes.shared.SharedValue$1.process(SharedValue.java:61)
   [junit4]    >         at org.apache.curator.framework.imps.NamespaceWatcher.process(NamespaceWatcher.java:67)
   [junit4]    >         at org.apache.zookeeper.ClientCnxn$EventThread.processEvent(ClientCnxn.java:522)
   [junit4]    >         at org.apache.zookeeper.ClientCnxn$EventThread.run(ClientCnxn.java:498)
   [junit4]    >    2) Thread[id=3630, name=jetty-launcher-567-thread-1-EventThread, state=TIMED_WAITING, group=TGRP-TestSolrCloudWithSecureImpersonation]
   [junit4]    >         at sun.misc.Unsafe.park(Native Method)
   [junit4]    >         at java.util.concurrent.locks.LockSupport.parkNanos(LockSupport.java:215)
   [junit4]    >         at java.util.concurrent.locks.AbstractQueuedSynchronizer.doAcquireSharedNanos(AbstractQueuedSynchronizer.java:1037)
   [junit4]    >         at java.util.concurrent.locks.AbstractQueuedSynchronizer.tryAcquireSharedNanos(AbstractQueuedSynchronizer.java:1328)
   [junit4]    >         at java.util.concurrent.CountDownLatch.await(CountDownLatch.java:277)
   [junit4]    >         at org.apache.curator.CuratorZookeeperClient.internalBlockUntilConnectedOrTimedOut(CuratorZookeeperClient.java:323)
   [junit4]    >         at org.apache.curator.RetryLoop.callWithRetry(RetryLoop.java:105)
   [junit4]    >         at org.apache.curator.framework.imps.GetDataBuilderImpl.pathInForeground(GetDataBuilderImpl.java:288)
   [junit4]    >         at org.apache.curator.framework.imps.GetDataBuilderImpl.forPath(GetDataBuilderImpl.java:279)
   [junit4]    >         at org.apache.curator.framework.imps.GetDataBuilderImpl.forPath(GetDataBuilderImpl.java:41)
   [junit4]    >         at org.apache.curator.framework.recipes.shared.SharedValue.readValue(SharedValue.java:244)
   [junit4]    >         at org.apache.curator.framework.recipes.shared.SharedValue.access$100(SharedValue.java:44)
   [junit4]    >         at org.apache.curator.framework.recipes.shared.SharedValue$1.process(SharedValue.java:61)
   [junit4]    >         at org.apache.curator.framework.imps.NamespaceWatcher.process(NamespaceWatcher.java:67)
   [junit4]    >         at org.apache.zookeeper.ClientCnxn$EventThread.processEvent(ClientCnxn.java:522)
   [junit4]    >         at org.apache.zookeeper.ClientCnxn$EventThread.run(ClientCnxn.java:498)
   [junit4]    > 	at __randomizedtesting.SeedInfo.seed([68C5999D345EE6BE]:0)
   [junit4] Completed [106/681 (1!)] on J0 in 58.98s, 12 tests, 1 error <<< FAILURES!

[...truncated 42730 lines...]
-ecj-javadoc-lint-src:
    [mkdir] Created dir: /var/tmp/ecj975862153
 [ecj-lint] Compiling 810 source files to /var/tmp/ecj975862153
 [ecj-lint] ----------
 [ecj-lint] 1. ERROR in /export/home/jenkins/workspace/Lucene-Solr-6.x-Solaris/lucene/core/src/java/org/apache/lucene/document/SortedSetDocValuesRangeQuery.java (at line 22)
 [ecj-lint] 	import org.apache.lucene.index.DocValues;
 [ecj-lint] 	       ^^^^^^^^^^^^^^^^^^^^^^^^^^^^^^^^^
 [ecj-lint] The import org.apache.lucene.index.DocValues is never used
 [ecj-lint] ----------
 [ecj-lint] ----------
 [ecj-lint] 2. WARNING in /export/home/jenkins/workspace/Lucene-Solr-6.x-Solaris/lucene/core/src/java/org/apache/lucene/index/IndexWriter.java (at line 4308)
 [ecj-lint] 	newReader = new SegmentReader(info, reader, liveDocs, info.info.maxDoc() - delCount);
 [ecj-lint] 	^^^^^^^^^^^^^^^^^^^^^^^^^^^^^^^^^^^^^^^^^^^^^^^^^^^^^^^^^^^^^^^^^^^^^^^^^^^^^^^^^^^^
 [ecj-lint] Resource leak: 'newReader' is never closed
 [ecj-lint] ----------
 [ecj-lint] ----------
 [ecj-lint] 3. WARNING in /export/home/jenkins/workspace/Lucene-Solr-6.x-Solaris/lucene/core/src/java/org/apache/lucene/index/SegmentReader.java (at line 159)
 [ecj-lint] 	return null;
 [ecj-lint] 	^^^^^^^^^^^^
 [ecj-lint] Resource leak: 'dir' is not closed at this location
 [ecj-lint] ----------
 [ecj-lint] 3 problems (1 error, 2 warnings)

BUILD FAILED
/export/home/jenkins/workspace/Lucene-Solr-6.x-Solaris/build.xml:775: The following error occurred while executing this line:
/export/home/jenkins/workspace/Lucene-Solr-6.x-Solaris/build.xml:101: The following error occurred while executing this line:
/export/home/jenkins/workspace/Lucene-Solr-6.x-Solaris/lucene/build.xml:199: The following error occurred while executing this line:
/export/home/jenkins/workspace/Lucene-Solr-6.x-Solaris/lucene/common-build.xml:1992: The following error occurred while executing this line:
/export/home/jenkins/workspace/Lucene-Solr-6.x-Solaris/lucene/common-build.xml:2031: Compile failed; see the compiler error output for details.

Total time: 91 minutes 39 seconds
Build step 'Invoke Ant' marked build as failure
Archiving artifacts
[WARNINGS] Skipping publisher since build result is FAILURE
Recording test results
Email was triggered for: Failure - Any
Sending email for trigger: Failure - Any



Mime
View raw message