lucene-dev mailing list archives

Site index · List index
Message view « Date » · « Thread »
Top « Date » · « Thread »
From Policeman Jenkins Server <jenk...@thetaphi.de>
Subject [JENKINS] Lucene-Solr-master-MacOSX (64bit/jdk1.8.0) - Build # 3748 - Unstable!
Date Sun, 01 Jan 2017 17:40:40 GMT
Build: https://jenkins.thetaphi.de/job/Lucene-Solr-master-MacOSX/3748/
Java: 64bit/jdk1.8.0 -XX:+UseCompressedOops -XX:+UseSerialGC

1 tests failed.
FAILED:  org.apache.solr.update.processor.TestNamedUpdateProcessors.test

Error Message:
Index: 0, Size: 0

Stack Trace:
java.lang.IndexOutOfBoundsException: Index: 0, Size: 0
	at __randomizedtesting.SeedInfo.seed([33A3A6F28D0BE96F:BBF7992823F78497]:0)
	at java.util.ArrayList.rangeCheck(ArrayList.java:653)
	at java.util.ArrayList.get(ArrayList.java:429)
	at org.apache.solr.update.processor.TestNamedUpdateProcessors.test(TestNamedUpdateProcessors.java:128)
	at sun.reflect.NativeMethodAccessorImpl.invoke0(Native Method)
	at sun.reflect.NativeMethodAccessorImpl.invoke(NativeMethodAccessorImpl.java:62)
	at sun.reflect.DelegatingMethodAccessorImpl.invoke(DelegatingMethodAccessorImpl.java:43)
	at java.lang.reflect.Method.invoke(Method.java:498)
	at com.carrotsearch.randomizedtesting.RandomizedRunner.invoke(RandomizedRunner.java:1713)
	at com.carrotsearch.randomizedtesting.RandomizedRunner$8.evaluate(RandomizedRunner.java:907)
	at com.carrotsearch.randomizedtesting.RandomizedRunner$9.evaluate(RandomizedRunner.java:943)
	at com.carrotsearch.randomizedtesting.RandomizedRunner$10.evaluate(RandomizedRunner.java:957)
	at org.apache.solr.BaseDistributedSearchTestCase$ShardsRepeatRule$ShardsFixedStatement.callStatement(BaseDistributedSearchTestCase.java:985)
	at org.apache.solr.BaseDistributedSearchTestCase$ShardsRepeatRule$ShardsStatement.evaluate(BaseDistributedSearchTestCase.java:960)
	at com.carrotsearch.randomizedtesting.rules.SystemPropertiesRestoreRule$1.evaluate(SystemPropertiesRestoreRule.java:57)
	at org.apache.lucene.util.TestRuleSetupTeardownChained$1.evaluate(TestRuleSetupTeardownChained.java:49)
	at org.apache.lucene.util.AbstractBeforeAfterRule$1.evaluate(AbstractBeforeAfterRule.java:45)
	at org.apache.lucene.util.TestRuleThreadAndTestName$1.evaluate(TestRuleThreadAndTestName.java:48)
	at org.apache.lucene.util.TestRuleIgnoreAfterMaxFailures$1.evaluate(TestRuleIgnoreAfterMaxFailures.java:64)
	at org.apache.lucene.util.TestRuleMarkFailure$1.evaluate(TestRuleMarkFailure.java:47)
	at com.carrotsearch.randomizedtesting.rules.StatementAdapter.evaluate(StatementAdapter.java:36)
	at com.carrotsearch.randomizedtesting.ThreadLeakControl$StatementRunner.run(ThreadLeakControl.java:367)
	at com.carrotsearch.randomizedtesting.ThreadLeakControl.forkTimeoutingTask(ThreadLeakControl.java:811)
	at com.carrotsearch.randomizedtesting.ThreadLeakControl$3.evaluate(ThreadLeakControl.java:462)
	at com.carrotsearch.randomizedtesting.RandomizedRunner.runSingleTest(RandomizedRunner.java:916)
	at com.carrotsearch.randomizedtesting.RandomizedRunner$5.evaluate(RandomizedRunner.java:802)
	at com.carrotsearch.randomizedtesting.RandomizedRunner$6.evaluate(RandomizedRunner.java:852)
	at com.carrotsearch.randomizedtesting.RandomizedRunner$7.evaluate(RandomizedRunner.java:863)
	at com.carrotsearch.randomizedtesting.rules.StatementAdapter.evaluate(StatementAdapter.java:36)
	at com.carrotsearch.randomizedtesting.rules.SystemPropertiesRestoreRule$1.evaluate(SystemPropertiesRestoreRule.java:57)
	at org.apache.lucene.util.AbstractBeforeAfterRule$1.evaluate(AbstractBeforeAfterRule.java:45)
	at com.carrotsearch.randomizedtesting.rules.StatementAdapter.evaluate(StatementAdapter.java:36)
	at org.apache.lucene.util.TestRuleStoreClassName$1.evaluate(TestRuleStoreClassName.java:41)
	at com.carrotsearch.randomizedtesting.rules.NoShadowingOrOverridesOnMethodsRule$1.evaluate(NoShadowingOrOverridesOnMethodsRule.java:40)
	at com.carrotsearch.randomizedtesting.rules.NoShadowingOrOverridesOnMethodsRule$1.evaluate(NoShadowingOrOverridesOnMethodsRule.java:40)
	at com.carrotsearch.randomizedtesting.rules.StatementAdapter.evaluate(StatementAdapter.java:36)
	at com.carrotsearch.randomizedtesting.rules.StatementAdapter.evaluate(StatementAdapter.java:36)
	at com.carrotsearch.randomizedtesting.rules.StatementAdapter.evaluate(StatementAdapter.java:36)
	at org.apache.lucene.util.TestRuleAssertionsRequired$1.evaluate(TestRuleAssertionsRequired.java:53)
	at org.apache.lucene.util.TestRuleMarkFailure$1.evaluate(TestRuleMarkFailure.java:47)
	at org.apache.lucene.util.TestRuleIgnoreAfterMaxFailures$1.evaluate(TestRuleIgnoreAfterMaxFailures.java:64)
	at org.apache.lucene.util.TestRuleIgnoreTestSuites$1.evaluate(TestRuleIgnoreTestSuites.java:54)
	at com.carrotsearch.randomizedtesting.rules.StatementAdapter.evaluate(StatementAdapter.java:36)
	at com.carrotsearch.randomizedtesting.ThreadLeakControl$StatementRunner.run(ThreadLeakControl.java:367)
	at java.lang.Thread.run(Thread.java:745)




Build Log:
[...truncated 12758 lines...]
   [junit4] Suite: org.apache.solr.update.processor.TestNamedUpdateProcessors
   [junit4]   2> Creating dataDir: /Users/jenkins/workspace/Lucene-Solr-master-MacOSX/solr/build/solr-core/test/J0/temp/solr.update.processor.TestNamedUpdateProcessors_33A3A6F28D0BE96F-001/init-core-data-001
   [junit4]   2> 2819421 INFO  (SUITE-TestNamedUpdateProcessors-seed#[33A3A6F28D0BE96F]-worker) [    ] o.a.s.SolrTestCaseJ4 Randomized ssl (false) and clientAuth (false) via: @org.apache.solr.util.RandomizeSSL(reason=, value=NaN, ssl=NaN, clientAuth=NaN) w/ MAC_OS_X supressed clientAuth
   [junit4]   2> 2819421 INFO  (SUITE-TestNamedUpdateProcessors-seed#[33A3A6F28D0BE96F]-worker) [    ] o.a.s.BaseDistributedSearchTestCase Setting hostContext system property: /n_v/n
   [junit4]   2> 2819423 INFO  (TEST-TestNamedUpdateProcessors.test-seed#[33A3A6F28D0BE96F]) [    ] o.a.s.c.ZkTestServer STARTING ZK TEST SERVER
   [junit4]   2> 2819424 INFO  (Thread-4947) [    ] o.a.s.c.ZkTestServer client port:0.0.0.0/0.0.0.0:0
   [junit4]   2> 2819424 INFO  (Thread-4947) [    ] o.a.s.c.ZkTestServer Starting server
   [junit4]   2> 2819525 INFO  (TEST-TestNamedUpdateProcessors.test-seed#[33A3A6F28D0BE96F]) [    ] o.a.s.c.ZkTestServer start zk server on port:58174
   [junit4]   2> 2819552 INFO  (TEST-TestNamedUpdateProcessors.test-seed#[33A3A6F28D0BE96F]) [    ] o.a.s.c.AbstractZkTestCase put /Users/jenkins/workspace/Lucene-Solr-master-MacOSX/solr/core/src/test-files/solr/collection1/conf/solrconfig-tlog.xml to /configs/conf1/solrconfig.xml
   [junit4]   2> 2819556 INFO  (TEST-TestNamedUpdateProcessors.test-seed#[33A3A6F28D0BE96F]) [    ] o.a.s.c.AbstractZkTestCase put /Users/jenkins/workspace/Lucene-Solr-master-MacOSX/solr/core/src/test-files/solr/collection1/conf/schema.xml to /configs/conf1/schema.xml
   [junit4]   2> 2819559 INFO  (TEST-TestNamedUpdateProcessors.test-seed#[33A3A6F28D0BE96F]) [    ] o.a.s.c.AbstractZkTestCase put /Users/jenkins/workspace/Lucene-Solr-master-MacOSX/solr/core/src/test-files/solr/collection1/conf/solrconfig.snippet.randomindexconfig.xml to /configs/conf1/solrconfig.snippet.randomindexconfig.xml
   [junit4]   2> 2819562 INFO  (TEST-TestNamedUpdateProcessors.test-seed#[33A3A6F28D0BE96F]) [    ] o.a.s.c.AbstractZkTestCase put /Users/jenkins/workspace/Lucene-Solr-master-MacOSX/solr/core/src/test-files/solr/collection1/conf/stopwords.txt to /configs/conf1/stopwords.txt
   [junit4]   2> 2819565 INFO  (TEST-TestNamedUpdateProcessors.test-seed#[33A3A6F28D0BE96F]) [    ] o.a.s.c.AbstractZkTestCase put /Users/jenkins/workspace/Lucene-Solr-master-MacOSX/solr/core/src/test-files/solr/collection1/conf/protwords.txt to /configs/conf1/protwords.txt
   [junit4]   2> 2819568 INFO  (TEST-TestNamedUpdateProcessors.test-seed#[33A3A6F28D0BE96F]) [    ] o.a.s.c.AbstractZkTestCase put /Users/jenkins/workspace/Lucene-Solr-master-MacOSX/solr/core/src/test-files/solr/collection1/conf/currency.xml to /configs/conf1/currency.xml
   [junit4]   2> 2819571 INFO  (TEST-TestNamedUpdateProcessors.test-seed#[33A3A6F28D0BE96F]) [    ] o.a.s.c.AbstractZkTestCase put /Users/jenkins/workspace/Lucene-Solr-master-MacOSX/solr/core/src/test-files/solr/collection1/conf/enumsConfig.xml to /configs/conf1/enumsConfig.xml
   [junit4]   2> 2819574 INFO  (TEST-TestNamedUpdateProcessors.test-seed#[33A3A6F28D0BE96F]) [    ] o.a.s.c.AbstractZkTestCase put /Users/jenkins/workspace/Lucene-Solr-master-MacOSX/solr/core/src/test-files/solr/collection1/conf/open-exchange-rates.json to /configs/conf1/open-exchange-rates.json
   [junit4]   2> 2819577 INFO  (TEST-TestNamedUpdateProcessors.test-seed#[33A3A6F28D0BE96F]) [    ] o.a.s.c.AbstractZkTestCase put /Users/jenkins/workspace/Lucene-Solr-master-MacOSX/solr/core/src/test-files/solr/collection1/conf/mapping-ISOLatin1Accent.txt to /configs/conf1/mapping-ISOLatin1Accent.txt
   [junit4]   2> 2819580 INFO  (TEST-TestNamedUpdateProcessors.test-seed#[33A3A6F28D0BE96F]) [    ] o.a.s.c.AbstractZkTestCase put /Users/jenkins/workspace/Lucene-Solr-master-MacOSX/solr/core/src/test-files/solr/collection1/conf/old_synonyms.txt to /configs/conf1/old_synonyms.txt
   [junit4]   2> 2819583 INFO  (TEST-TestNamedUpdateProcessors.test-seed#[33A3A6F28D0BE96F]) [    ] o.a.s.c.AbstractZkTestCase put /Users/jenkins/workspace/Lucene-Solr-master-MacOSX/solr/core/src/test-files/solr/collection1/conf/synonyms.txt to /configs/conf1/synonyms.txt
   [junit4]   2> 2819964 INFO  (TEST-TestNamedUpdateProcessors.test-seed#[33A3A6F28D0BE96F]) [    ] o.a.s.SolrTestCaseJ4 Writing core.properties file to /Users/jenkins/workspace/Lucene-Solr-master-MacOSX/solr/build/solr-core/test/J0/temp/solr.update.processor.TestNamedUpdateProcessors_33A3A6F28D0BE96F-001/control-001/cores/collection1
   [junit4]   2> 2819968 INFO  (TEST-TestNamedUpdateProcessors.test-seed#[33A3A6F28D0BE96F]) [    ] o.e.j.s.Server jetty-9.3.14.v20161028
   [junit4]   2> 2819970 INFO  (TEST-TestNamedUpdateProcessors.test-seed#[33A3A6F28D0BE96F]) [    ] o.e.j.s.h.ContextHandler Started o.e.j.s.ServletContextHandler@5d06fde3{/n_v/n,null,AVAILABLE}
   [junit4]   2> 2819975 INFO  (TEST-TestNamedUpdateProcessors.test-seed#[33A3A6F28D0BE96F]) [    ] o.e.j.s.AbstractConnector Started ServerConnector@131bc5a{HTTP/1.1,[http/1.1]}{127.0.0.1:58177}
   [junit4]   2> 2819976 INFO  (TEST-TestNamedUpdateProcessors.test-seed#[33A3A6F28D0BE96F]) [    ] o.e.j.s.Server Started @2827290ms
   [junit4]   2> 2819976 INFO  (TEST-TestNamedUpdateProcessors.test-seed#[33A3A6F28D0BE96F]) [    ] o.a.s.c.s.e.JettySolrRunner Jetty properties: {solr.data.dir=/Users/jenkins/workspace/Lucene-Solr-master-MacOSX/solr/build/solr-core/test/J0/temp/solr.update.processor.TestNamedUpdateProcessors_33A3A6F28D0BE96F-001/tempDir-001/control/data, hostContext=/n_v/n, hostPort=58177, coreRootDirectory=/Users/jenkins/workspace/Lucene-Solr-master-MacOSX/solr/build/solr-core/test/J0/temp/solr.update.processor.TestNamedUpdateProcessors_33A3A6F28D0BE96F-001/control-001/cores}
   [junit4]   2> 2819976 ERROR (TEST-TestNamedUpdateProcessors.test-seed#[33A3A6F28D0BE96F]) [    ] o.a.s.s.StartupLoggingUtils Missing Java Option solr.log.dir. Logging may be missing or incomplete.
   [junit4]   2> 2819977 INFO  (TEST-TestNamedUpdateProcessors.test-seed#[33A3A6F28D0BE96F]) [    ] o.a.s.s.SolrDispatchFilter  ___      _       Welcome to Apache Solr? version 7.0.0
   [junit4]   2> 2819977 INFO  (TEST-TestNamedUpdateProcessors.test-seed#[33A3A6F28D0BE96F]) [    ] o.a.s.s.SolrDispatchFilter / __| ___| |_ _   Starting in cloud mode on port null
   [junit4]   2> 2819977 INFO  (TEST-TestNamedUpdateProcessors.test-seed#[33A3A6F28D0BE96F]) [    ] o.a.s.s.SolrDispatchFilter \__ \/ _ \ | '_|  Install dir: null
   [junit4]   2> 2819977 INFO  (TEST-TestNamedUpdateProcessors.test-seed#[33A3A6F28D0BE96F]) [    ] o.a.s.s.SolrDispatchFilter |___/\___/_|_|    Start time: 2017-01-01T17:13:03.667Z
   [junit4]   2> 2819982 INFO  (TEST-TestNamedUpdateProcessors.test-seed#[33A3A6F28D0BE96F]) [    ] o.a.s.s.SolrDispatchFilter Loading solr.xml from SolrHome (not found in ZooKeeper)
   [junit4]   2> 2819982 INFO  (TEST-TestNamedUpdateProcessors.test-seed#[33A3A6F28D0BE96F]) [    ] o.a.s.c.SolrXmlConfig Loading container configuration from /Users/jenkins/workspace/Lucene-Solr-master-MacOSX/solr/build/solr-core/test/J0/temp/solr.update.processor.TestNamedUpdateProcessors_33A3A6F28D0BE96F-001/control-001/solr.xml
   [junit4]   2> 2820001 INFO  (TEST-TestNamedUpdateProcessors.test-seed#[33A3A6F28D0BE96F]) [    ] o.a.s.c.ZkContainer Zookeeper client=127.0.0.1:58174/solr
   [junit4]   2> 2820046 INFO  (TEST-TestNamedUpdateProcessors.test-seed#[33A3A6F28D0BE96F]) [n:127.0.0.1:58177_n_v%2Fn    ] o.a.s.c.OverseerElectionContext I am going to be the leader 127.0.0.1:58177_n_v%2Fn
   [junit4]   2> 2820048 INFO  (TEST-TestNamedUpdateProcessors.test-seed#[33A3A6F28D0BE96F]) [n:127.0.0.1:58177_n_v%2Fn    ] o.a.s.c.Overseer Overseer (id=97208944762355716-127.0.0.1:58177_n_v%2Fn-n_0000000000) starting
   [junit4]   2> 2820062 INFO  (TEST-TestNamedUpdateProcessors.test-seed#[33A3A6F28D0BE96F]) [n:127.0.0.1:58177_n_v%2Fn    ] o.a.s.c.ZkController Register node as live in ZooKeeper:/live_nodes/127.0.0.1:58177_n_v%2Fn
   [junit4]   2> 2820069 INFO  (zkCallback-3944-thread-1-processing-n:127.0.0.1:58177_n_v%2Fn) [n:127.0.0.1:58177_n_v%2Fn    ] o.a.s.c.c.ZkStateReader Updated live nodes from ZooKeeper... (0) -> (1)
   [junit4]   2> 2820126 INFO  (TEST-TestNamedUpdateProcessors.test-seed#[33A3A6F28D0BE96F]) [n:127.0.0.1:58177_n_v%2Fn    ] o.a.s.c.CorePropertiesLocator Found 1 core definitions underneath /Users/jenkins/workspace/Lucene-Solr-master-MacOSX/solr/build/solr-core/test/J0/temp/solr.update.processor.TestNamedUpdateProcessors_33A3A6F28D0BE96F-001/control-001/cores
   [junit4]   2> 2820126 INFO  (TEST-TestNamedUpdateProcessors.test-seed#[33A3A6F28D0BE96F]) [n:127.0.0.1:58177_n_v%2Fn    ] o.a.s.c.CorePropertiesLocator Cores are: [collection1]
   [junit4]   2> 2820130 INFO  (OverseerStateUpdate-97208944762355716-127.0.0.1:58177_n_v%2Fn-n_0000000000) [n:127.0.0.1:58177_n_v%2Fn    ] o.a.s.c.o.ReplicaMutator Assigning new node to shard shard=shard1
   [junit4]   2> 2821149 WARN  (coreLoadExecutor-11302-thread-1-processing-n:127.0.0.1:58177_n_v%2Fn) [n:127.0.0.1:58177_n_v%2Fn c:control_collection   x:collection1] o.a.s.c.Config Beginning with Solr 5.5, <mergePolicy> is deprecated, use <mergePolicyFactory> instead.
   [junit4]   2> 2821150 INFO  (coreLoadExecutor-11302-thread-1-processing-n:127.0.0.1:58177_n_v%2Fn) [n:127.0.0.1:58177_n_v%2Fn c:control_collection   x:collection1] o.a.s.c.SolrConfig Using Lucene MatchVersion: 7.0.0
   [junit4]   2> 2821162 INFO  (coreLoadExecutor-11302-thread-1-processing-n:127.0.0.1:58177_n_v%2Fn) [n:127.0.0.1:58177_n_v%2Fn c:control_collection   x:collection1] o.a.s.s.IndexSchema [collection1] Schema name=test
   [junit4]   2> 2821237 WARN  (coreLoadExecutor-11302-thread-1-processing-n:127.0.0.1:58177_n_v%2Fn) [n:127.0.0.1:58177_n_v%2Fn c:control_collection   x:collection1] o.a.s.s.IndexSchema [collection1] default search field in schema is text. WARNING: Deprecated, please use 'df' on request instead.
   [junit4]   2> 2821240 INFO  (coreLoadExecutor-11302-thread-1-processing-n:127.0.0.1:58177_n_v%2Fn) [n:127.0.0.1:58177_n_v%2Fn c:control_collection   x:collection1] o.a.s.s.IndexSchema Loaded schema test/1.0 with uniqueid field id
   [junit4]   2> 2821261 INFO  (coreLoadExecutor-11302-thread-1-processing-n:127.0.0.1:58177_n_v%2Fn) [n:127.0.0.1:58177_n_v%2Fn c:control_collection   x:collection1] o.a.s.c.CoreContainer Creating SolrCore 'collection1' using configuration from collection control_collection
   [junit4]   2> 2821261 INFO  (coreLoadExecutor-11302-thread-1-processing-n:127.0.0.1:58177_n_v%2Fn) [n:127.0.0.1:58177_n_v%2Fn c:control_collection   x:collection1] o.a.s.c.SolrCore [[collection1] ] Opening new SolrCore at [/Users/jenkins/workspace/Lucene-Solr-master-MacOSX/solr/build/solr-core/test/J0/temp/solr.update.processor.TestNamedUpdateProcessors_33A3A6F28D0BE96F-001/control-001/cores/collection1], dataDir=[/Users/jenkins/workspace/Lucene-Solr-master-MacOSX/solr/build/solr-core/test/J0/temp/solr.update.processor.TestNamedUpdateProcessors_33A3A6F28D0BE96F-001/control-001/cores/collection1/data/]
   [junit4]   2> 2821261 INFO  (coreLoadExecutor-11302-thread-1-processing-n:127.0.0.1:58177_n_v%2Fn) [n:127.0.0.1:58177_n_v%2Fn c:control_collection   x:collection1] o.a.s.c.JmxMonitoredMap JMX monitoring is enabled. Adding Solr mbeans to JMX Server: com.sun.jmx.mbeanserver.JmxMBeanServer@7a0a8e8f
   [junit4]   2> 2821282 INFO  (coreLoadExecutor-11302-thread-1-processing-n:127.0.0.1:58177_n_v%2Fn) [n:127.0.0.1:58177_n_v%2Fn c:control_collection   x:collection1] o.a.s.u.RandomMergePolicy RandomMergePolicy wrapping class org.apache.lucene.index.TieredMergePolicy: [TieredMergePolicy: maxMergeAtOnce=16, maxMergeAtOnceExplicit=17, maxMergedSegmentMB=1.0498046875, floorSegmentMB=0.4462890625, forceMergeDeletesPctAllowed=27.28036057018505, segmentsPerTier=19.0, maxCFSSegmentSizeMB=8.796093022207999E12, noCFSRatio=1.0
   [junit4]   2> 2821320 WARN  (coreLoadExecutor-11302-thread-1-processing-n:127.0.0.1:58177_n_v%2Fn) [n:127.0.0.1:58177_n_v%2Fn c:control_collection   x:collection1] o.a.s.c.RequestHandlers INVALID paramSet a in requestHandler {type = requestHandler,name = /dump,class = DumpRequestHandler,attributes = {initParams=a, name=/dump, class=DumpRequestHandler},args = {defaults={a=A,b=B}}}
   [junit4]   2> 2821334 INFO  (coreLoadExecutor-11302-thread-1-processing-n:127.0.0.1:58177_n_v%2Fn) [n:127.0.0.1:58177_n_v%2Fn c:control_collection   x:collection1] o.a.s.u.UpdateHandler Using UpdateLog implementation: org.apache.solr.update.UpdateLog
   [junit4]   2> 2821334 INFO  (coreLoadExecutor-11302-thread-1-processing-n:127.0.0.1:58177_n_v%2Fn) [n:127.0.0.1:58177_n_v%2Fn c:control_collection   x:collection1] o.a.s.u.UpdateLog Initializing UpdateLog: dataDir= defaultSyncLevel=FLUSH numRecordsToKeep=100 maxNumLogsToKeep=10 numVersionBuckets=65536
   [junit4]   2> 2821335 INFO  (coreLoadExecutor-11302-thread-1-processing-n:127.0.0.1:58177_n_v%2Fn) [n:127.0.0.1:58177_n_v%2Fn c:control_collection   x:collection1] o.a.s.u.CommitTracker Hard AutoCommit: disabled
   [junit4]   2> 2821335 INFO  (coreLoadExecutor-11302-thread-1-processing-n:127.0.0.1:58177_n_v%2Fn) [n:127.0.0.1:58177_n_v%2Fn c:control_collection   x:collection1] o.a.s.u.CommitTracker Soft AutoCommit: disabled
   [junit4]   2> 2821336 INFO  (coreLoadExecutor-11302-thread-1-processing-n:127.0.0.1:58177_n_v%2Fn) [n:127.0.0.1:58177_n_v%2Fn c:control_collection   x:collection1] o.a.s.u.RandomMergePolicy RandomMergePolicy wrapping class org.apache.lucene.index.TieredMergePolicy: [TieredMergePolicy: maxMergeAtOnce=46, maxMergeAtOnceExplicit=28, maxMergedSegmentMB=79.58203125, floorSegmentMB=0.236328125, forceMergeDeletesPctAllowed=6.645236615222546, segmentsPerTier=25.0, maxCFSSegmentSizeMB=8.796093022207999E12, noCFSRatio=0.4294753050476081
   [junit4]   2> 2821347 INFO  (coreLoadExecutor-11302-thread-1-processing-n:127.0.0.1:58177_n_v%2Fn) [n:127.0.0.1:58177_n_v%2Fn c:control_collection   x:collection1] o.a.s.s.SolrIndexSearcher Opening [Searcher@33bef9bc[collection1] main]
   [junit4]   2> 2821349 INFO  (coreLoadExecutor-11302-thread-1-processing-n:127.0.0.1:58177_n_v%2Fn) [n:127.0.0.1:58177_n_v%2Fn c:control_collection   x:collection1] o.a.s.r.ManagedResourceStorage Configured ZooKeeperStorageIO with znodeBase: /configs/conf1
   [junit4]   2> 2821350 INFO  (coreLoadExecutor-11302-thread-1-processing-n:127.0.0.1:58177_n_v%2Fn) [n:127.0.0.1:58177_n_v%2Fn c:control_collection   x:collection1] o.a.s.r.ManagedResourceStorage Loaded null at path _rest_managed.json using ZooKeeperStorageIO:path=/configs/conf1
   [junit4]   2> 2821350 INFO  (coreLoadExecutor-11302-thread-1-processing-n:127.0.0.1:58177_n_v%2Fn) [n:127.0.0.1:58177_n_v%2Fn c:control_collection   x:collection1] o.a.s.h.ReplicationHandler Commits will be reserved for  10000
   [junit4]   2> 2821351 INFO  (searcherExecutor-11303-thread-1-processing-n:127.0.0.1:58177_n_v%2Fn x:collection1 c:control_collection) [n:127.0.0.1:58177_n_v%2Fn c:control_collection   x:collection1] o.a.s.c.SolrCore [collection1] Registered new searcher Searcher@33bef9bc[collection1] main{ExitableDirectoryReader(UninvertingDirectoryReader())}
   [junit4]   2> 2821351 INFO  (coreLoadExecutor-11302-thread-1-processing-n:127.0.0.1:58177_n_v%2Fn) [n:127.0.0.1:58177_n_v%2Fn c:control_collection   x:collection1] o.a.s.u.UpdateLog Could not find max version in index or recent updates, using new clock 1555343118215151616
   [junit4]   2> 2821362 INFO  (coreZkRegister-11295-thread-1-processing-n:127.0.0.1:58177_n_v%2Fn x:collection1 c:control_collection) [n:127.0.0.1:58177_n_v%2Fn c:control_collection s:shard1 r:core_node1 x:collection1] o.a.s.c.ShardLeaderElectionContext Enough replicas found to continue.
   [junit4]   2> 2821362 INFO  (coreZkRegister-11295-thread-1-processing-n:127.0.0.1:58177_n_v%2Fn x:collection1 c:control_collection) [n:127.0.0.1:58177_n_v%2Fn c:control_collection s:shard1 r:core_node1 x:collection1] o.a.s.c.ShardLeaderElectionContext I may be the new leader - try and sync
   [junit4]   2> 2821362 INFO  (coreZkRegister-11295-thread-1-processing-n:127.0.0.1:58177_n_v%2Fn x:collection1 c:control_collection) [n:127.0.0.1:58177_n_v%2Fn c:control_collection s:shard1 r:core_node1 x:collection1] o.a.s.c.SyncStrategy Sync replicas to http://127.0.0.1:58177/n_v/n/collection1/
   [junit4]   2> 2821362 INFO  (coreZkRegister-11295-thread-1-processing-n:127.0.0.1:58177_n_v%2Fn x:collection1 c:control_collection) [n:127.0.0.1:58177_n_v%2Fn c:control_collection s:shard1 r:core_node1 x:collection1] o.a.s.c.SyncStrategy Sync Success - now sync replicas to me
   [junit4]   2> 2821362 INFO  (coreZkRegister-11295-thread-1-processing-n:127.0.0.1:58177_n_v%2Fn x:collection1 c:control_collection) [n:127.0.0.1:58177_n_v%2Fn c:control_collection s:shard1 r:core_node1 x:collection1] o.a.s.c.SyncStrategy http://127.0.0.1:58177/n_v/n/collection1/ has no replicas
   [junit4]   2> 2821369 INFO  (coreZkRegister-11295-thread-1-processing-n:127.0.0.1:58177_n_v%2Fn x:collection1 c:control_collection) [n:127.0.0.1:58177_n_v%2Fn c:control_collection s:shard1 r:core_node1 x:collection1] o.a.s.c.ShardLeaderElectionContext I am the new leader: http://127.0.0.1:58177/n_v/n/collection1/ shard1
   [junit4]   2> 2821526 INFO  (coreZkRegister-11295-thread-1-processing-n:127.0.0.1:58177_n_v%2Fn x:collection1 c:control_collection) [n:127.0.0.1:58177_n_v%2Fn c:control_collection s:shard1 r:core_node1 x:collection1] o.a.s.c.ZkController I am the leader, no recovery necessary
   [junit4]   2> 2821833 INFO  (TEST-TestNamedUpdateProcessors.test-seed#[33A3A6F28D0BE96F]) [    ] o.a.s.c.c.ZkStateReader Updated live nodes from ZooKeeper... (0) -> (1)
   [junit4]   2> 2821835 INFO  (TEST-TestNamedUpdateProcessors.test-seed#[33A3A6F28D0BE96F]) [    ] o.a.s.c.s.i.ZkClientClusterStateProvider Cluster at 127.0.0.1:58174/solr ready
   [junit4]   2> 2821836 INFO  (TEST-TestNamedUpdateProcessors.test-seed#[33A3A6F28D0BE96F]) [    ] o.a.s.c.ChaosMonkey monkey: init - expire sessions:false cause connection loss:false
   [junit4]   2> 2822262 INFO  (TEST-TestNamedUpdateProcessors.test-seed#[33A3A6F28D0BE96F]) [    ] o.a.s.SolrTestCaseJ4 Writing core.properties file to /Users/jenkins/workspace/Lucene-Solr-master-MacOSX/solr/build/solr-core/test/J0/temp/solr.update.processor.TestNamedUpdateProcessors_33A3A6F28D0BE96F-001/shard-1-001/cores/collection1
   [junit4]   2> 2822265 INFO  (TEST-TestNamedUpdateProcessors.test-seed#[33A3A6F28D0BE96F]) [    ] o.a.s.c.AbstractFullDistribZkTestBase create jetty 1 in directory /Users/jenkins/workspace/Lucene-Solr-master-MacOSX/solr/build/solr-core/test/J0/temp/solr.update.processor.TestNamedUpdateProcessors_33A3A6F28D0BE96F-001/shard-1-001
   [junit4]   2> 2822266 INFO  (TEST-TestNamedUpdateProcessors.test-seed#[33A3A6F28D0BE96F]) [    ] o.e.j.s.Server jetty-9.3.14.v20161028
   [junit4]   2> 2822269 INFO  (TEST-TestNamedUpdateProcessors.test-seed#[33A3A6F28D0BE96F]) [    ] o.e.j.s.h.ContextHandler Started o.e.j.s.ServletContextHandler@6749d0bb{/n_v/n,null,AVAILABLE}
   [junit4]   2> 2822269 INFO  (TEST-TestNamedUpdateProcessors.test-seed#[33A3A6F28D0BE96F]) [    ] o.e.j.s.AbstractConnector Started ServerConnector@4280dde0{HTTP/1.1,[http/1.1]}{127.0.0.1:58183}
   [junit4]   2> 2822270 INFO  (TEST-TestNamedUpdateProcessors.test-seed#[33A3A6F28D0BE96F]) [    ] o.e.j.s.Server Started @2829584ms
   [junit4]   2> 2822270 INFO  (TEST-TestNamedUpdateProcessors.test-seed#[33A3A6F28D0BE96F]) [    ] o.a.s.c.s.e.JettySolrRunner Jetty properties: {solr.data.dir=/Users/jenkins/workspace/Lucene-Solr-master-MacOSX/solr/build/solr-core/test/J0/temp/solr.update.processor.TestNamedUpdateProcessors_33A3A6F28D0BE96F-001/tempDir-001/jetty1, solrconfig=solrconfig.xml, hostContext=/n_v/n, hostPort=58183, coreRootDirectory=/Users/jenkins/workspace/Lucene-Solr-master-MacOSX/solr/build/solr-core/test/J0/../../../../../../../../../Users/jenkins/workspace/Lucene-Solr-master-MacOSX/solr/build/solr-core/test/J0/temp/solr.update.processor.TestNamedUpdateProcessors_33A3A6F28D0BE96F-001/shard-1-001/cores}
   [junit4]   2> 2822271 ERROR (TEST-TestNamedUpdateProcessors.test-seed#[33A3A6F28D0BE96F]) [    ] o.a.s.s.StartupLoggingUtils Missing Java Option solr.log.dir. Logging may be missing or incomplete.
   [junit4]   2> 2822271 INFO  (TEST-TestNamedUpdateProcessors.test-seed#[33A3A6F28D0BE96F]) [    ] o.a.s.s.SolrDispatchFilter  ___      _       Welcome to Apache Solr? version 7.0.0
   [junit4]   2> 2822271 INFO  (TEST-TestNamedUpdateProcessors.test-seed#[33A3A6F28D0BE96F]) [    ] o.a.s.s.SolrDispatchFilter / __| ___| |_ _   Starting in cloud mode on port null
   [junit4]   2> 2822271 INFO  (TEST-TestNamedUpdateProcessors.test-seed#[33A3A6F28D0BE96F]) [    ] o.a.s.s.SolrDispatchFilter \__ \/ _ \ | '_|  Install dir: null
   [junit4]   2> 2822271 INFO  (TEST-TestNamedUpdateProcessors.test-seed#[33A3A6F28D0BE96F]) [    ] o.a.s.s.SolrDispatchFilter |___/\___/_|_|    Start time: 2017-01-01T17:13:05.961Z
   [junit4]   2> 2822278 INFO  (TEST-TestNamedUpdateProcessors.test-seed#[33A3A6F28D0BE96F]) [    ] o.a.s.s.SolrDispatchFilter Loading solr.xml from SolrHome (not found in ZooKeeper)
   [junit4]   2> 2822278 INFO  (TEST-TestNamedUpdateProcessors.test-seed#[33A3A6F28D0BE96F]) [    ] o.a.s.c.SolrXmlConfig Loading container configuration from /Users/jenkins/workspace/Lucene-Solr-master-MacOSX/solr/build/solr-core/test/J0/temp/solr.update.processor.TestNamedUpdateProcessors_33A3A6F28D0BE96F-001/shard-1-001/solr.xml
   [junit4]   2> 2822298 INFO  (TEST-TestNamedUpdateProcessors.test-seed#[33A3A6F28D0BE96F]) [    ] o.a.s.c.ZkContainer Zookeeper client=127.0.0.1:58174/solr
   [junit4]   2> 2822326 INFO  (TEST-TestNamedUpdateProcessors.test-seed#[33A3A6F28D0BE96F]) [n:127.0.0.1:58183_n_v%2Fn    ] o.a.s.c.c.ZkStateReader Updated live nodes from ZooKeeper... (0) -> (1)
   [junit4]   2> 2822337 INFO  (TEST-TestNamedUpdateProcessors.test-seed#[33A3A6F28D0BE96F]) [n:127.0.0.1:58183_n_v%2Fn    ] o.a.s.c.ZkController Register node as live in ZooKeeper:/live_nodes/127.0.0.1:58183_n_v%2Fn
   [junit4]   2> 2822341 INFO  (zkCallback-3944-thread-2-processing-n:127.0.0.1:58177_n_v%2Fn) [n:127.0.0.1:58177_n_v%2Fn    ] o.a.s.c.c.ZkStateReader Updated live nodes from ZooKeeper... (1) -> (2)
   [junit4]   2> 2822342 INFO  (zkCallback-3948-thread-1) [    ] o.a.s.c.c.ZkStateReader Updated live nodes from ZooKeeper... (1) -> (2)
   [junit4]   2> 2822343 INFO  (zkCallback-3953-thread-1-processing-n:127.0.0.1:58183_n_v%2Fn) [n:127.0.0.1:58183_n_v%2Fn    ] o.a.s.c.c.ZkStateReader Updated live nodes from ZooKeeper... (1) -> (2)
   [junit4]   2> 2822407 INFO  (TEST-TestNamedUpdateProcessors.test-seed#[33A3A6F28D0BE96F]) [n:127.0.0.1:58183_n_v%2Fn    ] o.a.s.c.CorePropertiesLocator Found 1 core definitions underneath /Users/jenkins/workspace/Lucene-Solr-master-MacOSX/solr/build/solr-core/test/J0/../../../../../../../../../Users/jenkins/workspace/Lucene-Solr-master-MacOSX/solr/build/solr-core/test/J0/temp/solr.update.processor.TestNamedUpdateProcessors_33A3A6F28D0BE96F-001/shard-1-001/cores
   [junit4]   2> 2822407 INFO  (TEST-TestNamedUpdateProcessors.test-seed#[33A3A6F28D0BE96F]) [n:127.0.0.1:58183_n_v%2Fn    ] o.a.s.c.CorePropertiesLocator Cores are: [collection1]
   [junit4]   2> 2822411 INFO  (OverseerStateUpdate-97208944762355716-127.0.0.1:58177_n_v%2Fn-n_0000000000) [n:127.0.0.1:58177_n_v%2Fn    ] o.a.s.c.o.ReplicaMutator Assigning new node to shard shard=shard2
   [junit4]   2> 2823459 WARN  (coreLoadExecutor-11313-thread-1-processing-n:127.0.0.1:58183_n_v%2Fn) [n:127.0.0.1:58183_n_v%2Fn c:collection1   x:collection1] o.a.s.c.Config Beginning with Solr 5.5, <mergePolicy> is deprecated, use <mergePolicyFactory> instead.
   [junit4]   2> 2823460 INFO  (coreLoadExecutor-11313-thread-1-processing-n:127.0.0.1:58183_n_v%2Fn) [n:127.0.0.1:58183_n_v%2Fn c:collection1   x:collection1] o.a.s.c.SolrConfig Using Lucene MatchVersion: 7.0.0
   [junit4]   2> 2823480 INFO  (coreLoadExecutor-11313-thread-1-processing-n:127.0.0.1:58183_n_v%2Fn) [n:127.0.0.1:58183_n_v%2Fn c:collection1   x:collection1] o.a.s.s.IndexSchema [collection1] Schema name=test
   [junit4]   2> 2823561 WARN  (coreLoadExecutor-11313-thread-1-processing-n:127.0.0.1:58183_n_v%2Fn) [n:127.0.0.1:58183_n_v%2Fn c:collection1   x:collection1] o.a.s.s.IndexSchema [collection1] default search field in schema is text. WARNING: Deprecated, please use 'df' on request instead.
   [junit4]   2> 2823563 INFO  (coreLoadExecutor-11313-thread-1-processing-n:127.0.0.1:58183_n_v%2Fn) [n:127.0.0.1:58183_n_v%2Fn c:collection1   x:collection1] o.a.s.s.IndexSchema Loaded schema test/1.0 with uniqueid field id
   [junit4]   2> 2823586 INFO  (coreLoadExecutor-11313-thread-1-processing-n:127.0.0.1:58183_n_v%2Fn) [n:127.0.0.1:58183_n_v%2Fn c:collection1   x:collection1] o.a.s.c.CoreContainer Creating SolrCore 'collection1' using configuration from collection collection1
   [junit4]   2> 2823586 INFO  (coreLoadExecutor-11313-thread-1-processing-n:127.0.0.1:58183_n_v%2Fn) [n:127.0.0.1:58183_n_v%2Fn c:collection1   x:collection1] o.a.s.c.SolrCore [[collection1] ] Opening new SolrCore at [/Users/jenkins/workspace/Lucene-Solr-master-MacOSX/solr/build/solr-core/test/J0/temp/solr.update.processor.TestNamedUpdateProcessors_33A3A6F28D0BE96F-001/shard-1-001/cores/collection1], dataDir=[/Users/jenkins/workspace/Lucene-Solr-master-MacOSX/solr/build/solr-core/test/J0/../../../../../../../../../Users/jenkins/workspace/Lucene-Solr-master-MacOSX/solr/build/solr-core/test/J0/temp/solr.update.processor.TestNamedUpdateProcessors_33A3A6F28D0BE96F-001/shard-1-001/cores/collection1/data/]
   [junit4]   2> 2823587 INFO  (coreLoadExecutor-11313-thread-1-processing-n:127.0.0.1:58183_n_v%2Fn) [n:127.0.0.1:58183_n_v%2Fn c:collection1   x:collection1] o.a.s.c.JmxMonitoredMap JMX monitoring is enabled. Adding Solr mbeans to JMX Server: com.sun.jmx.mbeanserver.JmxMBeanServer@7a0a8e8f
   [junit4]   2> 2823587 INFO  (coreLoadExecutor-11313-thread-1-processing-n:127.0.0.1:58183_n_v%2Fn) [n:127.0.0.1:58183_n_v%2Fn c:collection1   x:collection1] o.a.s.u.RandomMergePolicy RandomMergePolicy wrapping class org.apache.lucene.index.TieredMergePolicy: [TieredMergePolicy: maxMergeAtOnce=16, maxMergeAtOnceExplicit=17, maxMergedSegmentMB=1.0498046875, floorSegmentMB=0.4462890625, forceMergeDeletesPctAllowed=27.28036057018505, segmentsPerTier=19.0, maxCFSSegmentSizeMB=8.796093022207999E12, noCFSRatio=1.0
   [junit4]   2> 2823594 WARN  (coreLoadExecutor-11313-thread-1-processing-n:127.0.0.1:58183_n_v%2Fn) [n:127.0.0.1:58183_n_v%2Fn c:collection1   x:collection1] o.a.s.c.RequestHandlers INVALID paramSet a in requestHandler {type = requestHandler,name = /dump,class = DumpRequestHandler,attributes = {initParams=a, name=/dump, class=DumpRequestHandler},args = {defaults={a=A,b=B}}}
   [junit4]   2> 2823618 INFO  (coreLoadExecutor-11313-thread-1-processing-n:127.0.0.1:58183_n_v%2Fn) [n:127.0.0.1:58183_n_v%2Fn c:collection1   x:collection1] o.a.s.u.UpdateHandler Using UpdateLog implementation: org.apache.solr.update.UpdateLog
   [junit4]   2> 2823619 INFO  (coreLoadExecutor-11313-thread-1-processing-n:127.0.0.1:58183_n_v%2Fn) [n:127.0.0.1:58183_n_v%2Fn c:collection1   x:collection1] o.a.s.u.UpdateLog Initializing UpdateLog: dataDir= defaultSyncLevel=FLUSH numRecordsToKeep=100 maxNumLogsToKeep=10 numVersionBuckets=65536
   [junit4]   2> 2823620 INFO  (coreLoadExecutor-11313-thread-1-processing-n:127.0.0.1:58183_n_v%2Fn) [n:127.0.0.1:58183_n_v%2Fn c:collection1   x:collection1] o.a.s.u.CommitTracker Hard AutoCommit: disabled
   [junit4]   2> 2823621 INFO  (coreLoadExecutor-11313-thread-1-processing-n:127.0.0.1:58183_n_v%2Fn) [n:127.0.0.1:58183_n_v%2Fn c:collection1   x:collection1] o.a.s.u.CommitTracker Soft AutoCommit: disabled
   [junit4]   2> 2823621 INFO  (coreLoadExecutor-11313-thread-1-processing-n:127.0.0.1:58183_n_v%2Fn) [n:127.0.0.1:58183_n_v%2Fn c:collection1   x:collection1] o.a.s.u.RandomMergePolicy RandomMergePolicy wrapping class org.apache.lucene.index.TieredMergePolicy: [TieredMergePolicy: maxMergeAtOnce=46, maxMergeAtOnceExplicit=28, maxMergedSegmentMB=79.58203125, floorSegmentMB=0.236328125, forceMergeDeletesPctAllowed=6.645236615222546, segmentsPerTier=25.0, maxCFSSegmentSizeMB=8.796093022207999E12, noCFSRatio=0.4294753050476081
   [junit4]   2> 2823622 INFO  (coreLoadExecutor-11313-thread-1-processing-n:127.0.0.1:58183_n_v%2Fn) [n:127.0.0.1:58183_n_v%2Fn c:collection1   x:collection1] o.a.s.s.SolrIndexSearcher Opening [Searcher@28ae9426[collection1] main]
   [junit4]   2> 2823624 INFO  (coreLoadExecutor-11313-thread-1-processing-n:127.0.0.1:58183_n_v%2Fn) [n:127.0.0.1:58183_n_v%2Fn c:collection1   x:collection1] o.a.s.r.ManagedResourceStorage Configured ZooKeeperStorageIO with znodeBase: /configs/conf1
   [junit4]   2> 2823625 INFO  (coreLoadExecutor-11313-thread-1-processing-n:127.0.0.1:58183_n_v%2Fn) [n:127.0.0.1:58183_n_v%2Fn c:collection1   x:collection1] o.a.s.r.ManagedResourceStorage Loaded null at path _rest_managed.json using ZooKeeperStorageIO:path=/configs/conf1
   [junit4]   2> 2823625 INFO  (coreLoadExecutor-11313-thread-1-processing-n:127.0.0.1:58183_n_v%2Fn) [n:127.0.0.1:58183_n_v%2Fn c:collection1   x:collection1] o.a.s.h.ReplicationHandler Commits will be reserved for  10000
   [junit4]   2> 2823626 INFO  (searcherExecutor-11314-thread-1-processing-n:127.0.0.1:58183_n_v%2Fn x:collection1 c:collection1) [n:127.0.0.1:58183_n_v%2Fn c:collection1   x:collection1] o.a.s.c.SolrCore [collection1] Registered new searcher Searcher@28ae9426[collection1] main{ExitableDirectoryReader(UninvertingDirectoryReader())}
   [junit4]   2> 2823626 INFO  (coreLoadExecutor-11313-thread-1-processing-n:127.0.0.1:58183_n_v%2Fn) [n:127.0.0.1:58183_n_v%2Fn c:collection1   x:collection1] o.a.s.u.UpdateLog Could not find max version in index or recent updates, using new clock 1555343120600662016
   [junit4]   2> 2823639 INFO  (coreZkRegister-11308-thread-1-processing-n:127.0.0.1:58183_n_v%2Fn x:collection1 c:collection1) [n:127.0.0.1:58183_n_v%2Fn c:collection1 s:shard2 r:core_node1 x:collection1] o.a.s.c.ShardLeaderElectionContext Enough replicas found to continue.
   [junit4]   2> 2823639 INFO  (coreZkRegister-11308-thread-1-processing-n:127.0.0.1:58183_n_v%2Fn x:collection1 c:collection1) [n:127.0.0.1:58183_n_v%2Fn c:collection1 s:shard2 r:core_node1 x:collection1] o.a.s.c.ShardLeaderElectionContext I may be the new leader - try and sync
   [junit4]   2> 2823639 INFO  (coreZkRegister-11308-thread-1-processing-n:127.0.0.1:58183_n_v%2Fn x:collection1 c:collection1) [n:127.0.0.1:58183_n_v%2Fn c:collection1 s:shard2 r:core_node1 x:collection1] o.a.s.c.SyncStrategy Sync replicas to http://127.0.0.1:58183/n_v/n/collection1/
   [junit4]   2> 2823639 INFO  (coreZkRegister-11308-thread-1-processing-n:127.0.0.1:58183_n_v%2Fn x:collection1 c:collection1) [n:127.0.0.1:58183_n_v%2Fn c:collection1 s:shard2 r:core_node1 x:collection1] o.a.s.c.SyncStrategy Sync Success - now sync replicas to me
   [junit4]   2> 2823639 INFO  (coreZkRegister-11308-thread-1-processing-n:127.0.0.1:58183_n_v%2Fn x:collection1 c:collection1) [n:127.0.0.1:58183_n_v%2Fn c:collection1 s:shard2 r:core_node1 x:collection1] o.a.s.c.SyncStrategy http://127.0.0.1:58183/n_v/n/collection1/ has no replicas
   [junit4]   2> 2823648 INFO  (coreZkRegister-11308-thread-1-processing-n:127.0.0.1:58183_n_v%2Fn x:collection1 c:collection1) [n:127.0.0.1:58183_n_v%2Fn c:collection1 s:shard2 r:core_node1 x:collection1] o.a.s.c.ShardLeaderElectionContext I am the new leader: http://127.0.0.1:58183/n_v/n/collection1/ shard2
   [junit4]   2> 2823813 INFO  (coreZkRegister-11308-thread-1-processing-n:127.0.0.1:58183_n_v%2Fn x:collection1 c:collection1) [n:127.0.0.1:58183_n_v%2Fn c:collection1 s:shard2 r:core_node1 x:collection1] o.a.s.c.ZkController I am the leader, no recovery necessary
   [junit4]   2> 2824033 INFO  (TEST-TestNamedUpdateProcessors.test-seed#[33A3A6F28D0BE96F]) [    ] o.a.s.SolrTestCaseJ4 Writing core.properties file to /Users/jenkins/workspace/Lucene-Solr-master-MacOSX/solr/build/solr-core/test/J0/temp/solr.update.processor.TestNamedUpdateProcessors_33A3A6F28D0BE96F-001/shard-2-001/cores/collection1
   [junit4]   2> 2824035 INFO  (TEST-TestNamedUpdateProcessors.test-seed#[33A3A6F28D0BE96F]) [    ] o.a.s.c.AbstractFullDistribZkTestBase create jetty 2 in directory /Users/jenkins/workspace/Lucene-Solr-master-MacOSX/solr/build/solr-core/test/J0/temp/solr.update.processor.TestNamedUpdateProcessors_33A3A6F28D0BE96F-001/shard-2-001
   [junit4]   2> 2824036 INFO  (TEST-TestNamedUpdateProcessors.test-seed#[33A3A6F28D0BE96F]) [    ] o.e.j.s.Server jetty-9.3.14.v20161028
   [junit4]   2> 2824038 INFO  (TEST-TestNamedUpdateProcessors.test-seed#[33A3A6F28D0BE96F]) [    ] o.e.j.s.h.ContextHandler Started o.e.j.s.ServletContextHandler@2e3024e7{/n_v/n,null,AVAILABLE}
   [junit4]   2> 2824038 INFO  (TEST-TestNamedUpdateProcessors.test-seed#[33A3A6F28D0BE96F]) [    ] o.e.j.s.AbstractConnector Started ServerConnector@2e8e2145{HTTP/1.1,[http/1.1]}{127.0.0.1:58189}
   [junit4]   2> 2824038 INFO  (TEST-TestNamedUpdateProcessors.test-seed#[33A3A6F28D0BE96F]) [    ] o.e.j.s.Server Started @2831353ms
   [junit4]   2> 2824039 INFO  (TEST-TestNamedUpdateProcessors.test-seed#[33A3A6F28D0BE96F]) [    ] o.a.s.c.s.e.JettySolrRunner Jetty properties: {solr.data.dir=/Users/jenkins/workspace/Lucene-Solr-master-MacOSX/solr/build/solr-core/test/J0/temp/solr.update.processor.TestNamedUpdateProcessors_33A3A6F28D0BE96F-001/tempDir-001/jetty2, solrconfig=solrconfig.xml, hostContext=/n_v/n, hostPort=58189, coreRootDirectory=/Users/jenkins/workspace/Lucene-Solr-master-MacOSX/solr/build/solr-core/test/J0/../../../../../../../../../Users/jenkins/workspace/Lucene-Solr-master-MacOSX/solr/build/solr-core/test/J0/temp/solr.update.processor.TestNamedUpdateProcessors_33A3A6F28D0BE96F-001/shard-2-001/cores}
   [junit4]   2> 2824040 ERROR (TEST-TestNamedUpdateProcessors.test-seed#[33A3A6F28D0BE96F]) [    ] o.a.s.s.StartupLoggingUtils Missing Java Option solr.log.dir. Logging may be missing or incomplete.
   [junit4]   2> 2824040 INFO  (TEST-TestNamedUpdateProcessors.test-seed#[33A3A6F28D0BE96F]) [    ] o.a.s.s.SolrDispatchFilter  ___      _       Welcome to Apache Solr? version 7.0.0
   [junit4]   2> 2824040 INFO  (TEST-TestNamedUpdateProcessors.test-seed#[33A3A6F28D0BE96F]) [    ] o.a.s.s.SolrDispatchFilter / __| ___| |_ _   Starting in cloud mode on port null
   [junit4]   2> 2824041 INFO  (TEST-TestNamedUpdateProcessors.test-seed#[33A3A6F28D0BE96F]) [    ] o.a.s.s.SolrDispatchFilter \__ \/ _ \ | '_|  Install dir: null
   [junit4]   2> 2824041 INFO  (TEST-TestNamedUpdateProcessors.test-seed#[33A3A6F28D0BE96F]) [    ] o.a.s.s.SolrDispatchFilter |___/\___/_|_|    Start time: 2017-01-01T17:13:07.731Z
   [junit4]   2> 2824046 INFO  (TEST-TestNamedUpdateProcessors.test-seed#[33A3A6F28D0BE96F]) [    ] o.a.s.s.SolrDispatchFilter Loading solr.xml from SolrHome (not found in ZooKeeper)
   [junit4]   2> 2824046 INFO  (TEST-TestNamedUpdateProcessors.test-seed#[33A3A6F28D0BE96F]) [    ] o.a.s.c.SolrXmlConfig Loading container configuration from /Users/jenkins/workspace/Lucene-Solr-master-MacOSX/solr/build/solr-core/test/J0/temp/solr.update.processor.TestNamedUpdateProcessors_33A3A6F28D0BE96F-001/shard-2-001/solr.xml
   [junit4]   2> 2824064 INFO  (TEST-TestNamedUpdateProcessors.test-seed#[33A3A6F28D0BE96F]) [    ] o.a.s.c.ZkContainer Zookeeper client=127.0.0.1:58174/solr
   [junit4]   2> 2824086 INFO  (TEST-TestNamedUpdateProcessors.test-seed#[33A3A6F28D0BE96F]) [n:127.0.0.1:58189_n_v%2Fn    ] o.a.s.c.c.ZkStateReader Updated live nodes from ZooKeeper... (0) -> (2)
   [junit4]   2> 2824098 INFO  (TEST-TestNamedUpdateProcessors.test-seed#[33A3A6F28D0BE96F]) [n:127.0.0.1:58189_n_v%2Fn    ] o.a.s.c.ZkController Register node as live in ZooKeeper:/live_nodes/127.0.0.1:58189_n_v%2Fn
   [junit4]   2> 2824102 INFO  (zkCallback-3953-thread-1-processing-n:127.0.0.1:58183_n_v%2Fn) [n:127.0.0.1:58183_n_v%2Fn    ] o.a.s.c.c.ZkStateReader Updated live nodes from ZooKeeper... (2) -> (3)
   [junit4]   2> 2824102 INFO  (zkCallback-3948-thread-1) [    ] o.a.s.c.c.ZkStateReader Updated live nodes from ZooKeeper... (2) -> (3)
   [junit4]   2> 2824102 INFO  (zkCallback-3944-thread-3-processing-n:127.0.0.1:58177_n_v%2Fn) [n:127.0.0.1:58177_n_v%2Fn    ] o.a.s.c.c.ZkStateReader Updated live nodes from ZooKeeper... (2) -> (3)
   [junit4]   2> 2824103 INFO  (zkCallback-3959-thread-1-processing-n:127.0.0.1:58189_n_v%2Fn) [n:127.0.0.1:58189_n_v%2Fn    ] o.a.s.c.c.ZkStateReader Updated live nodes from ZooKeeper... (2) -> (3)
   [junit4]   2> 2824188 INFO  (TEST-TestNamedUpdateProcessors.test-seed#[33A3A6F28D0BE96F]) [n:127.0.0.1:58189_n_v%2Fn    ] o.a.s.c.CorePropertiesLocator Found 1 core definitions underneath /Users/jenkins/workspace/Lucene-Solr-master-MacOSX/solr/build/solr-core/test/J0/../../../../../../../../../Users/jenkins/workspace/Lucene-Solr-master-MacOSX/solr/build/solr-core/test/J0/temp/solr.update.processor.TestNamedUpdateProcessors_33A3A6F28D0BE96F-001/shard-2-001/cores
   [junit4]   2> 2824188 INFO  (TEST-TestNamedUpdateProcessors.test-seed#[33A3A6F28D0BE96F]) [n:127.0.0.1:58189_n_v%2Fn    ] o.a.s.c.CorePropertiesLocator Cores are: [collection1]
   [junit4]   2> 2824192 INFO  (OverseerStateUpdate-97208944762355716-127.0.0.1:58177_n_v%2Fn-n_0000000000) [n:127.0.0.1:58177_n_v%2Fn    ] o.a.s.c.o.ReplicaMutator Assigning new node to shard shard=shard1
   [junit4]   2> 2825220 WARN  (coreLoadExecutor-11324-thread-1-processing-n:127.0.0.1:58189_n_v%2Fn) [n:127.0.0.1:58189_n_v%2Fn c:collection1   x:collection1] o.a.s.c.Config Beginning with Solr 5.5, <mergePolicy> is deprecated, use <mergePolicyFactory> instead.
   [junit4]   2> 2825221 INFO  (coreLoadExecutor-11324-thread-1-processing-n:127.0.0.1:58189_n_v%2Fn) [n:127.0.0.1:58189_n_v%2Fn c:collection1   x:collection1] o.a.s.c.SolrConfig Using Lucene MatchVersion: 7.0.0
   [junit4]   2> 2825263 INFO  (coreLoadExecutor-11324-thread-1-processing-n:127.0.0.1:58189_n_v%2Fn) [n:127.0.0.1:58189_n_v%2Fn c:collection1   x:collection1] o.a.s.s.IndexSchema [collection1] Schema name=test
   [junit4]   2> 2825374 WARN  (coreLoadExecutor-11324-thread-1-processing-n:127.0.0.1:58189_n_v%2Fn) [n:127.0.0.1:58189_n_v%2Fn c:collection1   x:collection1] o.a.s.s.IndexSchema [collection1] default search field in schema is text. WARNING: Deprecated, please use 'df' on request instead.
   [junit4]   2> 2825395 INFO  (coreLoadExecutor-11324-thread-1-processing-n:127.0.0.1:58189_n_v%2Fn) [n:127.0.0.1:58189_n_v%2Fn c:collection1   x:collection1] o.a.s.s.IndexSchema Loaded schema test/1.0 with uniqueid field id
   [junit4]   2> 2825418 INFO  (coreLoadExecutor-11324-thread-1-processing-n:127.0.0.1:58189_n_v%2Fn) [n:127.0.0.1:58189_n_v%2Fn c:collection1   x:collection1] o.a.s.c.CoreContainer Creating SolrCore 'collection1' using configuration from collection collection1
   [junit4]   2> 2825419 INFO  (coreLoadExecutor-11324-thread-1-processing-n:127.0.0.1:58189_n_v%2Fn) [n:127.0.0.1:58189_n_v%2Fn c:collection1   x:collection1] o.a.s.c.SolrCore [[collection1] ] Opening new SolrCore at [/Users/jenkins/workspace/Lucene-Solr-master-MacOSX/solr/build/solr-core/test/J0/temp/solr.update.processor.TestNamedUpdateProcessors_33A3A6F28D0BE96F-001/shard-2-001/cores/collection1], dataDir=[/Users/jenkins/workspace/Lucene-Solr-master-MacOSX/solr/build/solr-core/test/J0/../../../../../../../../../Users/jenkins/workspace/Lucene-Solr-master-MacOSX/solr/build/solr-core/test/J0/temp/solr.update.processor.TestNamedUpdateProcessors_33A3A6F28D0BE96F-001/shard-2-001/cores/collection1/data/]
   [junit4]   2> 2825419 INFO  (coreLoadExecutor-11324-thread-1-processing-n:127.0.0.1:58189_n_v%2Fn) [n:127.0.0.1:58189_n_v%2Fn c:collection1   x:collection1] o.a.s.c.JmxMonitoredMap JMX monitoring is enabled. Adding Solr mbeans to JMX Server: com.sun.jmx.mbeanserver.JmxMBeanServer@7a0a8e8f
   [junit4]   2> 2825420 INFO  (coreLoadExecutor-11324-thread-1-processing-n:127.0.0.1:58189_n_v%2Fn) [n:127.0.0.1:58189_n_v%2Fn c:collection1   x:collection1] o.a.s.u.RandomMergePolicy RandomMergePolicy wrapping class org.apache.lucene.index.TieredMergePolicy: [TieredMergePolicy: maxMergeAtOnce=16, maxMergeAtOnceExplicit=17, maxMergedSegmentMB=1.0498046875, floorSegmentMB=0.4462890625, forceMergeDeletesPctAllowed=27.28036057018505, segmentsPerTier=19.0, maxCFSSegmentSizeMB=8.796093022207999E12, noCFSRatio=1.0
   [junit4]   2> 2825425 WARN  (coreLoadExecutor-11324-thread-1-processing-n:127.0.0.1:58189_n_v%2Fn) [n:127.0.0.1:58189_n_v%2Fn c:collection1   x:collection1] o.a.s.c.RequestHandlers INVALID paramSet a in requestHandler {type = requestHandler,name = /dump,class = DumpRequestHandler,attributes = {initParams=a, name=/dump, class=DumpRequestHandler},args = {defaults={a=A,b=B}}}
   [junit4]   2> 2825439 INFO  (coreLoadExecutor-11324-thread-1-processing-n:127.0.0.1:58189_n_v%2Fn) [n:127.0.0.1:58189_n_v%2Fn c:collection1   x:collection1] o.a.s.u.UpdateHandler Using UpdateLog implementation: org.apache.solr.update.UpdateLog
   [junit4]   2> 2825439 INFO  (coreLoadExecutor-11324-thread-1-processing-n:127.0.0.1:58189_n_v%2Fn) [n:127.0.0.1:58189_n_v%2Fn c:collection1   x:collection1] o.a.s.u.UpdateLog Initializing UpdateLog: dataDir= defaultSyncLevel=FLUSH numRecordsToKeep=100 maxNumLogsToKeep=10 numVersionBuckets=65536
   [junit4]   2> 2825440 INFO  (coreLoadExecutor-11324-thread-1-processing-n:127.0.0.1:58189_n_v%2Fn) [n:127.0.0.1:58189_n_v%2Fn c:collection1   x:collection1] o.a.s.u.CommitTracker Hard AutoCommit: disabled
   [junit4]   2> 2825440 INFO  (coreLoadExecutor-11324-thread-1-processing-n:127.0.0.1:58189_n_v%2Fn) [n:127.0.0.1:58189_n_v%2Fn c:collection1   x:collection1] o.a.s.u.CommitTracker Soft AutoCommit: disabled
   [junit4]   2> 2825441 INFO  (coreLoadExecutor-11324-thread-1-processing-n:127.0.0.1:58189_n_v%2Fn) [n:127.0.0.1:58189_n_v%2Fn c:collection1   x:collection1] o.a.s.u.RandomMergePolicy RandomMergePolicy wrapping class org.apache.lucene.index.TieredMergePolicy: [TieredMergePolicy: maxMergeAtOnce=46, maxMergeAtOnceExplicit=28, maxMergedSegmentMB=79.58203125, floorSegmentMB=0.236328125, forceMergeDeletesPctAllowed=6.645236615222546, segmentsPerTier=25.0, maxCFSSegmentSizeMB=8.796093022207999E12, noCFSRatio=0.4294753050476081
   [junit4]   2> 2825441 INFO  (coreLoadExecutor-11324-thread-1-processing-n:127.0.0.1:58189_n_v%2Fn) [n:127.0.0.1:58189_n_v%2Fn c:collection1   x:collection1] o.a.s.s.SolrIndexSearcher Opening [Searcher@304a4ae9[collection1] main]
   [junit4]   2> 2825443 INFO  (coreLoadExecutor-11324-thread-1-processing-n:127.0.0.1:58189_n_v%2Fn) [n:127.0.0.1:58189_n_v%2Fn c:collection1   x:collection1] o.a.s.r.ManagedResourceStorage Configured ZooKeeperStorageIO with znodeBase: /configs/conf1
   [junit4]   2> 2825443 INFO  (coreLoadExecutor-11324-thread-1-processing-n:127.0.0.1:58189_n_v%2Fn) [n:127.0.0.1:58189_n_v%2Fn c:collection1   x:collection1] o.a.s.r.ManagedResourceStorage Loaded null at path _rest_managed.json using ZooKeeperStorageIO:path=/configs/conf1
   [junit4]   2> 2825443 INFO  (coreLoadExecutor-11324-thread-1-processing-n:127.0.0.1:58189_n_v%2Fn) [n:127.0.0.1:58189_n_v%2Fn c:collection1   x:collection1] o.a.s.h.ReplicationHandler Commits will be reserved for  10000
   [junit4]   2> 2825445 INFO  (searcherExecutor-11325-thread-1-processing-n:127.0.0.1:58189_n_v%2Fn x:collection1 c:collection1) [n:127.0.0.1:58189_n_v%2Fn c:collection1   x:collection1] o.a.s.c.SolrCore [collection1] Registered new searcher Searcher@304a4ae9[collection1] main{ExitableDirectoryReader(UninvertingDirectoryReader())}
   [junit4]   2> 2825445 INFO  (coreLoadExecutor-11324-thread-1-processing-n:127.0.0.1:58189_n_v%2Fn) [n:127.0.0.1:58189_n_v%2Fn c:collection1   x:collection1] o.a.s.u.UpdateLog Could not find max version in index or recent updates, using new clock 1555343122508021760
   [junit4]   2> 2825454 INFO  (coreZkRegister-11319-thread-1-processing-n:127.0.0.1:58189_n_v%2Fn x:collection1 c:collection1) [n:127.0.0.1:58189_n_v%2Fn c:collection1 s:shard1 r:core_node2 x:collection1] o.a.s.c.ShardLeaderElectionContext Enough replicas found to continue.
   [junit4]   2> 2825455 INFO  (coreZkRegister-11319-thread-1-processing-n:127.0.0.1:58189_n_v%2Fn x:collection1 c:collection1) [n:127.0.0.1:58189_n_v%2Fn c:collection1 s:shard1 r:core_node2 x:collection1] o.a.s.c.ShardLeaderElectionContext I may be the new leader - try and sync
   [junit4]   2> 2825455 INFO  (coreZkRegister-11319-thread-1-processing-n:127.0.0.1:58189_n_v%2Fn x:collection1 c:collection1) [n:127.0.0.1:58189_n_v%2Fn c:collection1 s:shard1 r:core_node2 x:collection1] o.a.s.c.SyncStrategy Sync replicas to http://127.0.0.1:58189/n_v/n/collection1/
   [junit4]   2> 2825455 INFO  (coreZkRegister-11319-thread-1-processing-n:127.0.0.1:58189_n_v%2Fn x:collection1 c:collection1) [n:127.0.0.1:58189_n_v%2Fn c:collection1 s:shard1 r:core_node2 x:collection1] o.a.s.c.SyncStrategy Sync Success - now sync replicas to me
   [junit4]   2> 2825455 INFO  (coreZkRegister-11319-thread-1-processing-n:127.0.0.1:58189_n_v%2Fn x:collection1 c:collection1) [n:127.0.0.1:58189_n_v%2Fn c:collection1 s:shard1 r:core_node2 x:collection1] o.a.s.c.SyncStrategy http://127.0.0.1:58189/n_v/n/collection1/ has no replicas
   [junit4]   2> 2825474 INFO  (coreZkRegister-11319-thread-1-processing-n:127.0.0.1:58189_n_v%2Fn x:collection1 c:collection1) [n:127.0.0.1:58189_n_v%2Fn c:collection1 s:shard1 r:core_node2 x:collection1] o.a.s.c.ShardLeaderElectionContext I am the new leader: http://127.0.0.1:58189/n_v/n/collection1/ shard1
   [junit4]   2> 2825587 INFO  (coreZkRegister-11319-thread-1-processing-n:127.0.0.1:58189_n_v%2Fn x:collection1 c:collection1) [n:127.0.0.1:58189_n_v%2Fn c:collection1 s:shard1 r:core_node2 x:collection1] o.a.s.c.ZkController I am the leader, no recovery necessary
   [junit4]   2> 2825925 INFO  (TEST-TestNamedUpdateProcessors.test-seed#[33A3A6F28D0BE96F]) [    ] o.a.s.SolrTestCaseJ4 Writing core.properties file to /Users/jenkins/workspace/Lucene-Solr-master-MacOSX/solr/build/solr-core/test/J0/temp/solr.update.processor.TestNamedUpdateProcessors_33A3A6F28D0BE96F-001/shard-3-001/cores/collection1
   [junit4]   2> 2825927 INFO  (TEST-TestNamedUpdateProcessors.test-seed#[33A3A6F28D0BE96F]) [    ] o.a.s.c.AbstractFullDistribZkTestBase create jetty 3 in directory /Users/jenkins/workspace/Lucene-Solr-master-MacOSX/solr/build/solr-core/test/J0/temp/solr.update.processor.TestNamedUpdateProcessors_33A3A6F28D0BE96F-001/shard-3-001
   [junit4]   2> 2825928 INFO  (TEST-TestNamedUpdateProcessors.test-seed#[33A3A6F28D0BE96F]) [    ] o.e.j.s.Server jetty-9.3.14.v20161028
   [junit4]   2> 2825931 INFO  (TEST-TestNamedUpdateProcessors.test-seed#[33A3A6F28D0BE96F]) [    ] o.e.j.s.h.ContextHandler Started o.e.j.s.ServletContextHandler@a8c210b{/n_v/n,null,AVAILABLE}
   [junit4]   2> 2825931 INFO  (TEST-TestNamedUpdateProcessors.test-seed#[33A3A6F28D0BE96F]) [    ] o.e.j.s.AbstractConnector Started ServerConnector@112ec5db{HTTP/1.1,[http/1.1]}{127.0.0.1:58207}
   [junit4]   2> 2825931 INFO  (TEST-TestNamedUpdateProcessors.test-seed#[33A3A6F28D0BE96F]) [    ] o.e.j.s.Server Started @2833246ms
   [junit4]   2> 2825932 INFO  (TEST-TestNamedUpdateProcessors.test-seed#[33A3A6F28D0BE96F]) [    ] o.a.s.c.s.e.JettySolrRunner Jetty properties: {solr.data.dir=/Users/jenkins/workspace/Lucene-Solr-master-MacOSX/solr/build/solr-core/test/J0/temp/solr.update.processor.TestNamedUpdateProcessors_33A3A6F28D0BE96F-001/tempDir-001/jetty3, solrconfig=solrconfig.xml, hostContext=/n_v/n, hostPort=58207, coreRootDirectory=/Users/jenkins/workspace/Lucene-Solr-master-MacOSX/solr/build/solr-core/test/J0/../../../../../../../../../Users/jenkins/workspace/Lucene-Solr-master-MacOSX/solr/build/solr-core/test/J0/temp/solr.update.processor.TestNamedUpdateProcessors_33A3A6F28D0BE96F-001/shard-3-001/cores}
   [junit4]   2> 2825933 ERROR (TEST-TestNamedUpdateProcessors.test-seed#[33A3A6F28D0BE96F]) [    ] o.a.s.s.StartupLoggingUtils Missing Java Option solr.log.dir. Logging may be missing or incomplete.
   [junit4]   2> 2825933 INFO  (TEST-TestNamedUpdateProcessors.test-seed#[33A3A6F28D0BE96F]) [    ] o.a.s.s.SolrDispatchFilter  ___      _       Welcome to Apache Solr? version 7.0.0
   [junit4]   2> 2825933 INFO  (TEST-TestNamedUpdateProcessors.test-seed#[33A3A6F28D0BE96F]) [    ] o.a.s.s.SolrDispatchFilter / __| ___| |_ _   Starting in cloud mode on port null
   [junit4]   2> 2825933 INFO  (TEST-TestNamedUpdateProcessors.test-seed#[33A3A6F28D0BE96F]) [    ] o.a.s.s.SolrDispatchFilter \__ \/ _ \ | '_|  Install dir: null
   [junit4]   2> 2825933 INFO  (TEST-TestNamedUpdateProcessors.test-seed#[33A3A6F28D0BE96F]) [    ] o.a.s.s.SolrDispatchFilter |___/\___/_|_|    Start time: 2017-01-01T17:13:09.623Z
   [junit4]   2> 2825938 INFO  (TEST-TestNamedUpdateProcessors.test-seed#[33A3A6F28D0BE96F]) [    ] o.a.s.s.SolrDispatchFilter Loading solr.xml from SolrHome (not found in ZooKeeper)
   [junit4]   2> 2825939 INFO  (TEST-TestNamedUpdateProcessors.test-seed#[33A3A6F28D0BE96F]) [    ] o.a.s.c.SolrXmlConfig Loading container configuration from /Users/jenkins/workspace/Lucene-Solr-master-MacOSX/solr/build/solr-core/test/J0/temp/solr.update.processor.TestNamedUpdateProcessors_33A3A6F28D0BE96F-001/shard-3-001/solr.xml
   [junit4]   2> 2825954 INFO  (TEST-TestNamedUpdateProcessors.test-seed#[33A3A6F28D0BE96F]) [    ] o.a.s.c.ZkContainer Zookeeper client=127.0.0.1:58174/solr
   [junit4]   2> 2825977 INFO  (TEST-TestNamedUpdateProcessors.test-seed#[33A3A6F28D0BE96F]) [n:127.0.0.1:58207_n_v%2Fn    ] o.a.s.c.c.ZkStateReader Updated live nodes from ZooKeeper... (0) -> (3)
   [junit4]   2> 2825989 INFO  (TEST-TestNamedUpdateProcessors.test-seed#[33A3A6F28D0BE96F]) [n:127.0.0.1:58207_n_v%2Fn    ] o.a.s.c.ZkController Register node as live in ZooKeeper:/live_nodes/127.0.0.1:58207_n_v%2Fn
   [junit4]   2> 2825993 INFO  (zkCallback-3948-thread-1) [    ] o.a.s.c.c.ZkStateReader Updated live nodes from ZooKeeper... (3) -> (4)
   [junit4]   2> 2825993 INFO  (zkCallback-3953-thread-1-processing-n:127.0.0.1:58183_n_v%2Fn) [n:127.0.0.1:58183_n_v%2Fn    ] o.a.s.c.c.ZkStateReader Updated live nodes from ZooKeeper... (3) -> (4)
   [junit4]   2> 2825993 INFO  (zkCallback-3959-thread-1-processing-n:127.0.0.1:58189_n_v%2Fn) [n:127.0.0.1:58189_n_v%2Fn    ] o.a.s.c.c.ZkStateReader Updated live nodes from ZooKeeper... (3) -> (4)
   [junit4]   2> 2825993 INFO  (zkCallback-3944-thread-1-processing-n:127.0.0.1:58177_n_v%2Fn) [n:127.0.0.1:58177_n_v%2Fn    ] o.a.s.c.c.ZkStateReader Updated live nodes from ZooKeeper... (3) -> (4)
   [junit4]   2> 2825994 INFO  (zkCallback-3965-thread-1-processing-n:127.0.0.1:58207_n_v%2Fn) [n:127.0.0.1:58207_n_v%2Fn    ] o.a.s.c.c.ZkStateReader Updated live nodes from ZooKeeper... (3) -> (4)
   [junit4]   2> 2826057 INFO  (TEST-TestNamedUpdateProcessors.test-seed#[33A3A6F28D0BE96F]) [n:127.0.0.1:58207_n_v%2Fn    ] o.a.s.c.CorePropertiesLocator Found 1 core definitions underneath /Users/jenkins/workspace/Lucene-Solr-master-MacOSX/solr/build/solr-core/test/J0/../../../../../../../../../Users/jenkins/workspace/Lucene-Solr-master-MacOSX/solr/build/solr-core/test/J0/temp/solr.update.processor.TestNamedUpdateProcessors_33A3A6F28D0BE96F-001/shard-3-001/cores
   [junit4]   2> 2826058 INFO  (TEST-TestNamedUpdateProcessors.test-seed#[33A3A6F28D0BE96F]) [n:127.0.0.1:58207_n_v%2Fn    ] o.a.s.c.CorePropertiesLocator Cores are: [collection1]
   [junit4]   2> 2826061 INFO  (OverseerStateUpdate-97208944762355716-127.0.0.1:58177_n_v%2Fn-n_0000000000) [n:127.0.0.1:58177_n_v%2Fn    ] o.a.s.c.o.ReplicaMutator Assigning new node to shard shard=shard2
   [junit4]   2> 2827075 WARN  (coreLoadExecutor-11335-thread-1-processing-n:127.0.0.1:58207_n_v%2Fn) [n:127.0.0.1:58207_n_v%2Fn c:collection1   x:collection1] o.a.s.c.Config Beginning with Solr 5.5, <mergePolicy> is deprecated, use <mergePolicyFactory> instead.
   [junit4]   2> 2827077 INFO  (coreLoadExecutor-11335-thread-1-processing-n:127.0.0.1:58207_n_v%2Fn) [n:127.0.0.1:58207_n_v%2Fn c:collection1   x:collection1] o.a.s.c.SolrConfig Using Lucene MatchVersion: 7.0.0
   [junit4]   2> 2827094 INFO  (coreLoadExecutor-11335-thread-1-processing-n:127.0.0.1:58207_n_v%2Fn) [n:127.0.0.1:58207_n_v%2Fn c:collection1   x:collection1] o.a.s.s.IndexSchema [collection1] Schema name=test
   [junit4]   2> 2827180 WARN  (coreLoadExecutor-11335-thread-1-processing-n:127.0.0.1:58207_n_v%2Fn) [n:127.0.0.1:58207_n_v%2Fn c:collection1   x:collection1] o.a.s.s.IndexSchema [collection1] default search field in schema is text. WARNING: Deprecated, please use 'df' on request instead.
   [junit4]   2> 2827181 INFO  (coreLoadExecutor-11335-thread-1-processing-n:127.0.0.1:58207_n_v%2Fn) [n:127.0.0.1:58207_n_v%2Fn c:collection1   x:collection1] o.a.s.s.IndexSchema Loaded schema test/1.0 with uniqueid field id
   [junit4]   2> 2827203 INFO  (coreLoadExecutor-11335-thread-1-processing-n:127.0.0.1:58207_n_v%2Fn) [n:127.0.0.1:58207_n_v%2Fn c:collection1   x:collection1] o.a.s.c.CoreContainer Creating SolrCore 'collection1' using configuration from collection collection1
   [junit4]   2> 2827203 INFO  (coreLoadExecutor-11335-thread-1-processing-n:127.0.0.1:58207_n_v%2Fn) [n:127.0.0.1:58207_n_v%2Fn c:collection1   x:collection1] o.a.s.c.SolrCore [[collection1] ] Opening new SolrCore at [/Users/jenkins/workspace/Lucene-Solr-master-MacOSX/solr/build/solr-core/test/J0/temp/solr.update.processor.TestNamedUpdateProcessors_33A3A6F28D0BE96F-001/shard-3-001/cores/collection1], dataDir=[/Users/jenkins/workspace/Lucene-Solr-master-MacOSX/solr/build/solr-core/test/J0/../../../../../../../../../Users/jenkins/workspace/Lucene-Solr-master-MacOSX/solr/build/solr-core/test/J0/temp/solr.update.processor.TestNamedUpdateProcessors_33A3A6F28D0BE96F-001/shard-3-001/cores/collection1/data/]
   [junit4]   2> 2827203 INFO  (coreLoadExecutor-11335-thread-1-processing-n:127.0.0.1:58207_n_v%2Fn) [n:127.0.0.1:58207_n_v%2Fn c:collection1   x:collection1] o.a.s.c.JmxMonitoredMap JMX monitoring is enabled. Adding Solr mbeans to JMX Server: com.sun.jmx.mbeanserver.JmxMBeanServer@7a0a8e8f
   [junit4]   2> 2827204 INFO  (coreLoadExecutor-11335-thread-1-processing-n:127.0.0.1:58207_n_v%2Fn) [n:127.0.0.1:58207_n_v%2Fn c:collection1   x:collection1] o.a.s.u.RandomMergePolicy RandomMergePolicy wrapping class org.apache.lucene.index.TieredMergePolicy: [TieredMergePolicy: maxMergeAtOnce=16, maxMergeAtOnceExplicit=17, maxMergedSegmentMB=1.0498046875, floorSegmentMB=0.4462890625, forceMergeDeletesPctAllowed=27.28036057018505, segmentsPerTier=19.0, maxCFSSegmentSizeMB=8.796093022207999E12, noCFSRatio=1.0
   [junit4]   2> 2827209 WARN  (coreLoadExecutor-11335-thread-1-processing-n:127.0.0.1:58207_n_v%2Fn) [n:127.0.0.1:58207_n_v%2Fn c:collection1   x:collection1] o.a.s.c.RequestHandlers INVALID paramSet a in requestHandler {type = requestHandler,name = /dump,class = DumpRequestHandler,attributes = {initParams=a, name=/dump, class=DumpRequestHandler},args = {defaults={a=A,b=B}}}
   [junit4]   2> 2827222 INFO  (coreLoadExecutor-11335-thread-1-processing-n:127.0.0.1:58207_n_v%2Fn) [n:127.0.0.1:58207_n_v%2Fn c:collection1   x:collection1] o.a.s.u.UpdateHandler Using UpdateLog implementation: org.apache.solr.update.UpdateLog
   [junit4]   2> 2827222 INFO  (coreLoadExecutor-11335-thread-1-processing-n:127.0.0.1:58207_n_v%2Fn) [n:127.0.0.1:58207_n_v%2Fn c:collection1   x:collection1] o.a.s.u.UpdateLog Initializing UpdateLog: dataDir= defaultSyncLevel=FLUSH numRecordsToKeep=100 maxNumLogsToKeep=10 numVersionBuckets=65536
   [junit4]   2> 2827223 INFO  (coreLoadExecutor-11335-thread-1-processing-n:127.0.0.1:58207_n_v%2Fn) [n:127.0.0.1:58207_n_v%2Fn c:collection1   x:collection1] o.a.s.u.CommitTracker Hard AutoCommit: disabled
   [junit4]   2> 2827223 INFO  (coreLoadExecutor-11335-thread-1-processing-n:127.0.0.1:58207_n_v%2Fn) [n:127.0.0.1:58207_n_v%2Fn c:collection1   x:collection1] o.a.s.u.CommitTracker Soft AutoCommit: disabled
   [junit4]   2> 2827223 INFO  (coreLoadExecutor-11335-thread-1-processing-n:127.0.0.1:58207_n_v%2Fn) [n:127.0.0.1:58207_n_v%2Fn c:collection1   x:collection1] o.a.s.u.RandomMergePolicy RandomMergePolicy wrapping class org.apache.lucene.index.TieredMergePolicy: [TieredMergePolicy: maxMergeAtOnce=46, maxMergeAtOnceExplicit=28, maxMergedSegmentMB=79.58203125, floorSegmentMB=0.236328125, forceMergeDeletesPctAllowed=6.645236615222546, segmentsPerTier=25.0, maxCFSSegmentSizeMB=8.796093022207999E12, noCFSRatio=0.4294753050476081
   [junit4]   2> 2827223 INFO  (coreLoadExecutor-11335-thread-1-processing-n:127.0.0.1:58207_n_v%2Fn) [n:127.0.0.1:58207_n_v%2Fn c:collection1   x:collection1] o.a.s.s.SolrIndexSearcher Opening [Searcher@64ccf836[collection1] main]
   [junit4]   2> 2827225 INFO  (coreLoadExecutor-11335-thread-1-processing-n:127.0.0.1:58207_n_v%2Fn) [n:127.0.0.1:58207_n_v%2Fn c:collection1   x:collection1] o.a.s.r.ManagedResourceStorage Configured ZooKeeperStorageIO with znodeBase: /configs/conf1
   [junit4]   2> 2827226 INFO  (coreLoadExecutor-11335-thread-1-processing-n:127.0.0.1:58207_n_v%2Fn) [n:127.0.0.1:58207_n_v%2Fn c:collection1   x:collection1] o.a.s.r.ManagedResourceStorage Loaded null at path _rest_managed.json using ZooKeeperStorageIO:path=/configs/conf1
   [junit4]   2> 2827226 INFO  (coreLoadExecutor-11335-thread-1-processing-n:127.0.0.1:58207_n_v%2Fn) [n:127.0.0.1:58207_n_v%2Fn c:collection1   x:collection1] o.a.s.h.ReplicationHandler Commits will be reserved for  10000
   [junit4]   2> 2827227 INFO  (searcherExecutor-11336-thread-1-processing-n:127.0.0.1:58207_n_v%2Fn x:collection1 c:collection1) [n:127.0.0.1:58207_n_v%2Fn c:collection1   x:collection1] o.a.s.c.SolrCore [collection1] Registered new searcher Searcher@64ccf836[collection1] main{ExitableDirectoryReader(UninvertingDirectoryReader())}
   [junit4]   2> 2827227 INFO  (coreLoadExecutor-11335-thread-1-processing-n:127.0.0.1:58207_n_v%2Fn) [n:127.0.0.1:58207_n_v%2Fn c:collection1   x:collection1] o.a.s.u.UpdateLog Could not find max version in index or recent updates, using new clock 1555343124376584192
   [junit4]   2> 2827233 INFO  (coreZkRegister-11330-thread-1-processing-n:127.0.0.1:58207_n_v%2Fn x:collection1 c:collection1) [n:127.0.0.1:58207_n_v%2Fn c:collection1 s:shard2 r:core_node3 x:collection1] o.a.s.c.ZkController Core needs to recover:collection1
   [junit4]   2> 2827234 INFO  (updateExecutor-3962-thread-1-processing-n:127.0.0.1:58207_n_v%2Fn x:collection1 s:shard2 c:collection1 r:core_node3) [n:127.0.0.1:58207_n_v%2Fn c:collection1 s:shard2 r:core_node3 x:collection1] o.a.s.u.DefaultSolrCoreState Running recovery
   [junit4]   2> 2827234 INFO  (recoveryExecutor-3963-thread-1-processing-n:127.0.0.1:58207_n_v%2Fn x:collection1 s:shard2 c:collection1 r:core_node3) [n:127.0.0.1:58207_n_v%2Fn c:collection1 s:shard2 r:core_node3 x:collection1] o.a.s.c.RecoveryStrategy Starting recovery process. recoveringAfterStartup=true
   [junit4]   2> 2827234 INFO  (recoveryExecutor-3963-thread-1-processing-n:127.0.0.1:58207_n_v%2Fn x:collection1 s:shard2 c:collection1 r:core_node3) [n:127.0.0.1:58207_n_v%2Fn c:collection1 s:shard2 r:core_node3 x:collection1] o.a.s.c.RecoveryStrategy ###### startupVersions=[[]]
   [junit4]   2> 2827234 INFO  (recoveryExecutor-3963-thread-1-processing-n:127.0.0.1:58207_n_v%2Fn x:collection1 s:shard2 c:collection1 r:core_node3) [n:127.0.0.1:58207_n_v%2Fn c:collection1 s:shard2 r:core_node3 x:collection1] o.a.s.c.RecoveryStrategy Begin buffering updates. core=[collection1]
   [junit4]   2> 2827234 INFO  (recoveryExecutor-3963-thread-1-processing-n:127.0.0.1:58207_n_v%2Fn x:collection1 s:shard2 c:collection1 r:core_node3) [n:127.0.0.1:58207_n_v%2Fn c:collection1 s:shard2 r:core_node3 x:collection1] o.a.s.u.UpdateLog Starting to buffer updates. FSUpdateLog{state=ACTIVE, tlog=null}
   [junit4]   2> 2827234 INFO  (recoveryExecutor-3963-thread-1-processing-n:127.0.0.1:58207_n_v%2Fn x:collection1 s:shard2 c:collection1 r:core_node3) [n:127.0.0.1:58207_n_v%2Fn c:collection1 s:shard2 r:core_node3 x:collection1] o.a.s.c.RecoveryStrategy Publishing state of core [collection1] as recovering, leader is [http://127.0.0.1:58183/n_v/n/collection1/] and I am [http://127.0.0.1:58207/n_v/n/collection1/]
   [junit4]   2> 2827237 INFO  (recoveryExecutor-3963-thread-1-processing-n:127.0.0.1:58207_n_v%2Fn x:collection1 s:shard2 c:collection1 r:core_node3) [n:127.0.0.1:58207_n_v%2Fn c:collection1 s:shard2 r:core_node3 x:collection1] o.a.s.c.RecoveryStrategy Sending prep recovery command to [http://127.0.0.1:58183/n_v/n]; [WaitForState: action=PREPRECOVERY&core=collection1&nodeName=127.0.0.1:58207_n_v%252Fn&coreNodeName=core_node3&state=recovering&checkLive=true&onlyIfLeader=true&onlyIfLeaderActive=true]
   [junit4]   2> 2827241 INFO  (qtp1793393644-22681) [n:127.0.0.1:58183_n_v%2Fn    ] o.a.s.h.a.PrepRecoveryOp Going to wait for coreNodeName: core_node3, state: recovering, checkLive: true, onlyIfLeader: true, onlyIfLeaderActive: true
   [junit4]   2> 2827242 INFO  (qtp1793393644-22681) [n:127.0.0.1:58183_n_v%2Fn    ] o.a.s.h.a.PrepRecoveryOp Will wait a max of 183 seconds to see collection1 (shard2 of collection1) have state: recovering
   [junit4]   2> 2827242 INFO  (qtp1793393644-22681) [n:127.0.0.1:58183_n_v%2Fn    ] o.a.s.h.a.PrepRecoveryOp In WaitForState(recovering): collection=collection1, shard=shard2, thisCore=collection1, leaderDoesNotNeedRecovery=false, isLeader? true, live=true, checkLive=true, currentState=down, localState=active, nodeName=127.0.0.1:58207_n_v%2Fn, coreNodeName=core_node3, onlyIfActiveCheckResult=false, nodeProps: core_node3:{"core":"collection1","base_url":"http://127.0.0.1:58207/n_v/n","node_name":"127.0.0.1:58207_n_v%2Fn","state":"down"}
   [junit4]   2> 2827656 INFO  (TEST-TestNamedUpdateProcessors.test-seed#[33A3A6F28D0BE96F]) [    ] o.a.s.SolrTestCaseJ4 Writing core.properties file to /Users/jenkins/workspace/Lucene-Solr-master-MacOSX/solr/build/solr-core/test/J0/temp/solr.update.processor.TestNamedUpdateProcessors_33A3A6F28D0BE96F-001/shard-4-001/cores/collection1
   [junit4]   2> 2827657 INFO  (TEST-TestNamedUpdateProcessors.test-seed#[33A3A6F28D0BE96F]) [    ] o.a.s.c.AbstractFullDistribZkTestBase create jetty 4 in directory /Users/jenkins/workspace/Lucene-Solr-master-MacOSX/solr/build/solr-core/test/J0/temp/solr.update.processor.TestNamedUpdateProcessors_33A3A6F28D0BE96F-001/shard-4-001
   [junit4]   2> 2827658 INFO  (TEST-TestNamedUpdateProcessors.test-seed#[33A3A6F28D0BE96F]) [    ] o.e.j.s.Server jetty-9.3.14.v20161028
   [junit4]   2> 2827659 INFO  (TEST-TestNamedUpdateProcessors.test-seed#[33A3A6F28D0BE96F]) [    ] o.e.j.s.h.ContextHandler Started o.e.j.s.ServletContextHandler@2cc85bf6{/n_v/n,null,AVAILABLE}
   [junit4]   2> 2827660 INFO  (TEST-TestNamedUpdateProcessors.test-seed#[33A3A6F28D0BE96F]) [    ] o.e.j.s.AbstractConnector Started ServerConnector@70e938f9{HTTP/1.1,[http/1.1]}{127.0.0.1:58224}
   [junit4]   2> 2827660 INFO  (TEST-TestNamedUpdateProcessors.test-seed#[33A3A6F28D0BE96F]) [    ] o.e.j.s.Server Started @2834974ms
   [junit4]   2> 2827661 INFO  (TEST-TestNamedUpdateProcessors.test-seed#[33A3A6F28D0BE96F]) [    ] o.a.s.c.s.e.JettySolrRunner Jetty properties: {solr.data.dir=/Users/jenkins/workspace/Lucene-Solr-master-MacOSX/solr/build/solr-core/test/J0/temp/solr.update.processor.TestNamedUpdateProcessors_33A3A6F28D0BE96F-001/tempDir-001/jetty4, solrconfig=solrconfig.xml, hostContext=/n_v/n, hostPort=58224, coreRootDirectory=/Users/jenkins/workspace/Lucene-Solr-master-MacOSX/solr/build/solr-core/test/J0/temp/solr.update.processor.TestNamedUpdateProcessors_33A3A6F28D0BE96F-001/shard-4-001/cores}
   [junit4]   2> 2827661 ERROR (TEST-TestNamedUpdateProcessors.test-seed#[33A3A6F28D0BE96F]) [    ] o.a.s.s.StartupLoggingUtils Missing Java Option solr.log.dir. Logging may be missing or incomplete.
   [junit4]   2> 2827661 INFO  (TEST-TestNamedUpdateProcessors.test-seed#[33A3A6F28D0BE96F]) [    ] o.a.s.s.SolrDispatchFilter  ___      _       Welcome to Apache Solr? version 7.0.0
   [junit4]   2> 2827661 INFO  (TEST-TestNamedUpdateProcessors.test-seed#[33A3A6F28D0BE96F]) [    ] o.a.s.s.SolrDispatchFilter / __| ___| |_ _   Starting in cloud mode on port null
   [junit4]   2> 2827662 INFO  (TEST-TestNamedUpdateProcessors.test-seed#[33A3A6F28D0BE96F]) [    ] o.a.s.s.SolrDispatchFilter \__ \/ _ \ | '_|  Install dir: null
   [junit4]   2> 2827662 INFO  (TEST-TestNamedUpdateProcessors.test-seed#[33A3A6F28D0BE96F]) [    ] o.a.s.s.SolrDispatchFilter |___/\___/_|_|    Start time: 2017-01-01T17:13:11.352Z
   [junit4]   2> 2827666 INFO  (TEST-TestNamedUpdateProcessors.test-seed#[33A3A6F28D0BE96F]) [    ] o.a.s.s.SolrDispatchFilter Loading solr.xml from SolrHome (not found in ZooKeeper)
   [junit4]   2> 2827666 INFO  (TEST-TestNamedUpdateProcessors.test-seed#[33A3A6F28D0BE96F]) [    ] o.a.s.c.SolrXmlConfig Loading container configuration from /Users/jenkins/workspace/Lucene-Solr-master-MacOSX/solr/build/solr-core/test/J0/temp/solr.update.processor.TestNamedUpdateProcessors_33A3A6F28D0BE96F-001/shard-4-001/solr.xml
   [junit4]   2> 2827697 INFO  (TEST-TestNamedUpdateProcessors.test-seed#[33A3A6F28D0BE96F]) [    ] o.a.s.c.ZkContainer Zookeeper client=127.0.0.1:58174/solr
   [junit4]   2> 2827717 INFO  (TEST-TestNamedUpdateProcessors.test-seed#[33A3A6F28D0BE96F]) [n:127.0.0.1:58224_n_v%2Fn    ] o.a.s.c.c.ZkStateReader Updated live nodes from ZooKeeper... (0) -> (4)
   [junit4]   2> 2827728 INFO  (TEST-TestNamedUpdateProcessors.test-seed#[33A3A6F28D0BE96F]) [n:127.0.0.1:58224_n_v%2Fn    ] o.a.s.c.ZkController Register node as live in ZooKeeper:/live_nodes/127.0.0.1:58224_n_v%2Fn
   [junit4]   2> 2827733 INFO  (zkCallback-3948-thread-1) [    ] o.a.s.c.c.ZkStateReader Updated live nodes from ZooKeeper... (4) -> (5)
   [junit4]   2> 2827733 INFO  (zkCallback-3944-thread-3-processing-n:127.0.0.1:58177_n_v%2Fn) [n:127.0.0.1:58177_n_v%2Fn    ] o.a.s.c.c.ZkStateReader Updated live nodes from ZooKeeper... (4) -> (5)
   [junit4]   2> 2827734 INFO  (zkCallback-3953-thread-1-processing-n:127.0.0.1:58183_n_v%2Fn) [n:127.0.0.1:58183_n_v%2Fn    ] o.a.s.c.c.ZkStateReader Updated live nodes from ZooKeeper... (4) -> (5)
   [junit4]   2> 2827735 INFO  (zkCallback-3972-thread-1-processing-n:127.0.0.1:58224_n_v%2Fn) [n:127.0.0.1:58224_n_v%2Fn    ] o.a.s.c.c.ZkStateReader Updated live nodes from ZooKeeper... (4) -> (5)
   [junit4]   2> 2827736 INFO  (zkCallback-3965-thread-1-processing-n:127.0.0.1:58207_n_v%2Fn) [n:127.0.0.1:58207_n_v%2Fn    ] o.a.s.c.c.ZkStateReader Updated live nodes from ZooKeeper... (4) -> (5)
   [junit4]   2> 2827736 INFO  (zkCallback-3959-thread-1-processing-n:127.0.0.1:58189_n_v%2Fn) [n:127.0.0.1:58189_n_v%2Fn    ] o.a.s.c.c.ZkStateReader Updated live nodes from ZooKeeper... (4) -> (5)
   [junit4]   2> 2827765 INFO  (TEST-TestNamedUpdateProcessors.test-seed#[33A3A6F28D0BE96F]) [n:127.0.0.1:58224_n_v%2Fn    ] o.a.s.c.CorePropertiesLocator Found 1 core definitions underneath /Users/jenkins/workspace/Lucene-Solr-master-MacOSX/solr/build/solr-core/test/J0/temp/solr.update.processor.TestNamedUpdateProcessors_33A3A6F28D0BE96F-001/shard-4-001/cores
   [junit4]   2> 2827765 INFO  (TEST-TestNamedUpdateProcessors.test-seed#[33A3A6F28D0BE96F]) [n:127.0.0.1:58224_n_v%2Fn    ] o.a.s.c.CorePropertiesLocator Cores are: [collection1]
   [junit4]   2> 2827797 INFO  (OverseerStateUpdate-97208944762355716-127.0.0.1:58177_n_v%2Fn-n_0000000000) [n:127.0.0.1:58177_n_v%2Fn    ] o.a.s.c.o.ReplicaMutator Assigning new node to shard shard=shard1
   [junit4]   2> 2828242 INFO  (qtp1793393644-22681) [n:127.0.0.1:58183_n_v%2Fn    ] o.a.s.h.a.PrepRecoveryOp In WaitForState(recovering): collection=collection1, shard=shard2, thisCore=collection1, leaderDoesNotNeedRecovery=false, isLeader? true, live=true, checkLive=true, currentState=recovering, localState=active, nodeName=127.0.0.1:58207_n_v%2Fn, coreNodeName=core_node3, onlyIfActiveCheckResult=false, nodeProps: core_node3:{"core":"collection1","base_url":"http://127.0.0.1:58207/n_v/n","node_name":"127.0.0.1:58207_n_v%2Fn","state":"recovering"}
   [junit4]   2> 2828243 INFO  (qtp1793393644-22681) [n:127.0.0.1:58183_n_v%2Fn    ] o.a.s.h.a.PrepRecoveryOp Waited coreNodeName: core_node3, state: recovering, checkLive: true, onlyIfLeader: true for: 1 seconds.
   [junit4]   2> 2828243 INFO  (qtp1793393644-22681) [n:127.0.0.1:58183_n_v%2Fn    ] o.a.s.s.HttpSolrCall [admin] webapp=null path=/admin/cores params={nodeName=127.0.0.1:58207_n_v%252Fn&onlyIfLeaderActive=true&core=collection1&coreNodeName=core_node3&action=PREPRECOVERY&checkLive=true&state=recovering&onlyIfLeader=true&wt=javabin&version=2} status=0 QTime=1001
   [junit4]   2> 2828813 WARN  (coreLoadExecutor-11346-thread-1-processing-n:127.0.0.1:58224_n_v%2Fn) [n:127.0.0.1:58224_n_v%2Fn c:collection1   x:collection1] o.a.s.c.Config Beginning with Solr 5.5, <mergePolicy> is deprecated, use <mergePolicyFactory> instead.
   [junit4]   2> 2828813 INFO  (coreLoadExecutor-11346-thread-1-processing-n:127.0.0.1:58224_n_v%2Fn) [n:127.0.0.1:58224_n_v%2Fn c:collection1   x:collection1] o.a.s.c.SolrConfig Using Lucene MatchVersion: 7.0.0
   [junit4]   2> 2828826 INFO  (coreLoadExecutor-11346-thread-1-processing-n:127.0.0.1:58224_n_v%2Fn) [n:127.0.0.1:58224_n_v%2Fn c:collection1   x:collection1] o.a.s.s.IndexSchema [collection1] Schema name=test
   [junit4]   2> 2828945 WARN  (coreLoadExecutor-11346-thread-1-processing-n:127.0.0.1:58224_n_v%2Fn) [n:127.0.0.1:58224_n_v%2Fn c:collection1   x:collection1] o.a.s.s.IndexSchema [collection1] default search field in schema is text. WARNING: Deprecated, please use 'df' on request instead.
   [junit4]   2> 2828948 INFO  (coreLoadExecutor-11346-thread-1-processing-n:127.0.0.1:58224_n_v%2Fn) [n:127.0.0.1:58224_n_v%2Fn c:collection1   x:collection1] o.a.s.s.IndexSchema Loaded schema test/1.0 with uniqueid field id
   [junit4]   2> 2828971 INFO  (coreLoadExecutor-11346-thread-1-processing-n:127.0.0.1:58224_n_v%2Fn) [n:127.0.0.1:58224_n_v%2Fn c:collection1   x:collection1] o.a.s.c.CoreContainer Creating SolrCore 'collection1' using configuration from collection collection1
   [junit4]   2> 2828971 INFO  (coreLoadExecutor-11346-thread-1-processing-n:127.0.0.1:58224_n_v%2Fn) [n:127.0.0.1:58224_n_v%2Fn c:collection1   x:collection1] o.a.s.c.SolrCore [[collection1] ] Opening new SolrCore at [/Users/jenkins/workspace/Lucene-Solr-master-MacOSX/solr/build/solr-core/test/J0/temp/solr.update.processor.TestNamedUpdateProcessors_33A3A6F28D0BE96F-001/shard-4-001/cores/collection1], dataDir=[/Users/jenkins/workspace/Lucene-Solr-master-MacOSX/solr/build/solr-core/test/J0/temp/solr.update.processor.TestNamedUpdateProcessors_33A3A6F28D0BE96F-001/shard-4-001/cores/collection1/data/]
   [junit4]   2> 2828971 INFO  (coreLoadExecutor-11346-thread-1-processing-n:127.0.0.1:58224_n_v%2Fn) [n:127.0.0.1:58224_n_v%2Fn c:collection1   x:collection1] o.a.s.c.JmxMonitoredMap JMX monitoring is enabled. Adding Solr mbeans to JMX Server: com.sun.jmx.mbeanserver.JmxMBeanServer@7a0a8e8f
   [junit4]   2> 2828982 INFO  (coreLoadExecutor-11346-thread-1-processing-n:127.0.0.1:58224_n_v%2Fn) [n:127.0.0.1:58224_n_v%2Fn c:collection1   x:collection1] o.a.s.u.RandomMergePolicy RandomMergePolicy wrapping class org.apache.lucene.index.TieredMergePolicy: [TieredMergePolicy: maxMergeAtOnce=16, maxMergeAtOnceExplicit=17, maxMergedSegmentMB=1.0498046875, floorSegmentMB=0.4462890625, forceMergeDeletesPctAllowed=27.28036057018505, segmentsPerTier=19.0, maxCFSSegmentSizeMB=8.796093022207999E12, noCFSRatio=1.0
   [junit4]   2> 2828991 WARN  (coreLoadExecutor-11346-thread-1-processing-n:127.0.0.1:58224_n_v%2Fn) [n:127.0.0.1:58224_n_v%2Fn c:collection1   x:collection1] o.a.s.c.RequestHandlers INVALID paramSet a in requestHandler {type = requestHandler,name = /dump,class = DumpRequestHandler,attributes = {initParams=a, name=/dump, class=DumpRequestHandler},args = {defaults={a=A,b=B}}}
   [junit4]   2> 2829021 INFO  (coreLoadExecutor-11346-thread-1-processing-n:127.0.0.1:58224_n_v%2Fn) [n:127.0.0.1:58224_n_v%2Fn c:collection1   x:collection1] o.a.s.u.UpdateHandler Using UpdateLog implementation: org.apache.solr.update.UpdateLog
   [junit4]   2> 2829021 INFO  (coreLoadExecutor-11346-thread-1-processing-n:127.0.0.1:58224_n_v%2Fn) [n:127.0.0.1:58224_n_v%2Fn c:collection1   x:collection1] o.a.s.u.UpdateLog Initializing UpdateLog: dataDir= defaultSyncLevel=FLUSH numRecordsToKeep=100 maxNumLogsToKeep=10 numVersionBuckets=65536
   [junit4]   2> 2829022 INFO  (coreLoadExecutor-11346-thread-1-processing-n:127.0.0.1:58224_n_v%2Fn) [n:127.0.0.1:58224_n_v%2Fn c:collection1   x:collection1] o.a.s.u.CommitTracker Hard AutoCommit: disabled
   [junit4]   2> 2829022 INFO  (coreLoadExecutor-11346-thread-1-processing-n:127.0.0.1:58224_n_v%2Fn) [n:127.0.0.1:58224_n_v%2Fn c:collection1   x:collection1] o.a.s.u.CommitTracker Soft AutoCommit: disabled
   [junit4]   2> 2829023 INFO  (coreLoadExecutor-11346-thread-1-processing-n:127.0.0.1:58224_n_v%2Fn) [n:127.0.0.1:58224_n_v%2Fn c:collection1   x:collection1] o.a.s.u.RandomMergePolicy RandomMergePolicy wrapping class org.apache.lucene.index.TieredMergePolicy: [TieredMergePolicy: maxMergeAtOnce=46, maxMergeAtOnceExplicit=28, maxMergedSegmentMB=79.58203125, floorSegmentMB=0.236328125, forceMergeDeletesPctAllowed=6.645236615222546, segmentsPerTier=25.0, maxCFSSegmentSizeMB=8.796093022207999E12, noCFSRatio=0.4294753050476081
   [junit4]   2> 2829026 INFO  (coreLoadExecutor-11346-thread-1-processing-n:127.0.0.1:58224_n_v%2Fn) [n:127.0.0.1:58224_n_v%2Fn c:collection1   x:collection1] o.a.s.s.SolrIndexSearcher Opening [Searcher@7b4f97b0[collection1] main]
   [junit4]   2> 2829028 INFO  (coreLoadExecutor-11346-thread-1-processing-n:127.0.0.1:58224_n_v%2Fn) [n:127.0.0.1:58224_n_v%2Fn c:collection1   x:collection1] o.a.s.r.ManagedResourceStorage Configured ZooKeeperStorageIO with znodeBase: /configs/conf1
   [junit4]   2> 2829029 INFO  (coreLoadExecutor-11346-thread-1-processing-n:127.0.0.1:58224_n_v%2Fn) [n:127.0.0.1:58224_n_v%2Fn c:collection1   x:collection1] o.a.s.r.ManagedResourceStorage Loaded null at path _rest_managed.json using ZooKeeperStorageIO:path=/configs/conf1
   [junit4]   2> 2829029 INFO  (coreLoadExecutor-11346-thread-1-processing-n:127.0.0.1:58224_n_v%2Fn) [n:127.0.0.1:58224_n_v%2Fn c:collection1   x:collection1] o.a.s.h.ReplicationHandler Commits will be reserved for  10000
   [junit4]   2> 2829030 INFO  (searcherExecutor-11347-thread-1-processing-n:127.0.0.1:58224_n_v%2Fn x:collection1 c:collection1) [n:127.0.0.1:58224_n_v%2Fn c:collection1   x:collection1] o.a.s.c.SolrCore [collection1] Registered new searcher Searcher@7b4f97b0[collection1] main{ExitableDirectoryReader(UninvertingDirectoryReader())}
   [junit4]   2> 2829031 INFO  (coreLoadExecutor-11346-thread-1-processing-n:127.0.0.1:58224_n_v%2Fn) [n:127.0.0.1:58224_n_v%2Fn c:collection1   x:collection1] o.a.s.u.UpdateLog Could not find max version in index or recent updates, using new clock 1555343126268215296
   [junit4]   2> 2829038 INFO  (coreZkRegister-11341-thread-1-processing-n:127.0.0.1:58224_n_v%2Fn x:collection1 c:collection1) [n:127.0.0.1:58224_n_v%2Fn c:collection1 s:shard1 r:core_node4 x:collection1] o.a.s.c.ZkController Core needs to recover:collection1
   [junit4]   2> 2829039 INFO  (updateExecutor-3969-thread-1-processing-n:127.0.0.1:58224_n_v%2Fn x:collection1 s:shard1 c:collection1 r:core_node4) [n:127.0.0.1:58224_n_v%2Fn c:collection1 s:shard1 r:core_node4 x:collection1] o.a.s.u.DefaultSolrCoreState Running recovery
   [junit4]   2> 2829039 INFO  (recoveryExecutor-3970-thread-1-processing-n:127.0.0.1:58224_n_v%2Fn x:collection1 s:shard1 c:collection1 r:core_node4) [n:127.0.0.1:58224_n_v%2Fn c:collection1 s:shard1 r:core_node4 x:collection1] o.a.s.c.RecoveryStrategy Starting recovery process. recoveringAfterStartup=true
   [junit4]   2> 2829039 INFO  (recoveryExecutor-3970-thread-1-processing-n:127.0.0.1:58224_n_v%2Fn x:collection1 s:shard1 c:collection1 r:core_node4) [n:127.0.0.1:58224_n_v%2Fn c:collection1 s:shard1 r:core_node4 x:collection1] o.a.s.c.RecoveryStrategy ###### startupVersions=[[]]
   [junit4]   2> 2829039 INFO  (recoveryExecutor-3970-thread-1-processing-n:127.0.0.1:58224_n_v%2Fn x:collection1 s:shard1 c:collection1 r:core_node4) [n:127.0.0.1:58224_n_v%2Fn c:collection1 s:shard1 r:core_node4 x:collection1] o.a.s.c.RecoveryStrategy Begin buffering updates. core=[collection1]
   [junit4]   2> 2829040 INFO  (recoveryExecutor-3970-thread-1-processing-n:127.0.0.1:58224_n_v%2Fn x:collection1 s:shard1 c:collection1 r:core_node4) [n:127.0.0.1:58224_n_v%2Fn c:collection1 s:shard1 r:core_node4 x:collection1] o.a.s.u.UpdateLog Starting to buffer updates. FSUpdateLog{state=ACTIVE, tlog=null}
   [junit4]   2> 2829040 INFO  (recoveryExecutor-3970-thread-1-processing-n:127.0.0.1:58224_n_v%2Fn x:collection1 s:shard1 c:collection1 r:core_node4) [n:127.0.0.1:58224_n_v%2Fn c:collection1 s:shard1 r:core_node4 x:collection1] o.a.s.c.RecoveryStrategy Publishing state of core [collection1] as recovering, leader is [http://127.0.0.1:58189/n_v/n/collection1/] and I am [http://127.0.0.1:58224/n_v/n/collection1/]
   [junit4]   2> 2829042 INFO  (recoveryExecutor-3970-thread-1-processing-n:127.0.0.1:58224_n_v%2Fn x:collection1 s:shard1 c:collection1 r:core_node4) [n:127.0.0.1:58224_n_v%2Fn c:collection1 s:shard1 r:core_node4 x:collection1] o.a.s.c.RecoveryStrategy Sending prep recovery command to [http://127.0.0.1:58189/n_v/n]; [WaitForState: action=PREPRECOVERY&core=collection1&nodeName=127.0.0.1:58224_n_v%252Fn&coreNodeName=core_node4&state=recovering&checkLive=true&onlyIfLeader=true&onlyIfLeaderActive=true]
   [junit4]   2> 2829046 INFO  (qtp1286110536-22709) [n:127.0.0.1:58189_n_v%2Fn    ] o.a.s.h.a.PrepRecoveryOp Going to wait for coreNodeName: core_node4, state: recovering, checkLive: true, onlyIfLeader: true, onlyIfLeaderActive: true
   [junit4]   2> 2829047 INFO  (qtp1286110536-22709) [n:127.0.0.1:58189_n_v%2Fn    ] o.a.s.h.a.PrepRecoveryOp Will wait a max of 183 seconds to see collection1 (shard1 of collection1) have state: recovering
   [junit4]   2> 2829047 INFO  (qtp1286110536-22709) [n:127.0.0.1:58189_n_v%2Fn    ] o.a.s.h.a.PrepRecoveryOp In WaitForState(recovering): collection=collection1, shard=shard1, thisCore=collection1, leaderDoesNotNeedRecovery=false, isLeader? true, live=true, checkLive=true, currentState=down, localState=active, nodeName=127.0.0.1:58224_n_v%2Fn, coreNodeName=core_node4, onlyIfActiveCheckResult=false, nodeProps: core_node4:{"core":"collection1","base_url":"http://127.0.0.1:58224/n_v/n","node_name":"127.0.0.1:58224_n_v%2Fn","state":"down"}
   [junit4]   2> 2829533 INFO  (TEST-TestNamedUpdateProcessors.test-seed#[33A3A6F28D0BE96F]) [    ] o.a.s.SolrTestCaseJ4 ###Starting test
   [junit4]   2> 2829539 INFO  (qtp1793393644-22685) [n:127.0.0.1:58183_n_v%2Fn    ] o.a.s.h.a.CollectionsHandler Invoked Collection Action :create with params replicationFactor=2&name=.system&action=CREATE&numShards=1&wt=javabin&version=2 and sendToOCPQueue=true
   [junit4]   2> 2829558 INFO  (OverseerThreadFactory-11300-thread-1-processing-n:127.0.0.1:58177_n_v%2Fn) [n:127.0.0.1:58177_n_v%2Fn    ] o.a.s.c.CreateCollectionCmd Create collection .system
   [junit4]   2> 2829792 INFO  (qtp635803955-22772) [n:127.0.0.1:58224_n_v%2Fn    ] o.a.s.h.a.CoreAdminOperation core create command qt=/admin/cores&collection.configName=.system&newCollection=true&name=.system_shard1_replica1&action=CREATE&numShards=1&collection=.system&shard=shard1&wt=javabin&version=2
   [junit4]   2> 2829792 INFO  (qtp1252191381-22644) [n:127.0.0.1:58177_n_v%2Fn    ] o.a.s.h.a.CoreAdminOperation core create command qt=/admin/cores&collection.configName=.system&newCollection=true&name=.system_shard1_replica2&action=CREATE&numShards=1&collection=.system&shard=shard1&wt=javabin&version=2
   [junit4]   2> 2829914 INFO  (zkCallback-3944-thread-2-processing-n:127.0.0.1:58177_n_v%2Fn) [n:127.0.0.1:58177_n_v%2Fn    ] o.a.s.c.c.ZkStateReader A cluster state change: [WatchedEvent state:SyncConnected type:NodeDataChanged path:/collections/.system/state.json] for collection [.system] has occurred - updating... (live nodes size: [5])
   [junit4]   2> 2829914 INFO  (zkCallback-3972-thread-1-processing-n:127.0.0.1:58224_n_v%2Fn) [n:127.0.0.1:58224_n_v%2Fn    ] o.a.s.c.c.ZkStateReader A cluster state change: [WatchedEvent state:SyncConnected type:NodeDataChanged path:/collections/.system/state.json] for collection [.system] has occurred - updating... (live nodes size: [5])
   [junit4]   2> 2830057 INFO  (qtp1286110536-22709) [n:127.0.0.1:58189_n_v%2Fn    ] o.a.s.h.a.PrepRecoveryOp In WaitForState(recovering): collection=collection1, shard=shard1, thisCore=collection1, leaderDoesNotNeedRecovery=false, isLeader? true, live=true, checkLive=true, currentState=recovering, localState=active, nodeName=127.0.0.1:58224_n_v%2Fn, coreNodeName=core_node4, onlyIfActiveCheckResult=false, nodeProps: core_node4:{"core":"collection1","base_url":"http://127.0.0.1:58224/n_v/n","node_name":"127.0.0.1:58224_n_v%2Fn","state":"recovering"}
   [junit4]   2> 2830057 INFO  (qtp1286110536-22709) [n:127.0.0.1:58189_n_v%2Fn    ] o.a.s.h.a.PrepRecoveryOp Waited coreNodeName: core_node4, state: recovering, checkLive: true, onlyIfLeader: true for: 1 seconds.
   [junit4]   2> 2830057 INFO  (qtp1286110536-22709) [n:127.0.0.1:58189_n_v%2Fn    ] o.a.s.s.HttpSolrCall [admin] webapp=null path=/admin/cores params={nodeName=127.0.0.1:58224_n_v%252Fn&onlyIfLeaderActive=true&core=collection1&coreNodeName=core_node4&action=PREPRECOVERY&checkLive=true&state=recovering&onlyIfLeader=true&wt=javabin&version=2} status=0 QTime=1011
   [junit4]   2> 2830811 INFO  (qtp1252191381-22644) [n:127.0.0.1:58177_n_v%2Fn c:.system s:shard1  x:.system_shard1_replica2] o.a.s.c.SolrConfig Using Lucene MatchVersion: 7.0.0
   [junit4]   2> 2830863 INFO  (qtp635803955-22772) [n:127.0.0.1:58224_n_v%2Fn c:.system s:shard1  x:.system_shard1_replica1] o.a.s.c.SolrConfig Using Lucene MatchVersion: 7.0.0
   [junit4]   2> 2830866 INFO  (qtp1252191381-22644) [n:127.0.0.1:58177_n_v%2Fn c:.system s:shard1  x:.system_shard1_replica2] o.a.s.s.ManagedIndexSchemaFactory The schema is configured as managed, but managed schema resource managed-schema not found - loading non-managed schema schema.xml instead
   [junit4]   2> 2830868 INFO  (qtp635803955-22772) [n:127.0.0.1:58224_n_v%2Fn c:.system s:shard1  x:.system_shard1_replica1] o.a.s.s.ManagedIndexSchemaFactory The schema is configured as managed, but managed schema resource managed-schema not found - loading non-managed schema schema.xml instead
   [junit4]   2> 2830870 INFO  (qtp1252191381-22644) [n:127.0.0.1:58177_n_v%2Fn c:.system s:shard1  x:.system_shard1_replica2] o.a.s.s.IndexSchema [.system_shard1_replica2] Schema name=_system collection or core
   [junit4]   2> 2830872 INFO  (qtp1252191381-22644) [n:127.0.0.1:58177_n_v%2Fn c:.system s:shard1  x:.system_shard1_replica2] o.a.s.s.IndexSchema Loaded schema _system collection or core/1.1 with uniqueid field id
   [junit4]   2> 2830872 INFO  (qtp635803955-22772) [n:127.0.0.1:58224_n_v%2Fn c:.system s:shard1  x:.system_shard1_replica1] o.a.s.s.IndexSchema [.system_shard1_replica1] Schema name=_system collection or core
   [junit4]   2> 2830873 INFO  (qtp1252191381-22644) [n:127.0.0.1:58177_n_v%2Fn c:.system s:shard1  x:.system_shard1_replica2] o.a.s.s.ManagedIndexSchema Created and persisted managed schema znode at /configs/.system/managed-schema
   [junit4]   2> 2830875 INFO  (qtp635803955-22772) [n:127.0.0.1:58224_n_v%2Fn c:.system s:shard1  x:.system_shard1_replica1] o.a.s.s.IndexSchema Loaded schema _system collection or core/1.1 with uniqueid field id
   [junit4]   2> 2830876 INFO  (qtp635803955-22772) [n:127.0.0.1:58224_n_v%2Fn c:.system s:shard1  x:.system_shard1_replica1] o.a.s.s.ManagedIndexSchema Managed schema znode at /configs/.system/managed-schema already exists - no need to create it
   [junit4]   2> 2830879 INFO  (qtp635803955-22772) [n:127.0.0.1:58224_n_v%2Fn c:.system s:shard1  x:.system_shard1_replica1] o.a.s.s.ManagedIndexSchemaFactory After upgrading to managed schema in ZooKeeper, renamed the non-managed schema /configs/.system/schema.xml to /configs/.system/schema.xml.bak
   [junit4]   2> 2830879 WARN  (qtp1252191381-22644) [n:127.0.0.1:58177_n_v%2Fn c:.system s:shard1  x:.system_shard1_replica2] o.a.s.s.ManagedIndexSchemaFactory Error persisting managed schema resource managed-schema
   [junit4]   2> org.apache.zookeeper.KeeperException$NoNodeException: KeeperErrorCode = NoNode for /configs/.system/schema.xml
   [junit4]   2> 	at org.apache.zookeeper.KeeperException.create(KeeperException.java:111)
   [junit4]   2> 	at org.apache.zookeeper.KeeperException.create(KeeperException.java:51)
   [junit4]   2> 	at org.apache.zookeeper.ZooKeeper.delete(ZooKeeper.java:873)
   [junit4]   2> 	at org.apache.solr.common.cloud.SolrZkClient$2.execute(SolrZkClient.java:245)
   [junit4]   2> 	at org.apache.solr.common.cloud.SolrZkClient$2.execute(SolrZkClient.java:242)
   [junit4]

[...truncated too long message...]

nit4]    > 	at java.util.ArrayList.get(ArrayList.java:429)
   [junit4]    > 	at org.apache.solr.update.processor.TestNamedUpdateProcessors.test(TestNamedUpdateProcessors.java:128)
   [junit4]    > 	at org.apache.solr.BaseDistributedSearchTestCase$ShardsRepeatRule$ShardsFixedStatement.callStatement(BaseDistributedSearchTestCase.java:985)
   [junit4]    > 	at org.apache.solr.BaseDistributedSearchTestCase$ShardsRepeatRule$ShardsStatement.evaluate(BaseDistributedSearchTestCase.java:960)
   [junit4]    > 	at java.lang.Thread.run(Thread.java:745)
   [junit4]   2> 2843062 INFO  (SUITE-TestNamedUpdateProcessors-seed#[33A3A6F28D0BE96F]-worker) [    ] o.a.s.SolrTestCaseJ4 ###deleteCore
   [junit4]   2> NOTE: leaving temporary files on disk at: /Users/jenkins/workspace/Lucene-Solr-master-MacOSX/solr/build/solr-core/test/J0/temp/solr.update.processor.TestNamedUpdateProcessors_33A3A6F28D0BE96F-001
   [junit4]   2> NOTE: test params are: codec=Asserting(Lucene70): {blobName=Lucene50(blocksize=128), range_facet_l_dv=Lucene50(blocksize=128), processors_s=PostingsFormat(name=MockRandom), multiDefault=Lucene50(blocksize=128), intDefault=FST50, version=Lucene50(blocksize=128), mul_s=Lucene50(blocksize=128), range_facet_l=FST50, test_s=FST50, size=PostingsFormat(name=MockRandom), _version_=FST50, id=Lucene50(blocksize=128), range_facet_i_dv=FST50, md5=FST50, timestamp=FST50}, docValues:{range_facet_l_dv=DocValuesFormat(name=Lucene70), range_facet_i_dv=DocValuesFormat(name=Direct), timestamp=DocValuesFormat(name=Direct)}, maxPointsInLeafNode=157, maxMBSortInHeap=7.227253052984415, sim=RandomSimilarity(queryNorm=true): {}, locale=ga-IE, timezone=America/Atikokan
   [junit4]   2> NOTE: Mac OS X 10.11.6 x86_64/Oracle Corporation 1.8.0_102 (64-bit)/cpus=3,threads=1,free=165163112,total=518979584
   [junit4]   2> NOTE: All tests run in this JVM: [HLLUtilTest, TestLazyCores, TestReqParamsAPI, VMParamsZkACLAndCredentialsProvidersTest, TestCryptoKeys, TestSolrConfigHandler, BaseCdcrDistributedZkTest, SearchHandlerTest, RankQueryTest, IndexSchemaRuntimeFieldTest, JvmMetricsTest, TestCustomSort, ChaosMonkeyNothingIsSafeTest, IndexBasedSpellCheckerTest, TestPseudoReturnFields, SimplePostToolTest, OverseerCollectionConfigSetProcessorTest, BitVectorTest, PrimUtilsTest, TestFieldTypeCollectionResource, DocExpirationUpdateProcessorFactoryTest, TestSha256AuthenticationProvider, TestSolr4Spatial2, SSLMigrationTest, TestRawResponseWriter, RecoveryAfterSoftCommitTest, DocValuesNotIndexedTest, TestHashPartitioner, TestSurroundQueryParser, TestLeaderInitiatedRecoveryThread, CursorMarkTest, TestUseDocValuesAsStored, SchemaVersionSpecificBehaviorTest, TestDistributedSearch, ShardRoutingTest, SOLR749Test, SmileWriterTest, DistributedFacetPivotSmallTest, TestCollectionAPI, RestartWhileUpdatingTest, ReplicaListTransformerTest, BasicAuthIntegrationTest, CoreAdminCreateDiscoverTest, PrimitiveFieldTypeTest, TestBinaryField, PluginInfoTest, DocumentAnalysisRequestHandlerTest, ActionThrottleTest, TestUpdate, HttpPartitionTest, MetricUtilsTest, TestCSVLoader, TestManagedSchemaThreadSafety, TestStressLucene, PathHierarchyTokenizerFactoryTest, TestDistribDocBasedVersion, OutOfBoxZkACLAndCredentialsProvidersTest, TestGeoJSONResponseWriter, TestExactStatsCache, TestConfigSetImmutable, TestPhraseSuggestions, TestFunctionQuery, TestNumericTerms32, HdfsChaosMonkeySafeLeaderTest, DistributedMLTComponentTest, TestSQLHandler, UniqFieldsUpdateProcessorFactoryTest, PingRequestHandlerTest, TestSolrQueryParserResource, TestSlowCompositeReaderWrapper, TestSort, ManagedSchemaRoundRobinCloudTest, TestRandomRequestDistribution, LeaderElectionTest, HdfsBasicDistributedZkTest, SuggesterFSTTest, TestAddFieldRealTimeGet, TestCharFilters, TestStressVersions, MultiTermTest, DeleteStatusTest, TestImplicitCoreProperties, TestJsonFacets, CloudMLTQParserTest, TestGroupingSearch, TestCloudRecovery, TestStressCloudBlindAtomicUpdates, OpenExchangeRatesOrgProviderTest, ConnectionManagerTest, SolrGraphiteReporterTest, TestRandomDVFaceting, QueryElevationComponentTest, MBeansHandlerTest, SolrCoreTest, TestWordDelimiterFilterFactory, TestSolrConfigHandlerCloud, TestSolrCloudWithKerberosAlt, TestExclusionRuleCollectionAccess, TestSizeLimitedDistributedMap, DOMUtilTest, SolrTestCaseJ4Test, DistributedQueryElevationComponentTest, CollectionsAPIAsyncDistributedZkTest, QueryEqualityTest, TestSerializedLuceneMatchVersion, TestQuerySenderNoQuery, TestElisionMultitermQuery, TestMacros, MigrateRouteKeyTest, TemplateUpdateProcessorTest, SampleTest, PolyFieldTest, HdfsWriteToMultipleCollectionsTest, TestBlendedInfixSuggestions, TestHashQParserPlugin, TestHdfsBackupRestoreCore, TestCSVResponseWriter, ClassificationUpdateProcessorTest, TestIBSimilarityFactory, TestCloudSchemaless, TestPerFieldSimilarity, TestRTGBase, TestManagedStopFilterFactory, TestSubQueryTransformer, DocValuesMultiTest, TestRandomCollapseQParserPlugin, HdfsLockFactoryTest, TestFastLRUCache, TestDynamicFieldCollectionResource, SolrMetricManagerTest, SynonymTokenizerTest, HdfsSyncSliceTest, FastVectorHighlighterTest, FileUtilsTest, TestSolrJ, TestJmxIntegration, LeaderFailoverAfterPartitionTest, SharedFSAutoReplicaFailoverUtilsTest, CursorPagingTest, StandardRequestHandlerTest, BJQParserTest, TestFaceting, CustomCollectionTest, TimeZoneUtilsTest, TestSubQueryTransformerDistrib, TestStandardQParsers, TestCopyFieldCollectionResource, SegmentsInfoRequestHandlerTest, TestCloudManagedSchema, TestSolrDeletionPolicy1, TestTestInjection, TestCursorMarkWithoutUniqueKey, RecoveryZkTest, TestBulkSchemaAPI, TestCustomDocTransformer, PeerSyncTest, RuleEngineTest, TestReloadDeadlock, TestHdfsUpdateLog, TestUninvertingReader, TestDocumentBuilder, TestStressReorder, PKIAuthenticationIntegrationTest, SyncSliceTest, CopyFieldTest, ChaosMonkeySafeLeaderTest, BasicDistributedZk2Test, UnloadDistributedZkTest, FullSolrCloudDistribCmdsTest, ClusterStateUpdateTest, ZkCLITest, AutoCommitTest, TermVectorComponentDistributedTest, TestJoin, HardAutoCommitTest, TestFiltering, DirectUpdateHandlerTest, TestBadConfig, HighlighterTest, CurrencyFieldXmlFileTest, TestCoreDiscovery, AnalysisAfterCoreReloadTest, SignatureUpdateProcessorFactoryTest, TestExtendedDismaxParser, SpellCheckCollatorTest, SolrRequestParserTest, DocValuesTest, DistanceFunctionTest, XsltUpdateRequestHandlerTest, CacheHeaderTest, DirectSolrSpellCheckerTest, TestOmitPositions, FileBasedSpellCheckerTest, XmlUpdateRequestHandlerTest, DocumentBuilderTest, RequiredFieldsTest, TestCollationField, BinaryUpdateRequestHandlerTest, TestPHPSerializedResponseWriter, HighlighterConfigTest, UpdateParamsTest, AlternateDirectoryTest, ResponseLogComponentTest, SolrIndexConfigTest, TestMergePolicyConfig, TestDocSet, NumericFieldsTest, TestConfig, OutputWriterTest, ExternalFileFieldSortTest, TestSolrCoreProperties, TestPostingsSolrHighlighter, DirectSolrConnectionTest, NotRequiredUniqueKeyTest, TestLuceneMatchVersion, TestCodecSupport, TestXIncludeConfig, EchoParamsTest, TestSweetSpotSimilarityFactory, TestDFRSimilarityFactory, TestLMDirichletSimilarityFactory, TestLMJelinekMercerSimilarityFactory, TestBM25SimilarityFactory, ResourceLoaderTest, ScriptEngineTest, TestSystemIdResolver, DateFieldTest, ClusterStateTest, TestLRUCache, ZkNodePropsTest, CircularListTest, TestCrossCoreJoin, TestHighlightDedupGrouping, TestSimpleTrackingShardHandler, TestEmbeddedSolrServerConstructors, TestJettySolrRunner, AliasIntegrationTest, CollectionReloadTest, ConcurrentDeleteAndCreateCollectionTest, ConfigSetsAPITest, CreateCollectionCleanupTest, DeleteLastCustomShardedReplicaTest, DistribCursorPagingTest, DistributedQueueTest, DistributedVersionInfoTest, MultiThreadedOCPTest, OverseerTaskQueueTest, RemoteQueryErrorTest, ReplaceNodeTest, RollingRestartTest, ShardSplitTest, TlogReplayBufferedWhileIndexingTest, HdfsNNFailoverTest, HdfsRecoveryZkTest, HdfsRestartWhileUpdatingTest, HdfsTlogReplayBufferedWhileIndexingTest, TestClusterStateMutator, ZkStateReaderTest, BlobRepositoryCloudTest, QueryResultKeyTest, TestConfigSets, TestInfoStreamLogging, TestInitParams, TestReloadAndDeleteDocs, TestShardHandlerFactory, TestSolrDynamicMBean, TestSolrXml, TestSolrCoreSnapshots, TestBlobHandler, TestRestoreCore, TestSQLHandlerNonCloud, CoreMergeIndexesAdminHandlerTest, InfoHandlerTest, MetricsHandlerTest, DistributedDebugComponentTest, DistributedExpandComponentTest, DistributedFacetExistsSmallTest, DistributedFacetPivotLargeTest, DistributedQueryComponentCustomSortTest, FacetPivotSmallTest, ShufflingReplicaListTransformerTest, SpatialHeatmapFacetsTest, TestExpandComponent, TestPivotHelperCode, TestTrackingShardHandlerFactory, JavabinLoaderTest, HighlighterMaxOffsetTest, TestUnifiedSolrHighlighter, CheckHdfsIndexTest, SolrCoreMetricManagerTest, SolrSlf4jReporterTest, TestDefaultSearchFieldResource, TestFieldCollectionResource, TestSchemaSimilarityResource, BadCopyFieldTest, ChangedSchemaMergeTest, DocValuesMissingTest, TestBulkSchemaConcurrent, SortSpecParsingTest, TestCollapseQParserPlugin, TestFilteredDocIdSet, TestInitQParser, TestMissingGroups, TestReRankQParserPlugin, TestSearcherReuse, TestSmileRequest, TestOrdValues, TestSortByMinMaxFunction, BlockJoinFacetDistribTest, TestNonDefinedSimilarityFactory, TestDefaultStatsCache, TestLRUStatsCache, BasicAuthStandaloneTest, TestPKIAuthenticationPlugin, TestDelegationWithHadoopAuth, HttpSolrCallGetCoreTest, TestFreeTextSuggestions, BlockCacheTest, BufferStoreTest, TestFieldCache, TestFieldCacheSanityChecker, TestFieldCacheSort, TestFieldCacheSortRandom, TestFieldCacheVsDocValues, TestFieldCacheWithThreads, AnalysisErrorHandlingTest, DataDrivenBlockJoinTest, TestDocBasedVersionConstraints, TestExceedMaxTermLength, VersionInfoTest, AddSchemaFieldsUpdateProcessorFactoryTest, AtomicUpdatesTest, ClassificationUpdateProcessorFactoryTest, ParsingFieldUpdateProcessorsTest, TestNamedUpdateProcessors]
   [junit4] Completed [673/673 (1!)] on J0 in 23.66s, 1 test, 1 error <<< FAILURES!

[...truncated 62446 lines...]


Mime
View raw message