lucene-dev mailing list archives

Site index · List index
Message view « Date » · « Thread »
Top « Date » · « Thread »
From Policeman Jenkins Server <jenk...@thetaphi.de>
Subject [JENKINS] Lucene-Solr-6.x-Windows (64bit/jdk1.8.0_112) - Build # 673 - Unstable!
Date Sat, 07 Jan 2017 02:21:05 GMT
Build: https://jenkins.thetaphi.de/job/Lucene-Solr-6.x-Windows/673/
Java: 64bit/jdk1.8.0_112 -XX:-UseCompressedOops -XX:+UseConcMarkSweepGC

1 tests failed.
FAILED:  org.apache.lucene.index.TestDirectoryReader.testFilesOpenClose

Error Message:


Stack Trace:
java.lang.reflect.InvocationTargetException
	at __randomizedtesting.SeedInfo.seed([EE4F33618F0F7F12:CA56815D76F2667B]:0)
	at sun.reflect.NativeConstructorAccessorImpl.newInstance0(Native Method)
	at sun.reflect.NativeConstructorAccessorImpl.newInstance(NativeConstructorAccessorImpl.java:62)
	at sun.reflect.DelegatingConstructorAccessorImpl.newInstance(DelegatingConstructorAccessorImpl.java:45)
	at java.lang.reflect.Constructor.newInstance(Constructor.java:423)
	at org.apache.lucene.util.CommandLineUtil.newFSDirectory(CommandLineUtil.java:138)
	at org.apache.lucene.util.LuceneTestCase.newFSDirectoryImpl(LuceneTestCase.java:1606)
	at org.apache.lucene.util.LuceneTestCase.newFSDirectory(LuceneTestCase.java:1410)
	at org.apache.lucene.util.LuceneTestCase.newFSDirectory(LuceneTestCase.java:1391)
	at org.apache.lucene.util.LuceneTestCase.newFSDirectory(LuceneTestCase.java:1378)
	at org.apache.lucene.index.TestDirectoryReader.testFilesOpenClose(TestDirectoryReader.java:449)
	at sun.reflect.NativeMethodAccessorImpl.invoke0(Native Method)
	at sun.reflect.NativeMethodAccessorImpl.invoke(NativeMethodAccessorImpl.java:62)
	at sun.reflect.DelegatingMethodAccessorImpl.invoke(DelegatingMethodAccessorImpl.java:43)
	at java.lang.reflect.Method.invoke(Method.java:498)
	at com.carrotsearch.randomizedtesting.RandomizedRunner.invoke(RandomizedRunner.java:1713)
	at com.carrotsearch.randomizedtesting.RandomizedRunner$8.evaluate(RandomizedRunner.java:907)
	at com.carrotsearch.randomizedtesting.RandomizedRunner$9.evaluate(RandomizedRunner.java:943)
	at com.carrotsearch.randomizedtesting.RandomizedRunner$10.evaluate(RandomizedRunner.java:957)
	at org.apache.lucene.util.TestRuleSetupTeardownChained$1.evaluate(TestRuleSetupTeardownChained.java:49)
	at org.apache.lucene.util.AbstractBeforeAfterRule$1.evaluate(AbstractBeforeAfterRule.java:45)
	at org.apache.lucene.util.TestRuleThreadAndTestName$1.evaluate(TestRuleThreadAndTestName.java:48)
	at org.apache.lucene.util.TestRuleIgnoreAfterMaxFailures$1.evaluate(TestRuleIgnoreAfterMaxFailures.java:64)
	at org.apache.lucene.util.TestRuleMarkFailure$1.evaluate(TestRuleMarkFailure.java:47)
	at com.carrotsearch.randomizedtesting.rules.StatementAdapter.evaluate(StatementAdapter.java:36)
	at com.carrotsearch.randomizedtesting.ThreadLeakControl$StatementRunner.run(ThreadLeakControl.java:367)
	at com.carrotsearch.randomizedtesting.ThreadLeakControl.forkTimeoutingTask(ThreadLeakControl.java:811)
	at com.carrotsearch.randomizedtesting.ThreadLeakControl$3.evaluate(ThreadLeakControl.java:462)
	at com.carrotsearch.randomizedtesting.RandomizedRunner.runSingleTest(RandomizedRunner.java:916)
	at com.carrotsearch.randomizedtesting.RandomizedRunner$5.evaluate(RandomizedRunner.java:802)
	at com.carrotsearch.randomizedtesting.RandomizedRunner$6.evaluate(RandomizedRunner.java:852)
	at com.carrotsearch.randomizedtesting.RandomizedRunner$7.evaluate(RandomizedRunner.java:863)
	at org.apache.lucene.util.AbstractBeforeAfterRule$1.evaluate(AbstractBeforeAfterRule.java:45)
	at com.carrotsearch.randomizedtesting.rules.StatementAdapter.evaluate(StatementAdapter.java:36)
	at org.apache.lucene.util.TestRuleStoreClassName$1.evaluate(TestRuleStoreClassName.java:41)
	at com.carrotsearch.randomizedtesting.rules.NoShadowingOrOverridesOnMethodsRule$1.evaluate(NoShadowingOrOverridesOnMethodsRule.java:40)
	at com.carrotsearch.randomizedtesting.rules.NoShadowingOrOverridesOnMethodsRule$1.evaluate(NoShadowingOrOverridesOnMethodsRule.java:40)
	at com.carrotsearch.randomizedtesting.rules.StatementAdapter.evaluate(StatementAdapter.java:36)
	at com.carrotsearch.randomizedtesting.rules.StatementAdapter.evaluate(StatementAdapter.java:36)
	at com.carrotsearch.randomizedtesting.rules.StatementAdapter.evaluate(StatementAdapter.java:36)
	at org.apache.lucene.util.TestRuleAssertionsRequired$1.evaluate(TestRuleAssertionsRequired.java:53)
	at org.apache.lucene.util.TestRuleMarkFailure$1.evaluate(TestRuleMarkFailure.java:47)
	at org.apache.lucene.util.TestRuleIgnoreAfterMaxFailures$1.evaluate(TestRuleIgnoreAfterMaxFailures.java:64)
	at org.apache.lucene.util.TestRuleIgnoreTestSuites$1.evaluate(TestRuleIgnoreTestSuites.java:54)
	at com.carrotsearch.randomizedtesting.rules.StatementAdapter.evaluate(StatementAdapter.java:36)
	at com.carrotsearch.randomizedtesting.ThreadLeakControl$StatementRunner.run(ThreadLeakControl.java:367)
	at java.lang.Thread.run(Thread.java:745)
Caused by: java.nio.file.AccessDeniedException: C:\Users\jenkins\workspace\Lucene-Solr-6.x-Windows\lucene\build\core\test\J0\temp\lucene.index.TestDirectoryReader_EE4F33618F0F7F12-001\TestIndexReader.testFilesOpenClose-001
	at sun.nio.fs.WindowsException.translateToIOException(WindowsException.java:83)
	at sun.nio.fs.WindowsException.rethrowAsIOException(WindowsException.java:97)
	at sun.nio.fs.WindowsException.rethrowAsIOException(WindowsException.java:102)
	at sun.nio.fs.WindowsFileSystemProvider.createDirectory(WindowsFileSystemProvider.java:504)
	at org.apache.lucene.mockfile.FilterFileSystemProvider.createDirectory(FilterFileSystemProvider.java:132)
	at org.apache.lucene.mockfile.FilterFileSystemProvider.createDirectory(FilterFileSystemProvider.java:132)
	at org.apache.lucene.mockfile.FilterFileSystemProvider.createDirectory(FilterFileSystemProvider.java:132)
	at org.apache.lucene.mockfile.FilterFileSystemProvider.createDirectory(FilterFileSystemProvider.java:132)
	at org.apache.lucene.mockfile.FilterFileSystemProvider.createDirectory(FilterFileSystemProvider.java:132)
	at org.apache.lucene.mockfile.ExtrasFS.createDirectory(ExtrasFS.java:54)
	at java.nio.file.Files.createDirectory(Files.java:674)
	at java.nio.file.Files.createAndCheckIsDirectory(Files.java:781)
	at java.nio.file.Files.createDirectories(Files.java:767)
	at org.apache.lucene.store.FSDirectory.<init>(FSDirectory.java:157)
	at org.apache.lucene.store.SimpleFSDirectory.<init>(SimpleFSDirectory.java:58)
	... 46 more




Build Log:
[...truncated 381 lines...]
   [junit4] Suite: org.apache.lucene.index.TestDirectoryReader
   [junit4]   2> NOTE: reproduce with: ant test  -Dtestcase=TestDirectoryReader -Dtests.method=testFilesOpenClose
-Dtests.seed=EE4F33618F0F7F12 -Dtests.slow=true -Dtests.locale=fr-CA -Dtests.timezone=America/Nassau
-Dtests.asserts=true -Dtests.file.encoding=UTF-8
   [junit4] ERROR   0.05s J0 | TestDirectoryReader.testFilesOpenClose <<<
   [junit4]    > Throwable #1: java.lang.reflect.InvocationTargetException
   [junit4]    > 	at __randomizedtesting.SeedInfo.seed([EE4F33618F0F7F12:CA56815D76F2667B]:0)
   [junit4]    > 	at java.lang.reflect.Constructor.newInstance(Constructor.java:423)
   [junit4]    > 	at org.apache.lucene.util.CommandLineUtil.newFSDirectory(CommandLineUtil.java:138)
   [junit4]    > 	at org.apache.lucene.util.LuceneTestCase.newFSDirectoryImpl(LuceneTestCase.java:1606)
   [junit4]    > 	at org.apache.lucene.util.LuceneTestCase.newFSDirectory(LuceneTestCase.java:1410)
   [junit4]    > 	at org.apache.lucene.util.LuceneTestCase.newFSDirectory(LuceneTestCase.java:1391)
   [junit4]    > 	at org.apache.lucene.util.LuceneTestCase.newFSDirectory(LuceneTestCase.java:1378)
   [junit4]    > 	at org.apache.lucene.index.TestDirectoryReader.testFilesOpenClose(TestDirectoryReader.java:449)
   [junit4]    > 	at java.lang.Thread.run(Thread.java:745)
   [junit4]    > Caused by: java.nio.file.AccessDeniedException: C:\Users\jenkins\workspace\Lucene-Solr-6.x-Windows\lucene\build\core\test\J0\temp\lucene.index.TestDirectoryReader_EE4F33618F0F7F12-001\TestIndexReader.testFilesOpenClose-001
   [junit4]    > 	at sun.nio.fs.WindowsException.translateToIOException(WindowsException.java:83)
   [junit4]    > 	at sun.nio.fs.WindowsException.rethrowAsIOException(WindowsException.java:97)
   [junit4]    > 	at sun.nio.fs.WindowsException.rethrowAsIOException(WindowsException.java:102)
   [junit4]    > 	at sun.nio.fs.WindowsFileSystemProvider.createDirectory(WindowsFileSystemProvider.java:504)
   [junit4]    > 	at org.apache.lucene.mockfile.FilterFileSystemProvider.createDirectory(FilterFileSystemProvider.java:132)
   [junit4]    > 	at org.apache.lucene.mockfile.FilterFileSystemProvider.createDirectory(FilterFileSystemProvider.java:132)
   [junit4]    > 	at org.apache.lucene.mockfile.FilterFileSystemProvider.createDirectory(FilterFileSystemProvider.java:132)
   [junit4]    > 	at org.apache.lucene.mockfile.FilterFileSystemProvider.createDirectory(FilterFileSystemProvider.java:132)
   [junit4]    > 	at org.apache.lucene.mockfile.FilterFileSystemProvider.createDirectory(FilterFileSystemProvider.java:132)
   [junit4]    > 	at org.apache.lucene.mockfile.ExtrasFS.createDirectory(ExtrasFS.java:54)
   [junit4]    > 	at java.nio.file.Files.createDirectory(Files.java:674)
   [junit4]    > 	at java.nio.file.Files.createAndCheckIsDirectory(Files.java:781)
   [junit4]    > 	at java.nio.file.Files.createDirectories(Files.java:767)
   [junit4]    > 	at org.apache.lucene.store.FSDirectory.<init>(FSDirectory.java:157)
   [junit4]    > 	at org.apache.lucene.store.SimpleFSDirectory.<init>(SimpleFSDirectory.java:58)
   [junit4]    > 	... 46 more
   [junit4]   2> NOTE: leaving temporary files on disk at: C:\Users\jenkins\workspace\Lucene-Solr-6.x-Windows\lucene\build\core\test\J0\temp\lucene.index.TestDirectoryReader_EE4F33618F0F7F12-001
   [junit4]   2> NOTE: test params are: codec=Lucene62, sim=RandomSimilarity(queryNorm=false,coord=crazy):
{termvector=DFR GBZ(0.3), f=LM Jelinek-Mercer(0.100000), tvnot=DFR I(F)L1, tvoffset=DFR I(n)1,
body=IB LL-DZ(0.3), tvposition=DFI(Standardized), content=DFR I(F)1, unstored2=IB LL-L2, tvpositionoffset=DFI(ChiSquared),
number=IB LL-L3(800.0), field=DFR I(n)Z(0.3), unstored=DFI(Saturated), text2=DFR I(F)L1, junk=DFR
I(n)B1, text=DFR I(n)2}, locale=fr-CA, timezone=America/Nassau
   [junit4]   2> NOTE: Windows 10 10.0 amd64/Oracle Corporation 1.8.0_112 (64-bit)/cpus=3,threads=1,free=36668456,total=119148544
   [junit4]   2> NOTE: All tests run in this JVM: [TestCodecHoldsOpenFiles, TestPolygon2D,
TestPriorityQueue, TestGraphQuery, TestMultiTermQueryRewrites, TestDocsAndPositions, TestBlockPostingsFormat2,
TestTwoPhaseCommitTool, TestPayloadsOnVectors, TestLSBRadixSorter, TestIndexingSequenceNumbers,
TestBufferedIndexInput, TestSparseFixedBitSet, TestDateSort, TestWordlistLoader, Test2BPostingsBytes,
TestBytesStore, TestSearchAfter, TestCharacterUtils, TestSpanSearchEquivalence, TestFilterIterator,
MultiCollectorTest, TestDirectMonotonic, TestSegmentTermEnum, TestMultiTermsEnum, TestGeoUtils,
TestTryDelete, TestDocValuesIndexing, TestParallelTermEnum, TestFastDecompressionMode, TestBytesRefArray,
TestDeletionPolicy, TestFieldCacheRewriteMethod, TestCustomSearcherSort, TestDirectoryReader]
   [junit4] Completed [53/446 (1!)] on J0 in 1.12s, 24 tests, 1 error <<< FAILURES!

[...truncated 75069 lines...]


Mime
View raw message