lucene-dev mailing list archives

Site index · List index
Message view « Date » · « Thread »
Top « Date » · « Thread »
From Policeman Jenkins Server <jenk...@thetaphi.de>
Subject [JENKINS] Lucene-Solr-6.x-MacOSX (64bit/jdk1.8.0) - Build # 664 - Unstable!
Date Thu, 26 Jan 2017 12:08:43 GMT
Build: https://jenkins.thetaphi.de/job/Lucene-Solr-6.x-MacOSX/664/
Java: 64bit/jdk1.8.0 -XX:+UseCompressedOops -XX:+UseG1GC

1 tests failed.
FAILED:  org.apache.solr.handler.extraction.TestExtractionDateUtil.testParseDate

Error Message:
Incorrect parsed timestamp: 1226583351000 != 1226579751000 (Thu Nov 13 04:35:51 AKST 2008)

Stack Trace:
java.lang.AssertionError: Incorrect parsed timestamp: 1226583351000 != 1226579751000 (Thu
Nov 13 04:35:51 AKST 2008)
	at __randomizedtesting.SeedInfo.seed([B72AC4792F31F74B:FD33BC4C549880FE]:0)
	at org.junit.Assert.fail(Assert.java:93)
	at org.junit.Assert.assertTrue(Assert.java:43)
	at org.apache.solr.handler.extraction.TestExtractionDateUtil.assertParsedDate(TestExtractionDateUtil.java:59)
	at org.apache.solr.handler.extraction.TestExtractionDateUtil.testParseDate(TestExtractionDateUtil.java:54)
	at sun.reflect.NativeMethodAccessorImpl.invoke0(Native Method)
	at sun.reflect.NativeMethodAccessorImpl.invoke(NativeMethodAccessorImpl.java:62)
	at sun.reflect.DelegatingMethodAccessorImpl.invoke(DelegatingMethodAccessorImpl.java:43)
	at java.lang.reflect.Method.invoke(Method.java:498)
	at com.carrotsearch.randomizedtesting.RandomizedRunner.invoke(RandomizedRunner.java:1713)
	at com.carrotsearch.randomizedtesting.RandomizedRunner$8.evaluate(RandomizedRunner.java:907)
	at com.carrotsearch.randomizedtesting.RandomizedRunner$9.evaluate(RandomizedRunner.java:943)
	at com.carrotsearch.randomizedtesting.RandomizedRunner$10.evaluate(RandomizedRunner.java:957)
	at org.apache.lucene.util.TestRuleSetupTeardownChained$1.evaluate(TestRuleSetupTeardownChained.java:49)
	at org.apache.lucene.util.AbstractBeforeAfterRule$1.evaluate(AbstractBeforeAfterRule.java:45)
	at org.apache.lucene.util.TestRuleThreadAndTestName$1.evaluate(TestRuleThreadAndTestName.java:48)
	at org.apache.lucene.util.TestRuleIgnoreAfterMaxFailures$1.evaluate(TestRuleIgnoreAfterMaxFailures.java:64)
	at org.apache.lucene.util.TestRuleMarkFailure$1.evaluate(TestRuleMarkFailure.java:47)
	at com.carrotsearch.randomizedtesting.rules.StatementAdapter.evaluate(StatementAdapter.java:36)
	at com.carrotsearch.randomizedtesting.ThreadLeakControl$StatementRunner.run(ThreadLeakControl.java:368)
	at com.carrotsearch.randomizedtesting.ThreadLeakControl.forkTimeoutingTask(ThreadLeakControl.java:817)
	at com.carrotsearch.randomizedtesting.ThreadLeakControl$3.evaluate(ThreadLeakControl.java:468)
	at com.carrotsearch.randomizedtesting.RandomizedRunner.runSingleTest(RandomizedRunner.java:916)
	at com.carrotsearch.randomizedtesting.RandomizedRunner$5.evaluate(RandomizedRunner.java:802)
	at com.carrotsearch.randomizedtesting.RandomizedRunner$6.evaluate(RandomizedRunner.java:852)
	at com.carrotsearch.randomizedtesting.RandomizedRunner$7.evaluate(RandomizedRunner.java:863)
	at org.apache.lucene.util.AbstractBeforeAfterRule$1.evaluate(AbstractBeforeAfterRule.java:45)
	at com.carrotsearch.randomizedtesting.rules.StatementAdapter.evaluate(StatementAdapter.java:36)
	at org.apache.lucene.util.TestRuleStoreClassName$1.evaluate(TestRuleStoreClassName.java:41)
	at com.carrotsearch.randomizedtesting.rules.NoShadowingOrOverridesOnMethodsRule$1.evaluate(NoShadowingOrOverridesOnMethodsRule.java:40)
	at com.carrotsearch.randomizedtesting.rules.NoShadowingOrOverridesOnMethodsRule$1.evaluate(NoShadowingOrOverridesOnMethodsRule.java:40)
	at com.carrotsearch.randomizedtesting.rules.StatementAdapter.evaluate(StatementAdapter.java:36)
	at com.carrotsearch.randomizedtesting.rules.StatementAdapter.evaluate(StatementAdapter.java:36)
	at com.carrotsearch.randomizedtesting.rules.StatementAdapter.evaluate(StatementAdapter.java:36)
	at org.apache.lucene.util.TestRuleAssertionsRequired$1.evaluate(TestRuleAssertionsRequired.java:53)
	at org.apache.lucene.util.TestRuleMarkFailure$1.evaluate(TestRuleMarkFailure.java:47)
	at org.apache.lucene.util.TestRuleIgnoreAfterMaxFailures$1.evaluate(TestRuleIgnoreAfterMaxFailures.java:64)
	at org.apache.lucene.util.TestRuleIgnoreTestSuites$1.evaluate(TestRuleIgnoreTestSuites.java:54)
	at com.carrotsearch.randomizedtesting.rules.StatementAdapter.evaluate(StatementAdapter.java:36)
	at com.carrotsearch.randomizedtesting.ThreadLeakControl$StatementRunner.run(ThreadLeakControl.java:368)
	at java.lang.Thread.run(Thread.java:745)




Build Log:
[...truncated 18102 lines...]
   [junit4] Suite: org.apache.solr.handler.extraction.TestExtractionDateUtil
   [junit4]   2> NOTE: reproduce with: ant test  -Dtestcase=TestExtractionDateUtil -Dtests.method=testParseDate
-Dtests.seed=B72AC4792F31F74B -Dtests.slow=true -Dtests.locale=lv -Dtests.timezone=America/Metlakatla
-Dtests.asserts=true -Dtests.file.encoding=UTF-8
   [junit4] FAILURE 0.04s J1 | TestExtractionDateUtil.testParseDate <<<
   [junit4]    > Throwable #1: java.lang.AssertionError: Incorrect parsed timestamp: 1226583351000
!= 1226579751000 (Thu Nov 13 04:35:51 AKST 2008)
   [junit4]    > 	at __randomizedtesting.SeedInfo.seed([B72AC4792F31F74B:FD33BC4C549880FE]:0)
   [junit4]    > 	at org.apache.solr.handler.extraction.TestExtractionDateUtil.assertParsedDate(TestExtractionDateUtil.java:59)
   [junit4]    > 	at org.apache.solr.handler.extraction.TestExtractionDateUtil.testParseDate(TestExtractionDateUtil.java:54)
   [junit4]    > 	at java.lang.Thread.run(Thread.java:745)
   [junit4]   2> NOTE: test params are: codec=Asserting(Lucene62): {}, docValues:{}, maxPointsInLeafNode=482,
maxMBSortInHeap=7.973143971813624, sim=RandomSimilarity(queryNorm=false,coord=yes): {}, locale=lv,
timezone=America/Metlakatla
   [junit4]   2> NOTE: Mac OS X 10.11.6 x86_64/Oracle Corporation 1.8.0_121 (64-bit)/cpus=3,threads=1,free=27032760,total=56623104
   [junit4]   2> NOTE: All tests run in this JVM: [TestExtractionDateUtil]
   [junit4] Completed [1/4 (1!)] on J1 in 2.64s, 2 tests, 1 failure <<< FAILURES!

[...truncated 57316 lines...]


Mime
View raw message