lucene-dev mailing list archives

Site index · List index
Message view « Date » · « Thread »
Top « Date » · « Thread »
From Policeman Jenkins Server <jenk...@thetaphi.de>
Subject [JENKINS-EA] Lucene-Solr-master-Linux (64bit/jdk-9-ea+147) - Build # 18699 - Unstable!
Date Thu, 05 Jan 2017 00:40:04 GMT
Build: https://jenkins.thetaphi.de/job/Lucene-Solr-master-Linux/18699/
Java: 64bit/jdk-9-ea+147 -XX:-UseCompressedOops -XX:+UseSerialGC

1 tests failed.
FAILED:  org.apache.solr.cloud.PeerSyncReplicationTest.test

Error Message:
PeerSynced node did not become leader expected:<CloudJettyRunner [url=https://127.0.0.1:42151/ipown/al/collection1]> but was:<CloudJettyRunner [url=https://127.0.0.1:45471/ipown/al/collection1]>

Stack Trace:
java.lang.AssertionError: PeerSynced node did not become leader expected:<CloudJettyRunner [url=https://127.0.0.1:42151/ipown/al/collection1]> but was:<CloudJettyRunner [url=https://127.0.0.1:45471/ipown/al/collection1]>
	at __randomizedtesting.SeedInfo.seed([1C27B93464235B84:947386EECADF367C]:0)
	at org.junit.Assert.fail(Assert.java:93)
	at org.junit.Assert.failNotEquals(Assert.java:647)
	at org.junit.Assert.assertEquals(Assert.java:128)
	at org.apache.solr.cloud.PeerSyncReplicationTest.test(PeerSyncReplicationTest.java:157)
	at java.base/jdk.internal.reflect.NativeMethodAccessorImpl.invoke0(Native Method)
	at java.base/jdk.internal.reflect.NativeMethodAccessorImpl.invoke(NativeMethodAccessorImpl.java:62)
	at java.base/jdk.internal.reflect.DelegatingMethodAccessorImpl.invoke(DelegatingMethodAccessorImpl.java:43)
	at java.base/java.lang.reflect.Method.invoke(Method.java:538)
	at com.carrotsearch.randomizedtesting.RandomizedRunner.invoke(RandomizedRunner.java:1713)
	at com.carrotsearch.randomizedtesting.RandomizedRunner$8.evaluate(RandomizedRunner.java:907)
	at com.carrotsearch.randomizedtesting.RandomizedRunner$9.evaluate(RandomizedRunner.java:943)
	at com.carrotsearch.randomizedtesting.RandomizedRunner$10.evaluate(RandomizedRunner.java:957)
	at org.apache.solr.BaseDistributedSearchTestCase$ShardsRepeatRule$ShardsFixedStatement.callStatement(BaseDistributedSearchTestCase.java:985)
	at org.apache.solr.BaseDistributedSearchTestCase$ShardsRepeatRule$ShardsStatement.evaluate(BaseDistributedSearchTestCase.java:960)
	at com.carrotsearch.randomizedtesting.rules.SystemPropertiesRestoreRule$1.evaluate(SystemPropertiesRestoreRule.java:57)
	at org.apache.lucene.util.TestRuleSetupTeardownChained$1.evaluate(TestRuleSetupTeardownChained.java:49)
	at org.apache.lucene.util.AbstractBeforeAfterRule$1.evaluate(AbstractBeforeAfterRule.java:45)
	at org.apache.lucene.util.TestRuleThreadAndTestName$1.evaluate(TestRuleThreadAndTestName.java:48)
	at org.apache.lucene.util.TestRuleIgnoreAfterMaxFailures$1.evaluate(TestRuleIgnoreAfterMaxFailures.java:64)
	at org.apache.lucene.util.TestRuleMarkFailure$1.evaluate(TestRuleMarkFailure.java:47)
	at com.carrotsearch.randomizedtesting.rules.StatementAdapter.evaluate(StatementAdapter.java:36)
	at com.carrotsearch.randomizedtesting.ThreadLeakControl$StatementRunner.run(ThreadLeakControl.java:367)
	at com.carrotsearch.randomizedtesting.ThreadLeakControl.forkTimeoutingTask(ThreadLeakControl.java:811)
	at com.carrotsearch.randomizedtesting.ThreadLeakControl$3.evaluate(ThreadLeakControl.java:462)
	at com.carrotsearch.randomizedtesting.RandomizedRunner.runSingleTest(RandomizedRunner.java:916)
	at com.carrotsearch.randomizedtesting.RandomizedRunner$5.evaluate(RandomizedRunner.java:802)
	at com.carrotsearch.randomizedtesting.RandomizedRunner$6.evaluate(RandomizedRunner.java:852)
	at com.carrotsearch.randomizedtesting.RandomizedRunner$7.evaluate(RandomizedRunner.java:863)
	at com.carrotsearch.randomizedtesting.rules.StatementAdapter.evaluate(StatementAdapter.java:36)
	at com.carrotsearch.randomizedtesting.rules.SystemPropertiesRestoreRule$1.evaluate(SystemPropertiesRestoreRule.java:57)
	at org.apache.lucene.util.AbstractBeforeAfterRule$1.evaluate(AbstractBeforeAfterRule.java:45)
	at com.carrotsearch.randomizedtesting.rules.StatementAdapter.evaluate(StatementAdapter.java:36)
	at org.apache.lucene.util.TestRuleStoreClassName$1.evaluate(TestRuleStoreClassName.java:41)
	at com.carrotsearch.randomizedtesting.rules.NoShadowingOrOverridesOnMethodsRule$1.evaluate(NoShadowingOrOverridesOnMethodsRule.java:40)
	at com.carrotsearch.randomizedtesting.rules.NoShadowingOrOverridesOnMethodsRule$1.evaluate(NoShadowingOrOverridesOnMethodsRule.java:40)
	at com.carrotsearch.randomizedtesting.rules.StatementAdapter.evaluate(StatementAdapter.java:36)
	at com.carrotsearch.randomizedtesting.rules.StatementAdapter.evaluate(StatementAdapter.java:36)
	at org.apache.lucene.util.TestRuleAssertionsRequired$1.evaluate(TestRuleAssertionsRequired.java:53)
	at org.apache.lucene.util.TestRuleMarkFailure$1.evaluate(TestRuleMarkFailure.java:47)
	at org.apache.lucene.util.TestRuleIgnoreAfterMaxFailures$1.evaluate(TestRuleIgnoreAfterMaxFailures.java:64)
	at org.apache.lucene.util.TestRuleIgnoreTestSuites$1.evaluate(TestRuleIgnoreTestSuites.java:54)
	at com.carrotsearch.randomizedtesting.rules.StatementAdapter.evaluate(StatementAdapter.java:36)
	at com.carrotsearch.randomizedtesting.ThreadLeakControl$StatementRunner.run(ThreadLeakControl.java:367)
	at java.base/java.lang.Thread.run(Thread.java:844)




Build Log:
[...truncated 12449 lines...]
   [junit4] Suite: org.apache.solr.cloud.PeerSyncReplicationTest
   [junit4]   2> Creating dataDir: /home/jenkins/workspace/Lucene-Solr-master-Linux/solr/build/solr-core/test/J1/temp/solr.cloud.PeerSyncReplicationTest_1C27B93464235B84-001/init-core-data-001
   [junit4]   2> 1360211 INFO  (SUITE-PeerSyncReplicationTest-seed#[1C27B93464235B84]-worker) [    ] o.a.s.SolrTestCaseJ4 Randomized ssl (true) and clientAuth (true) via: @org.apache.solr.util.RandomizeSSL(reason="", ssl=0.0/0.0, value=0.0/0.0, clientAuth=0.0/0.0)
   [junit4]   2> 1360212 INFO  (SUITE-PeerSyncReplicationTest-seed#[1C27B93464235B84]-worker) [    ] o.a.s.BaseDistributedSearchTestCase Setting hostContext system property: /ipown/al
   [junit4]   2> 1360213 INFO  (TEST-PeerSyncReplicationTest.test-seed#[1C27B93464235B84]) [    ] o.a.s.c.ZkTestServer STARTING ZK TEST SERVER
   [junit4]   2> 1360214 INFO  (Thread-2513) [    ] o.a.s.c.ZkTestServer client port:0.0.0.0/0.0.0.0:0
   [junit4]   2> 1360214 INFO  (Thread-2513) [    ] o.a.s.c.ZkTestServer Starting server
   [junit4]   2> 1360314 INFO  (TEST-PeerSyncReplicationTest.test-seed#[1C27B93464235B84]) [    ] o.a.s.c.ZkTestServer start zk server on port:37638
   [junit4]   2> 1360319 INFO  (TEST-PeerSyncReplicationTest.test-seed#[1C27B93464235B84]) [    ] o.a.s.c.AbstractZkTestCase put /home/jenkins/workspace/Lucene-Solr-master-Linux/solr/core/src/test-files/solr/collection1/conf/solrconfig-tlog.xml to /configs/conf1/solrconfig.xml
   [junit4]   2> 1360321 INFO  (TEST-PeerSyncReplicationTest.test-seed#[1C27B93464235B84]) [    ] o.a.s.c.AbstractZkTestCase put /home/jenkins/workspace/Lucene-Solr-master-Linux/solr/core/src/test-files/solr/collection1/conf/schema.xml to /configs/conf1/schema.xml
   [junit4]   2> 1360323 INFO  (TEST-PeerSyncReplicationTest.test-seed#[1C27B93464235B84]) [    ] o.a.s.c.AbstractZkTestCase put /home/jenkins/workspace/Lucene-Solr-master-Linux/solr/core/src/test-files/solr/collection1/conf/solrconfig.snippet.randomindexconfig.xml to /configs/conf1/solrconfig.snippet.randomindexconfig.xml
   [junit4]   2> 1360324 INFO  (TEST-PeerSyncReplicationTest.test-seed#[1C27B93464235B84]) [    ] o.a.s.c.AbstractZkTestCase put /home/jenkins/workspace/Lucene-Solr-master-Linux/solr/core/src/test-files/solr/collection1/conf/stopwords.txt to /configs/conf1/stopwords.txt
   [junit4]   2> 1360326 INFO  (TEST-PeerSyncReplicationTest.test-seed#[1C27B93464235B84]) [    ] o.a.s.c.AbstractZkTestCase put /home/jenkins/workspace/Lucene-Solr-master-Linux/solr/core/src/test-files/solr/collection1/conf/protwords.txt to /configs/conf1/protwords.txt
   [junit4]   2> 1360328 INFO  (TEST-PeerSyncReplicationTest.test-seed#[1C27B93464235B84]) [    ] o.a.s.c.AbstractZkTestCase put /home/jenkins/workspace/Lucene-Solr-master-Linux/solr/core/src/test-files/solr/collection1/conf/currency.xml to /configs/conf1/currency.xml
   [junit4]   2> 1360330 INFO  (TEST-PeerSyncReplicationTest.test-seed#[1C27B93464235B84]) [    ] o.a.s.c.AbstractZkTestCase put /home/jenkins/workspace/Lucene-Solr-master-Linux/solr/core/src/test-files/solr/collection1/conf/enumsConfig.xml to /configs/conf1/enumsConfig.xml
   [junit4]   2> 1360332 INFO  (TEST-PeerSyncReplicationTest.test-seed#[1C27B93464235B84]) [    ] o.a.s.c.AbstractZkTestCase put /home/jenkins/workspace/Lucene-Solr-master-Linux/solr/core/src/test-files/solr/collection1/conf/open-exchange-rates.json to /configs/conf1/open-exchange-rates.json
   [junit4]   2> 1360334 INFO  (TEST-PeerSyncReplicationTest.test-seed#[1C27B93464235B84]) [    ] o.a.s.c.AbstractZkTestCase put /home/jenkins/workspace/Lucene-Solr-master-Linux/solr/core/src/test-files/solr/collection1/conf/mapping-ISOLatin1Accent.txt to /configs/conf1/mapping-ISOLatin1Accent.txt
   [junit4]   2> 1360335 INFO  (TEST-PeerSyncReplicationTest.test-seed#[1C27B93464235B84]) [    ] o.a.s.c.AbstractZkTestCase put /home/jenkins/workspace/Lucene-Solr-master-Linux/solr/core/src/test-files/solr/collection1/conf/old_synonyms.txt to /configs/conf1/old_synonyms.txt
   [junit4]   2> 1360337 INFO  (TEST-PeerSyncReplicationTest.test-seed#[1C27B93464235B84]) [    ] o.a.s.c.AbstractZkTestCase put /home/jenkins/workspace/Lucene-Solr-master-Linux/solr/core/src/test-files/solr/collection1/conf/synonyms.txt to /configs/conf1/synonyms.txt
   [junit4]   2> 1360936 INFO  (TEST-PeerSyncReplicationTest.test-seed#[1C27B93464235B84]) [    ] o.a.s.SolrTestCaseJ4 Writing core.properties file to /home/jenkins/workspace/Lucene-Solr-master-Linux/solr/build/solr-core/test/J1/temp/solr.cloud.PeerSyncReplicationTest_1C27B93464235B84-001/control-001/cores/collection1
   [junit4]   2> 1360940 INFO  (TEST-PeerSyncReplicationTest.test-seed#[1C27B93464235B84]) [    ] o.e.j.s.Server jetty-9.3.14.v20161028
   [junit4]   2> 1360941 INFO  (TEST-PeerSyncReplicationTest.test-seed#[1C27B93464235B84]) [    ] o.e.j.s.h.ContextHandler Started o.e.j.s.ServletContextHandler@79b01a49{/ipown/al,null,AVAILABLE}
   [junit4]   2> 1360943 INFO  (TEST-PeerSyncReplicationTest.test-seed#[1C27B93464235B84]) [    ] o.e.j.s.AbstractConnector Started ServerConnector@82761a2{SSL,[ssl, http/1.1]}{127.0.0.1:٣٨٤٠٠}
   [junit4]   2> 1360943 INFO  (TEST-PeerSyncReplicationTest.test-seed#[1C27B93464235B84]) [    ] o.e.j.s.Server Started @١٣٦٣٠٦٣ms
   [junit4]   2> 1360943 INFO  (TEST-PeerSyncReplicationTest.test-seed#[1C27B93464235B84]) [    ] o.a.s.c.s.e.JettySolrRunner Jetty properties: {hostContext=/ipown/al, solr.data.dir=/home/jenkins/workspace/Lucene-Solr-master-Linux/solr/build/solr-core/test/J1/temp/solr.cloud.PeerSyncReplicationTest_1C27B93464235B84-001/tempDir-001/control/data, hostPort=38400, coreRootDirectory=/home/jenkins/workspace/Lucene-Solr-master-Linux/solr/build/solr-core/test/J1/temp/solr.cloud.PeerSyncReplicationTest_1C27B93464235B84-001/control-001/cores}
   [junit4]   2> 1360944 ERROR (TEST-PeerSyncReplicationTest.test-seed#[1C27B93464235B84]) [    ] o.a.s.s.StartupLoggingUtils Missing Java Option solr.log.dir. Logging may be missing or incomplete.
   [junit4]   2> 1360944 INFO  (TEST-PeerSyncReplicationTest.test-seed#[1C27B93464235B84]) [    ] o.a.s.s.SolrDispatchFilter  ___      _       Welcome to Apache Solr™ version 7.0.0
   [junit4]   2> 1360944 INFO  (TEST-PeerSyncReplicationTest.test-seed#[1C27B93464235B84]) [    ] o.a.s.s.SolrDispatchFilter / __| ___| |_ _   Starting in cloud mode on port null
   [junit4]   2> 1360944 INFO  (TEST-PeerSyncReplicationTest.test-seed#[1C27B93464235B84]) [    ] o.a.s.s.SolrDispatchFilter \__ \/ _ \ | '_|  Install dir: null
   [junit4]   2> 1360944 INFO  (TEST-PeerSyncReplicationTest.test-seed#[1C27B93464235B84]) [    ] o.a.s.s.SolrDispatchFilter |___/\___/_|_|    Start time: 2017-01-05T00:20:01.008391Z
   [junit4]   2> 1360949 INFO  (TEST-PeerSyncReplicationTest.test-seed#[1C27B93464235B84]) [    ] o.a.s.s.SolrDispatchFilter Loading solr.xml from SolrHome (not found in ZooKeeper)
   [junit4]   2> 1360949 INFO  (TEST-PeerSyncReplicationTest.test-seed#[1C27B93464235B84]) [    ] o.a.s.c.SolrXmlConfig Loading container configuration from /home/jenkins/workspace/Lucene-Solr-master-Linux/solr/build/solr-core/test/J1/temp/solr.cloud.PeerSyncReplicationTest_1C27B93464235B84-001/control-001/solr.xml
   [junit4]   2> 1360957 INFO  (TEST-PeerSyncReplicationTest.test-seed#[1C27B93464235B84]) [    ] o.a.s.c.ZkContainer Zookeeper client=127.0.0.1:37638/solr
   [junit4]   2> 1360968 INFO  (TEST-PeerSyncReplicationTest.test-seed#[1C27B93464235B84]) [    ] o.a.s.c.OverseerElectionContext I am going to be the leader 127.0.0.1:38400_ipown%2Fal
   [junit4]   2> 1360969 INFO  (TEST-PeerSyncReplicationTest.test-seed#[1C27B93464235B84]) [    ] o.a.s.c.Overseer Overseer (id=97227610539950085-127.0.0.1:38400_ipown%2Fal-n_0000000000) starting
   [junit4]   2> 1360973 INFO  (TEST-PeerSyncReplicationTest.test-seed#[1C27B93464235B84]) [    ] o.a.s.c.ZkController Register node as live in ZooKeeper:/live_nodes/127.0.0.1:38400_ipown%2Fal
   [junit4]   2> 1360974 INFO  (OverseerStateUpdate-97227610539950085-127.0.0.1:38400_ipown%2Fal-n_0000000000) [    ] o.a.s.c.c.ZkStateReader Updated live nodes from ZooKeeper... (0) -> (1)
   [junit4]   2> 1361002 INFO  (TEST-PeerSyncReplicationTest.test-seed#[1C27B93464235B84]) [    ] o.a.s.c.CorePropertiesLocator Found 1 core definitions underneath /home/jenkins/workspace/Lucene-Solr-master-Linux/solr/build/solr-core/test/J1/temp/solr.cloud.PeerSyncReplicationTest_1C27B93464235B84-001/control-001/cores
   [junit4]   2> 1361002 INFO  (TEST-PeerSyncReplicationTest.test-seed#[1C27B93464235B84]) [    ] o.a.s.c.CorePropertiesLocator Cores are: [collection1]
   [junit4]   2> 1361004 INFO  (OverseerStateUpdate-97227610539950085-127.0.0.1:38400_ipown%2Fal-n_0000000000) [    ] o.a.s.c.o.ReplicaMutator Assigning new node to shard shard=shard1
   [junit4]   2> 1362011 WARN  (coreLoadExecutor-5750-thread-1) [    ] o.a.s.c.Config Beginning with Solr 5.5, <mergePolicy> is deprecated, use <mergePolicyFactory> instead.
   [junit4]   2> 1362012 INFO  (coreLoadExecutor-5750-thread-1) [    ] o.a.s.c.SolrConfig Using Lucene MatchVersion: 7.0.0
   [junit4]   2> 1362023 INFO  (coreLoadExecutor-5750-thread-1) [    ] o.a.s.s.IndexSchema [collection1] Schema name=test
   [junit4]   2> 1362146 WARN  (coreLoadExecutor-5750-thread-1) [    ] o.a.s.s.IndexSchema [collection1] default search field in schema is text. WARNING: Deprecated, please use 'df' on request instead.
   [junit4]   2> 1362148 INFO  (coreLoadExecutor-5750-thread-1) [    ] o.a.s.s.IndexSchema Loaded schema test/1.0 with uniqueid field id
   [junit4]   2> 1362156 INFO  (coreLoadExecutor-5750-thread-1) [    ] o.a.s.c.CoreContainer Creating SolrCore 'collection1' using configuration from collection control_collection
   [junit4]   2> 1362156 INFO  (coreLoadExecutor-5750-thread-1) [    ] o.a.s.c.SolrCore [[collection1] ] Opening new SolrCore at [/home/jenkins/workspace/Lucene-Solr-master-Linux/solr/build/solr-core/test/J1/temp/solr.cloud.PeerSyncReplicationTest_1C27B93464235B84-001/control-001/cores/collection1], dataDir=[/home/jenkins/workspace/Lucene-Solr-master-Linux/solr/build/solr-core/test/J1/temp/solr.cloud.PeerSyncReplicationTest_1C27B93464235B84-001/control-001/cores/collection1/data/]
   [junit4]   2> 1362156 INFO  (coreLoadExecutor-5750-thread-1) [    ] o.a.s.c.JmxMonitoredMap JMX monitoring is enabled. Adding Solr mbeans to JMX Server: com.sun.jmx.mbeanserver.JmxMBeanServer@496ce899
   [junit4]   2> 1362165 INFO  (coreLoadExecutor-5750-thread-1) [    ] o.a.s.u.RandomMergePolicy RandomMergePolicy wrapping class org.apache.lucene.index.LogByteSizeMergePolicy: [LogByteSizeMergePolicy: minMergeSize=1677721, mergeFactor=13, maxMergeSize=2147483648, maxMergeSizeForForcedMerge=9223372036854775807, calibrateSizeByDeletes=true, maxMergeDocs=2147483647, maxCFSSegmentSizeMB=8.796093022207999E12, noCFSRatio=0.4880685177284515]
   [junit4]   2> 1362227 WARN  (coreLoadExecutor-5750-thread-1) [    ] o.a.s.c.RequestHandlers INVALID paramSet a in requestHandler {type = requestHandler,name = /dump,class = DumpRequestHandler,attributes = {initParams=a, name=/dump, class=DumpRequestHandler},args = {defaults={a=A,b=B}}}
   [junit4]   2> 1362233 INFO  (coreLoadExecutor-5750-thread-1) [    ] o.a.s.u.UpdateHandler Using UpdateLog implementation: org.apache.solr.update.UpdateLog
   [junit4]   2> 1362233 INFO  (coreLoadExecutor-5750-thread-1) [    ] o.a.s.u.UpdateLog Initializing UpdateLog: dataDir= defaultSyncLevel=FLUSH numRecordsToKeep=1000 maxNumLogsToKeep=10 numVersionBuckets=65536
   [junit4]   2> 1362234 INFO  (coreLoadExecutor-5750-thread-1) [    ] o.a.s.u.CommitTracker Hard AutoCommit: disabled
   [junit4]   2> 1362234 INFO  (coreLoadExecutor-5750-thread-1) [    ] o.a.s.u.CommitTracker Soft AutoCommit: disabled
   [junit4]   2> 1362236 INFO  (coreLoadExecutor-5750-thread-1) [    ] o.a.s.u.RandomMergePolicy RandomMergePolicy wrapping class org.apache.lucene.index.AlcoholicMergePolicy: [AlcoholicMergePolicy: minMergeSize=0, mergeFactor=10, maxMergeSize=176120332, maxMergeSizeForForcedMerge=9223372036854775807, calibrateSizeByDeletes=true, maxMergeDocs=2147483647, maxCFSSegmentSizeMB=8.796093022207999E12, noCFSRatio=0.1]
   [junit4]   2> 1362237 INFO  (coreLoadExecutor-5750-thread-1) [    ] o.a.s.s.SolrIndexSearcher Opening [Searcher@11e7bcbd[collection1] main]
   [junit4]   2> 1362238 INFO  (coreLoadExecutor-5750-thread-1) [    ] o.a.s.r.ManagedResourceStorage Configured ZooKeeperStorageIO with znodeBase: /configs/conf1
   [junit4]   2> 1362238 INFO  (coreLoadExecutor-5750-thread-1) [    ] o.a.s.r.ManagedResourceStorage Loaded null at path _rest_managed.json using ZooKeeperStorageIO:path=/configs/conf1
   [junit4]   2> 1362238 INFO  (coreLoadExecutor-5750-thread-1) [    ] o.a.s.h.ReplicationHandler Commits will be reserved for  10000
   [junit4]   2> 1362239 INFO  (searcherExecutor-5751-thread-1) [    ] o.a.s.c.SolrCore [collection1] Registered new searcher Searcher@11e7bcbd[collection1] main{ExitableDirectoryReader(UninvertingDirectoryReader())}
   [junit4]   2> 1362239 INFO  (coreLoadExecutor-5750-thread-1) [    ] o.a.s.u.UpdateLog Could not find max version in index or recent updates, using new clock 1555641770760470528
   [junit4]   2> 1362242 INFO  (coreZkRegister-5743-thread-1) [    ] o.a.s.c.ShardLeaderElectionContext Enough replicas found to continue.
   [junit4]   2> 1362243 INFO  (coreZkRegister-5743-thread-1) [    ] o.a.s.c.ShardLeaderElectionContext I may be the new leader - try and sync
   [junit4]   2> 1362243 INFO  (coreZkRegister-5743-thread-1) [    ] o.a.s.c.SyncStrategy Sync replicas to https://127.0.0.1:38400/ipown/al/collection1/
   [junit4]   2> 1362243 INFO  (coreZkRegister-5743-thread-1) [    ] o.a.s.c.SyncStrategy Sync Success - now sync replicas to me
   [junit4]   2> 1362243 INFO  (coreZkRegister-5743-thread-1) [    ] o.a.s.c.SyncStrategy https://127.0.0.1:38400/ipown/al/collection1/ has no replicas
   [junit4]   2> 1362245 INFO  (coreZkRegister-5743-thread-1) [    ] o.a.s.c.ShardLeaderElectionContext I am the new leader: https://127.0.0.1:38400/ipown/al/collection1/ shard1
   [junit4]   2> 1362396 INFO  (coreZkRegister-5743-thread-1) [    ] o.a.s.c.ZkController I am the leader, no recovery necessary
   [junit4]   2> 1362607 INFO  (TEST-PeerSyncReplicationTest.test-seed#[1C27B93464235B84]) [    ] o.a.s.c.c.ZkStateReader Updated live nodes from ZooKeeper... (0) -> (1)
   [junit4]   2> 1362608 INFO  (TEST-PeerSyncReplicationTest.test-seed#[1C27B93464235B84]) [    ] o.a.s.c.s.i.ZkClientClusterStateProvider Cluster at 127.0.0.1:37638/solr ready
   [junit4]   2> 1362608 INFO  (TEST-PeerSyncReplicationTest.test-seed#[1C27B93464235B84]) [    ] o.a.s.c.ChaosMonkey monkey: init - expire sessions:false cause connection loss:false
   [junit4]   2> 1362608 INFO  (TEST-PeerSyncReplicationTest.test-seed#[1C27B93464235B84]) [    ] o.a.s.c.AbstractFullDistribZkTestBase Creating collection1 with stateFormat=2
   [junit4]   2> 1363291 INFO  (TEST-PeerSyncReplicationTest.test-seed#[1C27B93464235B84]) [    ] o.a.s.SolrTestCaseJ4 Writing core.properties file to /home/jenkins/workspace/Lucene-Solr-master-Linux/solr/build/solr-core/test/J1/temp/solr.cloud.PeerSyncReplicationTest_1C27B93464235B84-001/shard-1-001/cores/collection1
   [junit4]   2> 1363292 INFO  (TEST-PeerSyncReplicationTest.test-seed#[1C27B93464235B84]) [    ] o.a.s.c.AbstractFullDistribZkTestBase create jetty 1 in directory /home/jenkins/workspace/Lucene-Solr-master-Linux/solr/build/solr-core/test/J1/temp/solr.cloud.PeerSyncReplicationTest_1C27B93464235B84-001/shard-1-001
   [junit4]   2> 1363294 INFO  (TEST-PeerSyncReplicationTest.test-seed#[1C27B93464235B84]) [    ] o.e.j.s.Server jetty-9.3.14.v20161028
   [junit4]   2> 1363294 INFO  (TEST-PeerSyncReplicationTest.test-seed#[1C27B93464235B84]) [    ] o.e.j.s.h.ContextHandler Started o.e.j.s.ServletContextHandler@415b7a44{/ipown/al,null,AVAILABLE}
   [junit4]   2> 1363295 INFO  (TEST-PeerSyncReplicationTest.test-seed#[1C27B93464235B84]) [    ] o.e.j.s.AbstractConnector Started ServerConnector@61e91a9{SSL,[ssl, http/1.1]}{127.0.0.1:٤٥٤٧١}
   [junit4]   2> 1363295 INFO  (TEST-PeerSyncReplicationTest.test-seed#[1C27B93464235B84]) [    ] o.e.j.s.Server Started @١٣٦٥٤١٥ms
   [junit4]   2> 1363295 INFO  (TEST-PeerSyncReplicationTest.test-seed#[1C27B93464235B84]) [    ] o.a.s.c.s.e.JettySolrRunner Jetty properties: {hostContext=/ipown/al, solrconfig=solrconfig.xml, solr.data.dir=/home/jenkins/workspace/Lucene-Solr-master-Linux/solr/build/solr-core/test/J1/temp/solr.cloud.PeerSyncReplicationTest_1C27B93464235B84-001/tempDir-001/jetty1, hostPort=45471, coreRootDirectory=/home/jenkins/workspace/Lucene-Solr-master-Linux/solr/build/solr-core/test/J1/../../../../../../../../../home/jenkins/workspace/Lucene-Solr-master-Linux/solr/build/solr-core/test/J1/temp/solr.cloud.PeerSyncReplicationTest_1C27B93464235B84-001/shard-1-001/cores}
   [junit4]   2> 1363295 ERROR (TEST-PeerSyncReplicationTest.test-seed#[1C27B93464235B84]) [    ] o.a.s.s.StartupLoggingUtils Missing Java Option solr.log.dir. Logging may be missing or incomplete.
   [junit4]   2> 1363296 INFO  (TEST-PeerSyncReplicationTest.test-seed#[1C27B93464235B84]) [    ] o.a.s.s.SolrDispatchFilter  ___      _       Welcome to Apache Solr™ version 7.0.0
   [junit4]   2> 1363296 INFO  (TEST-PeerSyncReplicationTest.test-seed#[1C27B93464235B84]) [    ] o.a.s.s.SolrDispatchFilter / __| ___| |_ _   Starting in cloud mode on port null
   [junit4]   2> 1363296 INFO  (TEST-PeerSyncReplicationTest.test-seed#[1C27B93464235B84]) [    ] o.a.s.s.SolrDispatchFilter \__ \/ _ \ | '_|  Install dir: null
   [junit4]   2> 1363296 INFO  (TEST-PeerSyncReplicationTest.test-seed#[1C27B93464235B84]) [    ] o.a.s.s.SolrDispatchFilter |___/\___/_|_|    Start time: 2017-01-05T00:20:03.360235Z
   [junit4]   2> 1363298 INFO  (TEST-PeerSyncReplicationTest.test-seed#[1C27B93464235B84]) [    ] o.a.s.s.SolrDispatchFilter Loading solr.xml from SolrHome (not found in ZooKeeper)
   [junit4]   2> 1363298 INFO  (TEST-PeerSyncReplicationTest.test-seed#[1C27B93464235B84]) [    ] o.a.s.c.SolrXmlConfig Loading container configuration from /home/jenkins/workspace/Lucene-Solr-master-Linux/solr/build/solr-core/test/J1/temp/solr.cloud.PeerSyncReplicationTest_1C27B93464235B84-001/shard-1-001/solr.xml
   [junit4]   2> 1363304 INFO  (TEST-PeerSyncReplicationTest.test-seed#[1C27B93464235B84]) [    ] o.a.s.c.ZkContainer Zookeeper client=127.0.0.1:37638/solr
   [junit4]   2> 1363318 INFO  (TEST-PeerSyncReplicationTest.test-seed#[1C27B93464235B84]) [    ] o.a.s.c.c.ZkStateReader Updated live nodes from ZooKeeper... (0) -> (1)
   [junit4]   2> 1363320 INFO  (TEST-PeerSyncReplicationTest.test-seed#[1C27B93464235B84]) [    ] o.a.s.c.ZkController Register node as live in ZooKeeper:/live_nodes/127.0.0.1:45471_ipown%2Fal
   [junit4]   2> 1363321 INFO  (zkCallback-1728-thread-1) [    ] o.a.s.c.c.ZkStateReader Updated live nodes from ZooKeeper... (1) -> (2)
   [junit4]   2> 1363321 INFO  (zkCallback-1718-thread-1) [    ] o.a.s.c.c.ZkStateReader Updated live nodes from ZooKeeper... (1) -> (2)
   [junit4]   2> 1363321 INFO  (zkCallback-1722-thread-1) [    ] o.a.s.c.c.ZkStateReader Updated live nodes from ZooKeeper... (1) -> (2)
   [junit4]   2> 1363372 INFO  (TEST-PeerSyncReplicationTest.test-seed#[1C27B93464235B84]) [    ] o.a.s.c.CorePropertiesLocator Found 1 core definitions underneath /home/jenkins/workspace/Lucene-Solr-master-Linux/solr/build/solr-core/test/J1/../../../../../../../../../home/jenkins/workspace/Lucene-Solr-master-Linux/solr/build/solr-core/test/J1/temp/solr.cloud.PeerSyncReplicationTest_1C27B93464235B84-001/shard-1-001/cores
   [junit4]   2> 1363372 INFO  (TEST-PeerSyncReplicationTest.test-seed#[1C27B93464235B84]) [    ] o.a.s.c.CorePropertiesLocator Cores are: [collection1]
   [junit4]   2> 1363374 INFO  (OverseerStateUpdate-97227610539950085-127.0.0.1:38400_ipown%2Fal-n_0000000000) [    ] o.a.s.c.o.ReplicaMutator Assigning new node to shard shard=shard1
   [junit4]   2> 1363475 INFO  (zkCallback-1728-thread-1) [    ] o.a.s.c.c.ZkStateReader A cluster state change: [WatchedEvent state:SyncConnected type:NodeDataChanged path:/collections/collection1/state.json] for collection [collection1] has occurred - updating... (live nodes size: [2])
   [junit4]   2> 1364381 WARN  (coreLoadExecutor-5761-thread-1) [    ] o.a.s.c.Config Beginning with Solr 5.5, <mergePolicy> is deprecated, use <mergePolicyFactory> instead.
   [junit4]   2> 1364382 INFO  (coreLoadExecutor-5761-thread-1) [    ] o.a.s.c.SolrConfig Using Lucene MatchVersion: 7.0.0
   [junit4]   2> 1364404 INFO  (coreLoadExecutor-5761-thread-1) [    ] o.a.s.s.IndexSchema [collection1] Schema name=test
   [junit4]   2> 1364486 WARN  (coreLoadExecutor-5761-thread-1) [    ] o.a.s.s.IndexSchema [collection1] default search field in schema is text. WARNING: Deprecated, please use 'df' on request instead.
   [junit4]   2> 1364488 INFO  (coreLoadExecutor-5761-thread-1) [    ] o.a.s.s.IndexSchema Loaded schema test/1.0 with uniqueid field id
   [junit4]   2> 1364493 INFO  (coreLoadExecutor-5761-thread-1) [    ] o.a.s.c.CoreContainer Creating SolrCore 'collection1' using configuration from collection collection1
   [junit4]   2> 1364494 INFO  (coreLoadExecutor-5761-thread-1) [    ] o.a.s.c.SolrCore [[collection1] ] Opening new SolrCore at [/home/jenkins/workspace/Lucene-Solr-master-Linux/solr/build/solr-core/test/J1/temp/solr.cloud.PeerSyncReplicationTest_1C27B93464235B84-001/shard-1-001/cores/collection1], dataDir=[/home/jenkins/workspace/Lucene-Solr-master-Linux/solr/build/solr-core/test/J1/../../../../../../../../../home/jenkins/workspace/Lucene-Solr-master-Linux/solr/build/solr-core/test/J1/temp/solr.cloud.PeerSyncReplicationTest_1C27B93464235B84-001/shard-1-001/cores/collection1/data/]
   [junit4]   2> 1364494 INFO  (coreLoadExecutor-5761-thread-1) [    ] o.a.s.c.JmxMonitoredMap JMX monitoring is enabled. Adding Solr mbeans to JMX Server: com.sun.jmx.mbeanserver.JmxMBeanServer@496ce899
   [junit4]   2> 1364499 INFO  (coreLoadExecutor-5761-thread-1) [    ] o.a.s.u.RandomMergePolicy RandomMergePolicy wrapping class org.apache.lucene.index.LogByteSizeMergePolicy: [LogByteSizeMergePolicy: minMergeSize=1677721, mergeFactor=13, maxMergeSize=2147483648, maxMergeSizeForForcedMerge=9223372036854775807, calibrateSizeByDeletes=true, maxMergeDocs=2147483647, maxCFSSegmentSizeMB=8.796093022207999E12, noCFSRatio=0.4880685177284515]
   [junit4]   2> 1364562 WARN  (coreLoadExecutor-5761-thread-1) [    ] o.a.s.c.RequestHandlers INVALID paramSet a in requestHandler {type = requestHandler,name = /dump,class = DumpRequestHandler,attributes = {initParams=a, name=/dump, class=DumpRequestHandler},args = {defaults={a=A,b=B}}}
   [junit4]   2> 1364575 INFO  (coreLoadExecutor-5761-thread-1) [    ] o.a.s.u.UpdateHandler Using UpdateLog implementation: org.apache.solr.update.UpdateLog
   [junit4]   2> 1364575 INFO  (coreLoadExecutor-5761-thread-1) [    ] o.a.s.u.UpdateLog Initializing UpdateLog: dataDir= defaultSyncLevel=FLUSH numRecordsToKeep=1000 maxNumLogsToKeep=10 numVersionBuckets=65536
   [junit4]   2> 1364577 INFO  (coreLoadExecutor-5761-thread-1) [    ] o.a.s.u.CommitTracker Hard AutoCommit: disabled
   [junit4]   2> 1364577 INFO  (coreLoadExecutor-5761-thread-1) [    ] o.a.s.u.CommitTracker Soft AutoCommit: disabled
   [junit4]   2> 1364579 INFO  (coreLoadExecutor-5761-thread-1) [    ] o.a.s.u.RandomMergePolicy RandomMergePolicy wrapping class org.apache.lucene.index.AlcoholicMergePolicy: [AlcoholicMergePolicy: minMergeSize=0, mergeFactor=10, maxMergeSize=176120332, maxMergeSizeForForcedMerge=9223372036854775807, calibrateSizeByDeletes=true, maxMergeDocs=2147483647, maxCFSSegmentSizeMB=8.796093022207999E12, noCFSRatio=0.1]
   [junit4]   2> 1364581 INFO  (coreLoadExecutor-5761-thread-1) [    ] o.a.s.s.SolrIndexSearcher Opening [Searcher@149c5713[collection1] main]
   [junit4]   2> 1364582 INFO  (coreLoadExecutor-5761-thread-1) [    ] o.a.s.r.ManagedResourceStorage Configured ZooKeeperStorageIO with znodeBase: /configs/conf1
   [junit4]   2> 1364582 INFO  (coreLoadExecutor-5761-thread-1) [    ] o.a.s.r.ManagedResourceStorage Loaded null at path _rest_managed.json using ZooKeeperStorageIO:path=/configs/conf1
   [junit4]   2> 1364582 INFO  (coreLoadExecutor-5761-thread-1) [    ] o.a.s.h.ReplicationHandler Commits will be reserved for  10000
   [junit4]   2> 1364583 INFO  (searcherExecutor-5762-thread-1) [    ] o.a.s.c.SolrCore [collection1] Registered new searcher Searcher@149c5713[collection1] main{ExitableDirectoryReader(UninvertingDirectoryReader())}
   [junit4]   2> 1364583 INFO  (coreLoadExecutor-5761-thread-1) [    ] o.a.s.u.UpdateLog Could not find max version in index or recent updates, using new clock 1555641773218332672
   [junit4]   2> 1364587 INFO  (coreZkRegister-5756-thread-1) [    ] o.a.s.c.ShardLeaderElectionContext Enough replicas found to continue.
   [junit4]   2> 1364588 INFO  (coreZkRegister-5756-thread-1) [    ] o.a.s.c.ShardLeaderElectionContext I may be the new leader - try and sync
   [junit4]   2> 1364588 INFO  (coreZkRegister-5756-thread-1) [    ] o.a.s.c.SyncStrategy Sync replicas to https://127.0.0.1:45471/ipown/al/collection1/
   [junit4]   2> 1364588 INFO  (coreZkRegister-5756-thread-1) [    ] o.a.s.c.SyncStrategy Sync Success - now sync replicas to me
   [junit4]   2> 1364588 INFO  (coreZkRegister-5756-thread-1) [    ] o.a.s.c.SyncStrategy https://127.0.0.1:45471/ipown/al/collection1/ has no replicas
   [junit4]   2> 1364589 INFO  (coreZkRegister-5756-thread-1) [    ] o.a.s.c.ShardLeaderElectionContext I am the new leader: https://127.0.0.1:45471/ipown/al/collection1/ shard1
   [junit4]   2> 1364691 INFO  (zkCallback-1728-thread-1) [    ] o.a.s.c.c.ZkStateReader A cluster state change: [WatchedEvent state:SyncConnected type:NodeDataChanged path:/collections/collection1/state.json] for collection [collection1] has occurred - updating... (live nodes size: [2])
   [junit4]   2> 1364740 INFO  (coreZkRegister-5756-thread-1) [    ] o.a.s.c.ZkController I am the leader, no recovery necessary
   [junit4]   2> 1364842 INFO  (zkCallback-1728-thread-1) [    ] o.a.s.c.c.ZkStateReader A cluster state change: [WatchedEvent state:SyncConnected type:NodeDataChanged path:/collections/collection1/state.json] for collection [collection1] has occurred - updating... (live nodes size: [2])
   [junit4]   2> 1365491 INFO  (TEST-PeerSyncReplicationTest.test-seed#[1C27B93464235B84]) [    ] o.a.s.SolrTestCaseJ4 Writing core.properties file to /home/jenkins/workspace/Lucene-Solr-master-Linux/solr/build/solr-core/test/J1/temp/solr.cloud.PeerSyncReplicationTest_1C27B93464235B84-001/shard-2-001/cores/collection1
   [junit4]   2> 1365492 INFO  (TEST-PeerSyncReplicationTest.test-seed#[1C27B93464235B84]) [    ] o.a.s.c.AbstractFullDistribZkTestBase create jetty 2 in directory /home/jenkins/workspace/Lucene-Solr-master-Linux/solr/build/solr-core/test/J1/temp/solr.cloud.PeerSyncReplicationTest_1C27B93464235B84-001/shard-2-001
   [junit4]   2> 1365494 INFO  (TEST-PeerSyncReplicationTest.test-seed#[1C27B93464235B84]) [    ] o.e.j.s.Server jetty-9.3.14.v20161028
   [junit4]   2> 1365495 INFO  (TEST-PeerSyncReplicationTest.test-seed#[1C27B93464235B84]) [    ] o.e.j.s.h.ContextHandler Started o.e.j.s.ServletContextHandler@1a898da0{/ipown/al,null,AVAILABLE}
   [junit4]   2> 1365496 INFO  (TEST-PeerSyncReplicationTest.test-seed#[1C27B93464235B84]) [    ] o.e.j.s.AbstractConnector Started ServerConnector@4000caeb{SSL,[ssl, http/1.1]}{127.0.0.1:٤٢١٥١}
   [junit4]   2> 1365496 INFO  (TEST-PeerSyncReplicationTest.test-seed#[1C27B93464235B84]) [    ] o.e.j.s.Server Started @١٣٦٧٦١٦ms
   [junit4]   2> 1365496 INFO  (TEST-PeerSyncReplicationTest.test-seed#[1C27B93464235B84]) [    ] o.a.s.c.s.e.JettySolrRunner Jetty properties: {hostContext=/ipown/al, solrconfig=solrconfig.xml, solr.data.dir=/home/jenkins/workspace/Lucene-Solr-master-Linux/solr/build/solr-core/test/J1/temp/solr.cloud.PeerSyncReplicationTest_1C27B93464235B84-001/tempDir-001/jetty2, hostPort=42151, coreRootDirectory=/home/jenkins/workspace/Lucene-Solr-master-Linux/solr/build/solr-core/test/J1/temp/solr.cloud.PeerSyncReplicationTest_1C27B93464235B84-001/shard-2-001/cores}
   [junit4]   2> 1365496 ERROR (TEST-PeerSyncReplicationTest.test-seed#[1C27B93464235B84]) [    ] o.a.s.s.StartupLoggingUtils Missing Java Option solr.log.dir. Logging may be missing or incomplete.
   [junit4]   2> 1365497 INFO  (TEST-PeerSyncReplicationTest.test-seed#[1C27B93464235B84]) [    ] o.a.s.s.SolrDispatchFilter  ___      _       Welcome to Apache Solr™ version 7.0.0
   [junit4]   2> 1365497 INFO  (TEST-PeerSyncReplicationTest.test-seed#[1C27B93464235B84]) [    ] o.a.s.s.SolrDispatchFilter / __| ___| |_ _   Starting in cloud mode on port null
   [junit4]   2> 1365497 INFO  (TEST-PeerSyncReplicationTest.test-seed#[1C27B93464235B84]) [    ] o.a.s.s.SolrDispatchFilter \__ \/ _ \ | '_|  Install dir: null
   [junit4]   2> 1365497 INFO  (TEST-PeerSyncReplicationTest.test-seed#[1C27B93464235B84]) [    ] o.a.s.s.SolrDispatchFilter |___/\___/_|_|    Start time: 2017-01-05T00:20:05.561203Z
   [junit4]   2> 1365498 INFO  (TEST-PeerSyncReplicationTest.test-seed#[1C27B93464235B84]) [    ] o.a.s.s.SolrDispatchFilter Loading solr.xml from SolrHome (not found in ZooKeeper)
   [junit4]   2> 1365499 INFO  (TEST-PeerSyncReplicationTest.test-seed#[1C27B93464235B84]) [    ] o.a.s.c.SolrXmlConfig Loading container configuration from /home/jenkins/workspace/Lucene-Solr-master-Linux/solr/build/solr-core/test/J1/temp/solr.cloud.PeerSyncReplicationTest_1C27B93464235B84-001/shard-2-001/solr.xml
   [junit4]   2> 1365505 INFO  (TEST-PeerSyncReplicationTest.test-seed#[1C27B93464235B84]) [    ] o.a.s.c.ZkContainer Zookeeper client=127.0.0.1:37638/solr
   [junit4]   2> 1365510 INFO  (TEST-PeerSyncReplicationTest.test-seed#[1C27B93464235B84]) [    ] o.a.s.c.c.ZkStateReader Updated live nodes from ZooKeeper... (0) -> (2)
   [junit4]   2> 1365512 INFO  (TEST-PeerSyncReplicationTest.test-seed#[1C27B93464235B84]) [    ] o.a.s.c.ZkController Register node as live in ZooKeeper:/live_nodes/127.0.0.1:42151_ipown%2Fal
   [junit4]   2> 1365513 INFO  (zkCallback-1734-thread-1) [    ] o.a.s.c.c.ZkStateReader Updated live nodes from ZooKeeper... (2) -> (3)
   [junit4]   2> 1365513 INFO  (zkCallback-1722-thread-1) [    ] o.a.s.c.c.ZkStateReader Updated live nodes from ZooKeeper... (2) -> (3)
   [junit4]   2> 1365513 INFO  (zkCallback-1728-thread-1) [    ] o.a.s.c.c.ZkStateReader Updated live nodes from ZooKeeper... (2) -> (3)
   [junit4]   2> 1365513 INFO  (zkCallback-1718-thread-3) [    ] o.a.s.c.c.ZkStateReader Updated live nodes from ZooKeeper... (2) -> (3)
   [junit4]   2> 1365537 INFO  (TEST-PeerSyncReplicationTest.test-seed#[1C27B93464235B84]) [    ] o.a.s.c.CorePropertiesLocator Found 1 core definitions underneath /home/jenkins/workspace/Lucene-Solr-master-Linux/solr/build/solr-core/test/J1/temp/solr.cloud.PeerSyncReplicationTest_1C27B93464235B84-001/shard-2-001/cores
   [junit4]   2> 1365537 INFO  (TEST-PeerSyncReplicationTest.test-seed#[1C27B93464235B84]) [    ] o.a.s.c.CorePropertiesLocator Cores are: [collection1]
   [junit4]   2> 1365538 INFO  (OverseerStateUpdate-97227610539950085-127.0.0.1:38400_ipown%2Fal-n_0000000000) [    ] o.a.s.c.o.ReplicaMutator Assigning new node to shard shard=shard1
   [junit4]   2> 1365640 INFO  (zkCallback-1728-thread-1) [    ] o.a.s.c.c.ZkStateReader A cluster state change: [WatchedEvent state:SyncConnected type:NodeDataChanged path:/collections/collection1/state.json] for collection [collection1] has occurred - updating... (live nodes size: [3])
   [junit4]   2> 1365640 INFO  (zkCallback-1734-thread-1) [    ] o.a.s.c.c.ZkStateReader A cluster state change: [WatchedEvent state:SyncConnected type:NodeDataChanged path:/collections/collection1/state.json] for collection [collection1] has occurred - updating... (live nodes size: [3])
   [junit4]   2> 1366558 WARN  (coreLoadExecutor-5772-thread-1) [    ] o.a.s.c.Config Beginning with Solr 5.5, <mergePolicy> is deprecated, use <mergePolicyFactory> instead.
   [junit4]   2> 1366559 INFO  (coreLoadExecutor-5772-thread-1) [    ] o.a.s.c.SolrConfig Using Lucene MatchVersion: 7.0.0
   [junit4]   2> 1366574 INFO  (coreLoadExecutor-5772-thread-1) [    ] o.a.s.s.IndexSchema [collection1] Schema name=test
   [junit4]   2> 1366686 WARN  (coreLoadExecutor-5772-thread-1) [    ] o.a.s.s.IndexSchema [collection1] default search field in schema is text. WARNING: Deprecated, please use 'df' on request instead.
   [junit4]   2> 1366689 INFO  (coreLoadExecutor-5772-thread-1) [    ] o.a.s.s.IndexSchema Loaded schema test/1.0 with uniqueid field id
   [junit4]   2> 1366695 INFO  (coreLoadExecutor-5772-thread-1) [    ] o.a.s.c.CoreContainer Creating SolrCore 'collection1' using configuration from collection collection1
   [junit4]   2> 1366695 INFO  (coreLoadExecutor-5772-thread-1) [    ] o.a.s.c.SolrCore [[collection1] ] Opening new SolrCore at [/home/jenkins/workspace/Lucene-Solr-master-Linux/solr/build/solr-core/test/J1/temp/solr.cloud.PeerSyncReplicationTest_1C27B93464235B84-001/shard-2-001/cores/collection1], dataDir=[/home/jenkins/workspace/Lucene-Solr-master-Linux/solr/build/solr-core/test/J1/temp/solr.cloud.PeerSyncReplicationTest_1C27B93464235B84-001/shard-2-001/cores/collection1/data/]
   [junit4]   2> 1366696 INFO  (coreLoadExecutor-5772-thread-1) [    ] o.a.s.c.JmxMonitoredMap JMX monitoring is enabled. Adding Solr mbeans to JMX Server: com.sun.jmx.mbeanserver.JmxMBeanServer@496ce899
   [junit4]   2> 1366704 INFO  (coreLoadExecutor-5772-thread-1) [    ] o.a.s.u.RandomMergePolicy RandomMergePolicy wrapping class org.apache.lucene.index.LogByteSizeMergePolicy: [LogByteSizeMergePolicy: minMergeSize=1677721, mergeFactor=13, maxMergeSize=2147483648, maxMergeSizeForForcedMerge=9223372036854775807, calibrateSizeByDeletes=true, maxMergeDocs=2147483647, maxCFSSegmentSizeMB=8.796093022207999E12, noCFSRatio=0.4880685177284515]
   [junit4]   2> 1366755 WARN  (coreLoadExecutor-5772-thread-1) [    ] o.a.s.c.RequestHandlers INVALID paramSet a in requestHandler {type = requestHandler,name = /dump,class = DumpRequestHandler,attributes = {initParams=a, name=/dump, class=DumpRequestHandler},args = {defaults={a=A,b=B}}}
   [junit4]   2> 1366768 INFO  (coreLoadExecutor-5772-thread-1) [    ] o.a.s.u.UpdateHandler Using UpdateLog implementation: org.apache.solr.update.UpdateLog
   [junit4]   2> 1366768 INFO  (coreLoadExecutor-5772-thread-1) [    ] o.a.s.u.UpdateLog Initializing UpdateLog: dataDir= defaultSyncLevel=FLUSH numRecordsToKeep=1000 maxNumLogsToKeep=10 numVersionBuckets=65536
   [junit4]   2> 1366770 INFO  (coreLoadExecutor-5772-thread-1) [    ] o.a.s.u.CommitTracker Hard AutoCommit: disabled
   [junit4]   2> 1366770 INFO  (coreLoadExecutor-5772-thread-1) [    ] o.a.s.u.CommitTracker Soft AutoCommit: disabled
   [junit4]   2> 1366772 INFO  (coreLoadExecutor-5772-thread-1) [    ] o.a.s.u.RandomMergePolicy RandomMergePolicy wrapping class org.apache.lucene.index.AlcoholicMergePolicy: [AlcoholicMergePolicy: minMergeSize=0, mergeFactor=10, maxMergeSize=176120332, maxMergeSizeForForcedMerge=9223372036854775807, calibrateSizeByDeletes=true, maxMergeDocs=2147483647, maxCFSSegmentSizeMB=8.796093022207999E12, noCFSRatio=0.1]
   [junit4]   2> 1366774 INFO  (coreLoadExecutor-5772-thread-1) [    ] o.a.s.s.SolrIndexSearcher Opening [Searcher@7156b1bc[collection1] main]
   [junit4]   2> 1366775 INFO  (coreLoadExecutor-5772-thread-1) [    ] o.a.s.r.ManagedResourceStorage Configured ZooKeeperStorageIO with znodeBase: /configs/conf1
   [junit4]   2> 1366775 INFO  (coreLoadExecutor-5772-thread-1) [    ] o.a.s.r.ManagedResourceStorage Loaded null at path _rest_managed.json using ZooKeeperStorageIO:path=/configs/conf1
   [junit4]   2> 1366775 INFO  (coreLoadExecutor-5772-thread-1) [    ] o.a.s.h.ReplicationHandler Commits will be reserved for  10000
   [junit4]   2> 1366790 INFO  (searcherExecutor-5773-thread-1) [    ] o.a.s.c.SolrCore [collection1] Registered new searcher Searcher@7156b1bc[collection1] main{ExitableDirectoryReader(UninvertingDirectoryReader())}
   [junit4]   2> 1366790 INFO  (coreLoadExecutor-5772-thread-1) [    ] o.a.s.u.UpdateLog Could not find max version in index or recent updates, using new clock 1555641775532539904
   [junit4]   2> 1366794 INFO  (coreZkRegister-5767-thread-1) [    ] o.a.s.c.ZkController Core needs to recover:collection1
   [junit4]   2> 1366794 INFO  (updateExecutor-1731-thread-1) [    ] o.a.s.u.DefaultSolrCoreState Running recovery
   [junit4]   2> 1366794 INFO  (recoveryExecutor-1732-thread-1) [    ] o.a.s.c.RecoveryStrategy Starting recovery process. recoveringAfterStartup=true
   [junit4]   2> 1366794 INFO  (recoveryExecutor-1732-thread-1) [    ] o.a.s.c.RecoveryStrategy ###### startupVersions=[[]]
   [junit4]   2> 1366794 INFO  (recoveryExecutor-1732-thread-1) [    ] o.a.s.c.RecoveryStrategy Begin buffering updates. core=[collection1]
   [junit4]   2> 1366794 INFO  (recoveryExecutor-1732-thread-1) [    ] o.a.s.u.UpdateLog Starting to buffer updates. FSUpdateLog{state=ACTIVE, tlog=null}
   [junit4]   2> 1366794 INFO  (recoveryExecutor-1732-thread-1) [    ] o.a.s.c.RecoveryStrategy Publishing state of core [collection1] as recovering, leader is [https://127.0.0.1:45471/ipown/al/collection1/] and I am [https://127.0.0.1:42151/ipown/al/collection1/]
   [junit4]   2> 1366797 INFO  (recoveryExecutor-1732-thread-1) [    ] o.a.s.c.RecoveryStrategy Sending prep recovery command to [https://127.0.0.1:45471/ipown/al]; [WaitForState: action=PREPRECOVERY&core=collection1&nodeName=127.0.0.1:42151_ipown%252Fal&coreNodeName=core_node2&state=recovering&checkLive=true&onlyIfLeader=true&onlyIfLeaderActive=true]
   [junit4]   2> 1366812 INFO  (qtp1409813677-10781) [    ] o.a.s.h.a.PrepRecoveryOp Going to wait for coreNodeName: core_node2, state: recovering, checkLive: true, onlyIfLeader: true, onlyIfLeaderActive: true
   [junit4]   2> 1366813 INFO  (qtp1409813677-10781) [    ] o.a.s.h.a.PrepRecoveryOp Will wait a max of 183 seconds to see collection1 (shard1 of collection1) have state: recovering
   [junit4]   2> 1366813 INFO  (qtp1409813677-10781) [    ] o.a.s.h.a.PrepRecoveryOp In WaitForState(recovering): collection=collection1, shard=shard1, thisCore=collection1, leaderDoesNotNeedRecovery=false, isLeader? true, live=true, checkLive=true, currentState=down, localState=active, nodeName=127.0.0.1:42151_ipown%2Fal, coreNodeName=core_node2, onlyIfActiveCheckResult=false, nodeProps: core_node2:{"core":"collection1","base_url":"https://127.0.0.1:42151/ipown/al","node_name":"127.0.0.1:42151_ipown%2Fal","state":"down"}
   [junit4]   2> 1366897 INFO  (zkCallback-1734-thread-1) [    ] o.a.s.c.c.ZkStateReader A cluster state change: [WatchedEvent state:SyncConnected type:NodeDataChanged path:/collections/collection1/state.json] for collection [collection1] has occurred - updating... (live nodes size: [3])
   [junit4]   2> 1366897 INFO  (zkCallback-1728-thread-1) [    ] o.a.s.c.c.ZkStateReader A cluster state change: [WatchedEvent state:SyncConnected type:NodeDataChanged path:/collections/collection1/state.json] for collection [collection1] has occurred - updating... (live nodes size: [3])
   [junit4]   2> 1367674 INFO  (TEST-PeerSyncReplicationTest.test-seed#[1C27B93464235B84]) [    ] o.a.s.SolrTestCaseJ4 Writing core.properties file to /home/jenkins/workspace/Lucene-Solr-master-Linux/solr/build/solr-core/test/J1/temp/solr.cloud.PeerSyncReplicationTest_1C27B93464235B84-001/shard-3-001/cores/collection1
   [junit4]   2> 1367675 INFO  (TEST-PeerSyncReplicationTest.test-seed#[1C27B93464235B84]) [    ] o.a.s.c.AbstractFullDistribZkTestBase create jetty 3 in directory /home/jenkins/workspace/Lucene-Solr-master-Linux/solr/build/solr-core/test/J1/temp/solr.cloud.PeerSyncReplicationTest_1C27B93464235B84-001/shard-3-001
   [junit4]   2> 1367677 INFO  (TEST-PeerSyncReplicationTest.test-seed#[1C27B93464235B84]) [    ] o.e.j.s.Server jetty-9.3.14.v20161028
   [junit4]   2> 1367677 INFO  (TEST-PeerSyncReplicationTest.test-seed#[1C27B93464235B84]) [    ] o.e.j.s.h.ContextHandler Started o.e.j.s.ServletContextHandler@211996c6{/ipown/al,null,AVAILABLE}
   [junit4]   2> 1367678 INFO  (TEST-PeerSyncReplicationTest.test-seed#[1C27B93464235B84]) [    ] o.e.j.s.AbstractConnector Started ServerConnector@2cfd3360{SSL,[ssl, http/1.1]}{127.0.0.1:٣٥٩٩١}
   [junit4]   2> 1367678 INFO  (TEST-PeerSyncReplicationTest.test-seed#[1C27B93464235B84]) [    ] o.e.j.s.Server Started @١٣٦٩٧٩٨ms
   [junit4]   2> 1367678 INFO  (TEST-PeerSyncReplicationTest.test-seed#[1C27B93464235B84]) [    ] o.a.s.c.s.e.JettySolrRunner Jetty properties: {hostContext=/ipown/al, solrconfig=solrconfig.xml, solr.data.dir=/home/jenkins/workspace/Lucene-Solr-master-Linux/solr/build/solr-core/test/J1/temp/solr.cloud.PeerSyncReplicationTest_1C27B93464235B84-001/tempDir-001/jetty3, hostPort=35991, coreRootDirectory=/home/jenkins/workspace/Lucene-Solr-master-Linux/solr/build/solr-core/test/J1/../../../../../../../../../home/jenkins/workspace/Lucene-Solr-master-Linux/solr/build/solr-core/test/J1/temp/solr.cloud.PeerSyncReplicationTest_1C27B93464235B84-001/shard-3-001/cores}
   [junit4]   2> 1367678 ERROR (TEST-PeerSyncReplicationTest.test-seed#[1C27B93464235B84]) [    ] o.a.s.s.StartupLoggingUtils Missing Java Option solr.log.dir. Logging may be missing or incomplete.
   [junit4]   2> 1367679 INFO  (TEST-PeerSyncReplicationTest.test-seed#[1C27B93464235B84]) [    ] o.a.s.s.SolrDispatchFilter  ___      _       Welcome to Apache Solr™ version 7.0.0
   [junit4]   2> 1367679 INFO  (TEST-PeerSyncReplicationTest.test-seed#[1C27B93464235B84]) [    ] o.a.s.s.SolrDispatchFilter / __| ___| |_ _   Starting in cloud mode on port null
   [junit4]   2> 1367679 INFO  (TEST-PeerSyncReplicationTest.test-seed#[1C27B93464235B84]) [    ] o.a.s.s.SolrDispatchFilter \__ \/ _ \ | '_|  Install dir: null
   [junit4]   2> 1367679 INFO  (TEST-PeerSyncReplicationTest.test-seed#[1C27B93464235B84]) [    ] o.a.s.s.SolrDispatchFilter |___/\___/_|_|    Start time: 2017-01-05T00:20:07.743238Z
   [junit4]   2> 1367681 INFO  (TEST-PeerSyncReplicationTest.test-seed#[1C27B93464235B84]) [    ] o.a.s.s.SolrDispatchFilter Loading solr.xml from SolrHome (not found in ZooKeeper)
   [junit4]   2> 1367681 INFO  (TEST-PeerSyncReplicationTest.test-seed#[1C27B93464235B84]) [    ] o.a.s.c.SolrXmlConfig Loading container configuration from /home/jenkins/workspace/Lucene-Solr-master-Linux/solr/build/solr-core/test/J1/temp/solr.cloud.PeerSyncReplicationTest_1C27B93464235B84-001/shard-3-001/solr.xml
   [junit4]   2> 1367688 INFO  (TEST-PeerSyncReplicationTest.test-seed#[1C27B93464235B84]) [    ] o.a.s.c.ZkContainer Zookeeper client=127.0.0.1:37638/solr
   [junit4]   2> 1367692 INFO  (TEST-PeerSyncReplicationTest.test-seed#[1C27B93464235B84]) [    ] o.a.s.c.c.ZkStateReader Updated live nodes from ZooKeeper... (0) -> (3)
   [junit4]   2> 1367694 INFO  (TEST-PeerSyncReplicationTest.test-seed#[1C27B93464235B84]) [    ] o.a.s.c.ZkController Register node as live in ZooKeeper:/live_nodes/127.0.0.1:35991_ipown%2Fal
   [junit4]   2> 1367694 INFO  (zkCallback-1728-thread-1) [    ] o.a.s.c.c.ZkStateReader Updated live nodes from ZooKeeper... (3) -> (4)
   [junit4]   2> 1367694 INFO  (zkCallback-1734-thread-1) [    ] o.a.s.c.c.ZkStateReader Updated live nodes from ZooKeeper... (3) -> (4)
   [junit4]   2> 1367695 INFO  (zkCallback-1741-thread-1) [    ] o.a.s.c.c.ZkStateReader Updated live nodes from ZooKeeper... (3) -> (4)
   [junit4]   2> 1367695 INFO  (zkCallback-1718-thread-2) [    ] o.a.s.c.c.ZkStateReader Updated live nodes from ZooKeeper... (3) -> (4)
   [junit4]   2> 1367695 INFO  (zkCallback-1722-thread-1) [    ] o.a.s.c.c.ZkStateReader Updated live nodes from ZooKeeper... (3) -> (4)
   [junit4]   2> 1367714 INFO  (TEST-PeerSyncReplicationTest.test-seed#[1C27B93464235B84]) [    ] o.a.s.c.CorePropertiesLocator Found 1 core definitions underneath /home/jenkins/workspace/Lucene-Solr-master-Linux/solr/build/solr-core/test/J1/../../../../../../../../../home/jenkins/workspace/Lucene-Solr-master-Linux/solr/build/solr-core/test/J1/temp/solr.cloud.PeerSyncReplicationTest_1C27B93464235B84-001/shard-3-001/cores
   [junit4]   2> 1367714 INFO  (TEST-PeerSyncReplicationTest.test-seed#[1C27B93464235B84]) [    ] o.a.s.c.CorePropertiesLocator Cores are: [collection1]
   [junit4]   2> 1367717 INFO  (OverseerStateUpdate-97227610539950085-127.0.0.1:38400_ipown%2Fal-n_0000000000) [    ] o.a.s.c.o.ReplicaMutator Assigning new node to shard shard=shard1
   [junit4]   2> 1367815 INFO  (qtp1409813677-10781) [    ] o.a.s.h.a.PrepRecoveryOp In WaitForState(recovering): collection=collection1, shard=shard1, thisCore=collection1, leaderDoesNotNeedRecovery=false, isLeader? true, live=true, checkLive=true, currentState=recovering, localState=active, nodeName=127.0.0.1:42151_ipown%2Fal, coreNodeName=core_node2, onlyIfActiveCheckResult=false, nodeProps: core_node2:{"core":"collection1","base_url":"https://127.0.0.1:42151/ipown/al","node_name":"127.0.0.1:42151_ipown%2Fal","state":"recovering"}
   [junit4]   2> 1367815 INFO  (qtp1409813677-10781) [    ] o.a.s.h.a.PrepRecoveryOp Waited coreNodeName: core_node2, state: recovering, checkLive: true, onlyIfLeader: true for: 1 seconds.
   [junit4]   2> 1367815 INFO  (qtp1409813677-10781) [    ] o.a.s.s.HttpSolrCall [admin] webapp=null path=/admin/cores params={nodeName=127.0.0.1:42151_ipown%252Fal&onlyIfLeaderActive=true&core=collection1&coreNodeName=core_node2&action=PREPRECOVERY&checkLive=true&state=recovering&onlyIfLeader=true&wt=javabin&version=2} status=0 QTime=1002
   [junit4]   2> 1367818 INFO  (zkCallback-1728-thread-1) [    ] o.a.s.c.c.ZkStateReader A cluster state change: [WatchedEvent state:SyncConnected type:NodeDataChanged path:/collections/collection1/state.json] for collection [collection1] has occurred - updating... (live nodes size: [4])
   [junit4]   2> 1367818 INFO  (zkCallback-1741-thread-1) [    ] o.a.s.c.c.ZkStateReader A cluster state change: [WatchedEvent state:SyncConnected type:NodeDataChanged path:/collections/collection1/state.json] for collection [collection1] has occurred - updating... (live nodes size: [4])
   [junit4]   2> 1367818 INFO  (zkCallback-1734-thread-1) [    ] o.a.s.c.c.ZkStateReader A cluster state change: [WatchedEvent state:SyncConnected type:NodeDataChanged path:/collections/collection1/state.json] for collection [collection1] has occurred - updating... (live nodes size: [4])
   [junit4]   2> 1368724 WARN  (coreLoadExecutor-5783-thread-1) [    ] o.a.s.c.Config Beginning with Solr 5.5, <mergePolicy> is deprecated, use <mergePolicyFactory> instead.
   [junit4]   2> 1368725 INFO  (coreLoadExecutor-5783-thread-1) [    ] o.a.s.c.SolrConfig Using Lucene MatchVersion: 7.0.0
   [junit4]   2> 1368737 INFO  (coreLoadExecutor-5783-thread-1) [    ] o.a.s.s.IndexSchema [collection1] Schema name=test
   [junit4]   2> 1368838 WARN  (coreLoadExecutor-5783-thread-1) [    ] o.a.s.s.IndexSchema [collection1] default search field in schema is text. WARNING: Deprecated, please use 'df' on request instead.
   [junit4]   2> 1368840 INFO  (coreLoadExecutor-5783-thread-1) [    ] o.a.s.s.IndexSchema Loaded schema test/1.0 with uniqueid field id
   [junit4]   2> 1368845 INFO  (coreLoadExecutor-5783-thread-1) [    ] o.a.s.c.CoreContainer Creating SolrCore 'collection1' using configuration from collection collection1
   [junit4]   2> 1368845 INFO  (coreLoadExecutor-5783-thread-1) [    ] o.a.s.c.SolrCore [[collection1] ] Opening new SolrCore at [/home/jenkins/workspace/Lucene-Solr-master-Linux/solr/build/solr-core/test/J1/temp/solr.cloud.PeerSyncReplicationTest_1C27B93464235B84-001/shard-3-001/cores/collection1], dataDir=[/home/jenkins/workspace/Lucene-Solr-master-Linux/solr/build/solr-core/test/J1/../../../../../../../../../home/jenkins/workspace/Lucene-Solr-master-Linux/solr/build/solr-core/test/J1/temp/solr.cloud.PeerSyncReplicationTest_1C27B93464235B84-001/shard-3-001/cores/collection1/data/]
   [junit4]   2> 1368845 INFO  (coreLoadExecutor-5783-thread-1) [    ] o.a.s.c.JmxMonitoredMap JMX monitoring is enabled. Adding Solr mbeans to JMX Server: com.sun.jmx.mbeanserver.JmxMBeanServer@496ce899
   [junit4]   2> 1368850 INFO  (coreLoadExecutor-5783-thread-1) [    ] o.a.s.u.RandomMergePolicy RandomMergePolicy wrapping class org.apache.lucene.index.LogByteSizeMergePolicy: [LogByteSizeMergePolicy: minMergeSize=1677721, mergeFactor=13, maxMergeSize=2147483648, maxMergeSizeForForcedMerge=9223372036854775807, calibrateSizeByDeletes=true, maxMergeDocs=2147483647, maxCFSSegmentSizeMB=8.796093022207999E12, noCFSRatio=0.4880685177284515]
   [junit4]   2> 1368914 WARN  (coreLoadExecutor-5783-thread-1) [    ] o.a.s.c.RequestHandlers INVALID paramSet a in requestHandler {type = requestHandler,name = /dump,class = DumpRequestHandler,attributes = {initParams=a, name=/dump, class=DumpRequestHandler},args = {defaults={a=A,b=B}}}
   [junit4]   2> 1368922 INFO  (coreLoadExecutor-5783-thread-1) [    ] o.a.s.u.UpdateHandler Using UpdateLog implementation: org.apache.solr.update.UpdateLog
   [junit4]   2> 1368922 INFO  (coreLoadExecutor-5783-thread-1) [    ] o.a.s.u.UpdateLog Initializing UpdateLog: dataDir= defaultSyncLevel=FLUSH numRecordsToKeep=1000 maxNumLogsToKeep=10 numVersionBuckets=65536
   [junit4]   2> 1368923 INFO  (coreLoadExecutor-5783-thread-1) [    ] o.a.s.u.CommitTracker Hard AutoCommit: disabled
   [junit4]   2> 1368923 INFO  (coreLoadExecutor-5783-thread-1) [    ] o.a.s.u.CommitTracker Soft AutoCommit: disabled
   [junit4]   2> 1368924 INFO  (coreLoadExecutor-5783-thread-1) [    ] o.a.s.u.RandomMergePolicy RandomMergePolicy wrapping class org.apache.lucene.index.AlcoholicMergePolicy: [AlcoholicMergePolicy: minMergeSize=0, mergeFactor=10, maxMergeSize=176120332, maxMergeSizeForForcedMerge=9223372036854775807, calibrateSizeByDeletes=true, maxMergeDocs=2147483647, maxCFSSegmentSizeMB=8.796093022207999E12, noCFSRatio=0.1]
   [junit4]   2> 1368925 INFO  (coreLoadExecutor-5783-thread-1) [    ] o.a.s.s.SolrIndexSearcher Opening [Searcher@336e6c76[collection1] main]
   [junit4]   2> 1368926 INFO  (coreLoadExecutor-5783-thread-1) [    ] o.a.s.r.ManagedResourceStorage Configured ZooKeeperStorageIO with znodeBase: /configs/conf1
   [junit4]   2> 1368926 INFO  (coreLoadExecutor-5783-thread-1) [    ] o.a.s.r.ManagedResourceStorage Loaded null at path _rest_managed.json using ZooKeeperStorageIO:path=/configs/conf1
   [junit4]   2> 1368926 INFO  (coreLoadExecutor-5783-thread-1) [    ] o.a.s.h.ReplicationHandler Commits will be reserved for  10000
   [junit4]   2> 1368927 INFO  (searcherExecutor-5784-thread-1) [    ] o.a.s.c.SolrCore [collection1] Registered new searcher Searcher@336e6c76[collection1] main{ExitableDirectoryReader(UninvertingDirectoryReader())}
   [junit4]   2> 1368927 INFO  (coreLoadExecutor-5783-thread-1) [    ] o.a.s.u.UpdateLog Could not find max version in index or recent updates, using new clock 1555641777773346816
   [junit4]   2> 1368930 INFO  (coreZkRegister-5778-thread-1) [    ] o.a.s.c.ZkController Core needs to recover:collection1
   [junit4]   2> 1368930 INFO  (updateExecutor-1738-thread-1) [    ] o.a.s.u.DefaultSolrCoreState Running recovery
   [junit4]   2> 1368930 INFO  (recoveryExecutor-1739-thread-1) [    ] o.a.s.c.RecoveryStrategy Starting recovery process. recoveringAfterStartup=true
   [junit4]   2> 1368930 INFO  (recoveryExecutor-1739-thread-1) [    ] o.a.s.c.RecoveryStrategy ###### startupVersions=[[]]
   [junit4]   2> 1368930 INFO  (recoveryExecutor-1739-thread-1) [    ] o.a.s.c.RecoveryStrategy Begin buffering updates. core=[collection1]
   [junit4]   2> 1368930 INFO  (recoveryExecutor-1739-thread-1) [    ] o.a.s.u.UpdateLog Starting to buffer updates. FSUpdateLog{state=ACTIVE, tlog=null}
   [junit4]   2> 1368931 INFO  (recoveryExecutor-1739-thread-1) [    ] o.a.s.c.RecoveryStrategy Publishing state of core [collection1] as recovering, leader is [https://127.0.0.1:45471/ipown/al/collection1/] and I am [https://127.0.0.1:35991/ipown/al/collection1/]
   [junit4]   2> 1368933 INFO  (recoveryExecutor-1739-thread-1) [    ] o.a.s.c.RecoveryStrategy Sending prep recovery command to [https://127.0.0.1:45471/ipown/al]; [WaitForState: action=PREPRECOVERY&core=collection1&nodeName=127.0.0.1:35991_ipown%252Fal&coreNodeName=core_node3&state=recovering&checkLive=true&onlyIfLeader=true&onlyIfLeaderActive=true]
   [junit4]   2> 1368935 INFO  (qtp1409813677-10786) [    ] o.a.s.h.a.PrepRecoveryOp Going to wait for coreNodeName: core_node3, state: recovering, checkLive: true, onlyIfLeader: true, onlyIfLeaderActive: true
   [junit4]   2> 1368935 INFO  (qtp1409813677-10786) [    ] o.a.s.h.a.PrepRecoveryOp Will wait a max of 183 seconds to see collection1 (shard1 of collection1) have state: recovering
   [junit4]   2> 1368935 INFO  (qtp1409813677-10786) [    ] o.a.s.h.a.PrepRecoveryOp In WaitForState(recovering): collection=collection1, shard=shard1, thisCore=collection1, leaderDoesNotNeedRecovery=false, isLeader? true, live=true, checkLive=true, currentState=down, localState=active, nodeName=127.0.0.1:35991_ipown%2Fal, coreNodeName=core_node3, onlyIfActiveCheckResult=false, nodeProps: core_node3:{"core":"collection1","base_url":"https://127.0.0.1:35991/ipown/al","node_name":"127.0.0.1:35991_ipown%2Fal","state":"down"}
   [junit4]   2> 1369033 INFO  (zkCallback-1728-thread-1) [    ] o.a.s.c.c.ZkStateReader A cluster state change: [WatchedEvent state:SyncConnected type:NodeDataChanged path:/collections/collection1/state.json] for collection [collection1] has occurred - updating... (live nodes size: [4])
   [junit4]   2> 1369033 INFO  (zkCallback-1734-thread-1) [    ] o.a.s.c.c.ZkStateReader A cluster state change: [WatchedEvent state:SyncConnected type:NodeDataChanged path:/collections/collection1/state.json] for collection [collection1] has occurred - updating... (live nodes size: [4])
   [junit4]   2> 1369033 INFO  (zkCallback-1741-thread-1) [    ] o.a.s.c.c.ZkStateReader A cluster state change: [WatchedEvent state:SyncConnected type:NodeDataChanged path:/collections/collection1/state.json] for collection [collection1] has occurred - updating... (live nodes size: [4])
   [junit4]   2> 1369243 INFO  (TEST-PeerSyncReplicationTest.test-seed#[1C27B93464235B84]) [    ] o.a.s.SolrTestCaseJ4 ###Starting test
   [junit4]   2> 1369243 INFO  (TEST-PeerSyncReplicationTest.test-seed#[1C27B93464235B84]) [    ] o.a.s.c.AbstractFullDistribZkTestBase Wait for recoveries to finish - wait 30 for each attempt
   [junit4]   2> 1369243 INFO  (TEST-PeerSyncReplicationTest.test-seed#[1C27B93464235B84]) [    ] o.a.s.c.AbstractDistribZkTestBase Wait for recoveries to finish - collection: collection1 failOnTimeout:true timeout (sec):30
   [junit4]   2> 1369936 INFO  (qtp1409813677-10786) [    ] o.a.s.h.a.PrepRecoveryOp In WaitForState(recovering): collection=collection1, shard=shard1, thisCore=collection1, leaderDoesNotNeedRecovery=false, isLeader? true, live=true, checkLive=true, currentState=recovering, localState=active, nodeName=127.0.0.1:35991_ipown%2Fal, coreNodeName=core_node3, onlyIfActiveCheckResult=false, nodeProps: core_node3:{"core":"collection1","base_url":"https://127.0.0.1:35991/ipown/al","node_name":"127.0.0.1:35991_ipown%2Fal","state":"recovering"}
   [junit4]   2> 1369936 INFO  (qtp1409813677-10786) [    ] o.a.s.h.a.PrepRecoveryOp Waited coreNodeName: core_node3, state: recovering, checkLive: true, onlyIfLeader: true for: 1 seconds.
   [junit4]   2> 1369936 INFO  (qtp1409813677-10786) [    ] o.a.s.s.HttpSolrCall [admin] webapp=null path=/admin/cores params={nodeName=127.0.0.1:35991_ipown%252Fal&onlyIfLeaderActive=true&core=collection1&coreNodeName=core_node3&action=PREPRECOVERY&checkLive=true&state=recovering&onlyIfLeader=true&wt=javabin&version=2} status=0 QTime=1001
   [junit4]   2> 1374816 INFO  (recoveryExecutor-1732-thread-1) [    ] o.a.s.c.RecoveryStrategy Attempting to PeerSync from [https://127.0.0.1:45471/ipown/al/collection1/] - recoveringAfterStartup=[true]
   [junit4]   2> 1374816 INFO  (recoveryExecutor-1732-thread-1) [    ] o.a.s.u.PeerSync PeerSync: core=collection1 url=https://127.0.0.1:42151/ipown/al START replicas=[https://127.0.0.1:45471/ipown/al/collection1/] nUpdates=1000
   [junit4]   2> 1374818 INFO  (qtp1409813677-10782) [    ] o.a.s.u.IndexFingerprint IndexFingerprint millis:0.0 result:{maxVersionSpecified=9223372036854775807, maxVersionEncountered=0, maxInHash=0, versionsHash=0, numVersions=0, numDocs=0, maxDoc=0}
   [junit4]   2> 1374819 INFO  (qtp1409813677-10782) [    ] o.a.s.c.S.Request [collection1]  webapp=/ipown/al path=/get params={distrib=false&qt=/get&getFingerprint=9223372036854775807&wt=javabin&version=2} status=0 QTime=0
   [junit4]   2> 1374819 INFO  (recoveryExecutor-1732-thread-1) [    ] o.a.s.u.IndexFingerprint IndexFingerprint millis:0.0 result:{maxVersionSpecified=9223372036854775807, maxVersionEncountered=0, maxInHash=0, versionsHash=0, numVersions=0, numDocs=0, maxDoc=0}
   [junit4]   2> 1374819 INFO  (recoveryExecutor-1732-thread-1) [    ] o.a.s.u.PeerSync We are already in sync. No need to do a PeerSync 
   [junit4]   2> 1374819 INFO  (recoveryExecutor-1732-thread-1) [    ] o.a.s.u.DirectUpdateHandler2 start commit{,optimize=false,openSearcher=true,waitSearcher=true,expungeDeletes=false,softCommit=false,prepareCommit=false}
   [junit4]   2> 1374819 INFO  (recoveryExecutor-1732-thread-1) [    ] o.a.s.u.DirectUpdateHandler2 No uncommitted changes. Skipping IW.commit.
   [junit4]   2> 1374820 INFO  (recoveryExecutor-1732-thread-1) [    ] o.a.s.u.DirectUpdateHandler2 end_commit_flush
   [junit4]   2> 1374820 INFO  (recoveryExecutor-1732-thread-1) [    ] o.a.s.c.RecoveryStrategy PeerSync stage of recovery was successful.
   [junit4]   2> 1374820 INFO  (recoveryExecutor-1732-thread-1) [    ] o.a.s.c.RecoveryStrategy Replaying updates buffered during PeerSync.
   [junit4]   2> 1374820 INFO  (recoveryExecutor-1732-thread-1) [    ] o.a.s.c.RecoveryStrategy No replay needed.
   [junit4]   2> 1374820 INFO  (recoveryExecutor-1732-thread-1) [    ] o.a.s.c.RecoveryStrategy Registering as Active after recovery.
   [junit4]   2> 1374822 INFO  (zkCallback-1728-thread-1) [    ] o.a.s.c.c.ZkStateReader A cluster state change: [WatchedEvent state:SyncConnected type:NodeDataChanged path:/collections/collection1/state.json] for collection [collection1] has occurred - updating... (live nodes size: [4])
   [junit4]   2> 1374822 INFO  (zkCallback-1734-thread-1) [    ] o.a.s.c.c.ZkStateReader A cluster state change: [WatchedEvent state:SyncConnected type:NodeDataChanged path:/collections/collection1/state.json] for collection [collection1] has occurred - updating... (live nodes size: [4])
   [junit4]   2> 1374822 INFO  (zkCallback-1741-thread-1) [    ] o.a.s.c.c.ZkStateReader A cluster state change: [WatchedEvent state:SyncConnected type:NodeDataChanged path:/collections/collection1/state.json] for collection [collection1] has occurred - updating... (live nodes size: [4])
   [junit4]   2> 1376936 INFO  (recoveryExecutor-1739-thread-1) [    ] o.a.s.c.RecoveryStrategy Attempting to PeerSync from [https://127.0.0.1:45471/ipown/al/collection1/] - recoveringAfterStartup=[true]
   [junit4]   2> 1376937 INFO  (recoveryExecutor-1739-thread-1) [    ] o.a.s.u.PeerSync PeerSync: core=collection1 url=https://127.0.0.1:35991/ipown/al START replicas=[https://127.0.0.1:45471/ipown/al/collection1/] nUpdates=1000
   [junit4]   2> 1376940 INFO  (qtp1409813677-10787) [    ] o.a.s.u.IndexFingerprint IndexFingerprint millis:1.0 result:{maxVersionSpecified=9223372036854775807, maxVersionEncountered=0, maxInHash=0, versionsHash=0, numVersions=0, numDocs=0, maxDoc=0}
   [junit4]   2> 1376940 INFO  (qtp1409813677-10787) [    ] o.a.s.c.S.Request [collection1]  webapp=/ipown/al path=/get params={distrib=false&qt=/get&getFingerprint=9223372036854775807&wt=javabin&version=2} status=0 QTime=1
   [junit4]   2> 1376941 INFO  (recoveryExecutor-1739-thread-1) [    ] o.a.s.u.IndexFingerprint IndexFingerprint millis:0.0 result:{maxVersionSpecified=9223372036854775807, maxVersionEncountered=0, maxInHash=0, versionsHash=0, numVersions=0, numDocs=0, maxDoc=0}
   [junit4]   2> 1376941 INFO  (recoveryExecutor-1739-thread-1) [    ] o.a.s.u.PeerSync We are already in sync. No need to do a PeerSync 
   [junit4]   2> 1376941 INFO  (recoveryExecutor-1739-thread-1) [    ] o.a.s.u.DirectUpdateHandler2 start commit{,optimize=false,openSearcher=true,waitSearcher=true,expungeDeletes=false,softCommit=false,prepareCommit=false}
   [junit4]   2> 1376941 INFO  (recoveryExecutor-1739-thread-1) [    ] o.a.s.u.DirectUpdateHandler2 No uncommitted changes. Skipping IW.commit.
   [junit4]   2> 1376941 INFO  (recoveryExecutor-1739-thread-1) [    ] o.a.s.u.DirectUpdateHandler2 end_commit_flush
   [junit4]   2> 1376941 INFO  (recoveryExecutor-1739-thread-1) [    ] o.a.s.c.RecoveryStrategy PeerSync stage of recovery was successful.
   [junit4]   2> 1376941 INFO  (recoveryExecutor-1739-thread-1) [    ] o.a.s.c.RecoveryStrategy Replaying updates buffered during PeerSync.
   [junit4]   2> 1376941 INFO  (recoveryExecutor-1739-thread-1) [    ] o.a.s.c.RecoveryStrategy No replay needed.
   [junit4]   2> 1376941 INFO  (recoveryExecutor-1739-thread-1) [    ] o.a.s.c.RecoveryStrategy Registering as Active after recovery.
   [junit4]   2> 1376943 INFO  (zkCallback-1728-thread-1) [    ] o.a.s.c.c.ZkStateReader A cluster state change: [WatchedEvent state:SyncConnected type:NodeDataChanged path:/collections/collection1/state.json] for collection [collection1] has occurred - updating... (live nodes size: [4])
   [junit4]   2> 1376943 INFO  (zkCallback-1741-thread-1) [    ] o.a.s.c.c.ZkStateReader A cluster state change: [WatchedEvent state:SyncConnected type:NodeDataChanged path:/collections/collection1/state.json] for collection [collection1] has occurred - updating... (live nodes size: [4])
   [junit4]   2> 1376943 INFO  (zkCallback-1734-thread-1) [    ] o.a.s.c.c.ZkStateReader A cluster state change: [WatchedEvent state:SyncConnected type:NodeDataChanged path:/collections/collection1/state.json] for collection [collection1] has occurred - updating... (live nodes size: [4])
   [junit4]   2> 1377247 INFO  (TEST-PeerSyncReplicationTest.test-seed#[1C27B93464235B84]) [    ] o.a.s.c.AbstractDistribZkTestBase Recoveries finished - collection: collection1
   [junit4]   2> 1377263 INFO  (qtp383243230-10742) [    ] o.a.s.u.DirectUpdateHandler2 start commit{,optimize=false,openSearcher=true,waitSearcher=true,expungeDeletes=false,softCommit=false,prepareCommit=false}
   [junit4]   2> 1377263 INFO  (qtp383243230-10742) [    ] o.a.s.u.DirectUpdateHandler2 No uncommitted changes. Skipping IW.commit.
   [junit4]   2> 1377264 INFO  (qtp383243230-10742) [    ] o.a.s.u.DirectUpdateHandler2 end_commit_flush
   [junit4]   2> 1377264 INFO  (qtp383243230-10742) [    ] o.a.s.u.p.LogUpdateProcessorFactory [collection1]  webapp=/ipown/al path=/update params={waitSearcher=true&commit=true&softCommit=false&wt=javabin&version=2}{commit=} 0 1
   [junit4]   2> 1377269 INFO  (qtp1409813677-10786) [    ] o.a.s.u.DirectUpdateHandler2 start commit{,optimize=false,openSearcher=true,waitSearcher=true,expungeDeletes=false,softCommit=false,prepareCommit=false}
   [junit4]   2> 1377269 INFO  (qtp1409813677-10786) [    ] o.a.s.u.DirectUpdateHandler2 No uncommitted changes. Skipping IW.commit.
   [junit4]   2> 1377271 INFO  (qtp1409813677-10786) [    ] o.a.s.u.DirectUpdateHandler2 end_commit_flush
   [junit4]   2> 1377271 INFO  (qtp1409813677-10786) [    ] o.a.s.u.p.LogUpdateProcessorFactory [collection1]  webapp=/ipown/al path=/update params={update.distrib=FROMLEADER&waitSearcher=true&openSearcher=true&commit=true&softCommit=false&distrib.from=https://127.0.0.1:45471/ipown/al/collection1/&commit_end_point=true&wt=javabin&version=2&expungeDeletes=false}{commit=} 0 2
   [junit4]   2> 1377285 INFO  (qtp1419849679-10845) [    ] o.a.s.u.DirectUpdateHandler2 start commit{,optimize=false,openSearcher=true,waitSearcher=true,expungeDeletes=false,softCommit=false,prepareCommit=false}
   [junit4]   2> 1377285 INFO  (qtp1419849679-10845) [    ] o.a.s.u.DirectUpdateHandler2 No uncommitted changes. Skipping IW.commit.
   [junit4]   2> 1377286 INFO  (qtp1419849679-10845) [    ] o.a.s.u.DirectUpdateHandler2 end_commit_flush
   [junit4]   2> 1377286 INFO  (qtp1419849679-10845) [    ] o.a.s.u.p.LogUpdateProcessorFactory [collection1]  webapp=/ipown/al path=/update params={update.distrib=FROMLEADER&waitSearcher=true&openSearcher=true&commit=true&softCommit=false&distrib.from=https://127.0.0.1:45471/ipown/al/collection1/&commit_end_point=true&wt=javabin&version=2&expungeDeletes=false}{commit=} 0 1
   [junit4]   2> 1377288 INFO  (qtp76187368-10810) [    ] o.a.s.u.DirectUpdateHandler2 start commit{,optimize=false,openSearcher=true,waitSearcher=true,expungeDeletes=false,softCommit=false,prepareCommit=false}
   [junit4]   2> 1377288 INFO  (qtp76187368-10810) [    ] o.a.s.u.DirectUpdateHandler2 No uncommitted changes. Skipping IW.commit.
   [junit4]   2> 1377289 INFO  (qtp76187368-10810) [    ] o.a.s.u.DirectUpdateHandler2 end_commit_flush
   [junit4]   2> 1377289 INFO  (qtp76187368-10810) [    ] o.a.s.u.p.LogUpdateProcessorFactory [collection1]  webapp=/ipown/al path=/update params={update.distrib=FROMLEADER&waitSearcher=true&openSearcher=true&commit=true&softCommit=false&distrib.from=https://127.0.0.1:45471/ipown/al/collection1/&commit_end_point=true&wt=javabin&version=2&expungeDeletes=false}{commit=} 0 0
   [junit4]   2> 1377289 INFO  (qtp1409813677-10787) [    ] o.a.s.u.p.LogUpdateProcessorFactory [collection1]  webapp=/ipown/al path=/update params={_stateVer_=collection1:9&waitSearcher=true&commit=true&softCommit=false&wt=javabin&version=2}{commit=} 0 22
   [junit4]   2> 1377292 INFO  (qtp1409813677-10787) [    ] o.a.s.c.S.Request [collection1]  webapp=/ipown/al path=/select params={q=*:*&distrib=false&tests=checkShardConsistency&rows=0&wt=javabin&version=2} hits=0 status=0 QTime=1
   [junit4]   2> 1377294 INFO  (qtp76187368-10810) [    ] o.a.s.c.S.Request [collection1]  webapp=/ipown/al path=/select params={q=*:*&distrib=false&tests=checkShardConsistency&rows=0&wt=javabin&version=2} hits=0 status=0 QTime=0
   [junit4]   2> 1377296 INFO  (qtp1419849679-10845) [    ] o.a.s.c.S.Request [collection1]  webapp=/ipown/al path=/select params={q=*:*&distrib=false&tests=checkShardConsistency&rows=0&wt=javabin&version=2} hits=0 status=0 QTime=0
   [junit4]   2> 1379300 INFO  (qtp383243230-10747) [    ] o.a.s.u.p.LogUpdateProcessorFactory [collection1]  webapp=/ipown/al path=/update params={wt=javabin&version=2}{deleteByQuery=*:* (-1555641788647079936)} 0 2
   [junit4]   2> 1379304 INFO  (qtp1419849679-10850) [    ] o.a.s.u.p.LogUpdateProcessorFactory [collection1]  webapp=/ipown/al path=/update params={update.distrib=FROMLEADER&_version_=-1555641788650225664&distrib.from=https://127.0.0.1:45471/ipown/al/collection1/&wt=javabin&version=2}{deleteByQuery=*:* (-1555641788650225664)} 0 1
   [junit4]   2> 1379304 INFO  (qtp76187368-10815) [    ] o.a.s.u.p.LogUpdateProcessorFactory [collection1]  webapp=/ipown/al path=/update params={update.distrib=FROMLEADER&_version_=-1555641788650225664&distrib.from=https://127.0.0.1:45471/ipown/al/collection1/&wt=javabin&version=2}{deleteByQuery=*:* (-1555641788650225664)} 0 1
   [junit4]   2> 1379305 INFO  (qtp1409813677-10788) [    ] o.a.s.u.p.LogUpdateProcessorFactory [collection1]  webapp=/ipown/al path=/update params={wt=javabin&version=2}{deleteByQuery=*:* (-1555641788650225664)} 0 4
   [junit4]   2> 1379311 INFO  (qtp76187368-10816) [    ] o.a.s.u.p.LogUpdateProcessorFactory [collection1]  webapp=/ipown/al path=/update params={update.distrib=FROMLEADER&distrib.from=https://127.0.0.1:45471/ipown/al/collection1/&wt=javabin&version=2}{add=[0 (1555641788656517120)]} 0 1
   [junit4]   2> 1379311 INFO  (qtp1419849679-10851) [    ] o.a.s.u.p.LogUpdateProcessorFactory [collection1]  webapp=/ipown/al path=/update params={update.distrib=FROMLEADER&distrib.from=https://127.0.0.1:45471/ipown/al/collection1/&wt=javabin&version=2}{add=[0 (1555641788656517120)]} 0 1
   [junit4]   2> 1379311 INFO  (qtp1409813677-10784) [    ] o.a.s.u.p.LogUpdateProcessorFactory [collection1]  webapp=/ipown/al path=/update params={_stateVer_=collection1:9&wt=javabin&version=2}{add=[0 (1555641788656517120)]} 0 4
   [junit4]   2> 1379312 INFO  (qtp76187368-10817) [    ] o.a.s.u.p.LogUpdateProcessorFactory [collection1]  webapp=/ipown/al path=/update params={update.distrib=FROMLEADER&distrib.from=https://127.0.0.1:45471/ipown/al/collection1/&wt=javabin&version=2}{add=[1 (1555641788662808576)]} 0 0
   [junit4]   2> 1379312 INFO  (qtp1419849679-10852) [    ] o.a.s.u.p.LogUpdateProcessorFactory [collection1]  webapp=/ipown/al path=/update params={update.distrib=FROMLEADER&distrib.from=https://127.0.0.1:45471/ipown/al/collection1/&wt=javabin&version=2}{add=[1 (1555641788662808576)]} 0 0
   [junit4]   2> 1379312 INFO  (qtp1409813677-10786) [    ] o.a.s.u.p.LogUpdateProcessorFactory [collection1]  webapp=/ipown/al path=/update params={_stateVer_=collection1:9&wt=javabin&version=2}{add=[1 (1555641788662808576)]} 0 0
   [junit4]   2> 1379313 INFO  (qtp1419849679-10845) [    ] o.a.s.u.p.LogUpdateProcessorFactory [collection1]  webapp=/ipown/al path=/update params={update.distrib=FROMLEADER&distrib.from=https://127.0.0.1:45471/ipown/al/collection1/&wt=javabin&version=2}{add=[2 (1555641788663857152)]} 0 0
   [junit4]   2> 1379313 INFO  (qtp76187368-10810) [    ] o.a.s.u.p.LogUpdateProcessorFactory [collection1]  webapp=/ipown/al path=/update params={update.distrib=FROMLEADER&distrib.from=https://127.0.0.1:45471/ipown/al/collection1/&wt=javabin&version=2}{add=[2 (1555641788663857152)]} 0 0
   [junit4]   2> 1379313 INFO  (qtp1409813677-10787) [    ] o.a.s.u.p.LogUpdateProcessorFactory [collection1]  webapp=/ipown/al path=/update params={_stateVer_=collection1:9&wt=javabin&version=2}{add=[2 (1555641788663857152)]} 0 0
   [junit4]   2> 1379314 INFO  (qtp1419849679-10850) [    ] o.a.s.u.p.LogUpdateProcessorFactory [collection1]  webapp=/ipown/al path=/update params={update.distrib=FROMLEADER&distrib.from=https://127.0.0.1:45471/ipown/al/collection1/&wt=javabin&version=2}{add=[3 (1555641788664905728)]} 0 0
   [junit4]   2> 1379314 INFO  (qtp76187368-10815) [    ] o.a.s.u.p.LogUpdateProcessorFactory [collection1]  webapp=/ipown/al path=/update params={update.distrib=FROMLEADER&distrib.from=https://127.0.0.1:45471/ipown/al/collection1/&wt=javabin&version=2}{add=[3 (1555641788664905728)]} 0 0
   [junit4]   2> 1379315 INFO  (qtp1409813677-10788) [    ] o.a.s.u.p.LogUpdateProcessorFactory [collection1]  webapp=/ipown/al path=/update params={_stateVer_=collection1:9&wt=javabin&version=2}{add=[3 (1555641788664905728)]} 0 0
   [junit4]   2> 1379315 INFO  (qtp1419849679-10851) [    ] o.a.s.u.p.LogUpdateProcessorFactory [collection1]  webapp=/ipown/al path=/update params={update.distrib=FROMLEADER&distrib.from=https://127.0.0.1:45471/ipown/al/collection1/&wt=javabin&version=2}{add=[4 (1555641788665954304)]} 0 0
   [junit4]   2> 1379315 INFO  (qtp76187368-10816) [    ] o.a.s.u.p.LogUpdateProcessorFactory [collection1]  webapp=/ipown/al path=/update params={update.distrib=FROMLEADER&distrib.from=https://127.0.0.1:45471/ipown/al/collection1/&wt=javabin&version=2}{add=[4 (1555641788665954304)]} 0 0
   [junit4]   2> 1379316 INFO  (qtp1409813677-10784) [    ] o.a.s.u.p.LogUpdateProcessorFactory [collection1]  webapp=/ipown/al path=/update params={_stateVer_=collection1:9&wt=javabin&version=2}{add=[4 (1555641788665954304)]} 0 0
   [junit4]   2> 1379316 INFO  (qtp1419849679-10852) [    ] o.a.s.u.p.LogUpdateProcessorFactory [collection1]  webapp=/ipown/al path=/update params={update.distrib=FROMLEADER&distrib.from=https://127.0.0.1:45471/ipown/al/collection1/&wt=javabin&version=2}{add=[5 (1555641788667002880)]} 0 0
   [junit4]   2> 1379316 INFO  (qtp76187368-10817) [    ] o.a.s.u.p.LogUpdateProcessorFactory [collection1]  webapp=/ipown/al path=/update params={update.distrib=FROMLEADER&distrib.from=https://127.0.0.1:45471/ipown/al/collection1/&wt=javabin&version=2}{add=[5 (1555641788667002880)]} 0 0
   [junit4]   2> 1379317 INFO  (qtp1409813677-10786) [    ] o.a.s.u.p.LogUpdateProcessorFactory [collection1]  webapp=/ipown/al path=/update params={_stateVer_=collection1:9&wt=javabin&version=2}{add=[5 (1555641788667002880)]} 0 0
   [junit4]   2> 1379317 INFO  (qtp76187368-10817) [    ] o.a.s.u.p.LogUpdateProcessorFactory [collection1]  webapp=/ipown/al path=/update params={update.distrib=FROMLEADER&distrib.from=https://127.0.0.1:45471/ipown/al/collection1/&wt=javabin&version=2}{add=[6 (1555641788668051456)]} 0 0
   [junit4]   2> 1379317 INFO  (qtp1419849679-10845) [    ] o.a.s.u.p.LogUpdateProcessorFactory [collection1]  webapp=/ipown/al path=/update params={update.distrib=FROMLEADER&distrib.from=https://127.0.0.1:45471/ipown/al/collection1/&wt=javabin&version=2}{add=[6 (1555641788668051456)]} 0 0
   [junit4]   2> 1379318 INFO  (qtp1409813677-10787) [    ] o.a.s.u.p.LogUpdateProcessorFactory [collection1]  webapp=/ipown/al path=/update params={_stateVer_=collection1:9&wt=javabin&version=2}{add=[6 (1555641788668051456)]} 0 0
   [junit4]   2> 1379319 INFO  (qtp76187368-10815) [    ] o.a.s.u.p.LogUpdateProcessorFactory [collection1]  webapp=/ipown/al path=/update params={update.distrib=FROMLEADER&distrib.from=https://127.0.0.1:45471/ipown/al/collection1/&wt=javabin&version=2}{add=[7 (1555641788669100032)]} 0 0
   [junit4]   2> 1379319 INFO  (qtp1419849679-10850) [    ] o.a.s.u.p.LogUpdateProcessorFactory [collection1]  webapp=/ipown/al path=/update params={update.distrib=FROMLEADER&distrib.from=https://127.0.0.1:45471/ipown/al/collection1/&wt=javabin&version=2}{add=[7 (1555641788669100032)]} 0 0
   [junit4]   2> 1379319 INFO  (qtp1409813677-10788) [    ] o.a.s.u.p.LogUpdateProcessorFactory [collection1]  webapp=/ipown/al path=/update params={_stateVer_=collection1:9&wt=javabin&version=2}{add=[7 (1555641788669100032)]} 0 0
   [junit4]   2> 1379320 INFO  (qtp1419849679-10851) [    ] o.a.s.u.p.LogUpdateProcessorFactory [collection1]  webapp=/ipown/al path=/update params={update.distrib=FROMLEADER&distrib.from=https://127.0.0.1:45471/ipown/al/collection1/&wt=javabin&version=2}{add=[8 (1555641788670148608)]} 0 0
   [junit4]   2> 1379320 INFO  (qtp76187368-10816) [    ] o.a.s.u.p.LogUpdateProcessorFactory [collection1]  webapp=/ipown/al path=/update params={update.distrib=FROMLEADER&distrib.from=https://127.0.0.1:45471/ipown/al/collection1/&wt=javabin&version=2}{add=[8 (1555641788670148608)]} 0 0
   [junit4]   2> 1379320 INFO  (qtp1409813677-10784) [    ] o.a.s.u.p.LogUpdateProcessorFactory [collection1]  webapp=/ipown/al path=/update params={_stateVer_=collection1:9&wt=javabin&version=2}{add=[8 (1555641788670148608)]} 0 1
   [junit4]   2> 1379321 INFO  (qtp76187368-10810) [    ] o.a.s.u.p.LogUpdateProcessorFactory [collection1]  webapp=/ipown/al path=/update params={update.distrib=FROMLEADER&distrib.from=https://127.0.0.1:45471/ipown/al/collection1/&wt=javabin&version=2}{add=[9 (1555641788672245760)]} 0 0
   [junit4]   2> 1379321 INFO  (qtp1419849679-10852) [    ] o.a.s.u.p.LogUpdateProcessorFactory [collection1]  webapp=/ipown/al path=/update params={update.distrib=FROMLEADER&distrib.from=https://127.0.0.1:45471/ipown/al/collection1/&wt=javabin&version=2}{add=[9 (1555641788672245760)]} 0 0
   [junit4]   2> 1379321 INFO  (qtp1409813677-10786) [    ] o.a.s.u.p.LogUpdateProcessorFactory [collection1]  webapp=/ipown/al path=/update params={_stateVer_=collection1:9&wt=javabin&version=2}{add=[9 (1555641788672245760)]} 0 0
   [junit4]   2> 1379322 INFO  (qtp1419849679-10845) [    ] o.a.s.u.p.LogUpdateProcessorFactory [collection1]  webapp=/ipown/al path=/update params={update.distrib=FROMLEADER&distrib.from=https://127.0.0.1:45471/ipown/al/collection1/&wt=javabin&version=2}{add=[10 (1555641788673294336)]} 0 0
   [junit4]   2> 1379322 INFO  (qtp76187368-10817) [    ] o.a.s.u.p.LogUpdateProcessorFactory [collection1]  webapp=/ipown/al path=/update params={update.distrib=FROMLEADER&distrib.from=https://127.0.0.1:45471/ipown/al/collection1/&wt=javabin&version=2}{add=[10 (1555641788673294336)]} 0 0
   [junit4]   2> 1379323 INFO  (qtp1409813677-10787) [    ] o.a.s.u.p.LogUpdateProcessorFactory [collection1]  webapp=/ipown/al path=/update params={_stateVer_=collection1:9&wt=javabin&version=2}{add=[10 (1555641788673294336)]} 0 0
   [junit4]   2> 1379324 INFO  (qtp76187368-10815) [    ] o.a.s.u.p.LogUpdateProcessorFactory [collection1]  webapp=/ipown/al path=/update params={update.distrib=FROMLEADER&distrib.from=https://127.0.0.1:45471/ipown/al/collection1/&wt=javabin&version=2}{add=[11 (1555641788674342912)]} 0 0
   [junit4]   2> 1379324 INFO  (qtp1419849679-10850) [    ] o.a.s.u.p.LogUpdateProcessorFactory [collection1]  webapp=/ipown/al path=/update params={update.distrib=FROMLEADER&distrib.from=https://127.0.0.1:45471/ipown/al/collection1/&wt=javabin&version=2}{add=[11 (1555641788674342912)]} 0 0
   [junit4]   2> 1379324 INFO  (qtp1409813677-10788) [    ] o.a.s.u.p.LogUpdateProcessorFactory [collection1]  webapp=/ipown/al path=/update params={_stateVer_=collection1:9&wt=javabin&version=2}{add=[11 (1555641788674342912)]} 0 0
   [junit4]   2> 1379325 INFO  (qtp76187368-10816) [    ] o.a.s.u.p.LogUpdateProcessorFactory [collection1]  webapp=/ipown/al path=/update params={update.distrib=FROMLEADER&distrib.from=https://127.0.0.1:45471/ipown/al/collection1/&wt=javabin&version=2}{add=[12 (1555641788675391488)]} 0 0
   [junit4]   2> 1379325 INFO  (qtp1419849679-10851) [    ] o.a.s.u.p.LogUpdateProcessorFactory [collection1]  webapp=/ipown/al path=/update params={update.distrib=FROMLEADER&distrib.from=https://127.0.0.1:45471/ipown/al/collection1/&wt=javabin&version=2}{add=[12 (1555641788675391488)]} 0 0
   [junit4]   2> 1379325 INFO  (qtp1409813677-10784) [    ] o.a.s.u.p.LogUpdateProcessorFactory [collection1]  webapp=/ipown/al path=/update params={_stateVer_=collection1:9&wt=javabin&version=2}{add=[12 (1555641788675391488)]} 0 0
   [junit4]   2> 1379326 INFO  (qtp1419849679-10852) [    ] o.a.s.u.p.LogUpdateProcessorFactory [collection1]  webapp=/ipown/al path=/update params={update.distrib=FROMLEADER&distrib.from=https://127.0.0.1:45471/ipown/al/collection1/&wt=javabin&version=2}{add=[13 (1555641788676440064)]} 0 0
   [junit4]   2> 1379326 INFO  (qtp76187368-10810) [    ] o.a.s.u.p.LogUpdateProcessorFactory [collection1]  webapp=/ipown/al path=/update params={update.distrib=FROMLEADER&distrib.from=https://127.0.0.1:45471/ipown/al/collection1/&wt=javabin&version=2}{add=[13 (1555641788676440064)]} 0 0
   [junit4]   2> 1379326 INFO  (qtp1409813677-10786) [    ] o.a.s.u.p.LogUpdateProcessorFactory [collection1]  webapp=/ipown/al path=/update params={_stateVer_=collection1:9&wt=javabin&version=2}{add=[13 (1555641788676440064)]} 0 0
   [junit4]   2> 1379327 INFO  (qtp1419849679-10845) [    ] o.a.s.u.p.LogUpdateProcessorFactory [collection1]  webapp=/ipown/al path=/update params={update.distrib=FROMLEADER&distrib.from=https://127.0.0.1:45471/ipown/al/collection1/&wt=javabin&version=2}{add=[14 (1555641788677488640)]} 0 0
   [junit4]   2> 1379327 INFO  (qtp76187368-10817) [    ] o.a.s.u.p.LogUpdateProcessorFactory [collection1]  webapp=/ipown/al path=/update params={update.distrib=FROMLEADER&distrib.from=https://127.0.0.1:45471/ipown/al/collection1/&wt=javabin&version=2}{add=[14 (1555641788677488640)]} 0 0
   [junit4]   2> 1379327 INFO  (qtp1409813677-10787) [    ] o.a.s.u.p.LogUpdateProcessorFactory [collection1]  webapp=/ipown/al path=/update params={_stateVer_=collection1:9&wt=javabin&version=2}{add=[14 (1555641788677488640)]} 0 0
   [junit4]   2> 1379328 INFO  (qtp76187368-10815) [    ] o.a.s.u.p.LogUpdateProcessorFactory [collection1]  webapp=/ipown/al path=/update params={update.distrib=FROMLEADER&distrib.from=https://127.0.0.1:45471/ipown/al/collection1/&wt=javabin&version=2}{add=[15 (1555641788678537216)]} 0 0
   [junit4]   2> 1379328 INFO  (qtp1419849679-10850) [    ] o.a.s.u.p.LogUpdateProcessorFactory [collection1]  webapp=/ipown/al path=/update params={update.distrib=FROMLEADER&distrib.from=https://127.0.0.1:45471/ipown/al/collection1/&wt=javabin&version=2}{add=[15 (1555641788678537216)]} 0 0
   [junit4]   2> 1379328 INFO  (qtp1409813677-10788) [    ] o.a.s.u.p.LogUpdateProcessorFactory [collection1]  webapp=/ipown/al path=/update params={_stateVer_=collection1:9&wt=javabin&version=2}{add=[15 (1555641788678537216)]} 0 0
   [junit4]   2> 1379329 INFO  (qtp76187368-10816) [    ] o.a.s.u.p.LogUpdateProcessorFactory [collection1]  webapp=/ipown/al path=/update params={update.distrib=FROMLEADER&distrib.from=https://127.0.0.1:45471/ipown/al/collection1/&wt=javabin&version=2}{add=[16 (1555641788679585792)]} 0 0
   [junit4]   2> 1379329 INFO  (qtp1419849679-10851) [    ] o.a.s.u.p.LogUpdateProcessorFactory [collection1]  webapp=/ipown/al path=/update params={update.distrib=FROMLEADER&distrib.from=https://127.0.0.1:45471/ipown/al/collection1/&wt=javabin&version=2}{add=[16 (1555641788679585792)]} 0 0
   [junit4]   2> 1379329 INFO  (qtp1409813677-10784) [    ] o.a.s.u.p.LogUpdateProcessorFactory [collection1]  webapp=/ipown/al path=/update params={_stateVer_=collection1:9&wt=javabin&version=2}{add=[16 (1555641788679585792)]} 0 0
   [junit4]   2> 1379330 INFO  (qtp1419849679-10852) [    ] o.a.s.u.p.LogUpdateProcessorFactory [collection1]  webapp=/ipown/al path=/update params={update.distrib=FROMLEADER&distrib.from=https://127.0.0.1:45471/ipown/al/collection1/&wt=javabin&version=2}{add=[17 (1555641788680634368)]} 0 0
   [junit4]   2> 1379330 INFO  (qtp76187368-10810) [    ] o.a.s.u.p.LogUpdateProcessorFactory [collection1]  webapp=/ipown/al path=/update params={update.distrib=FROMLEADER&distrib.from=https://127.0.0.1:45471/ipown/al/collection1/&wt=javabin&version=2}{add=[17 (1555641788680634368)]} 0 0
   [junit4]   2> 1379330 INFO  (qtp1409813677-10786) [    ] o.a.s.u.p.LogUpdateProcessorFactory [collection1]  webapp=/ipown/al path=/update params={_stateVer_=collection1:9&wt=javabin&version=2}{add=[17 (1555641788680634368)]} 0 0
   [junit4]   2> 1379331 INFO  (qtp76187368-10817) [    ] o.a.s.u.p.LogUpdateProcessorFactory [collection1]  webapp=/ipown/al path=/update params={update.distrib=FROMLEADER&distrib.from=https://127.0.0.1:45471/ipown/al/collection1/&wt=javabin&version=2}{add=[18 (1555641788681682944)]} 0 0
   [junit4]   2> 1379331 INFO  (qtp1419849679-10845) [    ] o.a.s.u.p.LogUpdateProcessorFactory [collection1]  webapp=/ipown/al path=/update params={update.distrib=FROMLEADER&distrib.from=https://127.0.0.1:45471/ipown/al/collection1/&wt=javabin&version=2}{add=[18 (1555641788681682944)]} 0 0
   [junit4]   2> 1379331 INFO  (qtp1409813677-10787) [    ] o.a.s.u.p.LogUpdateProcessorFactory [collection1]  webapp=/ipown/al path=/update params={_stateVer_=collection1:9&wt=javabin&version=2}{add=[18 (1555641788681682944)]} 0 0
   [junit4]   2> 1379332 INFO  (qtp76187368-10815) [    ] o.a.s.u.p.LogUpdateProcessorFactory [collection1]  webapp=/ipown/al path=/update params={update.distrib=FROMLEADER&distrib.from=https://127.0.0.1:45471/ipown/al/collection1/&wt=javabin&version=2}{add=[19 (1555641788682731520)]} 0 0
   [junit4]   2> 1379332 INFO  (qtp1419849679-10850) [    ] o.a.s.u.p.LogUpdateProcessorFactory [collection1]  webapp=/ipown/al path=/update params={update.distrib=FROMLEADER&distrib.from=https://127.0.0.1:45471/ipown/al/collection1/&wt=javabin&version=2}{add=[19 (1555641788682731520)]} 0 0
   [junit4]   2> 1379333 INFO  (qtp1409813677-10788) [    ] o.a.s.u.p.LogUpdateProcessorFactory [collection1]  webapp=/ipown/al path=/update params={_stateVer_=collection1:9&wt=javabin&version=2}{add=[19 (1555641788682731520)]} 0 1
   [junit4]   2> 1379333 INFO  (qtp1419849679-10851) [    ] o.a.s.u.p.LogUpdateProcessorFactory [collection1]  webapp=/ipown/al path=/update params={update.distrib=FROMLEADER&distrib.from=https://127.0.0.1:45471/ipown/al/collection1/&wt=javabin&version=2}{add=[20 (1555641788684828672)]} 0 0
   [junit4]   2> 1379333 INFO  (qtp76187368-10816) [    ] o.a.s.u.p.LogUpdateProcessorFactory [collection1]  webapp=/ipown/al path=/update params={update.distrib=FROMLEADER&distrib.from=https://127.0.0.1:45471/ipown/al/collection1/&wt=javabin&version=2}{add=[20 (1555641788684828672)]} 0 0
   [junit4]   2> 1379334 INFO  (qtp1409813677-10784) [    ] o.a.s.u.p.LogUpdateProcessorFactory [collection1]  webapp=/ipown/al path=/update params={_stateVer_=collection1:9&wt=javabin&version=2}{add=[20 (1555641788684828672)]} 0 0
   [junit4]   2> 1379334 INFO  (qtp76187368-10810) [    ] o.a.s.u.p.LogUpdateProcessorFactory [collection1]  webapp=/ipown/al path=/update params={update.distrib=FROMLEADER&distrib.from=https://127.0.0.1:45471/ipown/al/collection1/&wt=javabin&version=2}{add=[21 (1555641788685877248)]} 0 0
   [junit4] 

[...truncated too long message...]

 : 127.0.0.1:42151_ipown%2Fal
   [junit4]   2> 1405894 WARN  (zkCallback-1748-thread-1) [    ] o.a.s.c.SyncStrategy Closed, skipping sync up.
   [junit4]   2> 1405895 INFO  (zkCallback-1748-thread-1) [    ] o.a.s.c.SolrCore [collection1]  CLOSING SolrCore org.apache.solr.core.SolrCore@6fa8d13c
   [junit4]   2> 1406016 INFO  (zkCallback-1748-thread-1) [    ] o.a.s.m.SolrMetricManager Closing metric reporters for: solr.core.collection1
   [junit4]   2> 1406471 WARN  (zkCallback-1748-thread-2) [    ] o.a.s.c.c.ZkStateReader ZooKeeper watch triggered, but Solr cannot talk to ZK: [KeeperErrorCode = Session expired for /live_nodes]
   [junit4]   2> 1406472 INFO  (TEST-PeerSyncReplicationTest.test-seed#[1C27B93464235B84]) [    ] o.a.s.m.SolrMetricManager Closing metric reporters for: solr.node
   [junit4]   2> 1406472 INFO  (TEST-PeerSyncReplicationTest.test-seed#[1C27B93464235B84]) [    ] o.e.j.s.AbstractConnector Stopped ServerConnector@24be8f05{SSL,[ssl, http/1.1]}{127.0.0.1:٤٢١٥١}
   [junit4]   2> 1406473 INFO  (TEST-PeerSyncReplicationTest.test-seed#[1C27B93464235B84]) [    ] o.e.j.s.h.ContextHandler Stopped o.e.j.s.ServletContextHandler@69c41eb5{/ipown/al,null,UNAVAILABLE}
   [junit4]   2> 1406473 INFO  (TEST-PeerSyncReplicationTest.test-seed#[1C27B93464235B84]) [    ] o.a.s.c.ChaosMonkey monkey: stop shard! 35991
   [junit4]   2> 1406473 INFO  (TEST-PeerSyncReplicationTest.test-seed#[1C27B93464235B84]) [    ] o.a.s.c.ZkTestServer connecting to 127.0.0.1:37638 37638
   [junit4]   2> 1406491 INFO  (Thread-2513) [    ] o.a.s.c.ZkTestServer connecting to 127.0.0.1:37638 37638
   [junit4]   2> 1406491 WARN  (Thread-2513) [    ] o.a.s.c.ZkTestServer Watch limit violations: 
   [junit4]   2> Maximum concurrent create/delete watches above limit:
   [junit4]   2> 
   [junit4]   2> 	6	/solr/aliases.json
   [junit4]   2> 	5	/solr/security.json
   [junit4]   2> 	5	/solr/configs/conf1
   [junit4]   2> 
   [junit4]   2> Maximum concurrent data watches above limit:
   [junit4]   2> 
   [junit4]   2> 	6	/solr/clusterstate.json
   [junit4]   2> 	6	/solr/clusterprops.json
   [junit4]   2> 	4	/solr/collections/collection1/state.json
   [junit4]   2> 	2	/solr/overseer_elect/election/97227610539950085-127.0.0.1:38400_ipown%2Fal-n_0000000000
   [junit4]   2> 	2	/solr/collections/collection1/leader_elect/shard1/election/97227610539950090-core_node1-n_0000000000
   [junit4]   2> 	2	/solr/overseer_elect/election/97227610539950090-127.0.0.1:45471_ipown%2Fal-n_0000000001
   [junit4]   2> 
   [junit4]   2> Maximum concurrent children watches above limit:
   [junit4]   2> 
   [junit4]   2> 	44	/solr/overseer/collection-queue-work
   [junit4]   2> 	21	/solr/overseer/queue
   [junit4]   2> 	17	/solr/overseer/queue-work
   [junit4]   2> 	6	/solr/collections
   [junit4]   2> 	5	/solr/live_nodes
   [junit4]   2> 
   [junit4]   2> NOTE: reproduce with: ant test  -Dtestcase=PeerSyncReplicationTest -Dtests.method=test -Dtests.seed=1C27B93464235B84 -Dtests.multiplier=3 -Dtests.slow=true -Dtests.locale=ar-PS -Dtests.timezone=America/Fortaleza -Dtests.asserts=true -Dtests.file.encoding=UTF-8
   [junit4] FAILURE 46.3s J1 | PeerSyncReplicationTest.test <<<
   [junit4]    > Throwable #1: java.lang.AssertionError: PeerSynced node did not become leader expected:<CloudJettyRunner [url=https://127.0.0.1:42151/ipown/al/collection1]> but was:<CloudJettyRunner [url=https://127.0.0.1:45471/ipown/al/collection1]>
   [junit4]    > 	at __randomizedtesting.SeedInfo.seed([1C27B93464235B84:947386EECADF367C]:0)
   [junit4]    > 	at org.apache.solr.cloud.PeerSyncReplicationTest.test(PeerSyncReplicationTest.java:157)
   [junit4]    > 	at java.base/jdk.internal.reflect.NativeMethodAccessorImpl.invoke0(Native Method)
   [junit4]    > 	at java.base/jdk.internal.reflect.NativeMethodAccessorImpl.invoke(NativeMethodAccessorImpl.java:62)
   [junit4]    > 	at java.base/jdk.internal.reflect.DelegatingMethodAccessorImpl.invoke(DelegatingMethodAccessorImpl.java:43)
   [junit4]    > 	at java.base/java.lang.reflect.Method.invoke(Method.java:538)
   [junit4]    > 	at org.apache.solr.BaseDistributedSearchTestCase$ShardsRepeatRule$ShardsFixedStatement.callStatement(BaseDistributedSearchTestCase.java:985)
   [junit4]    > 	at org.apache.solr.BaseDistributedSearchTestCase$ShardsRepeatRule$ShardsStatement.evaluate(BaseDistributedSearchTestCase.java:960)
   [junit4]    > 	at java.base/java.lang.Thread.run(Thread.java:844)
   [junit4]   2> 1406494 INFO  (SUITE-PeerSyncReplicationTest-seed#[1C27B93464235B84]-worker) [    ] o.a.s.SolrTestCaseJ4 ###deleteCore
   [junit4]   2> NOTE: leaving temporary files on disk at: /home/jenkins/workspace/Lucene-Solr-master-Linux/solr/build/solr-core/test/J1/temp/solr.cloud.PeerSyncReplicationTest_1C27B93464235B84-001
   [junit4]   2> Jan 05, 2017 12:20:46 AM com.carrotsearch.randomizedtesting.ThreadLeakControl checkThreadLeaks
   [junit4]   2> WARNING: Will linger awaiting termination of 1 leaked thread(s).
   [junit4]   2> NOTE: test params are: codec=Asserting(Lucene70): {other_tl1=PostingsFormat(name=Asserting), range_facet_l_dv=PostingsFormat(name=Memory), rnd_s=PostingsFormat(name=Direct), multiDefault=PostingsFormat(name=Direct), intDefault=PostingsFormat(name=Asserting), a_i1=PostingsFormat(name=Asserting), range_facet_l=PostingsFormat(name=Asserting), _version_=PostingsFormat(name=Asserting), a_t=PostingsFormat(name=Asserting), id=PostingsFormat(name=Memory), range_facet_i_dv=PostingsFormat(name=Asserting), text=PostingsFormat(name=LuceneFixedGap), timestamp=PostingsFormat(name=Asserting)}, docValues:{range_facet_l_dv=DocValuesFormat(name=Direct), range_facet_i_dv=DocValuesFormat(name=Memory), timestamp=DocValuesFormat(name=Memory)}, maxPointsInLeafNode=645, maxMBSortInHeap=6.317664110568686, sim=RandomSimilarity(queryNorm=true): {}, locale=ar-PS, timezone=America/Fortaleza
   [junit4]   2> NOTE: Linux 4.4.0-53-generic amd64/Oracle Corporation 9-ea (64-bit)/cpus=12,threads=1,free=155326728,total=518979584
   [junit4]   2> NOTE: All tests run in this JVM: [TestReqParamsAPI, TestSolrIndexConfig, TestElisionMultitermQuery, TestRequestForwarding, TestInfoStreamLogging, SimplePostToolTest, TestNumericTerms64, SegmentsInfoRequestHandlerTest, ChaosMonkeyNothingIsSafeTest, TestAuthorizationFramework, BigEndianAscendingWordSerializerTest, AnalyticsMergeStrategyTest, TestTrie, TestDFISimilarityFactory, DirectSolrConnectionTest, SampleTest, DistanceFunctionTest, OpenCloseCoreStressTest, TestExceedMaxTermLength, TestMaxScoreQueryParser, TestTestInjection, ConjunctionSolrSpellCheckerTest, TestPivotHelperCode, TestJsonFacets, ZkControllerTest, TestExactSharedStatsCache, MoreLikeThisHandlerTest, TestSchemaManager, CdcrReplicationHandlerTest, TestQueryUtils, BlockCacheTest, SchemaVersionSpecificBehaviorTest, TestTolerantUpdateProcessorRandomCloud, PeerSyncWithIndexFingerprintCachingTest, CoreAdminCreateDiscoverTest, SuggestComponentTest, TestFieldSortValues, LeaderInitiatedRecoveryOnCommitTest, EnumFieldTest, PreAnalyzedUpdateProcessorTest, CollectionReloadTest, TestConfigSetProperties, SparseHLLTest, TestUpdate, TestHashQParserPlugin, AnalysisErrorHandlingTest, TestSolrCloudWithDelegationTokens, HdfsDirectoryTest, TestFiltering, BasicFunctionalityTest, DocumentBuilderTest, DistributedExpandComponentTest, SolrMetricReporterTest, TestSchemaVersionResource, DeleteNodeTest, IndexSchemaRuntimeFieldTest, CustomCollectionTest, TestBM25SimilarityFactory, InfoHandlerTest, OpenExchangeRatesOrgProviderTest, QueryParsingTest, ReplicationFactorTest, DistribJoinFromCollectionTest, BlockJoinFacetRandomTest, TestJettySolrRunner, AddSchemaFieldsUpdateProcessorFactoryTest, ExitableDirectoryReaderTest, TestCloudPivotFacet, TestCharFilters, TestOverriddenPrefixQueryForCustomFieldType, TestSimpleTrackingShardHandler, FullHLLTest, HdfsNNFailoverTest, TestManagedResourceStorage, SolrInfoMBeanTest, ShardRoutingTest, TestSQLHandlerNonCloud, ClassificationUpdateProcessorIntegrationTest, TestPushWriter, SuggesterFSTTest, TestMiniSolrCloudClusterSSL, CachingDirectoryFactoryTest, TestSolrQueryResponse, TestSolrDynamicMBean, DistributedTermsComponentTest, JvmMetricsTest, DocValuesTest, TestReloadDeadlock, TestHashPartitioner, SolrIndexSplitterTest, LeaderElectionContextKeyTest, TestSolrQueryParserResource, TestSearchPerf, TestManagedSchema, ConvertedLegacyTest, SortByFunctionTest, DocExpirationUpdateProcessorFactoryTest, AlternateDirectoryTest, TestCursorMarkWithoutUniqueKey, HdfsChaosMonkeyNothingIsSafeTest, ConfigSetsAPITest, TestPerFieldSimilarity, TestSurroundQueryParser, TestBackupRepositoryFactory, SpatialFilterTest, AliasIntegrationTest, TestSortByMinMaxFunction, ChaosMonkeySafeLeaderTest, UnloadDistributedZkTest, CollectionsAPIDistributedZkTest, FullSolrCloudDistribCmdsTest, TestZkChroot, ShardRoutingCustomTest, TestDistributedGrouping, TermVectorComponentDistributedTest, TestJoin, TestCoreContainer, SpellCheckComponentTest, TestLazyCores, ShowFileRequestHandlerTest, CurrencyFieldOpenExchangeTest, CurrencyFieldXmlFileTest, SignatureUpdateProcessorFactoryTest, SpellCheckCollatorTest, TestFoldingMultitermQuery, SuggesterWFSTTest, WordBreakSolrSpellCheckerTest, XsltUpdateRequestHandlerTest, DisMaxRequestHandlerTest, DirectSolrSpellCheckerTest, TestOmitPositions, RequestHandlersTest, PathHierarchyTokenizerFactoryTest, LoggingHandlerTest, UpdateRequestProcessorFactoryTest, TestPHPSerializedResponseWriter, SearchHandlerTest, TestLMJelinekMercerSimilarityFactory, TimeZoneUtilsTest, TestFastOutputStream, URLClassifyProcessorTest, TestFastLRUCache, TestSystemIdResolver, RAMDirectoryFactoryTest, CircularListTest, DistributedMLTComponentTest, BaseCdcrDistributedZkTest, CdcrBootstrapTest, DistribDocExpirationUpdateProcessorTest, MigrateRouteKeyTest, MultiThreadedOCPTest, OutOfBoxZkACLAndCredentialsProvidersTest, OverriddenZkACLAndCredentialsProvidersTest, PeerSyncReplicationTest]
   [junit4] Completed [495/675 (1!)] on J1 in 46.80s, 1 test, 1 failure <<< FAILURES!

[...truncated 52126 lines...]


Mime
View raw message