lucene-dev mailing list archives

Site index · List index
Message view « Date » · « Thread »
Top « Date » · « Thread »
From Policeman Jenkins Server <jenk...@thetaphi.de>
Subject [JENKINS] Lucene-Solr-master-Linux (64bit/jdk1.8.0_112) - Build # 18668 - Still Unstable!
Date Sun, 01 Jan 2017 04:41:09 GMT
Build: https://jenkins.thetaphi.de/job/Lucene-Solr-master-Linux/18668/
Java: 64bit/jdk1.8.0_112 -XX:+UseCompressedOops -XX:+UseG1GC

1 tests failed.
FAILED:  org.apache.solr.cloud.TestSolrCloudWithDelegationTokens.testDelegationTokenCancelFail

Error Message:
expected:<200> but was:<404>

Stack Trace:
java.lang.AssertionError: expected:<200> but was:<404>
	at __randomizedtesting.SeedInfo.seed([7934B909B3FE7005:118B8C23636462E9]:0)
	at org.junit.Assert.fail(Assert.java:93)
	at org.junit.Assert.failNotEquals(Assert.java:647)
	at org.junit.Assert.assertEquals(Assert.java:128)
	at org.junit.Assert.assertEquals(Assert.java:472)
	at org.junit.Assert.assertEquals(Assert.java:456)
	at org.apache.solr.cloud.TestSolrCloudWithDelegationTokens.cancelDelegationToken(TestSolrCloudWithDelegationTokens.java:140)
	at org.apache.solr.cloud.TestSolrCloudWithDelegationTokens.testDelegationTokenCancelFail(TestSolrCloudWithDelegationTokens.java:304)
	at sun.reflect.NativeMethodAccessorImpl.invoke0(Native Method)
	at sun.reflect.NativeMethodAccessorImpl.invoke(NativeMethodAccessorImpl.java:62)
	at sun.reflect.DelegatingMethodAccessorImpl.invoke(DelegatingMethodAccessorImpl.java:43)
	at java.lang.reflect.Method.invoke(Method.java:498)
	at com.carrotsearch.randomizedtesting.RandomizedRunner.invoke(RandomizedRunner.java:1713)
	at com.carrotsearch.randomizedtesting.RandomizedRunner$8.evaluate(RandomizedRunner.java:907)
	at com.carrotsearch.randomizedtesting.RandomizedRunner$9.evaluate(RandomizedRunner.java:943)
	at com.carrotsearch.randomizedtesting.RandomizedRunner$10.evaluate(RandomizedRunner.java:957)
	at com.carrotsearch.randomizedtesting.rules.SystemPropertiesRestoreRule$1.evaluate(SystemPropertiesRestoreRule.java:57)
	at org.apache.lucene.util.TestRuleSetupTeardownChained$1.evaluate(TestRuleSetupTeardownChained.java:49)
	at org.apache.lucene.util.AbstractBeforeAfterRule$1.evaluate(AbstractBeforeAfterRule.java:45)
	at org.apache.lucene.util.TestRuleThreadAndTestName$1.evaluate(TestRuleThreadAndTestName.java:48)
	at org.apache.lucene.util.TestRuleIgnoreAfterMaxFailures$1.evaluate(TestRuleIgnoreAfterMaxFailures.java:64)
	at org.apache.lucene.util.TestRuleMarkFailure$1.evaluate(TestRuleMarkFailure.java:47)
	at com.carrotsearch.randomizedtesting.rules.StatementAdapter.evaluate(StatementAdapter.java:36)
	at com.carrotsearch.randomizedtesting.ThreadLeakControl$StatementRunner.run(ThreadLeakControl.java:367)
	at com.carrotsearch.randomizedtesting.ThreadLeakControl.forkTimeoutingTask(ThreadLeakControl.java:811)
	at com.carrotsearch.randomizedtesting.ThreadLeakControl$3.evaluate(ThreadLeakControl.java:462)
	at com.carrotsearch.randomizedtesting.RandomizedRunner.runSingleTest(RandomizedRunner.java:916)
	at com.carrotsearch.randomizedtesting.RandomizedRunner$5.evaluate(RandomizedRunner.java:802)
	at com.carrotsearch.randomizedtesting.RandomizedRunner$6.evaluate(RandomizedRunner.java:852)
	at com.carrotsearch.randomizedtesting.RandomizedRunner$7.evaluate(RandomizedRunner.java:863)
	at com.carrotsearch.randomizedtesting.rules.StatementAdapter.evaluate(StatementAdapter.java:36)
	at com.carrotsearch.randomizedtesting.rules.SystemPropertiesRestoreRule$1.evaluate(SystemPropertiesRestoreRule.java:57)
	at org.apache.lucene.util.AbstractBeforeAfterRule$1.evaluate(AbstractBeforeAfterRule.java:45)
	at com.carrotsearch.randomizedtesting.rules.StatementAdapter.evaluate(StatementAdapter.java:36)
	at org.apache.lucene.util.TestRuleStoreClassName$1.evaluate(TestRuleStoreClassName.java:41)
	at com.carrotsearch.randomizedtesting.rules.NoShadowingOrOverridesOnMethodsRule$1.evaluate(NoShadowingOrOverridesOnMethodsRule.java:40)
	at com.carrotsearch.randomizedtesting.rules.NoShadowingOrOverridesOnMethodsRule$1.evaluate(NoShadowingOrOverridesOnMethodsRule.java:40)
	at com.carrotsearch.randomizedtesting.rules.StatementAdapter.evaluate(StatementAdapter.java:36)
	at com.carrotsearch.randomizedtesting.rules.StatementAdapter.evaluate(StatementAdapter.java:36)
	at com.carrotsearch.randomizedtesting.rules.StatementAdapter.evaluate(StatementAdapter.java:36)
	at org.apache.lucene.util.TestRuleAssertionsRequired$1.evaluate(TestRuleAssertionsRequired.java:53)
	at org.apache.lucene.util.TestRuleMarkFailure$1.evaluate(TestRuleMarkFailure.java:47)
	at org.apache.lucene.util.TestRuleIgnoreAfterMaxFailures$1.evaluate(TestRuleIgnoreAfterMaxFailures.java:64)
	at org.apache.lucene.util.TestRuleIgnoreTestSuites$1.evaluate(TestRuleIgnoreTestSuites.java:54)
	at com.carrotsearch.randomizedtesting.rules.StatementAdapter.evaluate(StatementAdapter.java:36)
	at com.carrotsearch.randomizedtesting.ThreadLeakControl$StatementRunner.run(ThreadLeakControl.java:367)
	at java.lang.Thread.run(Thread.java:745)




Build Log:
[...truncated 12298 lines...]
   [junit4] Suite: org.apache.solr.cloud.TestSolrCloudWithDelegationTokens
   [junit4]   2> Creating dataDir: /home/jenkins/workspace/Lucene-Solr-master-Linux/solr/build/solr-core/test/J2/temp/solr.cloud.TestSolrCloudWithDelegationTokens_7934B909B3FE7005-001/init-core-data-001
   [junit4]   2> 1443100 INFO  (SUITE-TestSolrCloudWithDelegationTokens-seed#[7934B909B3FE7005]-worker)
[    ] o.a.s.SolrTestCaseJ4 Randomized ssl (true) and clientAuth (false) via: @org.apache.solr.util.RandomizeSSL(reason=,
value=NaN, ssl=NaN, clientAuth=NaN)
   [junit4]   2> 1443101 INFO  (SUITE-TestSolrCloudWithDelegationTokens-seed#[7934B909B3FE7005]-worker)
[    ] o.a.s.c.MiniSolrCloudCluster Starting cluster of 2 servers in /home/jenkins/workspace/Lucene-Solr-master-Linux/solr/build/solr-core/test/J2/temp/solr.cloud.TestSolrCloudWithDelegationTokens_7934B909B3FE7005-001/tempDir-001
   [junit4]   2> 1443101 INFO  (SUITE-TestSolrCloudWithDelegationTokens-seed#[7934B909B3FE7005]-worker)
[    ] o.a.s.c.ZkTestServer STARTING ZK TEST SERVER
   [junit4]   2> 1443101 INFO  (Thread-3360) [    ] o.a.s.c.ZkTestServer client port:0.0.0.0/0.0.0.0:0
   [junit4]   2> 1443101 INFO  (Thread-3360) [    ] o.a.s.c.ZkTestServer Starting server
   [junit4]   2> 1443201 INFO  (SUITE-TestSolrCloudWithDelegationTokens-seed#[7934B909B3FE7005]-worker)
[    ] o.a.s.c.ZkTestServer start zk server on port:44675
   [junit4]   2> 1443207 INFO  (jetty-launcher-2423-thread-1) [    ] o.e.j.s.Server jetty-9.3.14.v20161028
   [junit4]   2> 1443207 INFO  (jetty-launcher-2423-thread-2) [    ] o.e.j.s.Server jetty-9.3.14.v20161028
   [junit4]   2> 1443208 INFO  (jetty-launcher-2423-thread-1) [    ] o.e.j.s.h.ContextHandler
Started o.e.j.s.ServletContextHandler@1ac9014f{/solr,null,AVAILABLE}
   [junit4]   2> 1443208 INFO  (jetty-launcher-2423-thread-2) [    ] o.e.j.s.h.ContextHandler
Started o.e.j.s.ServletContextHandler@7daa2634{/solr,null,AVAILABLE}
   [junit4]   2> 1443208 INFO  (jetty-launcher-2423-thread-2) [    ] o.e.j.s.AbstractConnector
Started ServerConnector@2c8c712e{SSL,[ssl, http/1.1]}{127.0.0.1:45626}
   [junit4]   2> 1443208 INFO  (jetty-launcher-2423-thread-1) [    ] o.e.j.s.AbstractConnector
Started ServerConnector@217a7a3c{SSL,[ssl, http/1.1]}{127.0.0.1:34568}
   [junit4]   2> 1443208 INFO  (jetty-launcher-2423-thread-2) [    ] o.e.j.s.Server Started
@1444901ms
   [junit4]   2> 1443208 INFO  (jetty-launcher-2423-thread-1) [    ] o.e.j.s.Server Started
@1444901ms
   [junit4]   2> 1443208 INFO  (jetty-launcher-2423-thread-2) [    ] o.a.s.c.s.e.JettySolrRunner
Jetty properties: {hostContext=/solr, hostPort=45626}
   [junit4]   2> 1443208 INFO  (jetty-launcher-2423-thread-1) [    ] o.a.s.c.s.e.JettySolrRunner
Jetty properties: {hostContext=/solr, hostPort=34568}
   [junit4]   2> 1443209 ERROR (jetty-launcher-2423-thread-2) [    ] o.a.s.s.StartupLoggingUtils
Missing Java Option solr.log.dir. Logging may be missing or incomplete.
   [junit4]   2> 1443209 ERROR (jetty-launcher-2423-thread-1) [    ] o.a.s.s.StartupLoggingUtils
Missing Java Option solr.log.dir. Logging may be missing or incomplete.
   [junit4]   2> 1443209 INFO  (jetty-launcher-2423-thread-2) [    ] o.a.s.s.SolrDispatchFilter
 ___      _       Welcome to Apache Solr™ version 7.0.0
   [junit4]   2> 1443209 INFO  (jetty-launcher-2423-thread-1) [    ] o.a.s.s.SolrDispatchFilter
 ___      _       Welcome to Apache Solr™ version 7.0.0
   [junit4]   2> 1443209 INFO  (jetty-launcher-2423-thread-2) [    ] o.a.s.s.SolrDispatchFilter
/ __| ___| |_ _   Starting in cloud mode on port null
   [junit4]   2> 1443209 INFO  (jetty-launcher-2423-thread-1) [    ] o.a.s.s.SolrDispatchFilter
/ __| ___| |_ _   Starting in cloud mode on port null
   [junit4]   2> 1443209 INFO  (jetty-launcher-2423-thread-2) [    ] o.a.s.s.SolrDispatchFilter
\__ \/ _ \ | '_|  Install dir: null
   [junit4]   2> 1443209 INFO  (jetty-launcher-2423-thread-1) [    ] o.a.s.s.SolrDispatchFilter
\__ \/ _ \ | '_|  Install dir: null
   [junit4]   2> 1443209 INFO  (jetty-launcher-2423-thread-2) [    ] o.a.s.s.SolrDispatchFilter
|___/\___/_|_|    Start time: 2017-01-01T04:22:44.955Z
   [junit4]   2> 1443209 INFO  (jetty-launcher-2423-thread-1) [    ] o.a.s.s.SolrDispatchFilter
|___/\___/_|_|    Start time: 2017-01-01T04:22:44.955Z
   [junit4]   2> 1443211 INFO  (jetty-launcher-2423-thread-1) [    ] o.a.s.s.SolrDispatchFilter
solr.xml found in ZooKeeper. Loading...
   [junit4]   2> 1443211 INFO  (jetty-launcher-2423-thread-2) [    ] o.a.s.s.SolrDispatchFilter
solr.xml found in ZooKeeper. Loading...
   [junit4]   2> 1443217 WARN  (NIOServerCxn.Factory:0.0.0.0/0.0.0.0:0) [    ] o.a.z.s.NIOServerCnxn
caught end of stream exception
   [junit4]   2> EndOfStreamException: Unable to read additional data from client sessionid
0x1595843f1700002, likely client has closed socket
   [junit4]   2> 	at org.apache.zookeeper.server.NIOServerCnxn.doIO(NIOServerCnxn.java:228)
   [junit4]   2> 	at org.apache.zookeeper.server.NIOServerCnxnFactory.run(NIOServerCnxnFactory.java:208)
   [junit4]   2> 	at java.lang.Thread.run(Thread.java:745)
   [junit4]   2> 1443219 INFO  (jetty-launcher-2423-thread-2) [    ] o.a.s.c.ZkContainer
Zookeeper client=127.0.0.1:44675/solr
   [junit4]   2> 1443219 INFO  (jetty-launcher-2423-thread-1) [    ] o.a.s.c.ZkContainer
Zookeeper client=127.0.0.1:44675/solr
   [junit4]   2> 1443228 INFO  (jetty-launcher-2423-thread-1) [n:127.0.0.1:34568_solr 
  ] o.a.s.c.OverseerElectionContext I am going to be the leader 127.0.0.1:34568_solr
   [junit4]   2> 1443228 INFO  (jetty-launcher-2423-thread-2) [n:127.0.0.1:45626_solr 
  ] o.a.s.c.ZkController Register node as live in ZooKeeper:/live_nodes/127.0.0.1:45626_solr
   [junit4]   2> 1443228 INFO  (jetty-launcher-2423-thread-1) [n:127.0.0.1:34568_solr 
  ] o.a.s.c.Overseer Overseer (id=97205915801878533-127.0.0.1:34568_solr-n_0000000000) starting
   [junit4]   2> 1443228 INFO  (zkCallback-2434-thread-1-processing-n:127.0.0.1:45626_solr)
[n:127.0.0.1:45626_solr    ] o.a.s.c.c.ZkStateReader Updated live nodes from ZooKeeper...
(0) -> (1)
   [junit4]   2> 1443228 INFO  (zkCallback-2433-thread-1-processing-n:127.0.0.1:34568_solr)
[n:127.0.0.1:34568_solr    ] o.a.s.c.c.ZkStateReader Updated live nodes from ZooKeeper...
(0) -> (1)
   [junit4]   2> 1443231 INFO  (jetty-launcher-2423-thread-1) [n:127.0.0.1:34568_solr 
  ] o.a.s.c.ZkController Register node as live in ZooKeeper:/live_nodes/127.0.0.1:34568_solr
   [junit4]   2> 1443231 INFO  (zkCallback-2433-thread-1-processing-n:127.0.0.1:34568_solr)
[n:127.0.0.1:34568_solr    ] o.a.s.c.c.ZkStateReader Updated live nodes from ZooKeeper...
(1) -> (2)
   [junit4]   2> 1443231 INFO  (zkCallback-2434-thread-1-processing-n:127.0.0.1:45626_solr)
[n:127.0.0.1:45626_solr    ] o.a.s.c.c.ZkStateReader Updated live nodes from ZooKeeper...
(1) -> (2)
   [junit4]   2> 1443287 INFO  (jetty-launcher-2423-thread-1) [n:127.0.0.1:34568_solr 
  ] o.a.s.c.CoreContainer Initializing authentication plugin: org.apache.solr.security.HttpParamDelegationTokenPlugin
   [junit4]   2> 1443288 INFO  (jetty-launcher-2423-thread-1) [n:127.0.0.1:34568_solr 
  ] o.a.s.s.KerberosPlugin Params: {token.valid=30, delegation-token.token-kind=solr-dt, cookie.domain=127.0.0.1,
cookie.path=/, zk-dt-secret-manager.znodeWorkingPath=solr/security/zkdtsm, token.validity=36000,
signer.secret.provider.zookeeper.path=/token, type=kerberos, zk-dt-secret-manager.enable=true,
kerberos.name.rules=DEFAULT, signer.secret.provider=zookeeper}
   [junit4]   2> 1443288 INFO  (jetty-launcher-2423-thread-1) [n:127.0.0.1:34568_solr 
  ] o.a.c.f.i.CuratorFrameworkImpl Starting
   [junit4]   2> 1443290 INFO  (jetty-launcher-2423-thread-1-EventThread) [n:127.0.0.1:34568_solr
   ] o.a.c.f.s.ConnectionStateManager State change: CONNECTED
   [junit4]   2> 1443298 INFO  (jetty-launcher-2423-thread-1) [n:127.0.0.1:34568_solr 
  ] o.a.s.c.CorePropertiesLocator Found 0 core definitions underneath /home/jenkins/workspace/Lucene-Solr-master-Linux/solr/build/solr-core/test/J2/temp/solr.cloud.TestSolrCloudWithDelegationTokens_7934B909B3FE7005-001/tempDir-001/node1/.
   [junit4]   2> 1443300 INFO  (jetty-launcher-2423-thread-2) [n:127.0.0.1:45626_solr 
  ] o.a.s.c.CoreContainer Initializing authentication plugin: org.apache.solr.security.HttpParamDelegationTokenPlugin
   [junit4]   2> 1443301 INFO  (jetty-launcher-2423-thread-2) [n:127.0.0.1:45626_solr 
  ] o.a.s.s.KerberosPlugin Params: {token.valid=30, delegation-token.token-kind=solr-dt, cookie.domain=127.0.0.1,
cookie.path=/, zk-dt-secret-manager.znodeWorkingPath=solr/security/zkdtsm, token.validity=36000,
signer.secret.provider.zookeeper.path=/token, type=kerberos, zk-dt-secret-manager.enable=true,
kerberos.name.rules=DEFAULT, signer.secret.provider=zookeeper}
   [junit4]   2> 1443301 INFO  (jetty-launcher-2423-thread-2) [n:127.0.0.1:45626_solr 
  ] o.a.c.f.i.CuratorFrameworkImpl Starting
   [junit4]   2> 1443302 INFO  (jetty-launcher-2423-thread-2-EventThread) [n:127.0.0.1:45626_solr
   ] o.a.c.f.s.ConnectionStateManager State change: CONNECTED
   [junit4]   2> 1443309 INFO  (jetty-launcher-2423-thread-2) [n:127.0.0.1:45626_solr 
  ] o.a.s.c.CorePropertiesLocator Found 0 core definitions underneath /home/jenkins/workspace/Lucene-Solr-master-Linux/solr/build/solr-core/test/J2/temp/solr.cloud.TestSolrCloudWithDelegationTokens_7934B909B3FE7005-001/tempDir-001/node2/.
   [junit4]   2> 1444138 INFO  (TEST-TestSolrCloudWithDelegationTokens.testDelegationOtherOp-seed#[7934B909B3FE7005])
[    ] o.a.s.SolrTestCaseJ4 ###Starting testDelegationOtherOp
   [junit4]   2> 1444141 INFO  (TEST-TestSolrCloudWithDelegationTokens.testDelegationOtherOp-seed#[7934B909B3FE7005])
[    ] o.a.s.c.c.ZkStateReader Updated live nodes from ZooKeeper... (0) -> (2)
   [junit4]   2> 1444141 INFO  (TEST-TestSolrCloudWithDelegationTokens.testDelegationOtherOp-seed#[7934B909B3FE7005])
[    ] o.a.s.c.s.i.ZkClientClusterStateProvider Cluster at 127.0.0.1:44675/solr ready
   [junit4]   2> 1444162 INFO  (qtp1442066130-13466) [n:127.0.0.1:34568_solr    ] o.a.s.h.a.CollectionsHandler
Invoked Collection Action :list with params op=someSolrOperation&action=LIST&wt=javabin&version=2
and sendToOCPQueue=true
   [junit4]   2> 1444162 INFO  (qtp1442066130-13466) [n:127.0.0.1:34568_solr    ] o.a.s.s.HttpSolrCall
[admin] webapp=null path=/admin/collections params={op=someSolrOperation&action=LIST&wt=javabin&version=2}
status=0 QTime=0
   [junit4]   2> 1444166 INFO  (TEST-TestSolrCloudWithDelegationTokens.testDelegationOtherOp-seed#[7934B909B3FE7005])
[    ] o.a.s.SolrTestCaseJ4 ###Ending testDelegationOtherOp
   [junit4]   2> 1444178 INFO  (TEST-TestSolrCloudWithDelegationTokens.testDelegationTokenCancelFail-seed#[7934B909B3FE7005])
[    ] o.a.s.SolrTestCaseJ4 ###Starting testDelegationTokenCancelFail
   [junit4]   2> 1444227 ERROR (qtp2094702188-13467) [    ] o.a.h.s.t.d.ZKDelegationTokenSecretManager
No node in path [/ZKDTSMTokensRoot/DT_1]
   [junit4]   2> 1444228 ERROR (qtp1442066130-13466) [n:127.0.0.1:34568_solr    ] o.a.h.s.t.d.ZKDelegationTokenSecretManager
No node in path [/ZKDTSMTokensRoot/DT_1]
   [junit4]   2> 1444237 ERROR (qtp2094702188-13463) [    ] o.a.h.s.t.d.ZKDelegationTokenSecretManager
No node in path [/ZKDTSMTokensRoot/DT_2]
   [junit4]   2> 1444238 INFO  (TEST-TestSolrCloudWithDelegationTokens.testDelegationTokenCancelFail-seed#[7934B909B3FE7005])
[    ] o.a.s.SolrTestCaseJ4 ###Ending testDelegationTokenCancelFail
   [junit4]   2> NOTE: reproduce with: ant test  -Dtestcase=TestSolrCloudWithDelegationTokens
-Dtests.method=testDelegationTokenCancelFail -Dtests.seed=7934B909B3FE7005 -Dtests.multiplier=3
-Dtests.slow=true -Dtests.locale=el -Dtests.timezone=Europe/London -Dtests.asserts=true -Dtests.file.encoding=UTF-8
   [junit4] FAILURE 0.08s J2 | TestSolrCloudWithDelegationTokens.testDelegationTokenCancelFail
<<<
   [junit4]    > Throwable #1: java.lang.AssertionError: expected:<200> but was:<404>
   [junit4]    > 	at __randomizedtesting.SeedInfo.seed([7934B909B3FE7005:118B8C23636462E9]:0)
   [junit4]    > 	at org.apache.solr.cloud.TestSolrCloudWithDelegationTokens.cancelDelegationToken(TestSolrCloudWithDelegationTokens.java:140)
   [junit4]    > 	at org.apache.solr.cloud.TestSolrCloudWithDelegationTokens.testDelegationTokenCancelFail(TestSolrCloudWithDelegationTokens.java:304)
   [junit4]    > 	at java.lang.Thread.run(Thread.java:745)
   [junit4]   2> 1444259 INFO  (TEST-TestSolrCloudWithDelegationTokens.testDelegationTokenVerify-seed#[7934B909B3FE7005])
[    ] o.a.s.SolrTestCaseJ4 ###Starting testDelegationTokenVerify
   [junit4]   2> 1444265 INFO  (TEST-TestSolrCloudWithDelegationTokens.testDelegationTokenVerify-seed#[7934B909B3FE7005])
[    ] o.a.s.c.c.ZkStateReader Updated live nodes from ZooKeeper... (0) -> (2)
   [junit4]   2> 1444267 INFO  (TEST-TestSolrCloudWithDelegationTokens.testDelegationTokenVerify-seed#[7934B909B3FE7005])
[    ] o.a.s.c.s.i.ZkClientClusterStateProvider Cluster at 127.0.0.1:44675/solr ready
   [junit4]   2> 1444269 INFO  (qtp1442066130-13454) [n:127.0.0.1:34568_solr    ] o.a.s.h.a.CollectionsHandler
Invoked Collection Action :list with params action=LIST&delegation=GgADYmFyA2JhcgCKAVlYQ_X1igFZfFB59QMCFHdxPf5Q--2sYOuHBpmn68D7mJN6B3NvbHItZHQA&wt=javabin&version=2
and sendToOCPQueue=true
   [junit4]   2> 1444269 INFO  (qtp1442066130-13454) [n:127.0.0.1:34568_solr    ] o.a.s.s.HttpSolrCall
[admin] webapp=null path=/admin/collections params={action=LIST&delegation=GgADYmFyA2JhcgCKAVlYQ_X1igFZfFB59QMCFHdxPf5Q--2sYOuHBpmn68D7mJN6B3NvbHItZHQA&wt=javabin&version=2}
status=0 QTime=0
   [junit4]   2> 1444273 INFO  (TEST-TestSolrCloudWithDelegationTokens.testDelegationTokenVerify-seed#[7934B909B3FE7005])
[    ] o.a.s.c.c.ZkStateReader Updated live nodes from ZooKeeper... (0) -> (2)
   [junit4]   2> 1444273 INFO  (TEST-TestSolrCloudWithDelegationTokens.testDelegationTokenVerify-seed#[7934B909B3FE7005])
[    ] o.a.s.c.s.i.ZkClientClusterStateProvider Cluster at 127.0.0.1:44675/solr ready
   [junit4]   2> 1444280 INFO  (qtp2094702188-13463) [n:127.0.0.1:45626_solr    ] o.a.s.h.a.CollectionsHandler
Invoked Collection Action :list with params action=LIST&delegation=GgADYmFyA2JhcgCKAVlYQ_X1igFZfFB59QMCFHdxPf5Q--2sYOuHBpmn68D7mJN6B3NvbHItZHQA&wt=javabin&version=2
and sendToOCPQueue=true
   [junit4]   2> 1444280 INFO  (qtp2094702188-13463) [n:127.0.0.1:45626_solr    ] o.a.s.s.HttpSolrCall
[admin] webapp=null path=/admin/collections params={action=LIST&delegation=GgADYmFyA2JhcgCKAVlYQ_X1igFZfFB59QMCFHdxPf5Q--2sYOuHBpmn68D7mJN6B3NvbHItZHQA&wt=javabin&version=2}
status=0 QTime=0
   [junit4]   2> 1444283 INFO  (TEST-TestSolrCloudWithDelegationTokens.testDelegationTokenVerify-seed#[7934B909B3FE7005])
[    ] o.a.s.c.c.ZkStateReader Updated live nodes from ZooKeeper... (0) -> (2)
   [junit4]   2> 1444284 INFO  (TEST-TestSolrCloudWithDelegationTokens.testDelegationTokenVerify-seed#[7934B909B3FE7005])
[    ] o.a.s.c.s.i.ZkClientClusterStateProvider Cluster at 127.0.0.1:44675/solr ready
   [junit4]   2> 1444286 INFO  (TEST-TestSolrCloudWithDelegationTokens.testDelegationTokenVerify-seed#[7934B909B3FE7005])
[    ] o.a.s.SolrTestCaseJ4 ###Ending testDelegationTokenVerify
   [junit4]   2> 1444298 INFO  (TEST-TestSolrCloudWithDelegationTokens.testDelegationTokenRenew-seed#[7934B909B3FE7005])
[    ] o.a.s.SolrTestCaseJ4 ###Starting testDelegationTokenRenew
   [junit4]   2> 1444322 INFO  (TEST-TestSolrCloudWithDelegationTokens.testDelegationTokenRenew-seed#[7934B909B3FE7005])
[    ] o.a.s.c.c.ZkStateReader Updated live nodes from ZooKeeper... (0) -> (2)
   [junit4]   2> 1444322 INFO  (TEST-TestSolrCloudWithDelegationTokens.testDelegationTokenRenew-seed#[7934B909B3FE7005])
[    ] o.a.s.c.s.i.ZkClientClusterStateProvider Cluster at 127.0.0.1:44675/solr ready
   [junit4]   2> 1444324 INFO  (qtp1442066130-13466) [n:127.0.0.1:34568_solr    ] o.a.s.h.a.CollectionsHandler
Invoked Collection Action :list with params action=LIST&delegation=GgADYmFyA2JhcgCKAVlYQ_YdigFZfFB6HQQCFIGGEDmGpcrsJRxCqFusOp_xvY1jB3NvbHItZHQA&wt=javabin&version=2
and sendToOCPQueue=true
   [junit4]   2> 1444324 INFO  (qtp1442066130-13466) [n:127.0.0.1:34568_solr    ] o.a.s.s.HttpSolrCall
[admin] webapp=null path=/admin/collections params={action=LIST&delegation=GgADYmFyA2JhcgCKAVlYQ_YdigFZfFB6HQQCFIGGEDmGpcrsJRxCqFusOp_xvY1jB3NvbHItZHQA&wt=javabin&version=2}
status=0 QTime=0
   [junit4]   2> 1444328 INFO  (TEST-TestSolrCloudWithDelegationTokens.testDelegationTokenRenew-seed#[7934B909B3FE7005])
[    ] o.a.s.c.c.ZkStateReader Updated live nodes from ZooKeeper... (0) -> (2)
   [junit4]   2> 1444329 INFO  (TEST-TestSolrCloudWithDelegationTokens.testDelegationTokenRenew-seed#[7934B909B3FE7005])
[    ] o.a.s.c.s.i.ZkClientClusterStateProvider Cluster at 127.0.0.1:44675/solr ready
   [junit4]   2> 1444333 INFO  (TEST-TestSolrCloudWithDelegationTokens.testDelegationTokenRenew-seed#[7934B909B3FE7005])
[    ] o.a.s.c.c.ZkStateReader Updated live nodes from ZooKeeper... (0) -> (2)
   [junit4]   2> 1444334 INFO  (TEST-TestSolrCloudWithDelegationTokens.testDelegationTokenRenew-seed#[7934B909B3FE7005])
[    ] o.a.s.c.s.i.ZkClientClusterStateProvider Cluster at 127.0.0.1:44675/solr ready
   [junit4]   2> 1444336 INFO  (qtp1442066130-13456) [n:127.0.0.1:34568_solr    ] o.a.s.h.a.CollectionsHandler
Invoked Collection Action :list with params action=LIST&delegation=GgADYmFyA2JhcgCKAVlYQ_YdigFZfFB6HQQCFIGGEDmGpcrsJRxCqFusOp_xvY1jB3NvbHItZHQA&wt=javabin&version=2
and sendToOCPQueue=true
   [junit4]   2> 1444336 INFO  (qtp1442066130-13456) [n:127.0.0.1:34568_solr    ] o.a.s.s.HttpSolrCall
[admin] webapp=null path=/admin/collections params={action=LIST&delegation=GgADYmFyA2JhcgCKAVlYQ_YdigFZfFB6HQQCFIGGEDmGpcrsJRxCqFusOp_xvY1jB3NvbHItZHQA&wt=javabin&version=2}
status=0 QTime=0
   [junit4]   2> 1444339 INFO  (TEST-TestSolrCloudWithDelegationTokens.testDelegationTokenRenew-seed#[7934B909B3FE7005])
[    ] o.a.s.c.c.ZkStateReader Updated live nodes from ZooKeeper... (0) -> (2)
   [junit4]   2> 1444340 INFO  (TEST-TestSolrCloudWithDelegationTokens.testDelegationTokenRenew-seed#[7934B909B3FE7005])
[    ] o.a.s.c.s.i.ZkClientClusterStateProvider Cluster at 127.0.0.1:44675/solr ready
   [junit4]   2> 1444354 INFO  (TEST-TestSolrCloudWithDelegationTokens.testDelegationTokenRenew-seed#[7934B909B3FE7005])
[    ] o.a.s.c.c.ZkStateReader Updated live nodes from ZooKeeper... (0) -> (2)
   [junit4]   2> 1444354 INFO  (TEST-TestSolrCloudWithDelegationTokens.testDelegationTokenRenew-seed#[7934B909B3FE7005])
[    ] o.a.s.c.s.i.ZkClientClusterStateProvider Cluster at 127.0.0.1:44675/solr ready
   [junit4]   2> 1444357 INFO  (qtp1442066130-13454) [n:127.0.0.1:34568_solr    ] o.a.s.h.a.CollectionsHandler
Invoked Collection Action :list with params action=LIST&delegation=GgADYmFyA2JhcgCKAVlYQ_ZIigFZfFB6SAUCFCnJLUxqqCGKGk9DCRZycadap9-HB3NvbHItZHQA&wt=javabin&version=2
and sendToOCPQueue=true
   [junit4]   2> 1444357 INFO  (qtp1442066130-13454) [n:127.0.0.1:34568_solr    ] o.a.s.s.HttpSolrCall
[admin] webapp=null path=/admin/collections params={action=LIST&delegation=GgADYmFyA2JhcgCKAVlYQ_ZIigFZfFB6SAUCFCnJLUxqqCGKGk9DCRZycadap9-HB3NvbHItZHQA&wt=javabin&version=2}
status=0 QTime=0
   [junit4]   2> 1444360 INFO  (TEST-TestSolrCloudWithDelegationTokens.testDelegationTokenRenew-seed#[7934B909B3FE7005])
[    ] o.a.s.c.c.ZkStateReader Updated live nodes from ZooKeeper... (0) -> (2)
   [junit4]   2> 1444361 INFO  (TEST-TestSolrCloudWithDelegationTokens.testDelegationTokenRenew-seed#[7934B909B3FE7005])
[    ] o.a.s.c.s.i.ZkClientClusterStateProvider Cluster at 127.0.0.1:44675/solr ready
   [junit4]   2> 1444366 INFO  (TEST-TestSolrCloudWithDelegationTokens.testDelegationTokenRenew-seed#[7934B909B3FE7005])
[    ] o.a.s.c.c.ZkStateReader Updated live nodes from ZooKeeper... (0) -> (2)
   [junit4]   2> 1444367 INFO  (TEST-TestSolrCloudWithDelegationTokens.testDelegationTokenRenew-seed#[7934B909B3FE7005])
[    ] o.a.s.c.s.i.ZkClientClusterStateProvider Cluster at 127.0.0.1:44675/solr ready
   [junit4]   2> 1444369 INFO  (qtp1442066130-13462) [n:127.0.0.1:34568_solr    ] o.a.s.h.a.CollectionsHandler
Invoked Collection Action :list with params action=LIST&delegation=GgADYmFyA2JhcgCKAVlYQ_ZIigFZfFB6SAUCFCnJLUxqqCGKGk9DCRZycadap9-HB3NvbHItZHQA&wt=javabin&version=2
and sendToOCPQueue=true
   [junit4]   2> 1444369 INFO  (qtp1442066130-13462) [n:127.0.0.1:34568_solr    ] o.a.s.s.HttpSolrCall
[admin] webapp=null path=/admin/collections params={action=LIST&delegation=GgADYmFyA2JhcgCKAVlYQ_ZIigFZfFB6SAUCFCnJLUxqqCGKGk9DCRZycadap9-HB3NvbHItZHQA&wt=javabin&version=2}
status=0 QTime=0
   [junit4]   2> 1444371 INFO  (TEST-TestSolrCloudWithDelegationTokens.testDelegationTokenRenew-seed#[7934B909B3FE7005])
[    ] o.a.s.c.c.ZkStateReader Updated live nodes from ZooKeeper... (0) -> (2)
   [junit4]   2> 1444372 INFO  (TEST-TestSolrCloudWithDelegationTokens.testDelegationTokenRenew-seed#[7934B909B3FE7005])
[    ] o.a.s.c.s.i.ZkClientClusterStateProvider Cluster at 127.0.0.1:44675/solr ready
   [junit4]   2> 1444384 INFO  (qtp1442066130-13464) [n:127.0.0.1:34568_solr    ] o.a.s.h.a.CollectionsHandler
Invoked Collection Action :list with params action=LIST&delegation=GgADYmFyA2JhcgCKAVlYQ_ZqigFZfFB6agYCFMEEGP6iA5q7Px5m5UffWtjEJ5PIB3NvbHItZHQA&wt=javabin&version=2
and sendToOCPQueue=true
   [junit4]   2> 1444384 INFO  (qtp1442066130-13464) [n:127.0.0.1:34568_solr    ] o.a.s.s.HttpSolrCall
[admin] webapp=null path=/admin/collections params={action=LIST&delegation=GgADYmFyA2JhcgCKAVlYQ_ZqigFZfFB6agYCFMEEGP6iA5q7Px5m5UffWtjEJ5PIB3NvbHItZHQA&wt=javabin&version=2}
status=0 QTime=0
   [junit4]   2> 1444388 INFO  (TEST-TestSolrCloudWithDelegationTokens.testDelegationTokenRenew-seed#[7934B909B3FE7005])
[    ] o.a.s.c.c.ZkStateReader Updated live nodes from ZooKeeper... (0) -> (2)
   [junit4]   2> 1444388 INFO  (TEST-TestSolrCloudWithDelegationTokens.testDelegationTokenRenew-seed#[7934B909B3FE7005])
[    ] o.a.s.c.s.i.ZkClientClusterStateProvider Cluster at 127.0.0.1:44675/solr ready
   [junit4]   2> 1444393 INFO  (qtp2094702188-13465) [n:127.0.0.1:45626_solr    ] o.a.s.h.a.CollectionsHandler
Invoked Collection Action :list with params action=LIST&delegation=GgADYmFyA2JhcgCKAVlYQ_ZqigFZfFB6agYCFMEEGP6iA5q7Px5m5UffWtjEJ5PIB3NvbHItZHQA&wt=javabin&version=2
and sendToOCPQueue=true
   [junit4]   2> 1444394 INFO  (qtp2094702188-13465) [n:127.0.0.1:45626_solr    ] o.a.s.s.HttpSolrCall
[admin] webapp=null path=/admin/collections params={action=LIST&delegation=GgADYmFyA2JhcgCKAVlYQ_ZqigFZfFB6agYCFMEEGP6iA5q7Px5m5UffWtjEJ5PIB3NvbHItZHQA&wt=javabin&version=2}
status=0 QTime=0
   [junit4]   2> 1444396 INFO  (TEST-TestSolrCloudWithDelegationTokens.testDelegationTokenRenew-seed#[7934B909B3FE7005])
[    ] o.a.s.c.c.ZkStateReader Updated live nodes from ZooKeeper... (0) -> (2)
   [junit4]   2> 1444396 INFO  (TEST-TestSolrCloudWithDelegationTokens.testDelegationTokenRenew-seed#[7934B909B3FE7005])
[    ] o.a.s.c.s.i.ZkClientClusterStateProvider Cluster at 127.0.0.1:44675/solr ready
   [junit4]   2> 1444408 INFO  (TEST-TestSolrCloudWithDelegationTokens.testDelegationTokenRenew-seed#[7934B909B3FE7005])
[    ] o.a.s.c.c.ZkStateReader Updated live nodes from ZooKeeper... (0) -> (2)
   [junit4]   2> 1444409 INFO  (TEST-TestSolrCloudWithDelegationTokens.testDelegationTokenRenew-seed#[7934B909B3FE7005])
[    ] o.a.s.c.s.i.ZkClientClusterStateProvider Cluster at 127.0.0.1:44675/solr ready
   [junit4]   2> 1444412 INFO  (qtp1442066130-13576) [n:127.0.0.1:34568_solr    ] o.a.s.h.a.CollectionsHandler
Invoked Collection Action :list with params action=LIST&delegation=GgADYmFyA2JhcgCKAVlYQ_aCigFZfFB6ggcCFNImfpvT1UURNLKhHbf-s_b6vZPVB3NvbHItZHQA&wt=javabin&version=2
and sendToOCPQueue=true
   [junit4]   2> 1444412 INFO  (qtp1442066130-13576) [n:127.0.0.1:34568_solr    ] o.a.s.s.HttpSolrCall
[admin] webapp=null path=/admin/collections params={action=LIST&delegation=GgADYmFyA2JhcgCKAVlYQ_aCigFZfFB6ggcCFNImfpvT1UURNLKhHbf-s_b6vZPVB3NvbHItZHQA&wt=javabin&version=2}
status=0 QTime=0
   [junit4]   2> 1444418 INFO  (qtp2094702188-13467) [n:127.0.0.1:45626_solr    ] o.a.s.h.a.CollectionsHandler
Invoked Collection Action :list with params action=LIST&delegation=GgADYmFyA2JhcgCKAVlYQ_aCigFZfFB6ggcCFNImfpvT1UURNLKhHbf-s_b6vZPVB3NvbHItZHQA&wt=javabin&version=2
and sendToOCPQueue=true
   [junit4]   2> 1444418 INFO  (qtp2094702188-13467) [n:127.0.0.1:45626_solr    ] o.a.s.s.HttpSolrCall
[admin] webapp=null path=/admin/collections params={action=LIST&delegation=GgADYmFyA2JhcgCKAVlYQ_aCigFZfFB6ggcCFNImfpvT1UURNLKhHbf-s_b6vZPVB3NvbHItZHQA&wt=javabin&version=2}
status=0 QTime=0
   [junit4]   2> 1444420 INFO  (TEST-TestSolrCloudWithDelegationTokens.testDelegationTokenRenew-seed#[7934B909B3FE7005])
[    ] o.a.s.SolrTestCaseJ4 ###Ending testDelegationTokenRenew
   [junit4]   2> 1444437 INFO  (TEST-TestSolrCloudWithDelegationTokens.testZNodePaths-seed#[7934B909B3FE7005])
[    ] o.a.s.SolrTestCaseJ4 ###Starting testZNodePaths
   [junit4]   2> 1444441 INFO  (TEST-TestSolrCloudWithDelegationTokens.testZNodePaths-seed#[7934B909B3FE7005])
[    ] o.a.s.SolrTestCaseJ4 ###Ending testZNodePaths
   [junit4]   2> 1444460 INFO  (TEST-TestSolrCloudWithDelegationTokens.testDelegationTokenSolrClient-seed#[7934B909B3FE7005])
[    ] o.a.s.SolrTestCaseJ4 ###Starting testDelegationTokenSolrClient
   [junit4]   2> 1444468 INFO  (qtp1442066130-13456) [n:127.0.0.1:34568_solr    ] o.a.s.h.a.CollectionsHandler
Invoked Collection Action :list with params action=LIST&delegation=GgADYmFyA2JhcgCKAVlYQ_a_igFZfFB6vwkCFHQIVztOxhK8M1R3joRR70rk6iSuB3NvbHItZHQA&wt=javabin&version=2
and sendToOCPQueue=true
   [junit4]   2> 1444468 INFO  (qtp1442066130-13456) [n:127.0.0.1:34568_solr    ] o.a.s.s.HttpSolrCall
[admin] webapp=null path=/admin/collections params={action=LIST&delegation=GgADYmFyA2JhcgCKAVlYQ_a_igFZfFB6vwkCFHQIVztOxhK8M1R3joRR70rk6iSuB3NvbHItZHQA&wt=javabin&version=2}
status=0 QTime=0
   [junit4]   2> 1444469 INFO  (TEST-TestSolrCloudWithDelegationTokens.testDelegationTokenSolrClient-seed#[7934B909B3FE7005])
[    ] o.a.s.SolrTestCaseJ4 ###Ending testDelegationTokenSolrClient
   [junit4]   2> 1444486 INFO  (TEST-TestSolrCloudWithDelegationTokens.testDelegationTokenCancel-seed#[7934B909B3FE7005])
[    ] o.a.s.SolrTestCaseJ4 ###Starting testDelegationTokenCancel
   [junit4]   2> 1444495 ERROR (qtp1442066130-13462) [n:127.0.0.1:34568_solr    ] o.a.h.s.t.d.ZKDelegationTokenSecretManager
No node in path [/ZKDTSMTokensRoot/DT_10]
   [junit4]   2> 1444501 INFO  (TEST-TestSolrCloudWithDelegationTokens.testDelegationTokenCancel-seed#[7934B909B3FE7005])
[    ] o.a.s.c.c.ZkStateReader Updated live nodes from ZooKeeper... (0) -> (2)
   [junit4]   2> 1444501 INFO  (TEST-TestSolrCloudWithDelegationTokens.testDelegationTokenCancel-seed#[7934B909B3FE7005])
[    ] o.a.s.c.s.i.ZkClientClusterStateProvider Cluster at 127.0.0.1:44675/solr ready
   [junit4]   2> 1444508 INFO  (TEST-TestSolrCloudWithDelegationTokens.testDelegationTokenCancel-seed#[7934B909B3FE7005])
[    ] o.a.s.c.c.ZkStateReader Updated live nodes from ZooKeeper... (0) -> (2)
   [junit4]   2> 1444509 INFO  (TEST-TestSolrCloudWithDelegationTokens.testDelegationTokenCancel-seed#[7934B909B3FE7005])
[    ] o.a.s.c.s.i.ZkClientClusterStateProvider Cluster at 127.0.0.1:44675/solr ready
   [junit4]   2> 1444522 ERROR (qtp2094702188-13465) [n:127.0.0.1:45626_solr    ] o.a.h.s.t.d.ZKDelegationTokenSecretManager
No node in path [/ZKDTSMTokensRoot/DT_11]
   [junit4]   2> 1444526 INFO  (TEST-TestSolrCloudWithDelegationTokens.testDelegationTokenCancel-seed#[7934B909B3FE7005])
[    ] o.a.s.c.c.ZkStateReader Updated live nodes from ZooKeeper... (0) -> (2)
   [junit4]   2> 1444527 INFO  (TEST-TestSolrCloudWithDelegationTokens.testDelegationTokenCancel-seed#[7934B909B3FE7005])
[    ] o.a.s.c.s.i.ZkClientClusterStateProvider Cluster at 127.0.0.1:44675/solr ready
   [junit4]   2> 1444533 INFO  (TEST-TestSolrCloudWithDelegationTokens.testDelegationTokenCancel-seed#[7934B909B3FE7005])
[    ] o.a.s.c.c.ZkStateReader Updated live nodes from ZooKeeper... (0) -> (2)
   [junit4]   2> 1444534 INFO  (TEST-TestSolrCloudWithDelegationTokens.testDelegationTokenCancel-seed#[7934B909B3FE7005])
[    ] o.a.s.c.s.i.ZkClientClusterStateProvider Cluster at 127.0.0.1:44675/solr ready
   [junit4]   2> 1444538 INFO  (TEST-TestSolrCloudWithDelegationTokens.testDelegationTokenCancel-seed#[7934B909B3FE7005])
[    ] o.a.s.SolrTestCaseJ4 ###Ending testDelegationTokenCancel
   [junit4]   2> 1444560 INFO  (TEST-TestSolrCloudWithDelegationTokens.testDelegationTokenRenewFail-seed#[7934B909B3FE7005])
[    ] o.a.s.SolrTestCaseJ4 ###Starting testDelegationTokenRenewFail
   [junit4]   2> 1444563 WARN  (qtp1442066130-13576) [n:127.0.0.1:34568_solr    ] o.a.h.s.a.s.AuthenticationFilter
Authentication exception: org.apache.hadoop.security.AccessControlException: foo tries to
renew a token with renewer bar
   [junit4]   2> 1444564 WARN  (qtp1442066130-13576) [n:127.0.0.1:34568_solr    ] o.a.s.s.KerberosPlugin
Could not find org.apache.solr.security.authentication.requestcontinues
   [junit4]   2> 1444564 WARN  (qtp2094702188-13467) [n:127.0.0.1:45626_solr    ] o.a.h.s.a.s.AuthenticationFilter
Authentication exception: org.apache.hadoop.security.AccessControlException: foo tries to
renew a token with renewer bar
   [junit4]   2> 1444565 WARN  (qtp2094702188-13467) [n:127.0.0.1:45626_solr    ] o.a.s.s.KerberosPlugin
Could not find org.apache.solr.security.authentication.requestcontinues
   [junit4]   2> 1444570 WARN  (qtp1442066130-13456) [n:127.0.0.1:34568_solr    ] o.a.h.s.a.s.AuthenticationFilter
Authentication exception: org.apache.hadoop.security.AccessControlException: notRenewUser
tries to renew a token with renewer renewUser
   [junit4]   2> 1444570 WARN  (qtp1442066130-13456) [n:127.0.0.1:34568_solr    ] o.a.s.s.KerberosPlugin
Could not find org.apache.solr.security.authentication.requestcontinues
   [junit4]   2> 1444571 WARN  (qtp2094702188-13457) [    ] o.a.h.s.a.s.AuthenticationFilter
Authentication exception: org.apache.hadoop.security.AccessControlException: notRenewUser
tries to renew a token with renewer renewUser
   [junit4]   2> 1444571 WARN  (qtp2094702188-13457) [    ] o.a.s.s.KerberosPlugin Could
not find org.apache.solr.security.authentication.requestcontinues
   [junit4]   2> 1444571 INFO  (TEST-TestSolrCloudWithDelegationTokens.testDelegationTokenRenewFail-seed#[7934B909B3FE7005])
[    ] o.a.s.SolrTestCaseJ4 ###Ending testDelegationTokenRenewFail
   [junit4]   2> 1444572 INFO  (jetty-launcher-2423-thread-2) [    ] o.e.j.s.AbstractConnector
Stopped ServerConnector@217a7a3c{SSL,[ssl, http/1.1]}{127.0.0.1:0}
   [junit4]   2> 1444573 INFO  (jetty-launcher-2423-thread-2) [    ] o.a.s.c.CoreContainer
Shutting down CoreContainer instance=1107259008
   [junit4]   2> 1444573 INFO  (jetty-launcher-2423-thread-1) [    ] o.e.j.s.AbstractConnector
Stopped ServerConnector@2c8c712e{SSL,[ssl, http/1.1]}{127.0.0.1:0}
   [junit4]   2> 1444574 INFO  (jetty-launcher-2423-thread-1) [    ] o.a.s.c.CoreContainer
Shutting down CoreContainer instance=1423372420
   [junit4]   2> 1444581 INFO  (jetty-launcher-2423-thread-2) [    ] o.a.s.c.Overseer Overseer
(id=97205915801878533-127.0.0.1:34568_solr-n_0000000000) closing
   [junit4]   2> 1444582 INFO  (OverseerStateUpdate-97205915801878533-127.0.0.1:34568_solr-n_0000000000)
[n:127.0.0.1:34568_solr    ] o.a.s.c.Overseer Overseer Loop exiting : 127.0.0.1:34568_solr
   [junit4]   2> 1446082 WARN  (zkCallback-2433-thread-3-processing-n:127.0.0.1:34568_solr)
[n:127.0.0.1:34568_solr    ] o.a.s.c.c.ZkStateReader ZooKeeper watch triggered, but Solr cannot
talk to ZK: [KeeperErrorCode = Session expired for /live_nodes]
   [junit4]   2> 1446082 WARN  (zkCallback-2434-thread-1-processing-n:127.0.0.1:45626_solr)
[n:127.0.0.1:45626_solr    ] o.a.s.c.c.ZkStateReader ZooKeeper watch triggered, but Solr cannot
talk to ZK: [KeeperErrorCode = Session expired for /live_nodes]
   [junit4]   2> 1446082 INFO  (jetty-launcher-2423-thread-2) [    ] o.a.s.m.SolrMetricManager
Closing metric reporters for: solr.node
   [junit4]   2> 1446082 INFO  (jetty-launcher-2423-thread-1) [    ] o.a.s.m.SolrMetricManager
Closing metric reporters for: solr.node
   [junit4]   2> 1446082 ERROR (Thread[Thread-3380,5,TGRP-TestSolrCloudWithDelegationTokens])
[n:127.0.0.1:45626_solr    ] o.a.h.s.t.d.AbstractDelegationTokenSecretManager ExpiredTokenRemover
received java.lang.InterruptedException: sleep interrupted
   [junit4]   2> 1446082 ERROR (Thread[Thread-3377,5,TGRP-TestSolrCloudWithDelegationTokens])
[n:127.0.0.1:34568_solr    ] o.a.h.s.t.d.AbstractDelegationTokenSecretManager ExpiredTokenRemover
received java.lang.InterruptedException: sleep interrupted
   [junit4]   2> 1446084 WARN  (NIOServerCxn.Factory:0.0.0.0/0.0.0.0:0) [    ] o.a.z.s.NIOServerCnxn
caught end of stream exception
   [junit4]   2> EndOfStreamException: Unable to read additional data from client sessionid
0x1595843f1700007, likely client has closed socket
   [junit4]   2> 	at org.apache.zookeeper.server.NIOServerCnxn.doIO(NIOServerCnxn.java:228)
   [junit4]   2> 	at org.apache.zookeeper.server.NIOServerCnxnFactory.run(NIOServerCnxnFactory.java:208)
   [junit4]   2> 	at java.lang.Thread.run(Thread.java:745)
   [junit4]   2> 1446084 INFO  (jetty-launcher-2423-thread-1) [    ] o.e.j.s.h.ContextHandler
Stopped o.e.j.s.ServletContextHandler@7daa2634{/solr,null,UNAVAILABLE}
   [junit4]   2> 1446084 INFO  (jetty-launcher-2423-thread-2) [    ] o.e.j.s.h.ContextHandler
Stopped o.e.j.s.ServletContextHandler@1ac9014f{/solr,null,UNAVAILABLE}
   [junit4]   2> 1446085 INFO  (SUITE-TestSolrCloudWithDelegationTokens-seed#[7934B909B3FE7005]-worker)
[    ] o.a.s.c.ZkTestServer connecting to 127.0.0.1:44675 44675
   [junit4]   2> 1446109 INFO  (Thread-3360) [    ] o.a.s.c.ZkTestServer connecting to
127.0.0.1:44675 44675
   [junit4]   2> 1446110 WARN  (Thread-3360) [    ] o.a.s.c.ZkTestServer Watch limit violations:

   [junit4]   2> Maximum concurrent create/delete watches above limit:
   [junit4]   2> 
   [junit4]   2> 	21	/solr/aliases.json
   [junit4]   2> 	2	/solr/security.json
   [junit4]   2> 
   [junit4]   2> Maximum concurrent data watches above limit:
   [junit4]   2> 
   [junit4]   2> 	21	/solr/clusterprops.json
   [junit4]   2> 	21	/solr/clusterstate.json
   [junit4]   2> 	2	/solr/security/zkdtsm/ZKDTSMRoot/ZKDTSMTokensRoot/DT_7
   [junit4]   2> 	2	/solr/security/zkdtsm/ZKDTSMRoot/ZKDTSMTokensRoot/DT_6
   [junit4]   2> 	2	/solr/security/zkdtsm/ZKDTSMRoot/ZKDTSMTokensRoot/DT_9
   [junit4]   2> 	2	/solr/security/zkdtsm/ZKDTSMRoot/ZKDTSMTokensRoot/DT_8
   [junit4]   2> 	2	/solr/security/zkdtsm/ZKDTSMRoot/ZKDTSMKeyIdRoot
   [junit4]   2> 	2	/solr/security/zkdtsm/ZKDTSMRoot/ZKDTSMMasterKeyRoot/DK_1
   [junit4]   2> 	2	/solr/security/zkdtsm/ZKDTSMRoot/ZKDTSMTokensRoot/DT_1
   [junit4]   2> 	2	/solr/security/zkdtsm/ZKDTSMRoot/ZKDTSMMasterKeyRoot/DK_3
   [junit4]   2> 	2	/solr/security/zkdtsm/ZKDTSMRoot/ZKDTSMTokensRoot/DT_3
   [junit4]   2> 	2	/solr/security/zkdtsm/ZKDTSMRoot/ZKDTSMMasterKeyRoot/DK_2
   [junit4]   2> 	2	/solr/security/zkdtsm/ZKDTSMRoot/ZKDTSMTokensRoot/DT_2
   [junit4]   2> 	2	/solr/security/zkdtsm/ZKDTSMRoot/ZKDTSMTokensRoot/DT_5
   [junit4]   2> 	2	/solr/security/zkdtsm/ZKDTSMRoot/ZKDTSMMasterKeyRoot/DK_4
   [junit4]   2> 	2	/solr/security/zkdtsm/ZKDTSMRoot/ZKDTSMTokensRoot/DT_4
   [junit4]   2> 	2	/solr/security/zkdtsm/ZKDTSMRoot/ZKDTSMTokensRoot/DT_13
   [junit4]   2> 	2	/solr/security/zkdtsm/ZKDTSMRoot/ZKDTSMTokensRoot/DT_12
   [junit4]   2> 	2	/solr/security/zkdtsm/ZKDTSMRoot/ZKDTSMSeqNumRoot
   [junit4]   2> 	2	/solr/security/zkdtsm/ZKDTSMRoot/ZKDTSMTokensRoot/DT_11
   [junit4]   2> 	2	/solr/security/zkdtsm/ZKDTSMRoot/ZKDTSMTokensRoot/DT_10
   [junit4]   2> 
   [junit4]   2> Maximum concurrent children watches above limit:
   [junit4]   2> 
   [junit4]   2> 	21	/solr/live_nodes
   [junit4]   2> 	21	/solr/collections
   [junit4]   2> 	3	/solr/overseer/queue
   [junit4]   2> 	2	/solr/security/zkdtsm/ZKDTSMRoot/ZKDTSMMasterKeyRoot
   [junit4]   2> 	2	/solr/overseer/queue-work
   [junit4]   2> 	2	/solr/security/zkdtsm/ZKDTSMRoot/ZKDTSMTokensRoot
   [junit4]   2> 
   [junit4]   2> 1446110 INFO  (SUITE-TestSolrCloudWithDelegationTokens-seed#[7934B909B3FE7005]-worker)
[    ] o.a.s.SolrTestCaseJ4 ###deleteCore
   [junit4]   2> NOTE: leaving temporary files on disk at: /home/jenkins/workspace/Lucene-Solr-master-Linux/solr/build/solr-core/test/J2/temp/solr.cloud.TestSolrCloudWithDelegationTokens_7934B909B3FE7005-001
   [junit4]   2> Jan 01, 2017 4:22:47 AM com.carrotsearch.randomizedtesting.ThreadLeakControl
checkThreadLeaks
   [junit4]   2> WARNING: Will linger awaiting termination of 3 leaked thread(s).
   [junit4]   2> NOTE: test params are: codec=Lucene70, sim=RandomSimilarity(queryNorm=false):
{}, locale=el, timezone=Europe/London
   [junit4]   2> NOTE: Linux 4.4.0-53-generic amd64/Oracle Corporation 1.8.0_112 (64-bit)/cpus=12,threads=1,free=283374824,total=486539264
   [junit4]   2> NOTE: All tests run in this JVM: [JSONWriterTest, PreAnalyzedFieldTest,
BinaryUpdateRequestHandlerTest, TestCollationField, TestIndexSearcher, LukeRequestHandlerTest,
SpatialHeatmapFacetsTest, TestSolrXml, TestStressReorder, CollectionsAPISolrJTest, DistribCursorPagingTest,
RequestLoggingTest, SparseHLLTest, TestFastOutputStream, TestGroupingSearch, TestHdfsBackupRestoreCore,
TestHdfsCloudBackupRestore, FacetPivotSmallTest, TestConfigOverlay, TestLuceneMatchVersion,
FieldAnalysisRequestHandlerTest, StatsReloadRaceTest, TestBlendedInfixSuggestions, DocValuesMultiTest,
TestClusterStateMutator, ResponseHeaderTest, ClassificationUpdateProcessorIntegrationTest,
TestPHPSerializedResponseWriter, DistributedFacetExistsSmallTest, StatelessScriptUpdateProcessorFactoryTest,
TestInitParams, AddSchemaFieldsUpdateProcessorFactoryTest, EchoParamsTest, CurrencyFieldXmlFileTest,
DebugComponentTest, TestSolrCloudWithKerberosAlt, TestJsonRequest, OverseerModifyCollectionTest,
DirectUpdateHandlerOptimizeTest, TestRecoveryHdfs, TestExtendedDismaxParser, SuggesterWFSTTest,
TestExceedMaxTermLength, TestDynamicFieldResource, ForceLeaderTest, PrimitiveFieldTypeTest,
BlockJoinFacetDistribTest, PKIAuthenticationIntegrationTest, TestDynamicLoading, SimpleFacetsTest,
URLClassifyProcessorTest, DeleteReplicaTest, TestSolrDeletionPolicy1, RestartWhileUpdatingTest,
SolrCoreCheckLockOnStartupTest, SolrCloudExampleTest, AnalyticsQueryTest, BlobRepositoryCloudTest,
GraphQueryTest, RankQueryTest, TolerantUpdateProcessorTest, LeaderElectionTest, DocExpirationUpdateProcessorFactoryTest,
HdfsUnloadDistributedZkTest, OverseerTest, PreAnalyzedUpdateProcessorTest, TestSimpleQParserPlugin,
TestLeaderInitiatedRecoveryThread, TestUnifiedSolrHighlighter, RequestHandlersTest, TestRequestStatusCollectionAPI,
TestComponentsName, BigEndianAscendingWordSerializerTest, TestQuerySenderNoQuery, PrimUtilsTest,
TestTrackingShardHandlerFactory, TestDistribIDF, SolrTestCaseJ4Test, SuggesterTSTTest, SaslZkACLProviderTest,
TestPhraseSuggestions, HdfsDirectoryFactoryTest, SolrIndexConfigTest, TestRestoreCore, SolrJmxReporterTest,
TestIntervalFaceting, TestMiniSolrCloudCluster, TestUseDocValuesAsStored, CollectionStateFormat2Test,
TestSerializedLuceneMatchVersion, TestConfigSets, LeaderFailoverAfterPartitionTest, TestHighFrequencyDictionaryFactory,
SynonymTokenizerTest, TestImpersonationWithHadoopAuth, TestRuleBasedAuthorizationPlugin, BasicDistributedZk2Test,
LeaderInitiatedRecoveryOnShardRestartTest, TestUniqueKeyFieldResource, TestNoOpRegenerator,
DistributedQueryComponentCustomSortTest, TermVectorComponentDistributedTest, TestRawResponseWriter,
RecoveryZkTest, HdfsChaosMonkeySafeLeaderTest, RemoteQueryErrorTest, TestCollectionAPI, TestCloudDeleteByQuery,
SuggesterTest, BadCopyFieldTest, TestReplicationHandler, TestDistributedSearch, SolrCoreTest,
SpellCheckComponentTest, BadIndexSchemaTest, TestSort, TestFunctionQuery, DirectUpdateHandlerTest,
TestBadConfig, ShowFileRequestHandlerTest, SolrIndexSplitterTest, TestCoreDiscovery, AnalysisAfterCoreReloadTest,
SignatureUpdateProcessorFactoryTest, CoreAdminHandlerTest, SolrRequestParserTest, DocValuesTest,
DisMaxRequestHandlerTest, TestWriterPerf, DocumentAnalysisRequestHandlerTest, DocumentBuilderTest,
PathHierarchyTokenizerFactoryTest, TestIndexingPerformance, RequiredFieldsTest, FastVectorHighlighterTest,
SolrPluginUtilsTest, TestCSVResponseWriter, QueryParsingTest, JsonLoaderTest, SearchHandlerTest,
TestLFUCache, AliasIntegrationTest, CdcrRequestHandlerTest, CdcrVersionReplicationTest, CloudExitableDirectoryReaderTest,
ConcurrentDeleteAndCreateCollectionTest, ConnectionManagerTest, DeleteShardTest, DistributedQueueTest,
DocValuesNotIndexedTest, OverseerRolesTest, PeerSyncReplicationTest, TestConfigSetsAPIZkFailure,
TestDeleteCollectionOnDownNodes, TestDownShardTolerantSearch, TestExclusionRuleCollectionAccess,
TestLeaderElectionWithEmptyReplica, TestOnReconnectListenerSupport, TestRandomFlRTGCloud,
TestRebalanceLeaders, TestSolrCloudWithDelegationTokens]
   [junit4] Completed [526/673 (1!)] on J2 in 3.27s, 8 tests, 1 failure <<< FAILURES!

[...truncated 62951 lines...]


Mime
View raw message