lucene-dev mailing list archives

Site index · List index
Message view « Date » · « Thread »
Top « Date » · « Thread »
From Policeman Jenkins Server <jenk...@thetaphi.de>
Subject [JENKINS] Lucene-Solr-master-Solaris (64bit/jdk1.8.0) - Build # 1053 - Unstable!
Date Tue, 03 Jan 2017 13:29:44 GMT
Build: https://jenkins.thetaphi.de/job/Lucene-Solr-master-Solaris/1053/
Java: 64bit/jdk1.8.0 -XX:+UseCompressedOops -XX:+UseSerialGC

4 tests failed.
FAILED:  org.apache.solr.cloud.PeerSyncReplicationTest.test

Error Message:
timeout waiting to see all nodes active

Stack Trace:
java.lang.AssertionError: timeout waiting to see all nodes active
	at __randomizedtesting.SeedInfo.seed([AE05F34AC7BDDDDF:2651CC906941B027]:0)
	at org.junit.Assert.fail(Assert.java:93)
	at org.apache.solr.cloud.PeerSyncReplicationTest.waitTillNodesActive(PeerSyncReplicationTest.java:311)
	at org.apache.solr.cloud.PeerSyncReplicationTest.bringUpDeadNodeAndEnsureNoReplication(PeerSyncReplicationTest.java:262)
	at org.apache.solr.cloud.PeerSyncReplicationTest.forceNodeFailureAndDoPeerSync(PeerSyncReplicationTest.java:244)
	at org.apache.solr.cloud.PeerSyncReplicationTest.test(PeerSyncReplicationTest.java:133)
	at sun.reflect.NativeMethodAccessorImpl.invoke0(Native Method)
	at sun.reflect.NativeMethodAccessorImpl.invoke(NativeMethodAccessorImpl.java:62)
	at sun.reflect.DelegatingMethodAccessorImpl.invoke(DelegatingMethodAccessorImpl.java:43)
	at java.lang.reflect.Method.invoke(Method.java:498)
	at com.carrotsearch.randomizedtesting.RandomizedRunner.invoke(RandomizedRunner.java:1713)
	at com.carrotsearch.randomizedtesting.RandomizedRunner$8.evaluate(RandomizedRunner.java:907)
	at com.carrotsearch.randomizedtesting.RandomizedRunner$9.evaluate(RandomizedRunner.java:943)
	at com.carrotsearch.randomizedtesting.RandomizedRunner$10.evaluate(RandomizedRunner.java:957)
	at org.apache.solr.BaseDistributedSearchTestCase$ShardsRepeatRule$ShardsFixedStatement.callStatement(BaseDistributedSearchTestCase.java:985)
	at org.apache.solr.BaseDistributedSearchTestCase$ShardsRepeatRule$ShardsStatement.evaluate(BaseDistributedSearchTestCase.java:960)
	at com.carrotsearch.randomizedtesting.rules.SystemPropertiesRestoreRule$1.evaluate(SystemPropertiesRestoreRule.java:57)
	at org.apache.lucene.util.TestRuleSetupTeardownChained$1.evaluate(TestRuleSetupTeardownChained.java:49)
	at org.apache.lucene.util.AbstractBeforeAfterRule$1.evaluate(AbstractBeforeAfterRule.java:45)
	at org.apache.lucene.util.TestRuleThreadAndTestName$1.evaluate(TestRuleThreadAndTestName.java:48)
	at org.apache.lucene.util.TestRuleIgnoreAfterMaxFailures$1.evaluate(TestRuleIgnoreAfterMaxFailures.java:64)
	at org.apache.lucene.util.TestRuleMarkFailure$1.evaluate(TestRuleMarkFailure.java:47)
	at com.carrotsearch.randomizedtesting.rules.StatementAdapter.evaluate(StatementAdapter.java:36)
	at com.carrotsearch.randomizedtesting.ThreadLeakControl$StatementRunner.run(ThreadLeakControl.java:367)
	at com.carrotsearch.randomizedtesting.ThreadLeakControl.forkTimeoutingTask(ThreadLeakControl.java:811)
	at com.carrotsearch.randomizedtesting.ThreadLeakControl$3.evaluate(ThreadLeakControl.java:462)
	at com.carrotsearch.randomizedtesting.RandomizedRunner.runSingleTest(RandomizedRunner.java:916)
	at com.carrotsearch.randomizedtesting.RandomizedRunner$5.evaluate(RandomizedRunner.java:802)
	at com.carrotsearch.randomizedtesting.RandomizedRunner$6.evaluate(RandomizedRunner.java:852)
	at com.carrotsearch.randomizedtesting.RandomizedRunner$7.evaluate(RandomizedRunner.java:863)
	at com.carrotsearch.randomizedtesting.rules.StatementAdapter.evaluate(StatementAdapter.java:36)
	at com.carrotsearch.randomizedtesting.rules.SystemPropertiesRestoreRule$1.evaluate(SystemPropertiesRestoreRule.java:57)
	at org.apache.lucene.util.AbstractBeforeAfterRule$1.evaluate(AbstractBeforeAfterRule.java:45)
	at com.carrotsearch.randomizedtesting.rules.StatementAdapter.evaluate(StatementAdapter.java:36)
	at org.apache.lucene.util.TestRuleStoreClassName$1.evaluate(TestRuleStoreClassName.java:41)
	at com.carrotsearch.randomizedtesting.rules.NoShadowingOrOverridesOnMethodsRule$1.evaluate(NoShadowingOrOverridesOnMethodsRule.java:40)
	at com.carrotsearch.randomizedtesting.rules.NoShadowingOrOverridesOnMethodsRule$1.evaluate(NoShadowingOrOverridesOnMethodsRule.java:40)
	at com.carrotsearch.randomizedtesting.rules.StatementAdapter.evaluate(StatementAdapter.java:36)
	at com.carrotsearch.randomizedtesting.rules.StatementAdapter.evaluate(StatementAdapter.java:36)
	at com.carrotsearch.randomizedtesting.rules.StatementAdapter.evaluate(StatementAdapter.java:36)
	at org.apache.lucene.util.TestRuleAssertionsRequired$1.evaluate(TestRuleAssertionsRequired.java:53)
	at org.apache.lucene.util.TestRuleMarkFailure$1.evaluate(TestRuleMarkFailure.java:47)
	at org.apache.lucene.util.TestRuleIgnoreAfterMaxFailures$1.evaluate(TestRuleIgnoreAfterMaxFailures.java:64)
	at org.apache.lucene.util.TestRuleIgnoreTestSuites$1.evaluate(TestRuleIgnoreTestSuites.java:54)
	at com.carrotsearch.randomizedtesting.rules.StatementAdapter.evaluate(StatementAdapter.java:36)
	at com.carrotsearch.randomizedtesting.ThreadLeakControl$StatementRunner.run(ThreadLeakControl.java:367)
	at java.lang.Thread.run(Thread.java:745)


FAILED:  org.apache.solr.handler.TestReplicationHandler.doTestIndexAndConfigAliasReplication

Error Message:
[/export/home/jenkins/workspace/Lucene-Solr-master-Solaris/solr/build/solr-core/test/J0/temp/solr.handler.TestReplicationHandler_AE05F34AC7BDDDDF-001/solr-instance-006/./collection1/data/index.20170103144549958, /export/home/jenkins/workspace/Lucene-Solr-master-Solaris/solr/build/solr-core/test/J0/temp/solr.handler.TestReplicationHandler_AE05F34AC7BDDDDF-001/solr-instance-006/./collection1/data, /export/home/jenkins/workspace/Lucene-Solr-master-Solaris/solr/build/solr-core/test/J0/temp/solr.handler.TestReplicationHandler_AE05F34AC7BDDDDF-001/solr-instance-006/./collection1/data/snapshot_metadata, /export/home/jenkins/workspace/Lucene-Solr-master-Solaris/solr/build/solr-core/test/J0/temp/solr.handler.TestReplicationHandler_AE05F34AC7BDDDDF-001/solr-instance-006/./collection1/data/index.20170103144550151] expected:<3> but was:<4>

Stack Trace:
java.lang.AssertionError: [/export/home/jenkins/workspace/Lucene-Solr-master-Solaris/solr/build/solr-core/test/J0/temp/solr.handler.TestReplicationHandler_AE05F34AC7BDDDDF-001/solr-instance-006/./collection1/data/index.20170103144549958, /export/home/jenkins/workspace/Lucene-Solr-master-Solaris/solr/build/solr-core/test/J0/temp/solr.handler.TestReplicationHandler_AE05F34AC7BDDDDF-001/solr-instance-006/./collection1/data, /export/home/jenkins/workspace/Lucene-Solr-master-Solaris/solr/build/solr-core/test/J0/temp/solr.handler.TestReplicationHandler_AE05F34AC7BDDDDF-001/solr-instance-006/./collection1/data/snapshot_metadata, /export/home/jenkins/workspace/Lucene-Solr-master-Solaris/solr/build/solr-core/test/J0/temp/solr.handler.TestReplicationHandler_AE05F34AC7BDDDDF-001/solr-instance-006/./collection1/data/index.20170103144550151] expected:<3> but was:<4>
	at __randomizedtesting.SeedInfo.seed([AE05F34AC7BDDDDF:59761D1201557239]:0)
	at org.junit.Assert.fail(Assert.java:93)
	at org.junit.Assert.failNotEquals(Assert.java:647)
	at org.junit.Assert.assertEquals(Assert.java:128)
	at org.junit.Assert.assertEquals(Assert.java:472)
	at org.apache.solr.handler.TestReplicationHandler.checkForSingleIndex(TestReplicationHandler.java:918)
	at org.apache.solr.handler.TestReplicationHandler.doTestIndexAndConfigAliasReplication(TestReplicationHandler.java:1350)
	at sun.reflect.NativeMethodAccessorImpl.invoke0(Native Method)
	at sun.reflect.NativeMethodAccessorImpl.invoke(NativeMethodAccessorImpl.java:62)
	at sun.reflect.DelegatingMethodAccessorImpl.invoke(DelegatingMethodAccessorImpl.java:43)
	at java.lang.reflect.Method.invoke(Method.java:498)
	at com.carrotsearch.randomizedtesting.RandomizedRunner.invoke(RandomizedRunner.java:1713)
	at com.carrotsearch.randomizedtesting.RandomizedRunner$8.evaluate(RandomizedRunner.java:907)
	at com.carrotsearch.randomizedtesting.RandomizedRunner$9.evaluate(RandomizedRunner.java:943)
	at com.carrotsearch.randomizedtesting.RandomizedRunner$10.evaluate(RandomizedRunner.java:957)
	at com.carrotsearch.randomizedtesting.rules.SystemPropertiesRestoreRule$1.evaluate(SystemPropertiesRestoreRule.java:57)
	at org.apache.lucene.util.TestRuleSetupTeardownChained$1.evaluate(TestRuleSetupTeardownChained.java:49)
	at org.apache.lucene.util.AbstractBeforeAfterRule$1.evaluate(AbstractBeforeAfterRule.java:45)
	at org.apache.lucene.util.TestRuleThreadAndTestName$1.evaluate(TestRuleThreadAndTestName.java:48)
	at org.apache.lucene.util.TestRuleIgnoreAfterMaxFailures$1.evaluate(TestRuleIgnoreAfterMaxFailures.java:64)
	at org.apache.lucene.util.TestRuleMarkFailure$1.evaluate(TestRuleMarkFailure.java:47)
	at com.carrotsearch.randomizedtesting.rules.StatementAdapter.evaluate(StatementAdapter.java:36)
	at com.carrotsearch.randomizedtesting.ThreadLeakControl$StatementRunner.run(ThreadLeakControl.java:367)
	at com.carrotsearch.randomizedtesting.ThreadLeakControl.forkTimeoutingTask(ThreadLeakControl.java:811)
	at com.carrotsearch.randomizedtesting.ThreadLeakControl$3.evaluate(ThreadLeakControl.java:462)
	at com.carrotsearch.randomizedtesting.RandomizedRunner.runSingleTest(RandomizedRunner.java:916)
	at com.carrotsearch.randomizedtesting.RandomizedRunner$5.evaluate(RandomizedRunner.java:802)
	at com.carrotsearch.randomizedtesting.RandomizedRunner$6.evaluate(RandomizedRunner.java:852)
	at com.carrotsearch.randomizedtesting.RandomizedRunner$7.evaluate(RandomizedRunner.java:863)
	at com.carrotsearch.randomizedtesting.rules.StatementAdapter.evaluate(StatementAdapter.java:36)
	at com.carrotsearch.randomizedtesting.rules.SystemPropertiesRestoreRule$1.evaluate(SystemPropertiesRestoreRule.java:57)
	at org.apache.lucene.util.AbstractBeforeAfterRule$1.evaluate(AbstractBeforeAfterRule.java:45)
	at com.carrotsearch.randomizedtesting.rules.StatementAdapter.evaluate(StatementAdapter.java:36)
	at org.apache.lucene.util.TestRuleStoreClassName$1.evaluate(TestRuleStoreClassName.java:41)
	at com.carrotsearch.randomizedtesting.rules.NoShadowingOrOverridesOnMethodsRule$1.evaluate(NoShadowingOrOverridesOnMethodsRule.java:40)
	at com.carrotsearch.randomizedtesting.rules.NoShadowingOrOverridesOnMethodsRule$1.evaluate(NoShadowingOrOverridesOnMethodsRule.java:40)
	at com.carrotsearch.randomizedtesting.rules.StatementAdapter.evaluate(StatementAdapter.java:36)
	at com.carrotsearch.randomizedtesting.rules.StatementAdapter.evaluate(StatementAdapter.java:36)
	at com.carrotsearch.randomizedtesting.rules.StatementAdapter.evaluate(StatementAdapter.java:36)
	at org.apache.lucene.util.TestRuleAssertionsRequired$1.evaluate(TestRuleAssertionsRequired.java:53)
	at org.apache.lucene.util.TestRuleMarkFailure$1.evaluate(TestRuleMarkFailure.java:47)
	at org.apache.lucene.util.TestRuleIgnoreAfterMaxFailures$1.evaluate(TestRuleIgnoreAfterMaxFailures.java:64)
	at org.apache.lucene.util.TestRuleIgnoreTestSuites$1.evaluate(TestRuleIgnoreTestSuites.java:54)
	at com.carrotsearch.randomizedtesting.rules.StatementAdapter.evaluate(StatementAdapter.java:36)
	at com.carrotsearch.randomizedtesting.ThreadLeakControl$StatementRunner.run(ThreadLeakControl.java:367)
	at java.lang.Thread.run(Thread.java:745)


FAILED:  org.apache.solr.update.HardAutoCommitTest.testCommitWithin

Error Message:
Exception during query

Stack Trace:
java.lang.RuntimeException: Exception during query
	at __randomizedtesting.SeedInfo.seed([AE05F34AC7BDDDDF:14D79C32449333CA]:0)
	at org.apache.solr.SolrTestCaseJ4.assertQ(SolrTestCaseJ4.java:818)
	at org.apache.solr.update.HardAutoCommitTest.testCommitWithin(HardAutoCommitTest.java:100)
	at sun.reflect.NativeMethodAccessorImpl.invoke0(Native Method)
	at sun.reflect.NativeMethodAccessorImpl.invoke(NativeMethodAccessorImpl.java:62)
	at sun.reflect.DelegatingMethodAccessorImpl.invoke(DelegatingMethodAccessorImpl.java:43)
	at java.lang.reflect.Method.invoke(Method.java:498)
	at com.carrotsearch.randomizedtesting.RandomizedRunner.invoke(RandomizedRunner.java:1713)
	at com.carrotsearch.randomizedtesting.RandomizedRunner$8.evaluate(RandomizedRunner.java:907)
	at com.carrotsearch.randomizedtesting.RandomizedRunner$9.evaluate(RandomizedRunner.java:943)
	at com.carrotsearch.randomizedtesting.RandomizedRunner$10.evaluate(RandomizedRunner.java:957)
	at com.carrotsearch.randomizedtesting.rules.SystemPropertiesRestoreRule$1.evaluate(SystemPropertiesRestoreRule.java:57)
	at org.apache.lucene.util.TestRuleSetupTeardownChained$1.evaluate(TestRuleSetupTeardownChained.java:49)
	at org.apache.lucene.util.AbstractBeforeAfterRule$1.evaluate(AbstractBeforeAfterRule.java:45)
	at org.apache.lucene.util.TestRuleThreadAndTestName$1.evaluate(TestRuleThreadAndTestName.java:48)
	at org.apache.lucene.util.TestRuleIgnoreAfterMaxFailures$1.evaluate(TestRuleIgnoreAfterMaxFailures.java:64)
	at org.apache.lucene.util.TestRuleMarkFailure$1.evaluate(TestRuleMarkFailure.java:47)
	at com.carrotsearch.randomizedtesting.rules.StatementAdapter.evaluate(StatementAdapter.java:36)
	at com.carrotsearch.randomizedtesting.ThreadLeakControl$StatementRunner.run(ThreadLeakControl.java:367)
	at com.carrotsearch.randomizedtesting.ThreadLeakControl.forkTimeoutingTask(ThreadLeakControl.java:811)
	at com.carrotsearch.randomizedtesting.ThreadLeakControl$3.evaluate(ThreadLeakControl.java:462)
	at com.carrotsearch.randomizedtesting.RandomizedRunner.runSingleTest(RandomizedRunner.java:916)
	at com.carrotsearch.randomizedtesting.RandomizedRunner$5.evaluate(RandomizedRunner.java:802)
	at com.carrotsearch.randomizedtesting.RandomizedRunner$6.evaluate(RandomizedRunner.java:852)
	at com.carrotsearch.randomizedtesting.RandomizedRunner$7.evaluate(RandomizedRunner.java:863)
	at com.carrotsearch.randomizedtesting.rules.StatementAdapter.evaluate(StatementAdapter.java:36)
	at com.carrotsearch.randomizedtesting.rules.SystemPropertiesRestoreRule$1.evaluate(SystemPropertiesRestoreRule.java:57)
	at org.apache.lucene.util.AbstractBeforeAfterRule$1.evaluate(AbstractBeforeAfterRule.java:45)
	at com.carrotsearch.randomizedtesting.rules.StatementAdapter.evaluate(StatementAdapter.java:36)
	at org.apache.lucene.util.TestRuleStoreClassName$1.evaluate(TestRuleStoreClassName.java:41)
	at com.carrotsearch.randomizedtesting.rules.NoShadowingOrOverridesOnMethodsRule$1.evaluate(NoShadowingOrOverridesOnMethodsRule.java:40)
	at com.carrotsearch.randomizedtesting.rules.NoShadowingOrOverridesOnMethodsRule$1.evaluate(NoShadowingOrOverridesOnMethodsRule.java:40)
	at com.carrotsearch.randomizedtesting.rules.StatementAdapter.evaluate(StatementAdapter.java:36)
	at com.carrotsearch.randomizedtesting.rules.StatementAdapter.evaluate(StatementAdapter.java:36)
	at com.carrotsearch.randomizedtesting.rules.StatementAdapter.evaluate(StatementAdapter.java:36)
	at org.apache.lucene.util.TestRuleAssertionsRequired$1.evaluate(TestRuleAssertionsRequired.java:53)
	at org.apache.lucene.util.TestRuleMarkFailure$1.evaluate(TestRuleMarkFailure.java:47)
	at org.apache.lucene.util.TestRuleIgnoreAfterMaxFailures$1.evaluate(TestRuleIgnoreAfterMaxFailures.java:64)
	at org.apache.lucene.util.TestRuleIgnoreTestSuites$1.evaluate(TestRuleIgnoreTestSuites.java:54)
	at com.carrotsearch.randomizedtesting.rules.StatementAdapter.evaluate(StatementAdapter.java:36)
	at com.carrotsearch.randomizedtesting.ThreadLeakControl$StatementRunner.run(ThreadLeakControl.java:367)
	at java.lang.Thread.run(Thread.java:745)
Caused by: java.lang.RuntimeException: REQUEST FAILED: xpath=//result[@numFound=1]
	xml response was: <?xml version="1.0" encoding="UTF-8"?>
<response>
<lst name="responseHeader"><int name="status">0</int><int name="QTime">0</int></lst><result name="response" numFound="0" start="0"></result>
</response>

	request was:q=id:529&qt=standard&start=0&rows=20&version=2.2
	at org.apache.solr.SolrTestCaseJ4.assertQ(SolrTestCaseJ4.java:811)
	... 40 more


FAILED:  org.apache.solr.update.SolrIndexMetricsTest.testIndexMetrics

Error Message:
minorMerge: 3 expected:<4> but was:<3>

Stack Trace:
java.lang.AssertionError: minorMerge: 3 expected:<4> but was:<3>
	at __randomizedtesting.SeedInfo.seed([AE05F34AC7BDDDDF:62D5CEF6073326E4]:0)
	at org.junit.Assert.fail(Assert.java:93)
	at org.junit.Assert.failNotEquals(Assert.java:647)
	at org.junit.Assert.assertEquals(Assert.java:128)
	at org.junit.Assert.assertEquals(Assert.java:472)
	at org.apache.solr.update.SolrIndexMetricsTest.testIndexMetrics(SolrIndexMetricsTest.java:70)
	at sun.reflect.NativeMethodAccessorImpl.invoke0(Native Method)
	at sun.reflect.NativeMethodAccessorImpl.invoke(NativeMethodAccessorImpl.java:62)
	at sun.reflect.DelegatingMethodAccessorImpl.invoke(DelegatingMethodAccessorImpl.java:43)
	at java.lang.reflect.Method.invoke(Method.java:498)
	at com.carrotsearch.randomizedtesting.RandomizedRunner.invoke(RandomizedRunner.java:1713)
	at com.carrotsearch.randomizedtesting.RandomizedRunner$8.evaluate(RandomizedRunner.java:907)
	at com.carrotsearch.randomizedtesting.RandomizedRunner$9.evaluate(RandomizedRunner.java:943)
	at com.carrotsearch.randomizedtesting.RandomizedRunner$10.evaluate(RandomizedRunner.java:957)
	at com.carrotsearch.randomizedtesting.rules.SystemPropertiesRestoreRule$1.evaluate(SystemPropertiesRestoreRule.java:57)
	at org.apache.lucene.util.TestRuleSetupTeardownChained$1.evaluate(TestRuleSetupTeardownChained.java:49)
	at org.apache.lucene.util.AbstractBeforeAfterRule$1.evaluate(AbstractBeforeAfterRule.java:45)
	at org.apache.lucene.util.TestRuleThreadAndTestName$1.evaluate(TestRuleThreadAndTestName.java:48)
	at org.apache.lucene.util.TestRuleIgnoreAfterMaxFailures$1.evaluate(TestRuleIgnoreAfterMaxFailures.java:64)
	at org.apache.lucene.util.TestRuleMarkFailure$1.evaluate(TestRuleMarkFailure.java:47)
	at com.carrotsearch.randomizedtesting.rules.StatementAdapter.evaluate(StatementAdapter.java:36)
	at com.carrotsearch.randomizedtesting.ThreadLeakControl$StatementRunner.run(ThreadLeakControl.java:367)
	at com.carrotsearch.randomizedtesting.ThreadLeakControl.forkTimeoutingTask(ThreadLeakControl.java:811)
	at com.carrotsearch.randomizedtesting.ThreadLeakControl$3.evaluate(ThreadLeakControl.java:462)
	at com.carrotsearch.randomizedtesting.RandomizedRunner.runSingleTest(RandomizedRunner.java:916)
	at com.carrotsearch.randomizedtesting.RandomizedRunner$5.evaluate(RandomizedRunner.java:802)
	at com.carrotsearch.randomizedtesting.RandomizedRunner$6.evaluate(RandomizedRunner.java:852)
	at com.carrotsearch.randomizedtesting.RandomizedRunner$7.evaluate(RandomizedRunner.java:863)
	at com.carrotsearch.randomizedtesting.rules.StatementAdapter.evaluate(StatementAdapter.java:36)
	at com.carrotsearch.randomizedtesting.rules.SystemPropertiesRestoreRule$1.evaluate(SystemPropertiesRestoreRule.java:57)
	at org.apache.lucene.util.AbstractBeforeAfterRule$1.evaluate(AbstractBeforeAfterRule.java:45)
	at com.carrotsearch.randomizedtesting.rules.StatementAdapter.evaluate(StatementAdapter.java:36)
	at org.apache.lucene.util.TestRuleStoreClassName$1.evaluate(TestRuleStoreClassName.java:41)
	at com.carrotsearch.randomizedtesting.rules.NoShadowingOrOverridesOnMethodsRule$1.evaluate(NoShadowingOrOverridesOnMethodsRule.java:40)
	at com.carrotsearch.randomizedtesting.rules.NoShadowingOrOverridesOnMethodsRule$1.evaluate(NoShadowingOrOverridesOnMethodsRule.java:40)
	at com.carrotsearch.randomizedtesting.rules.StatementAdapter.evaluate(StatementAdapter.java:36)
	at com.carrotsearch.randomizedtesting.rules.StatementAdapter.evaluate(StatementAdapter.java:36)
	at com.carrotsearch.randomizedtesting.rules.StatementAdapter.evaluate(StatementAdapter.java:36)
	at org.apache.lucene.util.TestRuleAssertionsRequired$1.evaluate(TestRuleAssertionsRequired.java:53)
	at org.apache.lucene.util.TestRuleMarkFailure$1.evaluate(TestRuleMarkFailure.java:47)
	at org.apache.lucene.util.TestRuleIgnoreAfterMaxFailures$1.evaluate(TestRuleIgnoreAfterMaxFailures.java:64)
	at org.apache.lucene.util.TestRuleIgnoreTestSuites$1.evaluate(TestRuleIgnoreTestSuites.java:54)
	at com.carrotsearch.randomizedtesting.rules.StatementAdapter.evaluate(StatementAdapter.java:36)
	at com.carrotsearch.randomizedtesting.ThreadLeakControl$StatementRunner.run(ThreadLeakControl.java:367)
	at java.lang.Thread.run(Thread.java:745)




Build Log:
[...truncated 10774 lines...]
   [junit4] Suite: org.apache.solr.update.SolrIndexMetricsTest
   [junit4]   2> Creating dataDir: /export/home/jenkins/workspace/Lucene-Solr-master-Solaris/solr/build/solr-core/test/J0/temp/solr.update.SolrIndexMetricsTest_AE05F34AC7BDDDDF-001/init-core-data-001
   [junit4]   2> 103954 INFO  (SUITE-SolrIndexMetricsTest-seed#[AE05F34AC7BDDDDF]-worker) [    ] o.a.s.SolrTestCaseJ4 Randomized ssl (false) and clientAuth (false) via: @org.apache.solr.util.RandomizeSSL(reason=, value=NaN, ssl=NaN, clientAuth=NaN)
   [junit4]   2> 103955 INFO  (SUITE-SolrIndexMetricsTest-seed#[AE05F34AC7BDDDDF]-worker) [    ] o.a.s.SolrTestCaseJ4 ####initCore
   [junit4]   2> 103955 INFO  (SUITE-SolrIndexMetricsTest-seed#[AE05F34AC7BDDDDF]-worker) [    ] o.a.s.c.SolrResourceLoader [null] Added 2 libs to classloader, from paths: [/export/home/jenkins/workspace/Lucene-Solr-master-Solaris/solr/core/src/test-files/solr/collection1/lib, /export/home/jenkins/workspace/Lucene-Solr-master-Solaris/solr/core/src/test-files/solr/collection1/lib/classes]
   [junit4]   2> 103993 WARN  (SUITE-SolrIndexMetricsTest-seed#[AE05F34AC7BDDDDF]-worker) [    ] o.a.s.c.Config Beginning with Solr 5.5, <mergePolicy> is deprecated, use <mergePolicyFactory> instead.
   [junit4]   2> 103993 WARN  (SUITE-SolrIndexMetricsTest-seed#[AE05F34AC7BDDDDF]-worker) [    ] o.a.s.c.Config Beginning with Solr 5.5, <mergeFactor> is deprecated, configure it on the relevant <mergePolicyFactory> instead.
   [junit4]   2> 103995 INFO  (SUITE-SolrIndexMetricsTest-seed#[AE05F34AC7BDDDDF]-worker) [    ] o.a.s.c.SolrConfig Using Lucene MatchVersion: 7.0.0
   [junit4]   2> 104016 INFO  (SUITE-SolrIndexMetricsTest-seed#[AE05F34AC7BDDDDF]-worker) [    ] o.a.s.s.IndexSchema [null] Schema name=test
   [junit4]   2> 104128 WARN  (SUITE-SolrIndexMetricsTest-seed#[AE05F34AC7BDDDDF]-worker) [    ] o.a.s.s.IndexSchema [null] default search field in schema is text. WARNING: Deprecated, please use 'df' on request instead.
   [junit4]   2> 104135 INFO  (SUITE-SolrIndexMetricsTest-seed#[AE05F34AC7BDDDDF]-worker) [    ] o.a.s.s.IndexSchema Loaded schema test/1.0 with uniqueid field id
   [junit4]   2> 104160 WARN  (SUITE-SolrIndexMetricsTest-seed#[AE05F34AC7BDDDDF]-worker) [    ] o.a.s.m.r.SolrJmxReporter No serviceUrl or agentId was configured, using first MBeanServer.
   [junit4]   2> 104163 INFO  (SUITE-SolrIndexMetricsTest-seed#[AE05F34AC7BDDDDF]-worker) [    ] o.a.s.m.r.SolrJmxReporter JMX monitoring enabled at server: com.sun.jmx.mbeanserver.JmxMBeanServer@66a610c8
   [junit4]   2> 104163 WARN  (SUITE-SolrIndexMetricsTest-seed#[AE05F34AC7BDDDDF]-worker) [    ] o.a.s.m.r.SolrJmxReporter No serviceUrl or agentId was configured, using first MBeanServer.
   [junit4]   2> 104170 INFO  (SUITE-SolrIndexMetricsTest-seed#[AE05F34AC7BDDDDF]-worker) [    ] o.a.s.m.r.SolrJmxReporter JMX monitoring enabled at server: com.sun.jmx.mbeanserver.JmxMBeanServer@66a610c8
   [junit4]   2> 104171 WARN  (SUITE-SolrIndexMetricsTest-seed#[AE05F34AC7BDDDDF]-worker) [    ] o.a.s.m.r.SolrJmxReporter No serviceUrl or agentId was configured, using first MBeanServer.
   [junit4]   2> 104171 INFO  (SUITE-SolrIndexMetricsTest-seed#[AE05F34AC7BDDDDF]-worker) [    ] o.a.s.m.r.SolrJmxReporter JMX monitoring enabled at server: com.sun.jmx.mbeanserver.JmxMBeanServer@66a610c8
   [junit4]   2> 104171 WARN  (SUITE-SolrIndexMetricsTest-seed#[AE05F34AC7BDDDDF]-worker) [    ] o.a.s.m.r.SolrJmxReporter No serviceUrl or agentId was configured, using first MBeanServer.
   [junit4]   2> 104179 INFO  (SUITE-SolrIndexMetricsTest-seed#[AE05F34AC7BDDDDF]-worker) [    ] o.a.s.m.r.SolrJmxReporter JMX monitoring enabled at server: com.sun.jmx.mbeanserver.JmxMBeanServer@66a610c8
   [junit4]   2> 104181 INFO  (coreLoadExecutor-791-thread-1) [    x:collection1] o.a.s.c.SolrResourceLoader [null] Added 2 libs to classloader, from paths: [/export/home/jenkins/workspace/Lucene-Solr-master-Solaris/solr/core/src/test-files/solr/collection1/lib, /export/home/jenkins/workspace/Lucene-Solr-master-Solaris/solr/core/src/test-files/solr/collection1/lib/classes]
   [junit4]   2> 104256 WARN  (coreLoadExecutor-791-thread-1) [    x:collection1] o.a.s.c.Config Beginning with Solr 5.5, <mergePolicy> is deprecated, use <mergePolicyFactory> instead.
   [junit4]   2> 104256 WARN  (coreLoadExecutor-791-thread-1) [    x:collection1] o.a.s.c.Config Beginning with Solr 5.5, <mergeFactor> is deprecated, configure it on the relevant <mergePolicyFactory> instead.
   [junit4]   2> 104256 INFO  (coreLoadExecutor-791-thread-1) [    x:collection1] o.a.s.c.SolrConfig Using Lucene MatchVersion: 7.0.0
   [junit4]   2> 104297 INFO  (coreLoadExecutor-791-thread-1) [    x:collection1] o.a.s.s.IndexSchema [collection1] Schema name=test
   [junit4]   2> 104425 WARN  (coreLoadExecutor-791-thread-1) [    x:collection1] o.a.s.s.IndexSchema [collection1] default search field in schema is text. WARNING: Deprecated, please use 'df' on request instead.
   [junit4]   2> 104445 INFO  (coreLoadExecutor-791-thread-1) [    x:collection1] o.a.s.s.IndexSchema Loaded schema test/1.0 with uniqueid field id
   [junit4]   2> 104473 INFO  (coreLoadExecutor-791-thread-1) [    x:collection1] o.a.s.c.CoreContainer Creating SolrCore 'collection1' using configuration from instancedir /export/home/jenkins/workspace/Lucene-Solr-master-Solaris/solr/core/src/test-files/solr/collection1
   [junit4]   2> 104477 WARN  (coreLoadExecutor-791-thread-1) [    x:collection1] o.a.s.m.r.SolrJmxReporter No serviceUrl or agentId was configured, using first MBeanServer.
   [junit4]   2> 104477 INFO  (coreLoadExecutor-791-thread-1) [    x:collection1] o.a.s.m.r.SolrJmxReporter JMX monitoring enabled at server: com.sun.jmx.mbeanserver.JmxMBeanServer@66a610c8
   [junit4]   2> 104491 INFO  (coreLoadExecutor-791-thread-1) [    x:collection1] o.a.s.c.SolrCore [[collection1] ] Opening new SolrCore at [/export/home/jenkins/workspace/Lucene-Solr-master-Solaris/solr/core/src/test-files/solr/collection1], dataDir=[/export/home/jenkins/workspace/Lucene-Solr-master-Solaris/solr/build/solr-core/test/J0/temp/solr.update.SolrIndexMetricsTest_AE05F34AC7BDDDDF-001/init-core-data-001/]
   [junit4]   2> 104580 INFO  (coreLoadExecutor-791-thread-1) [    x:collection1] o.a.s.u.CommitTracker Hard AutoCommit: disabled
   [junit4]   2> 104580 INFO  (coreLoadExecutor-791-thread-1) [    x:collection1] o.a.s.u.CommitTracker Soft AutoCommit: disabled
   [junit4]   2> 104585 INFO  (coreLoadExecutor-791-thread-1) [    x:collection1] o.a.s.s.SolrIndexSearcher Opening [Searcher@747f50c2[collection1] main]
   [junit4]   2> 104586 WARN  (coreLoadExecutor-791-thread-1) [    x:collection1] o.a.s.r.ManagedResourceStorage Cannot write to config directory /export/home/jenkins/workspace/Lucene-Solr-master-Solaris/solr/core/src/test-files/solr/collection1/conf; switching to use InMemory storage instead.
   [junit4]   2> 104586 INFO  (coreLoadExecutor-791-thread-1) [    x:collection1] o.a.s.h.ReplicationHandler Commits will be reserved for  10000
   [junit4]   2> 104586 INFO  (searcherExecutor-792-thread-1-processing-x:collection1) [    x:collection1] o.a.s.c.SolrCore [collection1] Registered new searcher Searcher@747f50c2[collection1] main{ExitableDirectoryReader(UninvertingDirectoryReader())}
   [junit4]   2> 104588 INFO  (SUITE-SolrIndexMetricsTest-seed#[AE05F34AC7BDDDDF]-worker) [    ] o.a.s.SolrTestCaseJ4 ####initCore end
   [junit4]   2> 104591 INFO  (TEST-SolrIndexMetricsTest.testIndexMetrics-seed#[AE05F34AC7BDDDDF]) [    ] o.a.s.SolrTestCaseJ4 ###Starting testIndexMetrics
   [junit4]   2> 105469 INFO  (TEST-SolrIndexMetricsTest.testIndexMetrics-seed#[AE05F34AC7BDDDDF]) [    ] o.a.s.u.DirectUpdateHandler2 start commit{,optimize=false,openSearcher=true,waitSearcher=true,expungeDeletes=false,softCommit=false,prepareCommit=false}
   [junit4]   2> 105469 INFO  (TEST-SolrIndexMetricsTest.testIndexMetrics-seed#[AE05F34AC7BDDDDF]) [    ] o.a.s.u.SolrIndexWriter Calling setCommitData with IW:org.apache.solr.update.SolrIndexWriter@60ef0500
   [junit4]   2> 105521 INFO  (TEST-SolrIndexMetricsTest.testIndexMetrics-seed#[AE05F34AC7BDDDDF]) [    ] o.a.s.s.SolrIndexSearcher Opening [Searcher@7f9e999d[collection1] main]
   [junit4]   2> 105521 INFO  (searcherExecutor-792-thread-1) [    ] o.a.s.c.SolrCore [collection1] Registered new searcher Searcher@7f9e999d[collection1] main{ExitableDirectoryReader(UninvertingDirectoryReader(Uninverting(_0(7.0.0):C100) Uninverting(_1(7.0.0):C100) Uninverting(_2(7.0.0):C100) Uninverting(_3(7.0.0):C100) Uninverting(_5(7.0.0):C100) Uninverting(_6(7.0.0):C100) Uninverting(_7(7.0.0):C100) Uninverting(_9(7.0.0):C100) Uninverting(_a(7.0.0):C100) Uninverting(_b(7.0.0):C100)))}
   [junit4]   2> 105521 INFO  (TEST-SolrIndexMetricsTest.testIndexMetrics-seed#[AE05F34AC7BDDDDF]) [    ] o.a.s.u.DirectUpdateHandler2 end_commit_flush
   [junit4]   2> 105522 INFO  (TEST-SolrIndexMetricsTest.testIndexMetrics-seed#[AE05F34AC7BDDDDF]) [    ] o.a.s.c.SolrResourceLoader [null] Added 2 libs to classloader, from paths: [/export/home/jenkins/workspace/Lucene-Solr-master-Solaris/solr/core/src/test-files/solr/collection1/lib, /export/home/jenkins/workspace/Lucene-Solr-master-Solaris/solr/core/src/test-files/solr/collection1/lib/classes]
   [junit4]   2> 105565 WARN  (TEST-SolrIndexMetricsTest.testIndexMetrics-seed#[AE05F34AC7BDDDDF]) [    ] o.a.s.c.Config Beginning with Solr 5.5, <mergePolicy> is deprecated, use <mergePolicyFactory> instead.
   [junit4]   2> 105565 WARN  (TEST-SolrIndexMetricsTest.testIndexMetrics-seed#[AE05F34AC7BDDDDF]) [    ] o.a.s.c.Config Beginning with Solr 5.5, <mergeFactor> is deprecated, configure it on the relevant <mergePolicyFactory> instead.
   [junit4]   2> 105565 INFO  (TEST-SolrIndexMetricsTest.testIndexMetrics-seed#[AE05F34AC7BDDDDF]) [    ] o.a.s.c.SolrConfig Using Lucene MatchVersion: 7.0.0
   [junit4]   2> 105573 INFO  (TEST-SolrIndexMetricsTest.testIndexMetrics-seed#[AE05F34AC7BDDDDF]) [    ] o.a.s.s.IndexSchema [collection1] Schema name=test
   [junit4]   2> 105670 WARN  (TEST-SolrIndexMetricsTest.testIndexMetrics-seed#[AE05F34AC7BDDDDF]) [    ] o.a.s.s.IndexSchema [collection1] default search field in schema is text. WARNING: Deprecated, please use 'df' on request instead.
   [junit4]   2> 105672 INFO  (TEST-SolrIndexMetricsTest.testIndexMetrics-seed#[AE05F34AC7BDDDDF]) [    ] o.a.s.s.IndexSchema Loaded schema test/1.0 with uniqueid field id
   [junit4]   2> 105680 INFO  (TEST-SolrIndexMetricsTest.testIndexMetrics-seed#[AE05F34AC7BDDDDF]) [    ] o.a.s.c.CoreContainer Reloading SolrCore 'collection1' using configuration from instancedir /export/home/jenkins/workspace/Lucene-Solr-master-Solaris/solr/core/src/test-files/solr/collection1
   [junit4]   2> 105681 WARN  (TEST-SolrIndexMetricsTest.testIndexMetrics-seed#[AE05F34AC7BDDDDF]) [    x:collection1] o.a.s.m.r.SolrJmxReporter No serviceUrl or agentId was configured, using first MBeanServer.
   [junit4]   2> 105763 INFO  (TEST-SolrIndexMetricsTest.testIndexMetrics-seed#[AE05F34AC7BDDDDF]) [    x:collection1] o.a.s.m.r.SolrJmxReporter JMX monitoring enabled at server: com.sun.jmx.mbeanserver.JmxMBeanServer@66a610c8
   [junit4]   2> 105764 INFO  (TEST-SolrIndexMetricsTest.testIndexMetrics-seed#[AE05F34AC7BDDDDF]) [    x:collection1] o.a.s.m.SolrMetricManager Replacing existing reporter 'default' in registry 'solr.core.collection1': [org.apache.solr.metrics.reporters.SolrJmxReporter@7eb2f8a4: domain = solr.core.collection1, service url = null, agent id = null]
   [junit4]   2> 105767 INFO  (TEST-SolrIndexMetricsTest.testIndexMetrics-seed#[AE05F34AC7BDDDDF]) [    x:collection1] o.a.s.c.SolrCore [[collection1] ] Opening new SolrCore at [/export/home/jenkins/workspace/Lucene-Solr-master-Solaris/solr/core/src/test-files/solr/collection1], dataDir=[/export/home/jenkins/workspace/Lucene-Solr-master-Solaris/solr/build/solr-core/test/J0/temp/solr.update.SolrIndexMetricsTest_AE05F34AC7BDDDDF-001/init-core-data-001/]
   [junit4]   2> 105780 INFO  (TEST-SolrIndexMetricsTest.testIndexMetrics-seed#[AE05F34AC7BDDDDF]) [    x:collection1] o.a.s.u.CommitTracker Hard AutoCommit: disabled
   [junit4]   2> 105780 INFO  (TEST-SolrIndexMetricsTest.testIndexMetrics-seed#[AE05F34AC7BDDDDF]) [    x:collection1] o.a.s.u.CommitTracker Soft AutoCommit: disabled
   [junit4]   2> 105839 INFO  (TEST-SolrIndexMetricsTest.testIndexMetrics-seed#[AE05F34AC7BDDDDF]) [    x:collection1] o.a.s.s.SolrIndexSearcher Opening [Searcher@23a38e74[collection1] main]
   [junit4]   2> 105839 WARN  (TEST-SolrIndexMetricsTest.testIndexMetrics-seed#[AE05F34AC7BDDDDF]) [    x:collection1] o.a.s.r.ManagedResourceStorage Cannot write to config directory /export/home/jenkins/workspace/Lucene-Solr-master-Solaris/solr/core/src/test-files/solr/collection1/conf; switching to use InMemory storage instead.
   [junit4]   2> 105839 INFO  (TEST-SolrIndexMetricsTest.testIndexMetrics-seed#[AE05F34AC7BDDDDF]) [    x:collection1] o.a.s.h.ReplicationHandler Commits will be reserved for  10000
   [junit4]   2> 105840 INFO  (searcherExecutor-796-thread-1-processing-x:collection1) [    x:collection1] o.a.s.c.SolrCore [collection1] Registered new searcher Searcher@23a38e74[collection1] main{ExitableDirectoryReader(UninvertingDirectoryReader(Uninverting(_4(7.0.0):C300) Uninverting(_3(7.0.0):C100) Uninverting(_5(7.0.0):C100) Uninverting(_6(7.0.0):C100) Uninverting(_7(7.0.0):C100) Uninverting(_9(7.0.0):C100) Uninverting(_a(7.0.0):C100) Uninverting(_b(7.0.0):C100)))}
   [junit4]   2> 105995 INFO  (TEST-SolrIndexMetricsTest.testIndexMetrics-seed#[AE05F34AC7BDDDDF]) [    x:collection1] o.a.s.u.DefaultSolrCoreState New IndexWriter is ready to be used.
   [junit4]   2> 106051 INFO  (TEST-SolrIndexMetricsTest.testIndexMetrics-seed#[AE05F34AC7BDDDDF]) [    x:collection1] o.a.s.s.SolrIndexSearcher Opening [Searcher@2ad3ec5c[collection1] main]
   [junit4]   2> 106052 INFO  (TEST-SolrIndexMetricsTest.testIndexMetrics-seed#[AE05F34AC7BDDDDF]) [    x:collection1] o.a.s.c.SolrCore [collection1]  CLOSING SolrCore org.apache.solr.core.SolrCore@77477fdb
   [junit4]   2> 106052 INFO  (searcherExecutor-796-thread-1-processing-x:collection1) [    x:collection1] o.a.s.c.SolrCore [collection1] Registered new searcher Searcher@2ad3ec5c[collection1] main{ExitableDirectoryReader(UninvertingDirectoryReader(Uninverting(_4(7.0.0):C300) Uninverting(_8(7.0.0):C300) Uninverting(_c(7.0.0):C300) Uninverting(_b(7.0.0):C100)))}
   [junit4]   2> 106052 INFO  (TEST-SolrIndexMetricsTest.testIndexMetrics-seed#[AE05F34AC7BDDDDF]) [    x:collection1] o.a.s.m.SolrMetricManager Closing metric reporters for: solr.core.collection1
   [junit4]   2> 106062 INFO  (TEST-SolrIndexMetricsTest.testIndexMetrics-seed#[AE05F34AC7BDDDDF]) [    x:collection1] o.a.s.SolrTestCaseJ4 ###Ending testIndexMetrics
   [junit4]   2> NOTE: reproduce with: ant test  -Dtestcase=SolrIndexMetricsTest -Dtests.method=testIndexMetrics -Dtests.seed=AE05F34AC7BDDDDF -Dtests.slow=true -Dtests.locale=hu -Dtests.timezone=Australia/Melbourne -Dtests.asserts=true -Dtests.file.encoding=UTF-8
   [junit4] FAILURE 1.48s J0 | SolrIndexMetricsTest.testIndexMetrics <<<
   [junit4]    > Throwable #1: java.lang.AssertionError: minorMerge: 3 expected:<4> but was:<3>
   [junit4]    > 	at __randomizedtesting.SeedInfo.seed([AE05F34AC7BDDDDF:62D5CEF6073326E4]:0)
   [junit4]    > 	at org.apache.solr.update.SolrIndexMetricsTest.testIndexMetrics(SolrIndexMetricsTest.java:70)
   [junit4]    > 	at java.lang.Thread.run(Thread.java:745)
   [junit4]   2> 106065 INFO  (SUITE-SolrIndexMetricsTest-seed#[AE05F34AC7BDDDDF]-worker) [    x:collection1] o.a.s.SolrTestCaseJ4 ###deleteCore
   [junit4]   2> 106065 INFO  (SUITE-SolrIndexMetricsTest-seed#[AE05F34AC7BDDDDF]-worker) [    x:collection1] o.a.s.c.CoreContainer Shutting down CoreContainer instance=193753922
   [junit4]   2> 106065 INFO  (coreCloseExecutor-800-thread-1-processing-x:collection1) [    x:collection1] o.a.s.c.SolrCore [collection1]  CLOSING SolrCore org.apache.solr.core.SolrCore@606ae639
   [junit4]   2> 106069 INFO  (coreCloseExecutor-800-thread-1-processing-x:collection1) [    x:collection1] o.a.s.m.SolrMetricManager Closing metric reporters for: solr.core.collection1
   [junit4]   2> 106070 INFO  (SUITE-SolrIndexMetricsTest-seed#[AE05F34AC7BDDDDF]-worker) [    x:collection1] o.a.s.m.SolrMetricManager Closing metric reporters for: solr.node
   [junit4]   2> NOTE: leaving temporary files on disk at: /export/home/jenkins/workspace/Lucene-Solr-master-Solaris/solr/build/solr-core/test/J0/temp/solr.update.SolrIndexMetricsTest_AE05F34AC7BDDDDF-001
   [junit4]   2> NOTE: test params are: codec=Asserting(Lucene70): {range_facet_l_dv=FST50, multiDefault=PostingsFormat(name=Memory), intDefault=PostingsFormat(name=LuceneFixedGap), foo_s=PostingsFormat(name=Memory), id=FST50, range_facet_i_dv=PostingsFormat(name=Memory), range_facet_l=PostingsFormat(name=Memory), timestamp=PostingsFormat(name=Memory)}, docValues:{range_facet_l_dv=DocValuesFormat(name=Lucene70), multiDefault=DocValuesFormat(name=Direct), intDefault=DocValuesFormat(name=Lucene70), range_facet_i_dv=DocValuesFormat(name=Direct), id=DocValuesFormat(name=Lucene70), foo_s=DocValuesFormat(name=Direct), timestamp=DocValuesFormat(name=Direct), range_facet_l=DocValuesFormat(name=Direct)}, maxPointsInLeafNode=179, maxMBSortInHeap=5.830830071247738, sim=RandomSimilarity(queryNorm=true): {}, locale=hu, timezone=Australia/Melbourne
   [junit4]   2> NOTE: SunOS 5.11 amd64/Oracle Corporation 1.8.0_112 (64-bit)/cpus=3,threads=1,free=38943856,total=141344768
   [junit4]   2> NOTE: All tests run in this JVM: [ManagedSchemaRoundRobinCloudTest, CloudMLTQParserTest, TestClusterStateMutator, TestUpdate, SoftAutoCommitTest, TestSlowCompositeReaderWrapper, TestReloadDeadlock, TestCollationField, TestScoreJoinQPScore, ConnectionManagerTest, BlockJoinFacetRandomTest, CoreAdminCreateDiscoverTest, TestDistribIDF, TestFunctionQuery, TestRandomDVFaceting, DistributedFacetPivotSmallTest, DirectSolrConnectionTest, DocValuesMissingTest, TestBinaryField, TestRemoteStreaming, HighlighterMaxOffsetTest, TestPseudoReturnFields, TestFastLRUCache, RuleEngineTest, TestCSVLoader, ConjunctionSolrSpellCheckerTest, TestFieldTypeCollectionResource, StatelessScriptUpdateProcessorFactoryTest, TestDynamicFieldCollectionResource, TestNonDefinedSimilarityFactory, OpenExchangeRatesOrgProviderTest, TestGroupingSearch, TestHashQParserPlugin, SchemaVersionSpecificBehaviorTest, TestAddFieldRealTimeGet, SampleTest, MultiTermTest, SolrIndexMetricsTest]
   [junit4] Completed [52/674 (1!)] on J0 in 2.14s, 1 test, 1 failure <<< FAILURES!

[...truncated 941 lines...]
   [junit4] Suite: org.apache.solr.cloud.PeerSyncReplicationTest
   [junit4]   2> Creating dataDir: /export/home/jenkins/workspace/Lucene-Solr-master-Solaris/solr/build/solr-core/test/J1/temp/solr.cloud.PeerSyncReplicationTest_AE05F34AC7BDDDDF-001/init-core-data-001
   [junit4]   2> 1247353 INFO  (SUITE-PeerSyncReplicationTest-seed#[AE05F34AC7BDDDDF]-worker) [    ] o.a.s.SolrTestCaseJ4 Randomized ssl (false) and clientAuth (true) via: @org.apache.solr.util.RandomizeSSL(reason=, value=NaN, ssl=NaN, clientAuth=NaN)
   [junit4]   2> 1247353 INFO  (SUITE-PeerSyncReplicationTest-seed#[AE05F34AC7BDDDDF]-worker) [    ] o.a.s.BaseDistributedSearchTestCase Setting hostContext system property: /
   [junit4]   2> 1247360 INFO  (TEST-PeerSyncReplicationTest.test-seed#[AE05F34AC7BDDDDF]) [    ] o.a.s.c.ZkTestServer STARTING ZK TEST SERVER
   [junit4]   2> 1247360 INFO  (Thread-3179) [    ] o.a.s.c.ZkTestServer client port:0.0.0.0/0.0.0.0:0
   [junit4]   2> 1247360 INFO  (Thread-3179) [    ] o.a.s.c.ZkTestServer Starting server
   [junit4]   2> 1247460 INFO  (TEST-PeerSyncReplicationTest.test-seed#[AE05F34AC7BDDDDF]) [    ] o.a.s.c.ZkTestServer start zk server on port:64029
   [junit4]   2> 1247489 INFO  (TEST-PeerSyncReplicationTest.test-seed#[AE05F34AC7BDDDDF]) [    ] o.a.s.c.AbstractZkTestCase put /export/home/jenkins/workspace/Lucene-Solr-master-Solaris/solr/core/src/test-files/solr/collection1/conf/solrconfig-tlog.xml to /configs/conf1/solrconfig.xml
   [junit4]   2> 1247491 INFO  (TEST-PeerSyncReplicationTest.test-seed#[AE05F34AC7BDDDDF]) [    ] o.a.s.c.AbstractZkTestCase put /export/home/jenkins/workspace/Lucene-Solr-master-Solaris/solr/core/src/test-files/solr/collection1/conf/schema.xml to /configs/conf1/schema.xml
   [junit4]   2> 1247493 INFO  (TEST-PeerSyncReplicationTest.test-seed#[AE05F34AC7BDDDDF]) [    ] o.a.s.c.AbstractZkTestCase put /export/home/jenkins/workspace/Lucene-Solr-master-Solaris/solr/core/src/test-files/solr/collection1/conf/solrconfig.snippet.randomindexconfig.xml to /configs/conf1/solrconfig.snippet.randomindexconfig.xml
   [junit4]   2> 1247495 INFO  (TEST-PeerSyncReplicationTest.test-seed#[AE05F34AC7BDDDDF]) [    ] o.a.s.c.AbstractZkTestCase put /export/home/jenkins/workspace/Lucene-Solr-master-Solaris/solr/core/src/test-files/solr/collection1/conf/stopwords.txt to /configs/conf1/stopwords.txt
   [junit4]   2> 1247496 INFO  (TEST-PeerSyncReplicationTest.test-seed#[AE05F34AC7BDDDDF]) [    ] o.a.s.c.AbstractZkTestCase put /export/home/jenkins/workspace/Lucene-Solr-master-Solaris/solr/core/src/test-files/solr/collection1/conf/protwords.txt to /configs/conf1/protwords.txt
   [junit4]   2> 1247498 INFO  (TEST-PeerSyncReplicationTest.test-seed#[AE05F34AC7BDDDDF]) [    ] o.a.s.c.AbstractZkTestCase put /export/home/jenkins/workspace/Lucene-Solr-master-Solaris/solr/core/src/test-files/solr/collection1/conf/currency.xml to /configs/conf1/currency.xml
   [junit4]   2> 1247500 INFO  (TEST-PeerSyncReplicationTest.test-seed#[AE05F34AC7BDDDDF]) [    ] o.a.s.c.AbstractZkTestCase put /export/home/jenkins/workspace/Lucene-Solr-master-Solaris/solr/core/src/test-files/solr/collection1/conf/enumsConfig.xml to /configs/conf1/enumsConfig.xml
   [junit4]   2> 1247501 INFO  (TEST-PeerSyncReplicationTest.test-seed#[AE05F34AC7BDDDDF]) [    ] o.a.s.c.AbstractZkTestCase put /export/home/jenkins/workspace/Lucene-Solr-master-Solaris/solr/core/src/test-files/solr/collection1/conf/open-exchange-rates.json to /configs/conf1/open-exchange-rates.json
   [junit4]   2> 1247503 INFO  (TEST-PeerSyncReplicationTest.test-seed#[AE05F34AC7BDDDDF]) [    ] o.a.s.c.AbstractZkTestCase put /export/home/jenkins/workspace/Lucene-Solr-master-Solaris/solr/core/src/test-files/solr/collection1/conf/mapping-ISOLatin1Accent.txt to /configs/conf1/mapping-ISOLatin1Accent.txt
   [junit4]   2> 1247505 INFO  (TEST-PeerSyncReplicationTest.test-seed#[AE05F34AC7BDDDDF]) [    ] o.a.s.c.AbstractZkTestCase put /export/home/jenkins/workspace/Lucene-Solr-master-Solaris/solr/core/src/test-files/solr/collection1/conf/old_synonyms.txt to /configs/conf1/old_synonyms.txt
   [junit4]   2> 1247506 INFO  (TEST-PeerSyncReplicationTest.test-seed#[AE05F34AC7BDDDDF]) [    ] o.a.s.c.AbstractZkTestCase put /export/home/jenkins/workspace/Lucene-Solr-master-Solaris/solr/core/src/test-files/solr/collection1/conf/synonyms.txt to /configs/conf1/synonyms.txt
   [junit4]   2> 1247718 INFO  (TEST-PeerSyncReplicationTest.test-seed#[AE05F34AC7BDDDDF]) [    ] o.a.s.SolrTestCaseJ4 Writing core.properties file to /export/home/jenkins/workspace/Lucene-Solr-master-Solaris/solr/build/solr-core/test/J1/temp/solr.cloud.PeerSyncReplicationTest_AE05F34AC7BDDDDF-001/control-001/cores/collection1
   [junit4]   2> 1247720 INFO  (TEST-PeerSyncReplicationTest.test-seed#[AE05F34AC7BDDDDF]) [    ] o.e.j.s.Server jetty-9.3.14.v20161028
   [junit4]   2> 1247721 INFO  (TEST-PeerSyncReplicationTest.test-seed#[AE05F34AC7BDDDDF]) [    ] o.e.j.s.h.ContextHandler Started o.e.j.s.ServletContextHandler@54d1b774{/,null,AVAILABLE}
   [junit4]   2> 1247723 INFO  (TEST-PeerSyncReplicationTest.test-seed#[AE05F34AC7BDDDDF]) [    ] o.e.j.s.AbstractConnector Started ServerConnector@e5cd439{HTTP/1.1,[http/1.1]}{127.0.0.1:42188}
   [junit4]   2> 1247723 INFO  (TEST-PeerSyncReplicationTest.test-seed#[AE05F34AC7BDDDDF]) [    ] o.e.j.s.Server Started @1251052ms
   [junit4]   2> 1247723 INFO  (TEST-PeerSyncReplicationTest.test-seed#[AE05F34AC7BDDDDF]) [    ] o.a.s.c.s.e.JettySolrRunner Jetty properties: {solr.data.dir=/export/home/jenkins/workspace/Lucene-Solr-master-Solaris/solr/build/solr-core/test/J1/temp/solr.cloud.PeerSyncReplicationTest_AE05F34AC7BDDDDF-001/tempDir-001/control/data, hostContext=/, hostPort=42188, coreRootDirectory=/export/home/jenkins/workspace/Lucene-Solr-master-Solaris/solr/build/solr-core/test/J1/../../../../../../../../../../export/home/jenkins/workspace/Lucene-Solr-master-Solaris/solr/build/solr-core/test/J1/temp/solr.cloud.PeerSyncReplicationTest_AE05F34AC7BDDDDF-001/control-001/cores}
   [junit4]   2> 1247724 ERROR (TEST-PeerSyncReplicationTest.test-seed#[AE05F34AC7BDDDDF]) [    ] o.a.s.s.StartupLoggingUtils Missing Java Option solr.log.dir. Logging may be missing or incomplete.
   [junit4]   2> 1247724 INFO  (TEST-PeerSyncReplicationTest.test-seed#[AE05F34AC7BDDDDF]) [    ] o.a.s.s.SolrDispatchFilter  ___      _       Welcome to Apache Solr™ version 7.0.0
   [junit4]   2> 1247724 INFO  (TEST-PeerSyncReplicationTest.test-seed#[AE05F34AC7BDDDDF]) [    ] o.a.s.s.SolrDispatchFilter / __| ___| |_ _   Starting in cloud mode on port null
   [junit4]   2> 1247724 INFO  (TEST-PeerSyncReplicationTest.test-seed#[AE05F34AC7BDDDDF]) [    ] o.a.s.s.SolrDispatchFilter \__ \/ _ \ | '_|  Install dir: null
   [junit4]   2> 1247724 INFO  (TEST-PeerSyncReplicationTest.test-seed#[AE05F34AC7BDDDDF]) [    ] o.a.s.s.SolrDispatchFilter |___/\___/_|_|    Start time: 2017-01-03T12:39:51.159Z
   [junit4]   2> 1247738 INFO  (TEST-PeerSyncReplicationTest.test-seed#[AE05F34AC7BDDDDF]) [    ] o.a.s.s.SolrDispatchFilter Loading solr.xml from SolrHome (not found in ZooKeeper)
   [junit4]   2> 1247738 INFO  (TEST-PeerSyncReplicationTest.test-seed#[AE05F34AC7BDDDDF]) [    ] o.a.s.c.SolrXmlConfig Loading container configuration from /export/home/jenkins/workspace/Lucene-Solr-master-Solaris/solr/build/solr-core/test/J1/temp/solr.cloud.PeerSyncReplicationTest_AE05F34AC7BDDDDF-001/control-001/solr.xml
   [junit4]   2> 1247756 INFO  (TEST-PeerSyncReplicationTest.test-seed#[AE05F34AC7BDDDDF]) [    ] o.a.s.c.ZkContainer Zookeeper client=127.0.0.1:64029/solr
   [junit4]   2> 1247800 INFO  (TEST-PeerSyncReplicationTest.test-seed#[AE05F34AC7BDDDDF]) [n:127.0.0.1:42188_    ] o.a.s.c.OverseerElectionContext I am going to be the leader 127.0.0.1:42188_
   [junit4]   2> 1247801 INFO  (TEST-PeerSyncReplicationTest.test-seed#[AE05F34AC7BDDDDF]) [n:127.0.0.1:42188_    ] o.a.s.c.Overseer Overseer (id=97219195096072196-127.0.0.1:42188_-n_0000000000) starting
   [junit4]   2> 1247812 INFO  (TEST-PeerSyncReplicationTest.test-seed#[AE05F34AC7BDDDDF]) [n:127.0.0.1:42188_    ] o.a.s.c.ZkController Register node as live in ZooKeeper:/live_nodes/127.0.0.1:42188_
   [junit4]   2> 1247814 INFO  (OverseerStateUpdate-97219195096072196-127.0.0.1:42188_-n_0000000000) [n:127.0.0.1:42188_    ] o.a.s.c.c.ZkStateReader Updated live nodes from ZooKeeper... (0) -> (1)
   [junit4]   2> 1247961 INFO  (TEST-PeerSyncReplicationTest.test-seed#[AE05F34AC7BDDDDF]) [n:127.0.0.1:42188_    ] o.a.s.c.CorePropertiesLocator Found 1 core definitions underneath /export/home/jenkins/workspace/Lucene-Solr-master-Solaris/solr/build/solr-core/test/J1/../../../../../../../../../../export/home/jenkins/workspace/Lucene-Solr-master-Solaris/solr/build/solr-core/test/J1/temp/solr.cloud.PeerSyncReplicationTest_AE05F34AC7BDDDDF-001/control-001/cores
   [junit4]   2> 1247961 INFO  (TEST-PeerSyncReplicationTest.test-seed#[AE05F34AC7BDDDDF]) [n:127.0.0.1:42188_    ] o.a.s.c.CorePropertiesLocator Cores are: [collection1]
   [junit4]   2> 1247966 INFO  (OverseerStateUpdate-97219195096072196-127.0.0.1:42188_-n_0000000000) [n:127.0.0.1:42188_    ] o.a.s.c.o.ReplicaMutator Assigning new node to shard shard=shard1
   [junit4]   2> 1247981 INFO  (coreLoadExecutor-5563-thread-1-processing-n:127.0.0.1:42188_) [n:127.0.0.1:42188_ c:control_collection   x:collection1] o.a.s.c.SolrConfig Using Lucene MatchVersion: 7.0.0
   [junit4]   2> 1247992 INFO  (coreLoadExecutor-5563-thread-1-processing-n:127.0.0.1:42188_) [n:127.0.0.1:42188_ c:control_collection   x:collection1] o.a.s.s.IndexSchema [collection1] Schema name=test
   [junit4]   2> 1248090 WARN  (coreLoadExecutor-5563-thread-1-processing-n:127.0.0.1:42188_) [n:127.0.0.1:42188_ c:control_collection   x:collection1] o.a.s.s.IndexSchema [collection1] default search field in schema is text. WARNING: Deprecated, please use 'df' on request instead.
   [junit4]   2> 1248092 INFO  (coreLoadExecutor-5563-thread-1-processing-n:127.0.0.1:42188_) [n:127.0.0.1:42188_ c:control_collection   x:collection1] o.a.s.s.IndexSchema Loaded schema test/1.0 with uniqueid field id
   [junit4]   2> 1248106 INFO  (coreLoadExecutor-5563-thread-1-processing-n:127.0.0.1:42188_) [n:127.0.0.1:42188_ c:control_collection   x:collection1] o.a.s.c.CoreContainer Creating SolrCore 'collection1' using configuration from collection control_collection
   [junit4]   2> 1248106 INFO  (coreLoadExecutor-5563-thread-1-processing-n:127.0.0.1:42188_) [n:127.0.0.1:42188_ c:control_collection   x:collection1] o.a.s.c.SolrCore [[collection1] ] Opening new SolrCore at [/export/home/jenkins/workspace/Lucene-Solr-master-Solaris/solr/build/solr-core/test/J1/temp/solr.cloud.PeerSyncReplicationTest_AE05F34AC7BDDDDF-001/control-001/cores/collection1], dataDir=[/export/home/jenkins/workspace/Lucene-Solr-master-Solaris/solr/build/solr-core/test/J1/../../../../../../../../../../export/home/jenkins/workspace/Lucene-Solr-master-Solaris/solr/build/solr-core/test/J1/temp/solr.cloud.PeerSyncReplicationTest_AE05F34AC7BDDDDF-001/control-001/cores/collection1/data/]
   [junit4]   2> 1248107 INFO  (coreLoadExecutor-5563-thread-1-processing-n:127.0.0.1:42188_) [n:127.0.0.1:42188_ c:control_collection   x:collection1] o.a.s.c.JmxMonitoredMap JMX monitoring is enabled. Adding Solr mbeans to JMX Server: com.sun.jmx.mbeanserver.JmxMBeanServer@769e78ab
   [junit4]   2> 1248109 INFO  (coreLoadExecutor-5563-thread-1-processing-n:127.0.0.1:42188_) [n:127.0.0.1:42188_ c:control_collection   x:collection1] o.a.s.u.RandomMergePolicy RandomMergePolicy wrapping class org.apache.lucene.index.LogDocMergePolicy: [LogDocMergePolicy: minMergeSize=1000, mergeFactor=12, maxMergeSize=9223372036854775807, maxMergeSizeForForcedMerge=9223372036854775807, calibrateSizeByDeletes=false, maxMergeDocs=2147483647, maxCFSSegmentSizeMB=8.796093022207999E12, noCFSRatio=0.0]
   [junit4]   2> 1248118 WARN  (coreLoadExecutor-5563-thread-1-processing-n:127.0.0.1:42188_) [n:127.0.0.1:42188_ c:control_collection   x:collection1] o.a.s.c.RequestHandlers INVALID paramSet a in requestHandler {type = requestHandler,name = /dump,class = DumpRequestHandler,attributes = {initParams=a, name=/dump, class=DumpRequestHandler},args = {defaults={a=A,b=B}}}
   [junit4]   2> 1248128 INFO  (coreLoadExecutor-5563-thread-1-processing-n:127.0.0.1:42188_) [n:127.0.0.1:42188_ c:control_collection   x:collection1] o.a.s.u.UpdateHandler Using UpdateLog implementation: org.apache.solr.update.UpdateLog
   [junit4]   2> 1248128 INFO  (coreLoadExecutor-5563-thread-1-processing-n:127.0.0.1:42188_) [n:127.0.0.1:42188_ c:control_collection   x:collection1] o.a.s.u.UpdateLog Initializing UpdateLog: dataDir= defaultSyncLevel=FLUSH numRecordsToKeep=1000 maxNumLogsToKeep=10 numVersionBuckets=65536
   [junit4]   2> 1248129 INFO  (coreLoadExecutor-5563-thread-1-processing-n:127.0.0.1:42188_) [n:127.0.0.1:42188_ c:control_collection   x:collection1] o.a.s.u.CommitTracker Hard AutoCommit: disabled
   [junit4]   2> 1248129 INFO  (coreLoadExecutor-5563-thread-1-processing-n:127.0.0.1:42188_) [n:127.0.0.1:42188_ c:control_collection   x:collection1] o.a.s.u.CommitTracker Soft AutoCommit: disabled
   [junit4]   2> 1248129 INFO  (coreLoadExecutor-5563-thread-1-processing-n:127.0.0.1:42188_) [n:127.0.0.1:42188_ c:control_collection   x:collection1] o.a.s.u.RandomMergePolicy RandomMergePolicy wrapping class org.apache.lucene.index.LogByteSizeMergePolicy: [LogByteSizeMergePolicy: minMergeSize=1677721, mergeFactor=32, maxMergeSize=2147483648, maxMergeSizeForForcedMerge=9223372036854775807, calibrateSizeByDeletes=false, maxMergeDocs=2147483647, maxCFSSegmentSizeMB=8.796093022207999E12, noCFSRatio=0.36210760436146994]
   [junit4]   2> 1248131 INFO  (coreLoadExecutor-5563-thread-1-processing-n:127.0.0.1:42188_) [n:127.0.0.1:42188_ c:control_collection   x:collection1] o.a.s.s.SolrIndexSearcher Opening [Searcher@14db89ad[collection1] main]
   [junit4]   2> 1248133 INFO  (coreLoadExecutor-5563-thread-1-processing-n:127.0.0.1:42188_) [n:127.0.0.1:42188_ c:control_collection   x:collection1] o.a.s.r.ManagedResourceStorage Configured ZooKeeperStorageIO with znodeBase: /configs/conf1
   [junit4]   2> 1248133 INFO  (coreLoadExecutor-5563-thread-1-processing-n:127.0.0.1:42188_) [n:127.0.0.1:42188_ c:control_collection   x:collection1] o.a.s.r.ManagedResourceStorage Loaded null at path _rest_managed.json using ZooKeeperStorageIO:path=/configs/conf1
   [junit4]   2> 1248133 INFO  (coreLoadExecutor-5563-thread-1-processing-n:127.0.0.1:42188_) [n:127.0.0.1:42188_ c:control_collection   x:collection1] o.a.s.h.ReplicationHandler Commits will be reserved for  10000
   [junit4]   2> 1248134 INFO  (coreLoadExecutor-5563-thread-1-processing-n:127.0.0.1:42188_) [n:127.0.0.1:42188_ c:control_collection   x:collection1] o.a.s.u.UpdateLog Could not find max version in index or recent updates, using new clock 1555507122346655744
   [junit4]   2> 1248142 INFO  (coreZkRegister-5556-thread-1-processing-n:127.0.0.1:42188_ x:collection1 c:control_collection) [n:127.0.0.1:42188_ c:control_collection s:shard1 r:core_node1 x:collection1] o.a.s.c.ShardLeaderElectionContext Enough replicas found to continue.
   [junit4]   2> 1248142 INFO  (coreZkRegister-5556-thread-1-processing-n:127.0.0.1:42188_ x:collection1 c:control_collection) [n:127.0.0.1:42188_ c:control_collection s:shard1 r:core_node1 x:collection1] o.a.s.c.ShardLeaderElectionContext I may be the new leader - try and sync
   [junit4]   2> 1248143 INFO  (coreZkRegister-5556-thread-1-processing-n:127.0.0.1:42188_ x:collection1 c:control_collection) [n:127.0.0.1:42188_ c:control_collection s:shard1 r:core_node1 x:collection1] o.a.s.c.SyncStrategy Sync replicas to http://127.0.0.1:42188/collection1/
   [junit4]   2> 1248143 INFO  (coreZkRegister-5556-thread-1-processing-n:127.0.0.1:42188_ x:collection1 c:control_collection) [n:127.0.0.1:42188_ c:control_collection s:shard1 r:core_node1 x:collection1] o.a.s.c.SyncStrategy Sync Success - now sync replicas to me
   [junit4]   2> 1248143 INFO  (coreZkRegister-5556-thread-1-processing-n:127.0.0.1:42188_ x:collection1 c:control_collection) [n:127.0.0.1:42188_ c:control_collection s:shard1 r:core_node1 x:collection1] o.a.s.c.SyncStrategy http://127.0.0.1:42188/collection1/ has no replicas
   [junit4]   2> 1248144 INFO  (searcherExecutor-5564-thread-1-processing-n:127.0.0.1:42188_ x:collection1 c:control_collection) [n:127.0.0.1:42188_ c:control_collection   x:collection1] o.a.s.c.SolrCore [collection1] Registered new searcher Searcher@14db89ad[collection1] main{ExitableDirectoryReader(UninvertingDirectoryReader())}
   [junit4]   2> 1248149 INFO  (coreZkRegister-5556-thread-1-processing-n:127.0.0.1:42188_ x:collection1 c:control_collection) [n:127.0.0.1:42188_ c:control_collection s:shard1 r:core_node1 x:collection1] o.a.s.c.ShardLeaderElectionContext I am the new leader: http://127.0.0.1:42188/collection1/ shard1
   [junit4]   2> 1248301 INFO  (coreZkRegister-5556-thread-1-processing-n:127.0.0.1:42188_ x:collection1 c:control_collection) [n:127.0.0.1:42188_ c:control_collection s:shard1 r:core_node1 x:collection1] o.a.s.c.ZkController I am the leader, no recovery necessary
   [junit4]   2> 1248627 INFO  (TEST-PeerSyncReplicationTest.test-seed#[AE05F34AC7BDDDDF]) [    ] o.a.s.c.c.ZkStateReader Updated live nodes from ZooKeeper... (0) -> (1)
   [junit4]   2> 1248629 INFO  (TEST-PeerSyncReplicationTest.test-seed#[AE05F34AC7BDDDDF]) [    ] o.a.s.c.s.i.ZkClientClusterStateProvider Cluster at 127.0.0.1:64029/solr ready
   [junit4]   2> 1248629 INFO  (TEST-PeerSyncReplicationTest.test-seed#[AE05F34AC7BDDDDF]) [    ] o.a.s.c.ChaosMonkey monkey: init - expire sessions:false cause connection loss:false
   [junit4]   2> 1248888 INFO  (TEST-PeerSyncReplicationTest.test-seed#[AE05F34AC7BDDDDF]) [    ] o.a.s.SolrTestCaseJ4 Writing core.properties file to /export/home/jenkins/workspace/Lucene-Solr-master-Solaris/solr/build/solr-core/test/J1/temp/solr.cloud.PeerSyncReplicationTest_AE05F34AC7BDDDDF-001/shard-1-001/cores/collection1
   [junit4]   2> 1248889 INFO  (TEST-PeerSyncReplicationTest.test-seed#[AE05F34AC7BDDDDF]) [    ] o.a.s.c.AbstractFullDistribZkTestBase create jetty 1 in directory /export/home/jenkins/workspace/Lucene-Solr-master-Solaris/solr/build/solr-core/test/J1/temp/solr.cloud.PeerSyncReplicationTest_AE05F34AC7BDDDDF-001/shard-1-001
   [junit4]   2> 1248889 INFO  (TEST-PeerSyncReplicationTest.test-seed#[AE05F34AC7BDDDDF]) [    ] o.e.j.s.Server jetty-9.3.14.v20161028
   [junit4]   2> 1248891 INFO  (TEST-PeerSyncReplicationTest.test-seed#[AE05F34AC7BDDDDF]) [    ] o.e.j.s.h.ContextHandler Started o.e.j.s.ServletContextHandler@d5ddee4{/,null,AVAILABLE}
   [junit4]   2> 1248891 INFO  (TEST-PeerSyncReplicationTest.test-seed#[AE05F34AC7BDDDDF]) [    ] o.e.j.s.AbstractConnector Started ServerConnector@38d74c8a{HTTP/1.1,[http/1.1]}{127.0.0.1:45611}
   [junit4]   2> 1248891 INFO  (TEST-PeerSyncReplicationTest.test-seed#[AE05F34AC7BDDDDF]) [    ] o.e.j.s.Server Started @1252221ms
   [junit4]   2> 1248891 INFO  (TEST-PeerSyncReplicationTest.test-seed#[AE05F34AC7BDDDDF]) [    ] o.a.s.c.s.e.JettySolrRunner Jetty properties: {solr.data.dir=/export/home/jenkins/workspace/Lucene-Solr-master-Solaris/solr/build/solr-core/test/J1/temp/solr.cloud.PeerSyncReplicationTest_AE05F34AC7BDDDDF-001/tempDir-001/jetty1, solrconfig=solrconfig.xml, hostContext=/, hostPort=45611, coreRootDirectory=/export/home/jenkins/workspace/Lucene-Solr-master-Solaris/solr/build/solr-core/test/J1/../../../../../../../../../../export/home/jenkins/workspace/Lucene-Solr-master-Solaris/solr/build/solr-core/test/J1/temp/solr.cloud.PeerSyncReplicationTest_AE05F34AC7BDDDDF-001/shard-1-001/cores}
   [junit4]   2> 1248892 ERROR (TEST-PeerSyncReplicationTest.test-seed#[AE05F34AC7BDDDDF]) [    ] o.a.s.s.StartupLoggingUtils Missing Java Option solr.log.dir. Logging may be missing or incomplete.
   [junit4]   2> 1248892 INFO  (TEST-PeerSyncReplicationTest.test-seed#[AE05F34AC7BDDDDF]) [    ] o.a.s.s.SolrDispatchFilter  ___      _       Welcome to Apache Solr™ version 7.0.0
   [junit4]   2> 1248893 INFO  (TEST-PeerSyncReplicationTest.test-seed#[AE05F34AC7BDDDDF]) [    ] o.a.s.s.SolrDispatchFilter / __| ___| |_ _   Starting in cloud mode on port null
   [junit4]   2> 1248893 INFO  (TEST-PeerSyncReplicationTest.test-seed#[AE05F34AC7BDDDDF]) [    ] o.a.s.s.SolrDispatchFilter \__ \/ _ \ | '_|  Install dir: null
   [junit4]   2> 1248893 INFO  (TEST-PeerSyncReplicationTest.test-seed#[AE05F34AC7BDDDDF]) [    ] o.a.s.s.SolrDispatchFilter |___/\___/_|_|    Start time: 2017-01-03T12:39:52.328Z
   [junit4]   2> 1248897 INFO  (TEST-PeerSyncReplicationTest.test-seed#[AE05F34AC7BDDDDF]) [    ] o.a.s.s.SolrDispatchFilter Loading solr.xml from SolrHome (not found in ZooKeeper)
   [junit4]   2> 1248897 INFO  (TEST-PeerSyncReplicationTest.test-seed#[AE05F34AC7BDDDDF]) [    ] o.a.s.c.SolrXmlConfig Loading container configuration from /export/home/jenkins/workspace/Lucene-Solr-master-Solaris/solr/build/solr-core/test/J1/temp/solr.cloud.PeerSyncReplicationTest_AE05F34AC7BDDDDF-001/shard-1-001/solr.xml
   [junit4]   2> 1248903 INFO  (TEST-PeerSyncReplicationTest.test-seed#[AE05F34AC7BDDDDF]) [    ] o.a.s.c.ZkContainer Zookeeper client=127.0.0.1:64029/solr
   [junit4]   2> 1248924 INFO  (TEST-PeerSyncReplicationTest.test-seed#[AE05F34AC7BDDDDF]) [n:127.0.0.1:45611_    ] o.a.s.c.c.ZkStateReader Updated live nodes from ZooKeeper... (0) -> (1)
   [junit4]   2> 1248935 INFO  (TEST-PeerSyncReplicationTest.test-seed#[AE05F34AC7BDDDDF]) [n:127.0.0.1:45611_    ] o.a.s.c.ZkController Register node as live in ZooKeeper:/live_nodes/127.0.0.1:45611_
   [junit4]   2> 1248939 INFO  (zkCallback-1897-thread-1) [    ] o.a.s.c.c.ZkStateReader Updated live nodes from ZooKeeper... (1) -> (2)
   [junit4]   2> 1248944 INFO  (zkCallback-1902-thread-1-processing-n:127.0.0.1:45611_) [n:127.0.0.1:45611_    ] o.a.s.c.c.ZkStateReader Updated live nodes from ZooKeeper... (1) -> (2)
   [junit4]   2> 1248944 INFO  (zkCallback-1893-thread-3-processing-n:127.0.0.1:42188_) [n:127.0.0.1:42188_    ] o.a.s.c.c.ZkStateReader Updated live nodes from ZooKeeper... (1) -> (2)
   [junit4]   2> 1249015 INFO  (TEST-PeerSyncReplicationTest.test-seed#[AE05F34AC7BDDDDF]) [n:127.0.0.1:45611_    ] o.a.s.c.CorePropertiesLocator Found 1 core definitions underneath /export/home/jenkins/workspace/Lucene-Solr-master-Solaris/solr/build/solr-core/test/J1/../../../../../../../../../../export/home/jenkins/workspace/Lucene-Solr-master-Solaris/solr/build/solr-core/test/J1/temp/solr.cloud.PeerSyncReplicationTest_AE05F34AC7BDDDDF-001/shard-1-001/cores
   [junit4]   2> 1249016 INFO  (TEST-PeerSyncReplicationTest.test-seed#[AE05F34AC7BDDDDF]) [n:127.0.0.1:45611_    ] o.a.s.c.CorePropertiesLocator Cores are: [collection1]
   [junit4]   2> 1249018 INFO  (OverseerStateUpdate-97219195096072196-127.0.0.1:42188_-n_0000000000) [n:127.0.0.1:42188_    ] o.a.s.c.o.ReplicaMutator Assigning new node to shard shard=shard1
   [junit4]   2> 1250035 INFO  (coreLoadExecutor-5574-thread-1-processing-n:127.0.0.1:45611_) [n:127.0.0.1:45611_ c:collection1   x:collection1] o.a.s.c.SolrConfig Using Lucene MatchVersion: 7.0.0
   [junit4]   2> 1250047 INFO  (coreLoadExecutor-5574-thread-1-processing-n:127.0.0.1:45611_) [n:127.0.0.1:45611_ c:collection1   x:collection1] o.a.s.s.IndexSchema [collection1] Schema name=test
   [junit4]   2> 1250180 WARN  (coreLoadExecutor-5574-thread-1-processing-n:127.0.0.1:45611_) [n:127.0.0.1:45611_ c:collection1   x:collection1] o.a.s.s.IndexSchema [collection1] default search field in schema is text. WARNING: Deprecated, please use 'df' on request instead.
   [junit4]   2> 1250182 INFO  (coreLoadExecutor-5574-thread-1-processing-n:127.0.0.1:45611_) [n:127.0.0.1:45611_ c:collection1   x:collection1] o.a.s.s.IndexSchema Loaded schema test/1.0 with uniqueid field id
   [junit4]   2> 1250208 INFO  (coreLoadExecutor-5574-thread-1-processing-n:127.0.0.1:45611_) [n:127.0.0.1:45611_ c:collection1   x:collection1] o.a.s.c.CoreContainer Creating SolrCore 'collection1' using configuration from collection collection1
   [junit4]   2> 1250208 INFO  (coreLoadExecutor-5574-thread-1-processing-n:127.0.0.1:45611_) [n:127.0.0.1:45611_ c:collection1   x:collection1] o.a.s.c.SolrCore [[collection1] ] Opening new SolrCore at [/export/home/jenkins/workspace/Lucene-Solr-master-Solaris/solr/build/solr-core/test/J1/temp/solr.cloud.PeerSyncReplicationTest_AE05F34AC7BDDDDF-001/shard-1-001/cores/collection1], dataDir=[/export/home/jenkins/workspace/Lucene-Solr-master-Solaris/solr/build/solr-core/test/J1/../../../../../../../../../../export/home/jenkins/workspace/Lucene-Solr-master-Solaris/solr/build/solr-core/test/J1/temp/solr.cloud.PeerSyncReplicationTest_AE05F34AC7BDDDDF-001/shard-1-001/cores/collection1/data/]
   [junit4]   2> 1250209 INFO  (coreLoadExecutor-5574-thread-1-processing-n:127.0.0.1:45611_) [n:127.0.0.1:45611_ c:collection1   x:collection1] o.a.s.c.JmxMonitoredMap JMX monitoring is enabled. Adding Solr mbeans to JMX Server: com.sun.jmx.mbeanserver.JmxMBeanServer@769e78ab
   [junit4]   2> 1250211 INFO  (coreLoadExecutor-5574-thread-1-processing-n:127.0.0.1:45611_) [n:127.0.0.1:45611_ c:collection1   x:collection1] o.a.s.u.RandomMergePolicy RandomMergePolicy wrapping class org.apache.lucene.index.LogDocMergePolicy: [LogDocMergePolicy: minMergeSize=1000, mergeFactor=12, maxMergeSize=9223372036854775807, maxMergeSizeForForcedMerge=9223372036854775807, calibrateSizeByDeletes=false, maxMergeDocs=2147483647, maxCFSSegmentSizeMB=8.796093022207999E12, noCFSRatio=0.0]
   [junit4]   2> 1250221 WARN  (coreLoadExecutor-5574-thread-1-processing-n:127.0.0.1:45611_) [n:127.0.0.1:45611_ c:collection1   x:collection1] o.a.s.c.RequestHandlers INVALID paramSet a in requestHandler {type = requestHandler,name = /dump,class = DumpRequestHandler,attributes = {initParams=a, name=/dump, class=DumpRequestHandler},args = {defaults={a=A,b=B}}}
   [junit4]   2> 1250232 INFO  (coreLoadExecutor-5574-thread-1-processing-n:127.0.0.1:45611_) [n:127.0.0.1:45611_ c:collection1   x:collection1] o.a.s.u.UpdateHandler Using UpdateLog implementation: org.apache.solr.update.UpdateLog
   [junit4]   2> 1250233 INFO  (coreLoadExecutor-5574-thread-1-processing-n:127.0.0.1:45611_) [n:127.0.0.1:45611_ c:collection1   x:collection1] o.a.s.u.UpdateLog Initializing UpdateLog: dataDir= defaultSyncLevel=FLUSH numRecordsToKeep=1000 maxNumLogsToKeep=10 numVersionBuckets=65536
   [junit4]   2> 1250233 INFO  (coreLoadExecutor-5574-thread-1-processing-n:127.0.0.1:45611_) [n:127.0.0.1:45611_ c:collection1   x:collection1] o.a.s.u.CommitTracker Hard AutoCommit: disabled
   [junit4]   2> 1250233 INFO  (coreLoadExecutor-5574-thread-1-processing-n:127.0.0.1:45611_) [n:127.0.0.1:45611_ c:collection1   x:collection1] o.a.s.u.CommitTracker Soft AutoCommit: disabled
   [junit4]   2> 1250234 INFO  (coreLoadExecutor-5574-thread-1-processing-n:127.0.0.1:45611_) [n:127.0.0.1:45611_ c:collection1   x:collection1] o.a.s.u.RandomMergePolicy RandomMergePolicy wrapping class org.apache.lucene.index.LogByteSizeMergePolicy: [LogByteSizeMergePolicy: minMergeSize=1677721, mergeFactor=32, maxMergeSize=2147483648, maxMergeSizeForForcedMerge=9223372036854775807, calibrateSizeByDeletes=false, maxMergeDocs=2147483647, maxCFSSegmentSizeMB=8.796093022207999E12, noCFSRatio=0.36210760436146994]
   [junit4]   2> 1250235 INFO  (coreLoadExecutor-5574-thread-1-processing-n:127.0.0.1:45611_) [n:127.0.0.1:45611_ c:collection1   x:collection1] o.a.s.s.SolrIndexSearcher Opening [Searcher@7554e1b4[collection1] main]
   [junit4]   2> 1250237 INFO  (coreLoadExecutor-5574-thread-1-processing-n:127.0.0.1:45611_) [n:127.0.0.1:45611_ c:collection1   x:collection1] o.a.s.r.ManagedResourceStorage Configured ZooKeeperStorageIO with znodeBase: /configs/conf1
   [junit4]   2> 1250237 INFO  (coreLoadExecutor-5574-thread-1-processing-n:127.0.0.1:45611_) [n:127.0.0.1:45611_ c:collection1   x:collection1] o.a.s.r.ManagedResourceStorage Loaded null at path _rest_managed.json using ZooKeeperStorageIO:path=/configs/conf1
   [junit4]   2> 1250237 INFO  (coreLoadExecutor-5574-thread-1-processing-n:127.0.0.1:45611_) [n:127.0.0.1:45611_ c:collection1   x:collection1] o.a.s.h.ReplicationHandler Commits will be reserved for  10000
   [junit4]   2> 1250238 INFO  (searcherExecutor-5575-thread-1-processing-n:127.0.0.1:45611_ x:collection1 c:collection1) [n:127.0.0.1:45611_ c:collection1   x:collection1] o.a.s.c.SolrCore [collection1] Registered new searcher Searcher@7554e1b4[collection1] main{ExitableDirectoryReader(UninvertingDirectoryReader())}
   [junit4]   2> 1250239 INFO  (coreLoadExecutor-5574-thread-1-processing-n:127.0.0.1:45611_) [n:127.0.0.1:45611_ c:collection1   x:collection1] o.a.s.u.UpdateLog Could not find max version in index or recent updates, using new clock 1555507124553908224
   [junit4]   2> 1250253 INFO  (coreZkRegister-5569-thread-1-processing-n:127.0.0.1:45611_ x:collection1 c:collection1) [n:127.0.0.1:45611_ c:collection1 s:shard1 r:core_node1 x:collection1] o.a.s.c.ShardLeaderElectionContext Enough replicas found to continue.
   [junit4]   2> 1250254 INFO  (coreZkRegister-5569-thread-1-processing-n:127.0.0.1:45611_ x:collection1 c:collection1) [n:127.0.0.1:45611_ c:collection1 s:shard1 r:core_node1 x:collection1] o.a.s.c.ShardLeaderElectionContext I may be the new leader - try and sync
   [junit4]   2> 1250254 INFO  (coreZkRegister-5569-thread-1-processing-n:127.0.0.1:45611_ x:collection1 c:collection1) [n:127.0.0.1:45611_ c:collection1 s:shard1 r:core_node1 x:collection1] o.a.s.c.SyncStrategy Sync replicas to http://127.0.0.1:45611/collection1/
   [junit4]   2> 1250254 INFO  (coreZkRegister-5569-thread-1-processing-n:127.0.0.1:45611_ x:collection1 c:collection1) [n:127.0.0.1:45611_ c:collection1 s:shard1 r:core_node1 x:collection1] o.a.s.c.SyncStrategy Sync Success - now sync replicas to me
   [junit4]   2> 1250254 INFO  (coreZkRegister-5569-thread-1-processing-n:127.0.0.1:45611_ x:collection1 c:collection1) [n:127.0.0.1:45611_ c:collection1 s:shard1 r:core_node1 x:collection1] o.a.s.c.SyncStrategy http://127.0.0.1:45611/collection1/ has no replicas
   [junit4]   2> 1250262 INFO  (coreZkRegister-5569-thread-1-processing-n:127.0.0.1:45611_ x:collection1 c:collection1) [n:127.0.0.1:45611_ c:collection1 s:shard1 r:core_node1 x:collection1] o.a.s.c.ShardLeaderElectionContext I am the new leader: http://127.0.0.1:45611/collection1/ shard1
   [junit4]   2> 1250416 INFO  (coreZkRegister-5569-thread-1-processing-n:127.0.0.1:45611_ x:collection1 c:collection1) [n:127.0.0.1:45611_ c:collection1 s:shard1 r:core_node1 x:collection1] o.a.s.c.ZkController I am the leader, no recovery necessary
   [junit4]   2> 1250604 INFO  (TEST-PeerSyncReplicationTest.test-seed#[AE05F34AC7BDDDDF]) [    ] o.a.s.SolrTestCaseJ4 Writing core.properties file to /export/home/jenkins/workspace/Lucene-Solr-master-Solaris/solr/build/solr-core/test/J1/temp/solr.cloud.PeerSyncReplicationTest_AE05F34AC7BDDDDF-001/shard-2-001/cores/collection1
   [junit4]   2> 1250605 INFO  (TEST-PeerSyncReplicationTest.test-seed#[AE05F34AC7BDDDDF]) [    ] o.a.s.c.AbstractFullDistribZkTestBase create jetty 2 in directory /export/home/jenkins/workspace/Lucene-Solr-master-Solaris/solr/build/solr-core/test/J1/temp/solr.cloud.PeerSyncReplicationTest_AE05F34AC7BDDDDF-001/shard-2-001
   [junit4]   2> 1250606 INFO  (TEST-PeerSyncReplicationTest.test-seed#[AE05F34AC7BDDDDF]) [    ] o.e.j.s.Server jetty-9.3.14.v20161028
   [junit4]   2> 1250608 INFO  (TEST-PeerSyncReplicationTest.test-seed#[AE05F34AC7BDDDDF]) [    ] o.e.j.s.h.ContextHandler Started o.e.j.s.ServletContextHandler@337340ad{/,null,AVAILABLE}
   [junit4]   2> 1250609 INFO  (TEST-PeerSyncReplicationTest.test-seed#[AE05F34AC7BDDDDF]) [    ] o.e.j.s.AbstractConnector Started ServerConnector@2c9553bd{HTTP/1.1,[http/1.1]}{127.0.0.1:51064}
   [junit4]   2> 1250609 INFO  (TEST-PeerSyncReplicationTest.test-seed#[AE05F34AC7BDDDDF]) [    ] o.e.j.s.Server Started @1253939ms
   [junit4]   2> 1250609 INFO  (TEST-PeerSyncReplicationTest.test-seed#[AE05F34AC7BDDDDF]) [    ] o.a.s.c.s.e.JettySolrRunner Jetty properties: {solr.data.dir=/export/home/jenkins/workspace/Lucene-Solr-master-Solaris/solr/build/solr-core/test/J1/temp/solr.cloud.PeerSyncReplicationTest_AE05F34AC7BDDDDF-001/tempDir-001/jetty2, solrconfig=solrconfig.xml, hostContext=/, hostPort=51064, coreRootDirectory=/export/home/jenkins/workspace/Lucene-Solr-master-Solaris/solr/build/solr-core/test/J1/temp/solr.cloud.PeerSyncReplicationTest_AE05F34AC7BDDDDF-001/shard-2-001/cores}
   [junit4]   2> 1250609 ERROR (TEST-PeerSyncReplicationTest.test-seed#[AE05F34AC7BDDDDF]) [    ] o.a.s.s.StartupLoggingUtils Missing Java Option solr.log.dir. Logging may be missing or incomplete.
   [junit4]   2> 1250611 INFO  (TEST-PeerSyncReplicationTest.test-seed#[AE05F34AC7BDDDDF]) [    ] o.a.s.s.SolrDispatchFilter  ___      _       Welcome to Apache Solr™ version 7.0.0
   [junit4]   2> 1250611 INFO  (TEST-PeerSyncReplicationTest.test-seed#[AE05F34AC7BDDDDF]) [    ] o.a.s.s.SolrDispatchFilter / __| ___| |_ _   Starting in cloud mode on port null
   [junit4]   2> 1250611 INFO  (TEST-PeerSyncReplicationTest.test-seed#[AE05F34AC7BDDDDF]) [    ] o.a.s.s.SolrDispatchFilter \__ \/ _ \ | '_|  Install dir: null
   [junit4]   2> 1250611 INFO  (TEST-PeerSyncReplicationTest.test-seed#[AE05F34AC7BDDDDF]) [    ] o.a.s.s.SolrDispatchFilter |___/\___/_|_|    Start time: 2017-01-03T12:39:54.046Z
   [junit4]   2> 1250619 INFO  (TEST-PeerSyncReplicationTest.test-seed#[AE05F34AC7BDDDDF]) [    ] o.a.s.s.SolrDispatchFilter Loading solr.xml from SolrHome (not found in ZooKeeper)
   [junit4]   2> 1250619 INFO  (TEST-PeerSyncReplicationTest.test-seed#[AE05F34AC7BDDDDF]) [    ] o.a.s.c.SolrXmlConfig Loading container configuration from /export/home/jenkins/workspace/Lucene-Solr-master-Solaris/solr/build/solr-core/test/J1/temp/solr.cloud.PeerSyncReplicationTest_AE05F34AC7BDDDDF-001/shard-2-001/solr.xml
   [junit4]   2> 1250626 INFO  (TEST-PeerSyncReplicationTest.test-seed#[AE05F34AC7BDDDDF]) [    ] o.a.s.c.ZkContainer Zookeeper client=127.0.0.1:64029/solr
   [junit4]   2> 1250684 INFO  (TEST-PeerSyncReplicationTest.test-seed#[AE05F34AC7BDDDDF]) [n:127.0.0.1:51064_    ] o.a.s.c.c.ZkStateReader Updated live nodes from ZooKeeper... (0) -> (2)
   [junit4]   2> 1250692 INFO  (TEST-PeerSyncReplicationTest.test-seed#[AE05F34AC7BDDDDF]) [n:127.0.0.1:51064_    ] o.a.s.c.ZkController Register node as live in ZooKeeper:/live_nodes/127.0.0.1:51064_
   [junit4]   2> 1250695 INFO  (zkCallback-1893-thread-1-processing-n:127.0.0.1:42188_) [n:127.0.0.1:42188_    ] o.a.s.c.c.ZkStateReader Updated live nodes from ZooKeeper... (2) -> (3)
   [junit4]   2> 1250696 INFO  (zkCallback-1897-thread-1) [    ] o.a.s.c.c.ZkStateReader Updated live nodes from ZooKeeper... (2) -> (3)
   [junit4]   2> 1250697 INFO  (zkCallback-1902-thread-1-processing-n:127.0.0.1:45611_) [n:127.0.0.1:45611_    ] o.a.s.c.c.ZkStateReader Updated live nodes from ZooKeeper... (2) -> (3)
   [junit4]   2> 1250697 INFO  (zkCallback-1908-thread-1-processing-n:127.0.0.1:51064_) [n:127.0.0.1:51064_    ] o.a.s.c.c.ZkStateReader Updated live nodes from ZooKeeper... (2) -> (3)
   [junit4]   2> 1250834 INFO  (TEST-PeerSyncReplicationTest.test-seed#[AE05F34AC7BDDDDF]) [n:127.0.0.1:51064_    ] o.a.s.c.CorePropertiesLocator Found 1 core definitions underneath /export/home/jenkins/workspace/Lucene-Solr-master-Solaris/solr/build/solr-core/test/J1/temp/solr.cloud.PeerSyncReplicationTest_AE05F34AC7BDDDDF-001/shard-2-001/cores
   [junit4]   2> 1250834 INFO  (TEST-PeerSyncReplicationTest.test-seed#[AE05F34AC7BDDDDF]) [n:127.0.0.1:51064_    ] o.a.s.c.CorePropertiesLocator Cores are: [collection1]
   [junit4]   2> 1250836 INFO  (OverseerStateUpdate-97219195096072196-127.0.0.1:42188_-n_0000000000) [n:127.0.0.1:42188_    ] o.a.s.c.o.ReplicaMutator Assigning new node to shard shard=shard1
   [junit4]   2> 1251850 INFO  (coreLoadExecutor-5585-thread-1-processing-n:127.0.0.1:51064_) [n:127.0.0.1:51064_ c:collection1   x:collection1] o.a.s.c.SolrConfig Using Lucene MatchVersion: 7.0.0
   [junit4]   2> 1251862 INFO  (coreLoadExecutor-5585-thread-1-processing-n:127.0.0.1:51064_) [n:127.0.0.1:51064_ c:collection1   x:collection1] o.a.s.s.IndexSchema [collection1] Schema name=test
   [junit4]   2> 1251941 WARN  (coreLoadExecutor-5585-thread-1-processing-n:127.0.0.1:51064_) [n:127.0.0.1:51064_ c:collection1   x:collection1] o.a.s.s.IndexSchema [collection1] default search field in schema is text. WARNING: Deprecated, please use 'df' on request instead.
   [junit4]   2> 1251943 INFO  (coreLoadExecutor-5585-thread-1-processing-n:127.0.0.1:51064_) [n:127.0.0.1:51064_ c:collection1   x:collection1] o.a.s.s.IndexSchema Loaded schema test/1.0 with uniqueid field id
   [junit4]   2> 1251963 INFO  (coreLoadExecutor-5585-thread-1-processing-n:127.0.0.1:51064_) [n:127.0.0.1:51064_ c:collection1   x:collection1] o.a.s.c.CoreContainer Creating SolrCore 'collection1' using configuration from collection collection1
   [junit4]   2> 1251964 INFO  (coreLoadExecutor-5585-thread-1-processing-n:127.0.0.1:51064_) [n:127.0.0.1:51064_ c:collection1   x:collection1] o.a.s.c.SolrCore [[collection1] ] Opening new SolrCore at [/export/home/jenkins/workspace/Lucene-Solr-master-Solaris/solr/build/solr-core/test/J1/temp/solr.cloud.PeerSyncReplicationTest_AE05F34AC7BDDDDF-001/shard-2-001/cores/collection1], dataDir=[/export/home/jenkins/workspace/Lucene-Solr-master-Solaris/solr/build/solr-core/test/J1/temp/solr.cloud.PeerSyncReplicationTest_AE05F34AC7BDDDDF-001/shard-2-001/cores/collection1/data/]
   [junit4]   2> 1251964 INFO  (coreLoadExecutor-5585-thread-1-processing-n:127.0.0.1:51064_) [n:127.0.0.1:51064_ c:collection1   x:collection1] o.a.s.c.JmxMonitoredMap JMX monitoring is enabled. Adding Solr mbeans to JMX Server: com.sun.jmx.mbeanserver.JmxMBeanServer@769e78ab
   [junit4]   2> 1251987 INFO  (coreLoadExecutor-5585-thread-1-processing-n:127.0.0.1:51064_) [n:127.0.0.1:51064_ c:collection1   x:collection1] o.a.s.u.RandomMergePolicy RandomMergePolicy wrapping class org.apache.lucene.index.LogDocMergePolicy: [LogDocMergePolicy: minMergeSize=1000, mergeFactor=12, maxMergeSize=9223372036854775807, maxMergeSizeForForcedMerge=9223372036854775807, calibrateSizeByDeletes=false, maxMergeDocs=2147483647, maxCFSSegmentSizeMB=8.796093022207999E12, noCFSRatio=0.0]
   [junit4]   2> 1251994 WARN  (coreLoadExecutor-5585-thread-1-processing-n:127.0.0.1:51064_) [n:127.0.0.1:51064_ c:collection1   x:collection1] o.a.s.c.RequestHandlers INVALID paramSet a in requestHandler {type = requestHandler,name = /dump,class = DumpRequestHandler,attributes = {initParams=a, name=/dump, class=DumpRequestHandler},args = {defaults={a=A,b=B}}}
   [junit4]   2> 1252029 INFO  (coreLoadExecutor-5585-thread-1-processing-n:127.0.0.1:51064_) [n:127.0.0.1:51064_ c:collection1   x:collection1] o.a.s.u.UpdateHandler Using UpdateLog implementation: org.apache.solr.update.UpdateLog
   [junit4]   2> 1252030 INFO  (coreLoadExecutor-5585-thread-1-processing-n:127.0.0.1:51064_) [n:127.0.0.1:51064_ c:collection1   x:collection1] o.a.s.u.UpdateLog Initializing UpdateLog: dataDir= defaultSyncLevel=FLUSH numRecordsToKeep=1000 maxNumLogsToKeep=10 numVersionBuckets=65536
   [junit4]   2> 1252030 INFO  (coreLoadExecutor-5585-thread-1-processing-n:127.0.0.1:51064_) [n:127.0.0.1:51064_ c:collection1   x:collection1] o.a.s.u.CommitTracker Hard AutoCommit: disabled
   [junit4]   2> 1252030 INFO  (coreLoadExecutor-5585-thread-1-processing-n:127.0.0.1:51064_) [n:127.0.0.1:51064_ c:collection1   x:collection1] o.a.s.u.CommitTracker Soft AutoCommit: disabled
   [junit4]   2> 1252032 INFO  (coreLoadExecutor-5585-thread-1-processing-n:127.0.0.1:51064_) [n:127.0.0.1:51064_ c:collection1   x:collection1] o.a.s.u.RandomMergePolicy RandomMergePolicy wrapping class org.apache.lucene.index.LogByteSizeMergePolicy: [LogByteSizeMergePolicy: minMergeSize=1677721, mergeFactor=32, maxMergeSize=2147483648, maxMergeSizeForForcedMerge=9223372036854775807, calibrateSizeByDeletes=false, maxMergeDocs=2147483647, maxCFSSegmentSizeMB=8.796093022207999E12, noCFSRatio=0.36210760436146994]
   [junit4]   2> 1252033 INFO  (coreLoadExecutor-5585-thread-1-processing-n:127.0.0.1:51064_) [n:127.0.0.1:51064_ c:collection1   x:collection1] o.a.s.s.SolrIndexSearcher Opening [Searcher@61353acd[collection1] main]
   [junit4]   2> 1252035 INFO  (coreLoadExecutor-5585-thread-1-processing-n:127.0.0.1:51064_) [n:127.0.0.1:51064_ c:collection1   x:collection1] o.a.s.r.ManagedResourceStorage Configured ZooKeeperStorageIO with znodeBase: /configs/conf1
   [junit4]   2> 1252036 INFO  (coreLoadExecutor-5585-thread-1-processing-n:127.0.0.1:51064_) [n:127.0.0.1:51064_ c:collection1   x:collection1] o.a.s.r.ManagedResourceStorage Loaded null at path _rest_managed.json using ZooKeeperStorageIO:path=/configs/conf1
   [junit4]   2> 1252036 INFO  (coreLoadExecutor-5585-thread-1-processing-n:127.0.0.1:51064_) [n:127.0.0.1:51064_ c:collection1   x:collection1] o.a.s.h.ReplicationHandler Commits will be reserved for  10000
   [junit4]   2> 1252037 INFO  (coreLoadExecutor-5585-thread-1-processing-n:127.0.0.1:51064_) [n:127.0.0.1:51064_ c:collection1   x:collection1] o.a.s.u.UpdateLog Could not find max version in index or recent updates, using new clock 1555507126439247872
   [junit4]   2> 1252040 INFO  (searcherExecutor-5586-thread-1-processing-n:127.0.0.1:51064_ x:collection1 c:collection1) [n:127.0.0.1:51064_ c:collection1   x:collection1] o.a.s.c.SolrCore [collection1] Registered new searcher Searcher@61353acd[collection1] main{ExitableDirectoryReader(UninvertingDirectoryReader())}
   [junit4]   2> 1252043 INFO  (coreZkRegister-5580-thread-1-processing-n:127.0.0.1:51064_ x:collection1 c:collection1) [n:127.0.0.1:51064_ c:collection1 s:shard1 r:core_node2 x:collection1] o.a.s.c.ZkController Core needs to recover:collection1
   [junit4]   2> 1252044 INFO  (updateExecutor-1905-thread-1-processing-n:127.0.0.1:51064_ x:collection1 s:shard1 c:collection1 r:core_node2) [n:127.0.0.1:51064_ c:collection1 s:shard1 r:core_node2 x:collection1] o.a.s.u.DefaultSolrCoreState Running recovery
   [junit4]   2> 1252044 INFO  (recoveryExecutor-1906-thread-1-processing-n:127.0.0.1:51064_ x:collection1 s:shard1 c:collection1 r:core_node2) [n:127.0.0.1:51064_ c:collection1 s:shard1 r:core_node2 x:collection1] o.a.s.c.RecoveryStrategy Starting recovery process. recoveringAfterStartup=true
   [junit4]   2> 1252044 INFO  (recoveryExecutor-1906-thread-1-processing-n:127.0.0.1:51064_ x:collection1 s:shard1 c:collection1 r:core_node2) [n:127.0.0.1:51064_ c:collection1 s:shard1 r:core_node2 x:collection1] o.a.s.c.RecoveryStrategy ###### startupVersions=[[]]
   [junit4]   2> 1252045 INFO  (recoveryExecutor-1906-thread-1-processing-n:127.0.0.1:51064_ x:collection1 s:shard1 c:collection1 r:core_node2) [n:127.0.0.1:51064_ c:collection1 s:shard1 r:core_node2 x:collection1] o.a.s.c.RecoveryStrategy Begin buffering updates. core=[collection1]
   [junit4]   2> 1252045 INFO  (recoveryExecutor-1906-thread-1-processing-n:127.0.0.1:51064_ x:collection1 s:shard1 c:collection1 r:core_node2) [n:127.0.0.1:51064_ c:collection1 s:shard1 r:core_node2 x:collection1] o.a.s.u.UpdateLog Starting to buffer updates. FSUpdateLog{state=ACTIVE, tlog=null}
   [junit4]   2> 1252045 INFO  (recoveryExecutor-1906-thread-1-processing-n:127.0.0.1:51064_ x:collection1 s:shard1 c:collection1 r:core_node2) [n:127.0.0.1:51064_ c:collection1 s:shard1 r:core_node2 x:collection1] o.a.s.c.RecoveryStrategy Publishing state of core [collection1] as recovering, leader is [http://127.0.0.1:45611/collection1/] and I am [http://127.0.0.1:51064/collection1/]
   [junit4]   2> 1252048 INFO  (recoveryExecutor-1906-thread-1-processing-n:127.0.0.1:51064_ x:collection1 s:shard1 c:collection1 r:core_node2) [n:127.0.0.1:51064_ c:collection1 s:shard1 r:core_node2 x:collection1] o.a.s.c.RecoveryStrategy Sending prep recovery command to [http://127.0.0.1:45611]; [WaitForState: action=PREPRECOVERY&core=collection1&nodeName=127.0.0.1:51064_&coreNodeName=core_node2&state=recovering&checkLive=true&onlyIfLeader=true&onlyIfLeaderActive=true]
   [junit4]   2> 1252052 INFO  (qtp254943343-11728) [n:127.0.0.1:45611_    ] o.a.s.h.a.PrepRecoveryOp Going to wait for coreNodeName: core_node2, state: recovering, checkLive: true, onlyIfLeader: true, onlyIfLeaderActive: true
   [junit4]   2> 1252053 INFO  (qtp254943343-11728) [n:127.0.0.1:45611_    ] o.a.s.h.a.PrepRecoveryOp Will wait a max of 183 seconds to see collection1 (shard1 of collection1) have state: recovering
   [junit4]   2> 1252053 INFO  (qtp254943343-11728) [n:127.0.0.1:45611_    ] o.a.s.h.a.PrepRecoveryOp In WaitForState(recovering): collection=collection1, shard=shard1, thisCore=collection1, leaderDoesNotNeedRecovery=false, isLeader? true, live=true, checkLive=true, currentState=down, localState=active, nodeName=127.0.0.1:51064_, coreNodeName=core_node2, onlyIfActiveCheckResult=false, nodeProps: core_node2:{"core":"collection1","base_url":"http://127.0.0.1:51064","node_name":"127.0.0.1:51064_","state":"down"}
   [junit4]   2> 1252580 INFO  (TEST-PeerSyncReplicationTest.test-seed#[AE05F34AC7BDDDDF]) [    ] o.a.s.SolrTestCaseJ4 Writing core.properties file to /export/home/jenkins/workspace/Lucene-Solr-master-Solaris/solr/build/solr-core/test/J1/temp/solr.cloud.PeerSyncReplicationTest_AE05F34AC7BDDDDF-001/shard-3-001/cores/collection1
   [junit4]   2> 1252581 INFO  (TEST-PeerSyncReplicationTest.test-seed#[AE05F34AC7BDDDDF]) [    ] o.a.s.c.AbstractFullDistribZkTestBase create jetty 3 in directory /export/home/jenkins/workspace/Lucene-Solr-master-Solaris/solr/build/solr-core/test/J1/temp/solr.cloud.PeerSyncReplicationTest_AE05F34AC7BDDDDF-001/shard-3-001
   [junit4]   2> 1252582 INFO  (TEST-PeerSyncReplicationTest.test-seed#[AE05F34AC7BDDDDF]) [    ] o.e.j.s.Server jetty-9.3.14.v20161028
   [junit4]   2> 1252584 INFO  (TEST-PeerSyncReplicationTest.test-seed#[AE05F34AC7BDDDDF]) [    ] o.e.j.s.h.ContextHandler Started o.e.j.s.ServletContextHandler@62105d7f{/,null,AVAILABLE}
   [junit4]   2> 1252584 INFO  (TEST-PeerSyncReplicationTest.test-seed#[AE05F34AC7BDDDDF]) [    ] o.e.j.s.AbstractConnector Started ServerConnector@7d02441e{HTTP/1.1,[http/1.1]}{127.0.0.1:34327}
   [junit4]   2> 1252584 INFO  (TEST-PeerSyncReplicationTest.test-seed#[AE05F34AC7BDDDDF]) [    ] o.e.j.s.Server Started @1255915ms
   [junit4]   2> 1252584 INFO  (TEST-PeerSyncReplicationTest.test-seed#[AE05F34AC7BDDDDF]) [    ] o.a.s.c.s.e.JettySolrRunner Jetty properties: {solr.data.dir=/export/home/jenkins/workspace/Lucene-Solr-master-Solaris/solr/build/solr-core/test/J1/temp/solr.cloud.PeerSyncReplicationTest_AE05F34AC7BDDDDF-001/tempDir-001/jetty3, solrconfig=solrconfig.xml, hostContext=/, hostPort=34327, coreRootDirectory=/export/home/jenkins/workspace/Lucene-Solr-master-Solaris/solr/build/solr-core/test/J1/temp/solr.cloud.PeerSyncReplicationTest_AE05F34AC7BDDDDF-001/shard-3-001/cores}
   [junit4]   2> 1252584 ERROR (TEST-PeerSyncReplicationTest.test-seed#[AE05F34AC7BDDDDF]) [    ] o.a.s.s.StartupLoggingUtils Missing Java Option solr.log.dir. Logging may be missing or incomplete.
   [junit4]   2> 1252586 INFO  (TEST-PeerSyncReplicationTest.test-seed#[AE05F34AC7BDDDDF]) [    ] o.a.s.s.SolrDispatchFilter  ___      _       Welcome to Apache Solr™ version 7.0.0
   [junit4]   2> 1252586 INFO  (TEST-PeerSyncReplicationTest.test-seed#[AE05F34AC7BDDDDF]) [    ] o.a.s.s.SolrDispatchFilter / __| ___| |_ _   Starting in cloud mode on port null
   [junit4]   2> 1252586 INFO  (TEST-PeerSyncReplicationTest.test-seed#[AE05F34AC7BDDDDF]) [    ] o.a.s.s.SolrDispatchFilter \__ \/ _ \ | '_|  Install dir: null
   [junit4]   2> 1252587 INFO  (TEST-PeerSyncReplicationTest.test-seed#[AE05F34AC7BDDDDF]) [    ] o.a.s.s.SolrDispatchFilter |___/\___/_|_|    Start time: 2017-01-03T12:39:56.021Z
   [junit4]   2> 1252590 INFO  (TEST-PeerSyncReplicationTest.test-seed#[AE05F34AC7BDDDDF]) [    ] o.a.s.s.SolrDispatchFilter Loading solr.xml from SolrHome (not found in ZooKeeper)
   [junit4]   2> 1252590 INFO  (TEST-PeerSyncReplicationTest.test-seed#[AE05F34AC7BDDDDF]) [    ] o.a.s.c.SolrXmlConfig Loading container configuration from /export/home/jenkins/workspace/Lucene-Solr-master-Solaris/solr/build/solr-core/test/J1/temp/solr.cloud.PeerSyncReplicationTest_AE05F34AC7BDDDDF-001/shard-3-001/solr.xml
   [junit4]   2> 1252597 INFO  (TEST-PeerSyncReplicationTest.test-seed#[AE05F34AC7BDDDDF]) [    ] o.a.s.c.ZkContainer Zookeeper client=127.0.0.1:64029/solr
   [junit4]   2> 1252615 INFO  (TEST-PeerSyncReplicationTest.test-seed#[AE05F34AC7BDDDDF]) [n:127.0.0.1:34327_    ] o.a.s.c.c.ZkStateReader Updated live nodes from ZooKeeper... (0) -> (3)
   [junit4]   2> 1252623 INFO  (TEST-PeerSyncReplicationTest.test-seed#[AE05F34AC7BDDDDF]) [n:127.0.0.1:34327_    ] o.a.s.c.ZkController Register node as live in ZooKeeper:/live_nodes/127.0.0.1:34327_
   [junit4]   2> 1252626 INFO  (zkCallback-1893-thread-3-processing-n:127.0.0.1:42188_) [n:127.0.0.1:42188_    ] o.a.s.c.c.ZkStateReader Updated live nodes from ZooKeeper... (3) -> (4)
   [junit4]   2> 1252628 INFO  (zkCallback-1897-thread-1) [    ] o.a.s.c.c.ZkStateReader Updated live nodes from ZooKeeper... (3) -> (4)
   [junit4]   2> 1252628 INFO  (zkCallback-1908-thread-1-processing-n:127.0.0.1:51064_) [n:127.0.0.1:51064_    ] o.a.s.c.c.ZkStateReader Updated live nodes from ZooKeeper... (3) -> (4)
   [junit4]   2> 1252628 INFO  (zkCallback-1902-thread-1-processing-n:127.0.0.1:45611_) [n:127.0.0.1:45611_    ] o.a.s.c.c.ZkStateReader Updated live nodes from ZooKeeper... (3) -> (4)
   [junit4]   2> 1252629 INFO  (zkCallback-1915-thread-1-processing-n:127.0.0.1:34327_) [n:127.0.0.1:34327_    ] o.a.s.c.c.ZkStateReader Updated live nodes from ZooKeeper... (3) -> (4)
   [junit4]   2> 1252712 INFO  (TEST-PeerSyncReplicationTest.test-seed#[AE05F34AC7BDDDDF]) [n:127.0.0.1:34327_    ] o.a.s.c.CorePropertiesLocator Found 1 core definitions underneath /export/home/jenkins/workspace/Lucene-Solr-master-Solaris/solr/build/solr-core/test/J1/temp/solr.cloud.PeerSyncReplicationTest_AE05F34AC7BDDDDF-001/shard-3-001/cores
   [junit4]   2> 1252712 INFO  (TEST-PeerSyncReplicationTest.test-seed#[AE05F34AC7BDDDDF]) [n:127.0.0.1:34327_    ] o.a.s.c.CorePropertiesLocator Cores are: [collection1]
   [junit4]   2> 1252714 INFO  (OverseerStateUpdate-97219195096072196-127.0.0.1:42188_-n_0000000000) [n:127.0.0.1:42188_    ] o.a.s.c.o.ReplicaMutator Assigning new node to shard shard=shard1
   [junit4]   2> 1253054 INFO  (qtp254943343-11728) [n:127.0.0.1:45611_    ] o.a.s.h.a.PrepRecoveryOp In WaitForState(recovering): collection=collection1, shard=shard1, thisCore=collection1, leaderDoesNotNeedRecovery=false, isLeader? true, live=true, checkLive=true, currentState=recovering, localState=active, nodeName=127.0.0.1:51064_, coreNodeName=core_node2, onlyIfActiveCheckResult=false, nodeProps: core_node2:{"core":"collection1","base_url":"http://127.0.0.1:51064","node_name":"127.0.0.1:51064_","state":"recovering"}
   [junit4]   2> 1253054 INFO  (qtp254943343-11728) [n:127.0.0.1:45611_    ] o.a.s.h.a.PrepRecoveryOp Waited coreNodeName: core_node2, state: recovering, checkLive: true, onlyIfLeader: true for: 1 seconds.
   [junit4]   2> 1253054 INFO  (q

[...truncated too long message...]

temPropertiesRestoreRule.java:57)
   [junit4]   2> 	at org.apache.lucene.util.AbstractBeforeAfterRule$1.evaluate(AbstractBeforeAfterRule.java:45)
   [junit4]   2> 	at com.carrotsearch.randomizedtesting.rules.StatementAdapter.evaluate(StatementAdapter.java:36)
   [junit4]   2> 	at org.apache.lucene.util.TestRuleStoreClassName$1.evaluate(TestRuleStoreClassName.java:41)
   [junit4]   2> 	at com.carrotsearch.randomizedtesting.rules.NoShadowingOrOverridesOnMethodsRule$1.evaluate(NoShadowingOrOverridesOnMethodsRule.java:40)
   [junit4]   2> 	at com.carrotsearch.randomizedtesting.rules.NoShadowingOrOverridesOnMethodsRule$1.evaluate(NoShadowingOrOverridesOnMethodsRule.java:40)
   [junit4]   2> 	at com.carrotsearch.randomizedtesting.rules.StatementAdapter.evaluate(StatementAdapter.java:36)
   [junit4]   2> 	at com.carrotsearch.randomizedtesting.rules.StatementAdapter.evaluate(StatementAdapter.java:36)
   [junit4]   2> 	at com.carrotsearch.randomizedtesting.rules.StatementAdapter.evaluate(StatementAdapter.java:36)
   [junit4]   2> 	at org.apache.lucene.util.TestRuleAssertionsRequired$1.evaluate(TestRuleAssertionsRequired.java:53)
   [junit4]   2> 	at org.apache.lucene.util.TestRuleMarkFailure$1.evaluate(TestRuleMarkFailure.java:47)
   [junit4]   2> 	at org.apache.lucene.util.TestRuleIgnoreAfterMaxFailures$1.evaluate(TestRuleIgnoreAfterMaxFailures.java:64)
   [junit4]   2> 	at org.apache.lucene.util.TestRuleIgnoreTestSuites$1.evaluate(TestRuleIgnoreTestSuites.java:54)
   [junit4]   2> 	at com.carrotsearch.randomizedtesting.rules.StatementAdapter.evaluate(StatementAdapter.java:36)
   [junit4]   2> 	at com.carrotsearch.randomizedtesting.ThreadLeakControl$StatementRunner.run(ThreadLeakControl.java:367)
   [junit4]   2> 	at java.lang.Thread.run(Thread.java:745)
   [junit4]   2> 
   [junit4]   2> 1751342 INFO  (TEST-HardAutoCommitTest.testCommitWithin-seed#[AE05F34AC7BDDDDF]) [    x:collection1] o.a.s.SolrTestCaseJ4 ###Ending testCommitWithin
   [junit4]   2> NOTE: reproduce with: ant test  -Dtestcase=HardAutoCommitTest -Dtests.method=testCommitWithin -Dtests.seed=AE05F34AC7BDDDDF -Dtests.slow=true -Dtests.locale=cs -Dtests.timezone=CAT -Dtests.asserts=true -Dtests.file.encoding=UTF-8
   [junit4] ERROR   0.69s J0 | HardAutoCommitTest.testCommitWithin <<<
   [junit4]    > Throwable #1: java.lang.RuntimeException: Exception during query
   [junit4]    > 	at __randomizedtesting.SeedInfo.seed([AE05F34AC7BDDDDF:14D79C32449333CA]:0)
   [junit4]    > 	at org.apache.solr.SolrTestCaseJ4.assertQ(SolrTestCaseJ4.java:818)
   [junit4]    > 	at org.apache.solr.update.HardAutoCommitTest.testCommitWithin(HardAutoCommitTest.java:100)
   [junit4]    > 	at java.lang.Thread.run(Thread.java:745)
   [junit4]    > Caused by: java.lang.RuntimeException: REQUEST FAILED: xpath=//result[@numFound=1]
   [junit4]    > 	xml response was: <?xml version="1.0" encoding="UTF-8"?>
   [junit4]    > <response>
   [junit4]    > <lst name="responseHeader"><int name="status">0</int><int name="QTime">0</int></lst><result name="response" numFound="0" start="0"></result>
   [junit4]    > </response>
   [junit4]    > 	request was:q=id:529&qt=standard&start=0&rows=20&version=2.2
   [junit4]    > 	at org.apache.solr.SolrTestCaseJ4.assertQ(SolrTestCaseJ4.java:811)
   [junit4]    > 	... 40 more
   [junit4]   2> 1751343 INFO  (SUITE-HardAutoCommitTest-seed#[AE05F34AC7BDDDDF]-worker) [    x:collection1] o.a.s.SolrTestCaseJ4 ###deleteCore
   [junit4]   2> 1751343 INFO  (SUITE-HardAutoCommitTest-seed#[AE05F34AC7BDDDDF]-worker) [    x:collection1] o.a.s.c.CoreContainer Shutting down CoreContainer instance=1531505295
   [junit4]   2> 1751344 INFO  (coreCloseExecutor-7069-thread-1-processing-x:collection1) [    x:collection1] o.a.s.c.SolrCore [collection1]  CLOSING SolrCore org.apache.solr.core.SolrCore@24017885
   [junit4]   2> 1751345 INFO  (coreCloseExecutor-7069-thread-1-processing-x:collection1) [    x:collection1] o.a.s.u.DirectUpdateHandler2 Committing on IndexWriter close.
   [junit4]   2> 1751345 INFO  (coreCloseExecutor-7069-thread-1-processing-x:collection1) [    x:collection1] o.a.s.u.SolrIndexWriter Calling setCommitData with IW:org.apache.solr.update.SolrIndexWriter@390079b8
   [junit4]   2> 1751375 INFO  (coreCloseExecutor-7069-thread-1-processing-x:collection1) [    x:collection1] o.a.s.m.SolrMetricManager Closing metric reporters for: solr.core.collection1
   [junit4]   2> 1751376 INFO  (SUITE-HardAutoCommitTest-seed#[AE05F34AC7BDDDDF]-worker) [    x:collection1] o.a.s.m.SolrMetricManager Closing metric reporters for: solr.node
   [junit4]   2> NOTE: leaving temporary files on disk at: /export/home/jenkins/workspace/Lucene-Solr-master-Solaris/solr/build/solr-core/test/J0/temp/solr.update.HardAutoCommitTest_AE05F34AC7BDDDDF-001
   [junit4]   2> NOTE: test params are: codec=Asserting(Lucene70): {range_facet_l_dv=TestBloomFilteredLucenePostings(BloomFilteringPostingsFormat(Lucene50(blocksize=128))), _version_=PostingsFormat(name=Memory), field_t=PostingsFormat(name=Direct), multiDefault=PostingsFormat(name=Asserting), subject=PostingsFormat(name=Asserting), intDefault=PostingsFormat(name=Memory), id=TestBloomFilteredLucenePostings(BloomFilteringPostingsFormat(Lucene50(blocksize=128))), range_facet_i_dv=PostingsFormat(name=Memory), text=PostingsFormat(name=Direct), range_facet_l=PostingsFormat(name=Memory), timestamp=PostingsFormat(name=Memory)}, docValues:{range_facet_l_dv=DocValuesFormat(name=Lucene70), range_facet_i_dv=DocValuesFormat(name=Memory), timestamp=DocValuesFormat(name=Memory)}, maxPointsInLeafNode=1951, maxMBSortInHeap=5.891552857969718, sim=RandomSimilarity(queryNorm=true): {}, locale=cs, timezone=CAT
   [junit4]   2> NOTE: SunOS 5.11 amd64/Oracle Corporation 1.8.0_112 (64-bit)/cpus=3,threads=1,free=131301184,total=518979584
   [junit4]   2> NOTE: All tests run in this JVM: [ManagedSchemaRoundRobinCloudTest, CloudMLTQParserTest, TestClusterStateMutator, TestUpdate, SoftAutoCommitTest, TestSlowCompositeReaderWrapper, TestReloadDeadlock, TestCollationField, TestScoreJoinQPScore, ConnectionManagerTest, BlockJoinFacetRandomTest, CoreAdminCreateDiscoverTest, TestDistribIDF, TestFunctionQuery, TestRandomDVFaceting, DistributedFacetPivotSmallTest, DirectSolrConnectionTest, DocValuesMissingTest, TestBinaryField, TestRemoteStreaming, HighlighterMaxOffsetTest, TestPseudoReturnFields, TestFastLRUCache, RuleEngineTest, TestCSVLoader, ConjunctionSolrSpellCheckerTest, TestFieldTypeCollectionResource, StatelessScriptUpdateProcessorFactoryTest, TestDynamicFieldCollectionResource, TestNonDefinedSimilarityFactory, OpenExchangeRatesOrgProviderTest, TestGroupingSearch, TestHashQParserPlugin, SchemaVersionSpecificBehaviorTest, TestAddFieldRealTimeGet, SampleTest, MultiTermTest, SolrIndexMetricsTest, TestCollectionAPI, TestPhraseSuggestions, TestSolrCloudWithKerberosAlt, TestFaceting, IndexSchemaRuntimeFieldTest, ZkNodePropsTest, FastVectorHighlighterTest, TestFieldCacheSortRandom, CoreMergeIndexesAdminHandlerTest, CollectionStateFormat2Test, TestSolrJ, TestCloudManagedSchema, ClassificationUpdateProcessorIntegrationTest, TestReRankQParserPlugin, DirectSolrSpellCheckerTest, TestCSVResponseWriter, SolrRequestParserTest, TestCharFilters, TestBM25SimilarityFactory, DocumentAnalysisRequestHandlerTest, DistributedQueryElevationComponentTest, TestCoreContainer, HttpPartitionTest, TestTrackingShardHandlerFactory, TestLRUCache, HLLSerializationTest, TestHighlightDedupGrouping, BadCopyFieldTest, CloneFieldUpdateProcessorFactoryTest, DeleteReplicaTest, TestIBSimilarityFactory, DistributedQueueTest, HttpSolrCallGetCoreTest, TestSchemaSimilarityResource, RequiredFieldsTest, LeaderElectionTest, TestCustomDocTransformer, RankQueryTest, TestExtendedDismaxParser, CursorPagingTest, SolrGraphiteReporterTest, ShardSplitTest, TestSolrXml, CachingDirectoryFactoryTest, SOLR749Test, TestLockTree, TestSolrCoreSnapshots, XsltUpdateRequestHandlerTest, TestManagedSchema, CdcrRequestHandlerTest, BaseCdcrDistributedZkTest, OverseerTest, TestCloudSchemaless, BJQParserTest, TestConfigSets, TestSchemaNameResource, MBeansHandlerTest, TestSolrConfigHandlerCloud, TestPostingsSolrHighlighter, OutOfBoxZkACLAndCredentialsProvidersTest, DistributedFacetPivotLongTailTest, SSLMigrationTest, ReplicaListTransformerTest, DocumentBuilderTest, TestLeaderInitiatedRecoveryThread, TestXmlQParserPlugin, SpatialFilterTest, DeleteLastCustomShardedReplicaTest, HighlighterTest, MigrateRouteKeyTest, HdfsBasicDistributedZkTest, TestObjectReleaseTracker, UUIDUpdateProcessorFallbackTest, SimplePostToolTest, TestExactStatsCache, SpatialRPTFieldTypeTest, TestSweetSpotSimilarityFactory, ClusterStateUpdateTest, ChangedSchemaMergeTest, TestCustomSort, DirectoryFactoryTest, TestClassicSimilarityFactory, TestMergePolicyConfig, TestGeoJSONResponseWriter, HdfsLockFactoryTest, TestSort, StandardRequestHandlerTest, SolrMetricManagerTest, BasicDistributedZkTest, TestSegmentSorting, TestNumericTerms32, VMParamsZkACLAndCredentialsProvidersTest, TestReloadAndDeleteDocs, MoreLikeThisHandlerTest, TestSimpleQParserPlugin, CheckHdfsIndexTest, DistributedQueryComponentCustomSortTest, CursorMarkTest, SimpleFacetsTest, TestRawResponseWriter, PolyFieldTest, SmileWriterTest, TestSQLHandler, HdfsTlogReplayBufferedWhileIndexingTest, TestElisionMultitermQuery, AlternateDirectoryTest, BinaryUpdateRequestHandlerTest, TestFieldCacheSanityChecker, MetricsHandlerTest, ExplicitHLLTest, SynonymTokenizerTest, HdfsNNFailoverTest, BlobRepositoryCloudTest, TestManagedStopFilterFactory, PeerSyncTest, ActionThrottleTest, TestRTGBase, TestFreeTextSuggestions, VersionInfoTest, DistribDocExpirationUpdateProcessorTest, TestManagedSchemaThreadSafety, TestJsonFacets, SegmentsInfoRequestHandlerTest, UnloadDistributedZkTest, ShardRoutingTest, BasicZkTest, TestReplicationHandler, TestZkChroot, ZkCLITest, TestDistributedSearch, TestStressReorder, HardAutoCommitTest]
   [junit4] Completed [358/674 (4!)] on J0 in 1.29s, 1 test, 1 error <<< FAILURES!

[...truncated 63450 lines...]


Mime
View raw message