lucene-dev mailing list archives

Site index · List index
Message view « Date » · « Thread »
Top « Date » · « Thread »
From Apache Jenkins Server <jenk...@builds.apache.org>
Subject [JENKINS] Lucene-Solr-NightlyTests-6.x - Build # 271 - Still unstable
Date Tue, 31 Jan 2017 00:55:07 GMT
Build: https://builds.apache.org/job/Lucene-Solr-NightlyTests-6.x/271/

2 tests failed.
FAILED:  org.apache.solr.cloud.hdfs.StressHdfsTest.test

Error Message:
Timeout occured while waiting response from server at: http://127.0.0.1:57802

Stack Trace:
org.apache.solr.client.solrj.SolrServerException: Timeout occured while waiting response from server at: http://127.0.0.1:57802
	at __randomizedtesting.SeedInfo.seed([765495B8CB018238:FE00AA6265FDEFC0]:0)
	at org.apache.solr.client.solrj.impl.HttpSolrClient.executeMethod(HttpSolrClient.java:621)
	at org.apache.solr.client.solrj.impl.HttpSolrClient.request(HttpSolrClient.java:279)
	at org.apache.solr.client.solrj.impl.HttpSolrClient.request(HttpSolrClient.java:268)
	at org.apache.solr.client.solrj.impl.LBHttpSolrClient.doRequest(LBHttpSolrClient.java:435)
	at org.apache.solr.client.solrj.impl.LBHttpSolrClient.request(LBHttpSolrClient.java:387)
	at org.apache.solr.client.solrj.impl.CloudSolrClient.sendRequest(CloudSolrClient.java:1344)
	at org.apache.solr.client.solrj.impl.CloudSolrClient.requestWithRetryOnStaleState(CloudSolrClient.java:1095)
	at org.apache.solr.client.solrj.impl.CloudSolrClient.request(CloudSolrClient.java:1037)
	at org.apache.solr.client.solrj.SolrClient.request(SolrClient.java:1219)
	at org.apache.solr.cloud.hdfs.StressHdfsTest.createAndDeleteCollection(StressHdfsTest.java:220)
	at org.apache.solr.cloud.hdfs.StressHdfsTest.test(StressHdfsTest.java:103)
	at sun.reflect.NativeMethodAccessorImpl.invoke0(Native Method)
	at sun.reflect.NativeMethodAccessorImpl.invoke(NativeMethodAccessorImpl.java:62)
	at sun.reflect.DelegatingMethodAccessorImpl.invoke(DelegatingMethodAccessorImpl.java:43)
	at java.lang.reflect.Method.invoke(Method.java:498)
	at com.carrotsearch.randomizedtesting.RandomizedRunner.invoke(RandomizedRunner.java:1713)
	at com.carrotsearch.randomizedtesting.RandomizedRunner$8.evaluate(RandomizedRunner.java:907)
	at com.carrotsearch.randomizedtesting.RandomizedRunner$9.evaluate(RandomizedRunner.java:943)
	at com.carrotsearch.randomizedtesting.RandomizedRunner$10.evaluate(RandomizedRunner.java:957)
	at org.apache.solr.BaseDistributedSearchTestCase$ShardsRepeatRule$ShardsFixedStatement.callStatement(BaseDistributedSearchTestCase.java:992)
	at org.apache.solr.BaseDistributedSearchTestCase$ShardsRepeatRule$ShardsStatement.evaluate(BaseDistributedSearchTestCase.java:967)
	at com.carrotsearch.randomizedtesting.rules.SystemPropertiesRestoreRule$1.evaluate(SystemPropertiesRestoreRule.java:57)
	at org.apache.lucene.util.TestRuleSetupTeardownChained$1.evaluate(TestRuleSetupTeardownChained.java:49)
	at org.apache.lucene.util.AbstractBeforeAfterRule$1.evaluate(AbstractBeforeAfterRule.java:45)
	at org.apache.lucene.util.TestRuleThreadAndTestName$1.evaluate(TestRuleThreadAndTestName.java:48)
	at org.apache.lucene.util.TestRuleIgnoreAfterMaxFailures$1.evaluate(TestRuleIgnoreAfterMaxFailures.java:64)
	at org.apache.lucene.util.TestRuleMarkFailure$1.evaluate(TestRuleMarkFailure.java:47)
	at com.carrotsearch.randomizedtesting.rules.StatementAdapter.evaluate(StatementAdapter.java:36)
	at com.carrotsearch.randomizedtesting.ThreadLeakControl$StatementRunner.run(ThreadLeakControl.java:368)
	at com.carrotsearch.randomizedtesting.ThreadLeakControl.forkTimeoutingTask(ThreadLeakControl.java:817)
	at com.carrotsearch.randomizedtesting.ThreadLeakControl$3.evaluate(ThreadLeakControl.java:468)
	at com.carrotsearch.randomizedtesting.RandomizedRunner.runSingleTest(RandomizedRunner.java:916)
	at com.carrotsearch.randomizedtesting.RandomizedRunner$5.evaluate(RandomizedRunner.java:802)
	at com.carrotsearch.randomizedtesting.RandomizedRunner$6.evaluate(RandomizedRunner.java:852)
	at com.carrotsearch.randomizedtesting.RandomizedRunner$7.evaluate(RandomizedRunner.java:863)
	at com.carrotsearch.randomizedtesting.rules.StatementAdapter.evaluate(StatementAdapter.java:36)
	at com.carrotsearch.randomizedtesting.rules.SystemPropertiesRestoreRule$1.evaluate(SystemPropertiesRestoreRule.java:57)
	at org.apache.lucene.util.AbstractBeforeAfterRule$1.evaluate(AbstractBeforeAfterRule.java:45)
	at com.carrotsearch.randomizedtesting.rules.StatementAdapter.evaluate(StatementAdapter.java:36)
	at org.apache.lucene.util.TestRuleStoreClassName$1.evaluate(TestRuleStoreClassName.java:41)
	at com.carrotsearch.randomizedtesting.rules.NoShadowingOrOverridesOnMethodsRule$1.evaluate(NoShadowingOrOverridesOnMethodsRule.java:40)
	at com.carrotsearch.randomizedtesting.rules.NoShadowingOrOverridesOnMethodsRule$1.evaluate(NoShadowingOrOverridesOnMethodsRule.java:40)
	at com.carrotsearch.randomizedtesting.rules.StatementAdapter.evaluate(StatementAdapter.java:36)
	at com.carrotsearch.randomizedtesting.rules.StatementAdapter.evaluate(StatementAdapter.java:36)
	at com.carrotsearch.randomizedtesting.rules.StatementAdapter.evaluate(StatementAdapter.java:36)
	at org.apache.lucene.util.TestRuleAssertionsRequired$1.evaluate(TestRuleAssertionsRequired.java:53)
	at org.apache.lucene.util.TestRuleMarkFailure$1.evaluate(TestRuleMarkFailure.java:47)
	at org.apache.lucene.util.TestRuleIgnoreAfterMaxFailures$1.evaluate(TestRuleIgnoreAfterMaxFailures.java:64)
	at org.apache.lucene.util.TestRuleIgnoreTestSuites$1.evaluate(TestRuleIgnoreTestSuites.java:54)
	at com.carrotsearch.randomizedtesting.rules.StatementAdapter.evaluate(StatementAdapter.java:36)
	at com.carrotsearch.randomizedtesting.ThreadLeakControl$StatementRunner.run(ThreadLeakControl.java:368)
	at java.lang.Thread.run(Thread.java:745)
Caused by: java.net.SocketTimeoutException: Read timed out
	at java.net.SocketInputStream.socketRead0(Native Method)
	at java.net.SocketInputStream.socketRead(SocketInputStream.java:116)
	at java.net.SocketInputStream.read(SocketInputStream.java:170)
	at java.net.SocketInputStream.read(SocketInputStream.java:141)
	at org.apache.http.impl.io.AbstractSessionInputBuffer.fillBuffer(AbstractSessionInputBuffer.java:160)
	at org.apache.http.impl.io.SocketInputBuffer.fillBuffer(SocketInputBuffer.java:84)
	at org.apache.http.impl.io.AbstractSessionInputBuffer.readLine(AbstractSessionInputBuffer.java:273)
	at org.apache.http.impl.conn.DefaultHttpResponseParser.parseHead(DefaultHttpResponseParser.java:140)
	at org.apache.http.impl.conn.DefaultHttpResponseParser.parseHead(DefaultHttpResponseParser.java:57)
	at org.apache.http.impl.io.AbstractMessageParser.parse(AbstractMessageParser.java:261)
	at org.apache.http.impl.AbstractHttpClientConnection.receiveResponseHeader(AbstractHttpClientConnection.java:283)
	at org.apache.http.impl.conn.DefaultClientConnection.receiveResponseHeader(DefaultClientConnection.java:251)
	at org.apache.http.impl.conn.ManagedClientConnectionImpl.receiveResponseHeader(ManagedClientConnectionImpl.java:197)
	at org.apache.http.protocol.HttpRequestExecutor.doReceiveResponse(HttpRequestExecutor.java:272)
	at org.apache.http.protocol.HttpRequestExecutor.execute(HttpRequestExecutor.java:124)
	at org.apache.http.impl.client.DefaultRequestDirector.tryExecute(DefaultRequestDirector.java:685)
	at org.apache.http.impl.client.DefaultRequestDirector.execute(DefaultRequestDirector.java:487)
	at org.apache.http.impl.client.AbstractHttpClient.doExecute(AbstractHttpClient.java:882)
	at org.apache.http.impl.client.CloseableHttpClient.execute(CloseableHttpClient.java:82)
	at org.apache.http.impl.client.CloseableHttpClient.execute(CloseableHttpClient.java:55)
	at org.apache.solr.client.solrj.impl.HttpSolrClient.executeMethod(HttpSolrClient.java:515)
	... 51 more


FAILED:  org.apache.solr.cloud.hdfs.HdfsWriteToMultipleCollectionsTest.test

Error Message:


Stack Trace:
java.lang.AssertionError
	at __randomizedtesting.SeedInfo.seed([765495B8CB018238:FE00AA6265FDEFC0]:0)
	at org.junit.Assert.fail(Assert.java:92)
	at org.junit.Assert.assertTrue(Assert.java:43)
	at org.junit.Assert.assertTrue(Assert.java:54)
	at org.apache.solr.cloud.hdfs.HdfsWriteToMultipleCollectionsTest.test(HdfsWriteToMultipleCollectionsTest.java:137)
	at sun.reflect.NativeMethodAccessorImpl.invoke0(Native Method)
	at sun.reflect.NativeMethodAccessorImpl.invoke(NativeMethodAccessorImpl.java:62)
	at sun.reflect.DelegatingMethodAccessorImpl.invoke(DelegatingMethodAccessorImpl.java:43)
	at java.lang.reflect.Method.invoke(Method.java:498)
	at com.carrotsearch.randomizedtesting.RandomizedRunner.invoke(RandomizedRunner.java:1713)
	at com.carrotsearch.randomizedtesting.RandomizedRunner$8.evaluate(RandomizedRunner.java:907)
	at com.carrotsearch.randomizedtesting.RandomizedRunner$9.evaluate(RandomizedRunner.java:943)
	at com.carrotsearch.randomizedtesting.RandomizedRunner$10.evaluate(RandomizedRunner.java:957)
	at org.apache.solr.BaseDistributedSearchTestCase$ShardsRepeatRule$ShardsFixedStatement.callStatement(BaseDistributedSearchTestCase.java:992)
	at org.apache.solr.BaseDistributedSearchTestCase$ShardsRepeatRule$ShardsStatement.evaluate(BaseDistributedSearchTestCase.java:967)
	at com.carrotsearch.randomizedtesting.rules.SystemPropertiesRestoreRule$1.evaluate(SystemPropertiesRestoreRule.java:57)
	at org.apache.lucene.util.TestRuleSetupTeardownChained$1.evaluate(TestRuleSetupTeardownChained.java:49)
	at org.apache.lucene.util.AbstractBeforeAfterRule$1.evaluate(AbstractBeforeAfterRule.java:45)
	at org.apache.lucene.util.TestRuleThreadAndTestName$1.evaluate(TestRuleThreadAndTestName.java:48)
	at org.apache.lucene.util.TestRuleIgnoreAfterMaxFailures$1.evaluate(TestRuleIgnoreAfterMaxFailures.java:64)
	at org.apache.lucene.util.TestRuleMarkFailure$1.evaluate(TestRuleMarkFailure.java:47)
	at com.carrotsearch.randomizedtesting.rules.StatementAdapter.evaluate(StatementAdapter.java:36)
	at com.carrotsearch.randomizedtesting.ThreadLeakControl$StatementRunner.run(ThreadLeakControl.java:368)
	at com.carrotsearch.randomizedtesting.ThreadLeakControl.forkTimeoutingTask(ThreadLeakControl.java:817)
	at com.carrotsearch.randomizedtesting.ThreadLeakControl$3.evaluate(ThreadLeakControl.java:468)
	at com.carrotsearch.randomizedtesting.RandomizedRunner.runSingleTest(RandomizedRunner.java:916)
	at com.carrotsearch.randomizedtesting.RandomizedRunner$5.evaluate(RandomizedRunner.java:802)
	at com.carrotsearch.randomizedtesting.RandomizedRunner$6.evaluate(RandomizedRunner.java:852)
	at com.carrotsearch.randomizedtesting.RandomizedRunner$7.evaluate(RandomizedRunner.java:863)
	at com.carrotsearch.randomizedtesting.rules.StatementAdapter.evaluate(StatementAdapter.java:36)
	at com.carrotsearch.randomizedtesting.rules.SystemPropertiesRestoreRule$1.evaluate(SystemPropertiesRestoreRule.java:57)
	at org.apache.lucene.util.AbstractBeforeAfterRule$1.evaluate(AbstractBeforeAfterRule.java:45)
	at com.carrotsearch.randomizedtesting.rules.StatementAdapter.evaluate(StatementAdapter.java:36)
	at org.apache.lucene.util.TestRuleStoreClassName$1.evaluate(TestRuleStoreClassName.java:41)
	at com.carrotsearch.randomizedtesting.rules.NoShadowingOrOverridesOnMethodsRule$1.evaluate(NoShadowingOrOverridesOnMethodsRule.java:40)
	at com.carrotsearch.randomizedtesting.rules.NoShadowingOrOverridesOnMethodsRule$1.evaluate(NoShadowingOrOverridesOnMethodsRule.java:40)
	at com.carrotsearch.randomizedtesting.rules.StatementAdapter.evaluate(StatementAdapter.java:36)
	at com.carrotsearch.randomizedtesting.rules.StatementAdapter.evaluate(StatementAdapter.java:36)
	at com.carrotsearch.randomizedtesting.rules.StatementAdapter.evaluate(StatementAdapter.java:36)
	at org.apache.lucene.util.TestRuleAssertionsRequired$1.evaluate(TestRuleAssertionsRequired.java:53)
	at org.apache.lucene.util.TestRuleMarkFailure$1.evaluate(TestRuleMarkFailure.java:47)
	at org.apache.lucene.util.TestRuleIgnoreAfterMaxFailures$1.evaluate(TestRuleIgnoreAfterMaxFailures.java:64)
	at org.apache.lucene.util.TestRuleIgnoreTestSuites$1.evaluate(TestRuleIgnoreTestSuites.java:54)
	at com.carrotsearch.randomizedtesting.rules.StatementAdapter.evaluate(StatementAdapter.java:36)
	at com.carrotsearch.randomizedtesting.ThreadLeakControl$StatementRunner.run(ThreadLeakControl.java:368)
	at java.lang.Thread.run(Thread.java:745)




Build Log:
[...truncated 11649 lines...]
   [junit4] Suite: org.apache.solr.cloud.hdfs.HdfsWriteToMultipleCollectionsTest
   [junit4]   2> Creating dataDir: /x1/jenkins/jenkins-slave/workspace/Lucene-Solr-NightlyTests-6.x/checkout/solr/build/solr-core/test/J1/temp/solr.cloud.hdfs.HdfsWriteToMultipleCollectionsTest_765495B8CB018238-001/init-core-data-001
   [junit4]   2> 1140112 INFO  (SUITE-HdfsWriteToMultipleCollectionsTest-seed#[765495B8CB018238]-worker) [    ] o.a.s.SolrTestCaseJ4 Randomized ssl (false) and clientAuth (false) via: @org.apache.solr.SolrTestCaseJ4$SuppressSSL(bugUrl=https://issues.apache.org/jira/browse/SOLR-5776)
   [junit4]   2> 1140112 INFO  (SUITE-HdfsWriteToMultipleCollectionsTest-seed#[765495B8CB018238]-worker) [    ] o.a.s.BaseDistributedSearchTestCase Setting hostContext system property: /
   [junit4]   2> 1141208 WARN  (SUITE-HdfsWriteToMultipleCollectionsTest-seed#[765495B8CB018238]-worker) [    ] o.a.h.u.NativeCodeLoader Unable to load native-hadoop library for your platform... using builtin-java classes where applicable
   [junit4]   1> Formatting using clusterid: testClusterID
   [junit4]   2> 1142027 WARN  (SUITE-HdfsWriteToMultipleCollectionsTest-seed#[765495B8CB018238]-worker) [    ] o.a.h.m.i.MetricsConfig Cannot locate configuration: tried hadoop-metrics2-namenode.properties,hadoop-metrics2.properties
   [junit4]   2> 1142457 INFO  (SUITE-HdfsWriteToMultipleCollectionsTest-seed#[765495B8CB018238]-worker) [    ] o.m.log Logging to org.slf4j.impl.Log4jLoggerAdapter(org.mortbay.log) via org.mortbay.log.Slf4jLog
   [junit4]   2> 1142519 WARN  (SUITE-HdfsWriteToMultipleCollectionsTest-seed#[765495B8CB018238]-worker) [    ] o.a.h.h.HttpRequestLog Jetty request log can only be enabled using Log4j
   [junit4]   2> 1142694 INFO  (SUITE-HdfsWriteToMultipleCollectionsTest-seed#[765495B8CB018238]-worker) [    ] o.m.log jetty-6.1.26
   [junit4]   2> 1142801 INFO  (SUITE-HdfsWriteToMultipleCollectionsTest-seed#[765495B8CB018238]-worker) [    ] o.m.log Extract jar:file:/x1/jenkins/.ivy2/cache/org.apache.hadoop/hadoop-hdfs/tests/hadoop-hdfs-2.7.2-tests.jar!/webapps/hdfs to ./temp/Jetty_localhost_46308_hdfs____d71x0j/webapp
   [junit4]   2> 1143785 INFO  (SUITE-HdfsWriteToMultipleCollectionsTest-seed#[765495B8CB018238]-worker) [    ] o.m.log Started HttpServer2$SelectChannelConnectorWithSafeStartup@localhost:46308
   [junit4]   2> 1144821 ERROR (Finalizer) [    ] o.a.s.c.CoreContainer CoreContainer was not close prior to finalize(), indicates a bug -- POSSIBLE RESOURCE LEAK!!!  instance=2140372790
   [junit4]   2> 1145667 WARN  (SUITE-HdfsWriteToMultipleCollectionsTest-seed#[765495B8CB018238]-worker) [    ] o.a.h.h.HttpRequestLog Jetty request log can only be enabled using Log4j
   [junit4]   2> 1145672 INFO  (SUITE-HdfsWriteToMultipleCollectionsTest-seed#[765495B8CB018238]-worker) [    ] o.m.log jetty-6.1.26
   [junit4]   2> 1145685 INFO  (SUITE-HdfsWriteToMultipleCollectionsTest-seed#[765495B8CB018238]-worker) [    ] o.m.log Extract jar:file:/x1/jenkins/.ivy2/cache/org.apache.hadoop/hadoop-hdfs/tests/hadoop-hdfs-2.7.2-tests.jar!/webapps/datanode to ./temp/Jetty_localhost_40599_datanode____ivolts/webapp
   [junit4]   2> 1146083 INFO  (SUITE-HdfsWriteToMultipleCollectionsTest-seed#[765495B8CB018238]-worker) [    ] o.m.log Started HttpServer2$SelectChannelConnectorWithSafeStartup@localhost:40599
   [junit4]   2> 1146514 WARN  (SUITE-HdfsWriteToMultipleCollectionsTest-seed#[765495B8CB018238]-worker) [    ] o.a.h.h.HttpRequestLog Jetty request log can only be enabled using Log4j
   [junit4]   2> 1146517 INFO  (SUITE-HdfsWriteToMultipleCollectionsTest-seed#[765495B8CB018238]-worker) [    ] o.m.log jetty-6.1.26
   [junit4]   2> 1146583 INFO  (SUITE-HdfsWriteToMultipleCollectionsTest-seed#[765495B8CB018238]-worker) [    ] o.m.log Extract jar:file:/x1/jenkins/.ivy2/cache/org.apache.hadoop/hadoop-hdfs/tests/hadoop-hdfs-2.7.2-tests.jar!/webapps/datanode to ./temp/Jetty_localhost_34349_datanode____pp3pem/webapp
   [junit4]   2> 1147132 INFO  (SUITE-HdfsWriteToMultipleCollectionsTest-seed#[765495B8CB018238]-worker) [    ] o.m.log Started HttpServer2$SelectChannelConnectorWithSafeStartup@localhost:34349
   [junit4]   2> 1148588 INFO  (IPC Server handler 9 on 40180) [    ] BlockStateChange BLOCK* processReport: from storage DS-11a74713-8e73-41df-9f4c-ab42e176baf9 node DatanodeRegistration(127.0.0.1:37960, datanodeUuid=8ab3a5b6-275a-4d69-8b39-7fe79ee55f09, infoPort=54896, infoSecurePort=0, ipcPort=43473, storageInfo=lv=-56;cid=testClusterID;nsid=97073154;c=0), blocks: 0, hasStaleStorage: true, processing time: 3 msecs
   [junit4]   2> 1148588 INFO  (IPC Server handler 9 on 40180) [    ] BlockStateChange BLOCK* processReport: from storage DS-659df4cb-91ea-4367-a007-b56c84862e7a node DatanodeRegistration(127.0.0.1:37960, datanodeUuid=8ab3a5b6-275a-4d69-8b39-7fe79ee55f09, infoPort=54896, infoSecurePort=0, ipcPort=43473, storageInfo=lv=-56;cid=testClusterID;nsid=97073154;c=0), blocks: 0, hasStaleStorage: false, processing time: 0 msecs
   [junit4]   2> 1148591 INFO  (IPC Server handler 0 on 40180) [    ] BlockStateChange BLOCK* processReport: from storage DS-eb907fae-6d6a-4936-8bbf-8d4eff1e29b5 node DatanodeRegistration(127.0.0.1:44103, datanodeUuid=d3c9b0e8-9a23-4136-92a7-79bf9f6f5ea7, infoPort=34010, infoSecurePort=0, ipcPort=44781, storageInfo=lv=-56;cid=testClusterID;nsid=97073154;c=0), blocks: 0, hasStaleStorage: true, processing time: 0 msecs
   [junit4]   2> 1148595 INFO  (IPC Server handler 0 on 40180) [    ] BlockStateChange BLOCK* processReport: from storage DS-ae22a632-cd5f-4c52-be91-c8876c0439cc node DatanodeRegistration(127.0.0.1:44103, datanodeUuid=d3c9b0e8-9a23-4136-92a7-79bf9f6f5ea7, infoPort=34010, infoSecurePort=0, ipcPort=44781, storageInfo=lv=-56;cid=testClusterID;nsid=97073154;c=0), blocks: 0, hasStaleStorage: false, processing time: 0 msecs
   [junit4]   2> 1148651 INFO  (TEST-HdfsWriteToMultipleCollectionsTest.test-seed#[765495B8CB018238]) [    ] o.a.s.c.ZkTestServer STARTING ZK TEST SERVER
   [junit4]   2> 1148661 INFO  (Thread-1530) [    ] o.a.s.c.ZkTestServer client port:0.0.0.0/0.0.0.0:0
   [junit4]   2> 1148661 INFO  (Thread-1530) [    ] o.a.s.c.ZkTestServer Starting server
   [junit4]   2> 1148759 INFO  (TEST-HdfsWriteToMultipleCollectionsTest.test-seed#[765495B8CB018238]) [    ] o.a.s.c.ZkTestServer start zk server on port:59338
   [junit4]   2> 1148785 INFO  (TEST-HdfsWriteToMultipleCollectionsTest.test-seed#[765495B8CB018238]) [    ] o.a.s.c.AbstractZkTestCase put /x1/jenkins/jenkins-slave/workspace/Lucene-Solr-NightlyTests-6.x/checkout/solr/core/src/test-files/solr/collection1/conf/solrconfig-tlog.xml to /configs/conf1/solrconfig.xml
   [junit4]   2> 1148787 INFO  (TEST-HdfsWriteToMultipleCollectionsTest.test-seed#[765495B8CB018238]) [    ] o.a.s.c.AbstractZkTestCase put /x1/jenkins/jenkins-slave/workspace/Lucene-Solr-NightlyTests-6.x/checkout/solr/core/src/test-files/solr/collection1/conf/schema15.xml to /configs/conf1/schema.xml
   [junit4]   2> 1148789 INFO  (TEST-HdfsWriteToMultipleCollectionsTest.test-seed#[765495B8CB018238]) [    ] o.a.s.c.AbstractZkTestCase put /x1/jenkins/jenkins-slave/workspace/Lucene-Solr-NightlyTests-6.x/checkout/solr/core/src/test-files/solr/collection1/conf/solrconfig.snippet.randomindexconfig.xml to /configs/conf1/solrconfig.snippet.randomindexconfig.xml
   [junit4]   2> 1148790 INFO  (TEST-HdfsWriteToMultipleCollectionsTest.test-seed#[765495B8CB018238]) [    ] o.a.s.c.AbstractZkTestCase put /x1/jenkins/jenkins-slave/workspace/Lucene-Solr-NightlyTests-6.x/checkout/solr/core/src/test-files/solr/collection1/conf/stopwords.txt to /configs/conf1/stopwords.txt
   [junit4]   2> 1148791 INFO  (TEST-HdfsWriteToMultipleCollectionsTest.test-seed#[765495B8CB018238]) [    ] o.a.s.c.AbstractZkTestCase put /x1/jenkins/jenkins-slave/workspace/Lucene-Solr-NightlyTests-6.x/checkout/solr/core/src/test-files/solr/collection1/conf/protwords.txt to /configs/conf1/protwords.txt
   [junit4]   2> 1148792 INFO  (TEST-HdfsWriteToMultipleCollectionsTest.test-seed#[765495B8CB018238]) [    ] o.a.s.c.AbstractZkTestCase put /x1/jenkins/jenkins-slave/workspace/Lucene-Solr-NightlyTests-6.x/checkout/solr/core/src/test-files/solr/collection1/conf/currency.xml to /configs/conf1/currency.xml
   [junit4]   2> 1148794 INFO  (TEST-HdfsWriteToMultipleCollectionsTest.test-seed#[765495B8CB018238]) [    ] o.a.s.c.AbstractZkTestCase put /x1/jenkins/jenkins-slave/workspace/Lucene-Solr-NightlyTests-6.x/checkout/solr/core/src/test-files/solr/collection1/conf/enumsConfig.xml to /configs/conf1/enumsConfig.xml
   [junit4]   2> 1148795 INFO  (TEST-HdfsWriteToMultipleCollectionsTest.test-seed#[765495B8CB018238]) [    ] o.a.s.c.AbstractZkTestCase put /x1/jenkins/jenkins-slave/workspace/Lucene-Solr-NightlyTests-6.x/checkout/solr/core/src/test-files/solr/collection1/conf/open-exchange-rates.json to /configs/conf1/open-exchange-rates.json
   [junit4]   2> 1148796 INFO  (TEST-HdfsWriteToMultipleCollectionsTest.test-seed#[765495B8CB018238]) [    ] o.a.s.c.AbstractZkTestCase put /x1/jenkins/jenkins-slave/workspace/Lucene-Solr-NightlyTests-6.x/checkout/solr/core/src/test-files/solr/collection1/conf/mapping-ISOLatin1Accent.txt to /configs/conf1/mapping-ISOLatin1Accent.txt
   [junit4]   2> 1148797 INFO  (TEST-HdfsWriteToMultipleCollectionsTest.test-seed#[765495B8CB018238]) [    ] o.a.s.c.AbstractZkTestCase put /x1/jenkins/jenkins-slave/workspace/Lucene-Solr-NightlyTests-6.x/checkout/solr/core/src/test-files/solr/collection1/conf/old_synonyms.txt to /configs/conf1/old_synonyms.txt
   [junit4]   2> 1148798 INFO  (TEST-HdfsWriteToMultipleCollectionsTest.test-seed#[765495B8CB018238]) [    ] o.a.s.c.AbstractZkTestCase put /x1/jenkins/jenkins-slave/workspace/Lucene-Solr-NightlyTests-6.x/checkout/solr/core/src/test-files/solr/collection1/conf/synonyms.txt to /configs/conf1/synonyms.txt
   [junit4]   2> 1148905 INFO  (TEST-HdfsWriteToMultipleCollectionsTest.test-seed#[765495B8CB018238]) [    ] o.a.s.SolrTestCaseJ4 Writing core.properties file to /x1/jenkins/jenkins-slave/workspace/Lucene-Solr-NightlyTests-6.x/checkout/solr/build/solr-core/test/J1/temp/solr.cloud.hdfs.HdfsWriteToMultipleCollectionsTest_765495B8CB018238-001/control-001/cores/collection1
   [junit4]   2> 1148907 INFO  (TEST-HdfsWriteToMultipleCollectionsTest.test-seed#[765495B8CB018238]) [    ] o.e.j.s.Server jetty-9.3.14.v20161028
   [junit4]   2> 1148908 INFO  (TEST-HdfsWriteToMultipleCollectionsTest.test-seed#[765495B8CB018238]) [    ] o.e.j.s.h.ContextHandler Started o.e.j.s.ServletContextHandler@38faa9c6{/,null,AVAILABLE}
   [junit4]   2> 1148909 INFO  (TEST-HdfsWriteToMultipleCollectionsTest.test-seed#[765495B8CB018238]) [    ] o.e.j.s.AbstractConnector Started ServerConnector@1b1ed91b{HTTP/1.1,[http/1.1]}{127.0.0.1:33786}
   [junit4]   2> 1148909 INFO  (TEST-HdfsWriteToMultipleCollectionsTest.test-seed#[765495B8CB018238]) [    ] o.e.j.s.Server Started @1152802ms
   [junit4]   2> 1148909 INFO  (TEST-HdfsWriteToMultipleCollectionsTest.test-seed#[765495B8CB018238]) [    ] o.a.s.c.s.e.JettySolrRunner Jetty properties: {solr.data.dir=hdfs://localhost:40180/hdfs__localhost_40180__x1_jenkins_jenkins-slave_workspace_Lucene-Solr-NightlyTests-6.x_checkout_solr_build_solr-core_test_J1_temp_solr.cloud.hdfs.HdfsWriteToMultipleCollectionsTest_765495B8CB018238-001_tempDir-002_control_data, hostContext=/, hostPort=33786, coreRootDirectory=/x1/jenkins/jenkins-slave/workspace/Lucene-Solr-NightlyTests-6.x/checkout/solr/build/solr-core/test/J1/../../../../../../../../../../../x1/jenkins/jenkins-slave/workspace/Lucene-Solr-NightlyTests-6.x/checkout/solr/build/solr-core/test/J1/temp/solr.cloud.hdfs.HdfsWriteToMultipleCollectionsTest_765495B8CB018238-001/control-001/cores}
   [junit4]   2> 1148909 ERROR (TEST-HdfsWriteToMultipleCollectionsTest.test-seed#[765495B8CB018238]) [    ] o.a.s.s.StartupLoggingUtils Missing Java Option solr.log.dir. Logging may be missing or incomplete.
   [junit4]   2> 1148909 INFO  (TEST-HdfsWriteToMultipleCollectionsTest.test-seed#[765495B8CB018238]) [    ] o.a.s.s.SolrDispatchFilter  ___      _       Welcome to Apache Solr? version 6.5.0
   [junit4]   2> 1148909 INFO  (TEST-HdfsWriteToMultipleCollectionsTest.test-seed#[765495B8CB018238]) [    ] o.a.s.s.SolrDispatchFilter / __| ___| |_ _   Starting in cloud mode on port null
   [junit4]   2> 1148909 INFO  (TEST-HdfsWriteToMultipleCollectionsTest.test-seed#[765495B8CB018238]) [    ] o.a.s.s.SolrDispatchFilter \__ \/ _ \ | '_|  Install dir: null
   [junit4]   2> 1148909 INFO  (TEST-HdfsWriteToMultipleCollectionsTest.test-seed#[765495B8CB018238]) [    ] o.a.s.s.SolrDispatchFilter |___/\___/_|_|    Start time: 2017-01-30T23:17:33.065Z
   [junit4]   2> 1148916 INFO  (TEST-HdfsWriteToMultipleCollectionsTest.test-seed#[765495B8CB018238]) [    ] o.a.s.s.SolrDispatchFilter Loading solr.xml from SolrHome (not found in ZooKeeper)
   [junit4]   2> 1148916 INFO  (TEST-HdfsWriteToMultipleCollectionsTest.test-seed#[765495B8CB018238]) [    ] o.a.s.c.SolrXmlConfig Loading container configuration from /x1/jenkins/jenkins-slave/workspace/Lucene-Solr-NightlyTests-6.x/checkout/solr/build/solr-core/test/J1/temp/solr.cloud.hdfs.HdfsWriteToMultipleCollectionsTest_765495B8CB018238-001/control-001/solr.xml
   [junit4]   2> 1148924 INFO  (TEST-HdfsWriteToMultipleCollectionsTest.test-seed#[765495B8CB018238]) [    ] o.a.s.u.UpdateShardHandler Creating UpdateShardHandler HTTP client with params: socketTimeout=340000&connTimeout=45000&retry=true
   [junit4]   2> 1148925 INFO  (TEST-HdfsWriteToMultipleCollectionsTest.test-seed#[765495B8CB018238]) [    ] o.a.s.c.ZkContainer Zookeeper client=127.0.0.1:59338/solr
   [junit4]   2> 1148989 INFO  (TEST-HdfsWriteToMultipleCollectionsTest.test-seed#[765495B8CB018238]) [n:127.0.0.1:33786_    ] o.a.s.c.OverseerElectionContext I am going to be the leader 127.0.0.1:33786_
   [junit4]   2> 1148990 INFO  (TEST-HdfsWriteToMultipleCollectionsTest.test-seed#[765495B8CB018238]) [n:127.0.0.1:33786_    ] o.a.s.c.Overseer Overseer (id=97374585016745988-127.0.0.1:33786_-n_0000000000) starting
   [junit4]   2> 1149016 INFO  (TEST-HdfsWriteToMultipleCollectionsTest.test-seed#[765495B8CB018238]) [n:127.0.0.1:33786_    ] o.a.s.c.ZkController Register node as live in ZooKeeper:/live_nodes/127.0.0.1:33786_
   [junit4]   2> 1149019 INFO  (zkCallback-1497-thread-1-processing-n:127.0.0.1:33786_) [n:127.0.0.1:33786_    ] o.a.s.c.c.ZkStateReader Updated live nodes from ZooKeeper... (0) -> (1)
   [junit4]   2> 1149049 INFO  (TEST-HdfsWriteToMultipleCollectionsTest.test-seed#[765495B8CB018238]) [n:127.0.0.1:33786_    ] o.a.s.c.CorePropertiesLocator Found 1 core definitions underneath /x1/jenkins/jenkins-slave/workspace/Lucene-Solr-NightlyTests-6.x/checkout/solr/build/solr-core/test/J1/../../../../../../../../../../../x1/jenkins/jenkins-slave/workspace/Lucene-Solr-NightlyTests-6.x/checkout/solr/build/solr-core/test/J1/temp/solr.cloud.hdfs.HdfsWriteToMultipleCollectionsTest_765495B8CB018238-001/control-001/cores
   [junit4]   2> 1149049 INFO  (TEST-HdfsWriteToMultipleCollectionsTest.test-seed#[765495B8CB018238]) [n:127.0.0.1:33786_    ] o.a.s.c.CorePropertiesLocator Cores are: [collection1]
   [junit4]   2> 1149063 INFO  (OverseerStateUpdate-97374585016745988-127.0.0.1:33786_-n_0000000000) [n:127.0.0.1:33786_    ] o.a.s.c.o.ReplicaMutator Assigning new node to shard shard=shard1
   [junit4]   2> 1150088 WARN  (coreLoadExecutor-2151-thread-1-processing-n:127.0.0.1:33786_) [n:127.0.0.1:33786_ c:control_collection   x:collection1] o.a.s.c.Config Beginning with Solr 5.5, <mergePolicy> is deprecated, use <mergePolicyFactory> instead.
   [junit4]   2> 1150089 INFO  (coreLoadExecutor-2151-thread-1-processing-n:127.0.0.1:33786_) [n:127.0.0.1:33786_ c:control_collection   x:collection1] o.a.s.c.SolrConfig Using Lucene MatchVersion: 6.5.0
   [junit4]   2> 1150105 INFO  (coreLoadExecutor-2151-thread-1-processing-n:127.0.0.1:33786_) [n:127.0.0.1:33786_ c:control_collection   x:collection1] o.a.s.s.IndexSchema [collection1] Schema name=test
   [junit4]   2> 1150213 WARN  (coreLoadExecutor-2151-thread-1-processing-n:127.0.0.1:33786_) [n:127.0.0.1:33786_ c:control_collection   x:collection1] o.a.s.s.IndexSchema [collection1] default search field in schema is text. WARNING: Deprecated, please use 'df' on request instead.
   [junit4]   2> 1150214 INFO  (coreLoadExecutor-2151-thread-1-processing-n:127.0.0.1:33786_) [n:127.0.0.1:33786_ c:control_collection   x:collection1] o.a.s.s.IndexSchema Loaded schema test/1.6 with uniqueid field id
   [junit4]   2> 1150238 INFO  (coreLoadExecutor-2151-thread-1-processing-n:127.0.0.1:33786_) [n:127.0.0.1:33786_ c:control_collection   x:collection1] o.a.s.c.CoreContainer Creating SolrCore 'collection1' using configuration from collection control_collection
   [junit4]   2> 1150249 INFO  (coreLoadExecutor-2151-thread-1-processing-n:127.0.0.1:33786_) [n:127.0.0.1:33786_ c:control_collection   x:collection1] o.a.s.c.HdfsDirectoryFactory solr.hdfs.home=hdfs://localhost:40180/solr_hdfs_home
   [junit4]   2> 1150249 INFO  (coreLoadExecutor-2151-thread-1-processing-n:127.0.0.1:33786_) [n:127.0.0.1:33786_ c:control_collection   x:collection1] o.a.s.c.HdfsDirectoryFactory Solr Kerberos Authentication disabled
   [junit4]   2> 1150249 INFO  (coreLoadExecutor-2151-thread-1-processing-n:127.0.0.1:33786_) [n:127.0.0.1:33786_ c:control_collection   x:collection1] o.a.s.c.SolrCore [[collection1] ] Opening new SolrCore at [/x1/jenkins/jenkins-slave/workspace/Lucene-Solr-NightlyTests-6.x/checkout/solr/build/solr-core/test/J1/temp/solr.cloud.hdfs.HdfsWriteToMultipleCollectionsTest_765495B8CB018238-001/control-001/cores/collection1], dataDir=[hdfs://localhost:40180/solr_hdfs_home/control_collection/core_node1/data/]
   [junit4]   2> 1150250 INFO  (coreLoadExecutor-2151-thread-1-processing-n:127.0.0.1:33786_) [n:127.0.0.1:33786_ c:control_collection   x:collection1] o.a.s.c.JmxMonitoredMap JMX monitoring is enabled. Adding Solr mbeans to JMX Server: com.sun.jmx.mbeanserver.JmxMBeanServer@2f136126
   [junit4]   2> 1150250 INFO  (coreLoadExecutor-2151-thread-1-processing-n:127.0.0.1:33786_) [n:127.0.0.1:33786_ c:control_collection   x:collection1] o.a.s.c.HdfsDirectoryFactory creating directory factory for path hdfs://localhost:40180/solr_hdfs_home/control_collection/core_node1/data/snapshot_metadata
   [junit4]   2> 1150268 INFO  (coreLoadExecutor-2151-thread-1-processing-n:127.0.0.1:33786_) [n:127.0.0.1:33786_ c:control_collection   x:collection1] o.a.s.c.HdfsDirectoryFactory Number of slabs of block cache [1] with direct memory allocation set to [true]
   [junit4]   2> 1150268 INFO  (coreLoadExecutor-2151-thread-1-processing-n:127.0.0.1:33786_) [n:127.0.0.1:33786_ c:control_collection   x:collection1] o.a.s.c.HdfsDirectoryFactory Block cache target memory usage, slab size of [8388608] will allocate [1] slabs and use ~[8388608] bytes
   [junit4]   2> 1150268 INFO  (coreLoadExecutor-2151-thread-1-processing-n:127.0.0.1:33786_) [n:127.0.0.1:33786_ c:control_collection   x:collection1] o.a.s.c.HdfsDirectoryFactory Creating new global HDFS BlockCache
   [junit4]   2> 1152335 INFO  (coreLoadExecutor-2151-thread-1-processing-n:127.0.0.1:33786_) [n:127.0.0.1:33786_ c:control_collection   x:collection1] o.a.s.s.b.BlockDirectory Block cache on write is disabled
   [junit4]   2> 1152345 INFO  (coreLoadExecutor-2151-thread-1-processing-n:127.0.0.1:33786_) [n:127.0.0.1:33786_ c:control_collection   x:collection1] o.a.s.c.HdfsDirectoryFactory creating directory factory for path hdfs://localhost:40180/solr_hdfs_home/control_collection/core_node1/data
   [junit4]   2> 1152431 INFO  (coreLoadExecutor-2151-thread-1-processing-n:127.0.0.1:33786_) [n:127.0.0.1:33786_ c:control_collection   x:collection1] o.a.s.c.HdfsDirectoryFactory creating directory factory for path hdfs://localhost:40180/solr_hdfs_home/control_collection/core_node1/data/index
   [junit4]   2> 1152453 INFO  (coreLoadExecutor-2151-thread-1-processing-n:127.0.0.1:33786_) [n:127.0.0.1:33786_ c:control_collection   x:collection1] o.a.s.c.HdfsDirectoryFactory Number of slabs of block cache [1] with direct memory allocation set to [true]
   [junit4]   2> 1152453 INFO  (coreLoadExecutor-2151-thread-1-processing-n:127.0.0.1:33786_) [n:127.0.0.1:33786_ c:control_collection   x:collection1] o.a.s.c.HdfsDirectoryFactory Block cache target memory usage, slab size of [8388608] will allocate [1] slabs and use ~[8388608] bytes
   [junit4]   2> 1152491 INFO  (coreLoadExecutor-2151-thread-1-processing-n:127.0.0.1:33786_) [n:127.0.0.1:33786_ c:control_collection   x:collection1] o.a.s.s.b.BlockDirectory Block cache on write is disabled
   [junit4]   2> 1152493 INFO  (coreLoadExecutor-2151-thread-1-processing-n:127.0.0.1:33786_) [n:127.0.0.1:33786_ c:control_collection   x:collection1] o.a.s.u.RandomMergePolicy RandomMergePolicy wrapping class org.apache.lucene.index.AlcoholicMergePolicy: [AlcoholicMergePolicy: minMergeSize=0, mergeFactor=10, maxMergeSize=1074057070, maxMergeSizeForForcedMerge=9223372036854775807, calibrateSizeByDeletes=true, maxMergeDocs=2147483647, maxCFSSegmentSizeMB=8.796093022207999E12, noCFSRatio=0.1]
   [junit4]   2> 1152996 INFO  (IPC Server handler 1 on 40180) [    ] BlockStateChange BLOCK* addStoredBlock: blockMap updated: 127.0.0.1:37960 is added to blk_1073741825_1001{UCState=COMMITTED, truncateBlock=null, primaryNodeIndex=-1, replicas=[ReplicaUC[[DISK]DS-ae22a632-cd5f-4c52-be91-c8876c0439cc:NORMAL:127.0.0.1:44103|RBW], ReplicaUC[[DISK]DS-11a74713-8e73-41df-9f4c-ab42e176baf9:NORMAL:127.0.0.1:37960|RBW]]} size 71
   [junit4]   2> 1152998 INFO  (IPC Server handler 5 on 40180) [    ] BlockStateChange BLOCK* addStoredBlock: blockMap updated: 127.0.0.1:44103 is added to blk_1073741825_1001 size 71
   [junit4]   2> 1153419 WARN  (coreLoadExecutor-2151-thread-1-processing-n:127.0.0.1:33786_) [n:127.0.0.1:33786_ c:control_collection   x:collection1] o.a.s.c.RequestHandlers INVALID paramSet a in requestHandler {type = requestHandler,name = /dump,class = DumpRequestHandler,attributes = {initParams=a, name=/dump, class=DumpRequestHandler},args = {defaults={a=A,b=B}}}
   [junit4]   2> 1153444 INFO  (coreLoadExecutor-2151-thread-1-processing-n:127.0.0.1:33786_) [n:127.0.0.1:33786_ c:control_collection   x:collection1] o.a.s.u.UpdateHandler Using UpdateLog implementation: org.apache.solr.update.HdfsUpdateLog
   [junit4]   2> 1153444 INFO  (coreLoadExecutor-2151-thread-1-processing-n:127.0.0.1:33786_) [n:127.0.0.1:33786_ c:control_collection   x:collection1] o.a.s.u.UpdateLog Initializing UpdateLog: dataDir= defaultSyncLevel=FLUSH numRecordsToKeep=100 maxNumLogsToKeep=10 numVersionBuckets=65536
   [junit4]   2> 1153444 INFO  (coreLoadExecutor-2151-thread-1-processing-n:127.0.0.1:33786_) [n:127.0.0.1:33786_ c:control_collection   x:collection1] o.a.s.u.HdfsUpdateLog Initializing HdfsUpdateLog: tlogDfsReplication=2
   [junit4]   2> 1153637 INFO  (coreLoadExecutor-2151-thread-1-processing-n:127.0.0.1:33786_) [n:127.0.0.1:33786_ c:control_collection   x:collection1] o.a.s.u.CommitTracker Hard AutoCommit: disabled
   [junit4]   2> 1153637 INFO  (coreLoadExecutor-2151-thread-1-processing-n:127.0.0.1:33786_) [n:127.0.0.1:33786_ c:control_collection   x:collection1] o.a.s.u.CommitTracker Soft AutoCommit: disabled
   [junit4]   2> 1153641 INFO  (coreLoadExecutor-2151-thread-1-processing-n:127.0.0.1:33786_) [n:127.0.0.1:33786_ c:control_collection   x:collection1] o.a.s.u.RandomMergePolicy RandomMergePolicy wrapping class org.apache.lucene.index.TieredMergePolicy: [TieredMergePolicy: maxMergeAtOnce=29, maxMergeAtOnceExplicit=45, maxMergedSegmentMB=1.0751953125, floorSegmentMB=0.625, forceMergeDeletesPctAllowed=3.7412116410685146, segmentsPerTier=48.0, maxCFSSegmentSizeMB=8.796093022207999E12, noCFSRatio=0.6234715550240746
   [junit4]   2> 1153793 INFO  (coreLoadExecutor-2151-thread-1-processing-n:127.0.0.1:33786_) [n:127.0.0.1:33786_ c:control_collection   x:collection1] o.a.s.s.SolrIndexSearcher Opening [Searcher@793c5823[collection1] main]
   [junit4]   2> 1153795 INFO  (coreLoadExecutor-2151-thread-1-processing-n:127.0.0.1:33786_) [n:127.0.0.1:33786_ c:control_collection   x:collection1] o.a.s.r.ManagedResourceStorage Configured ZooKeeperStorageIO with znodeBase: /configs/conf1
   [junit4]   2> 1153796 INFO  (coreLoadExecutor-2151-thread-1-processing-n:127.0.0.1:33786_) [n:127.0.0.1:33786_ c:control_collection   x:collection1] o.a.s.r.ManagedResourceStorage Loaded null at path _rest_managed.json using ZooKeeperStorageIO:path=/configs/conf1
   [junit4]   2> 1153798 INFO  (coreLoadExecutor-2151-thread-1-processing-n:127.0.0.1:33786_) [n:127.0.0.1:33786_ c:control_collection   x:collection1] o.a.s.h.ReplicationHandler Commits will be reserved for  10000
   [junit4]   2> 1153800 INFO  (searcherExecutor-2152-thread-1-processing-n:127.0.0.1:33786_ x:collection1 c:control_collection) [n:127.0.0.1:33786_ c:control_collection   x:collection1] o.a.s.c.SolrCore [collection1] Registered new searcher Searcher@793c5823[collection1] main{ExitableDirectoryReader(UninvertingDirectoryReader())}
   [junit4]   2> 1153810 INFO  (coreLoadExecutor-2151-thread-1-processing-n:127.0.0.1:33786_) [n:127.0.0.1:33786_ c:control_collection   x:collection1] o.a.s.u.UpdateLog Could not find max version in index or recent updates, using new clock 1557993365664956416
   [junit4]   2> 1153839 INFO  (coreZkRegister-2144-thread-1-processing-n:127.0.0.1:33786_ x:collection1 c:control_collection) [n:127.0.0.1:33786_ c:control_collection s:shard1 r:core_node1 x:collection1] o.a.s.c.ShardLeaderElectionContext Enough replicas found to continue.
   [junit4]   2> 1153839 INFO  (coreZkRegister-2144-thread-1-processing-n:127.0.0.1:33786_ x:collection1 c:control_collection) [n:127.0.0.1:33786_ c:control_collection s:shard1 r:core_node1 x:collection1] o.a.s.c.ShardLeaderElectionContext I may be the new leader - try and sync
   [junit4]   2> 1153839 INFO  (coreZkRegister-2144-thread-1-processing-n:127.0.0.1:33786_ x:collection1 c:control_collection) [n:127.0.0.1:33786_ c:control_collection s:shard1 r:core_node1 x:collection1] o.a.s.c.SyncStrategy Sync replicas to http://127.0.0.1:33786/collection1/
   [junit4]   2> 1153839 INFO  (coreZkRegister-2144-thread-1-processing-n:127.0.0.1:33786_ x:collection1 c:control_collection) [n:127.0.0.1:33786_ c:control_collection s:shard1 r:core_node1 x:collection1] o.a.s.c.SyncStrategy Sync Success - now sync replicas to me
   [junit4]   2> 1153839 INFO  (coreZkRegister-2144-thread-1-processing-n:127.0.0.1:33786_ x:collection1 c:control_collection) [n:127.0.0.1:33786_ c:control_collection s:shard1 r:core_node1 x:collection1] o.a.s.c.SyncStrategy http://127.0.0.1:33786/collection1/ has no replicas
   [junit4]   2> 1153842 INFO  (coreZkRegister-2144-thread-1-processing-n:127.0.0.1:33786_ x:collection1 c:control_collection) [n:127.0.0.1:33786_ c:control_collection s:shard1 r:core_node1 x:collection1] o.a.s.c.ShardLeaderElectionContext I am the new leader: http://127.0.0.1:33786/collection1/ shard1
   [junit4]   2> 1154005 INFO  (coreZkRegister-2144-thread-1-processing-n:127.0.0.1:33786_ x:collection1 c:control_collection) [n:127.0.0.1:33786_ c:control_collection s:shard1 r:core_node1 x:collection1] o.a.s.c.ZkController I am the leader, no recovery necessary
   [junit4]   2> 1154308 INFO  (TEST-HdfsWriteToMultipleCollectionsTest.test-seed#[765495B8CB018238]) [    ] o.a.s.c.c.ZkStateReader Updated live nodes from ZooKeeper... (0) -> (1)
   [junit4]   2> 1154309 INFO  (TEST-HdfsWriteToMultipleCollectionsTest.test-seed#[765495B8CB018238]) [    ] o.a.s.c.s.i.ZkClientClusterStateProvider Cluster at 127.0.0.1:59338/solr ready
   [junit4]   2> 1154309 INFO  (TEST-HdfsWriteToMultipleCollectionsTest.test-seed#[765495B8CB018238]) [    ] o.a.s.c.ChaosMonkey monkey: init - expire sessions:false cause connection loss:false
   [junit4]   2> 1154310 INFO  (TEST-HdfsWriteToMultipleCollectionsTest.test-seed#[765495B8CB018238]) [    ] o.a.s.c.AbstractFullDistribZkTestBase Creating collection1 with stateFormat=2
   [junit4]   2> 1154440 INFO  (TEST-HdfsWriteToMultipleCollectionsTest.test-seed#[765495B8CB018238]) [    ] o.a.s.SolrTestCaseJ4 Writing core.properties file to /x1/jenkins/jenkins-slave/workspace/Lucene-Solr-NightlyTests-6.x/checkout/solr/build/solr-core/test/J1/temp/solr.cloud.hdfs.HdfsWriteToMultipleCollectionsTest_765495B8CB018238-001/shard-1-001/cores/collection1
   [junit4]   2> 1154440 INFO  (TEST-HdfsWriteToMultipleCollectionsTest.test-seed#[765495B8CB018238]) [    ] o.a.s.c.AbstractFullDistribZkTestBase create jetty 1 in directory /x1/jenkins/jenkins-slave/workspace/Lucene-Solr-NightlyTests-6.x/checkout/solr/build/solr-core/test/J1/temp/solr.cloud.hdfs.HdfsWriteToMultipleCollectionsTest_765495B8CB018238-001/shard-1-001
   [junit4]   2> 1154441 INFO  (TEST-HdfsWriteToMultipleCollectionsTest.test-seed#[765495B8CB018238]) [    ] o.e.j.s.Server jetty-9.3.14.v20161028
   [junit4]   2> 1154443 INFO  (TEST-HdfsWriteToMultipleCollectionsTest.test-seed#[765495B8CB018238]) [    ] o.e.j.s.h.ContextHandler Started o.e.j.s.ServletContextHandler@27ae4844{/,null,AVAILABLE}
   [junit4]   2> 1154443 INFO  (TEST-HdfsWriteToMultipleCollectionsTest.test-seed#[765495B8CB018238]) [    ] o.e.j.s.AbstractConnector Started ServerConnector@3cfb9fa7{HTTP/1.1,[http/1.1]}{127.0.0.1:58111}
   [junit4]   2> 1154443 INFO  (TEST-HdfsWriteToMultipleCollectionsTest.test-seed#[765495B8CB018238]) [    ] o.e.j.s.Server Started @1158337ms
   [junit4]   2> 1154443 INFO  (TEST-HdfsWriteToMultipleCollectionsTest.test-seed#[765495B8CB018238]) [    ] o.a.s.c.s.e.JettySolrRunner Jetty properties: {solr.data.dir=hdfs://localhost:40180/hdfs__localhost_40180__x1_jenkins_jenkins-slave_workspace_Lucene-Solr-NightlyTests-6.x_checkout_solr_build_solr-core_test_J1_temp_solr.cloud.hdfs.HdfsWriteToMultipleCollectionsTest_765495B8CB018238-001_tempDir-002_jetty1, solrconfig=solrconfig.xml, hostContext=/, hostPort=58111, coreRootDirectory=/x1/jenkins/jenkins-slave/workspace/Lucene-Solr-NightlyTests-6.x/checkout/solr/build/solr-core/test/J1/temp/solr.cloud.hdfs.HdfsWriteToMultipleCollectionsTest_765495B8CB018238-001/shard-1-001/cores}
   [junit4]   2> 1154444 ERROR (TEST-HdfsWriteToMultipleCollectionsTest.test-seed#[765495B8CB018238]) [    ] o.a.s.s.StartupLoggingUtils Missing Java Option solr.log.dir. Logging may be missing or incomplete.
   [junit4]   2> 1154446 INFO  (TEST-HdfsWriteToMultipleCollectionsTest.test-seed#[765495B8CB018238]) [    ] o.a.s.s.SolrDispatchFilter  ___      _       Welcome to Apache Solr? version 6.5.0
   [junit4]   2> 1154446 INFO  (TEST-HdfsWriteToMultipleCollectionsTest.test-seed#[765495B8CB018238]) [    ] o.a.s.s.SolrDispatchFilter / __| ___| |_ _   Starting in cloud mode on port null
   [junit4]   2> 1154446 INFO  (TEST-HdfsWriteToMultipleCollectionsTest.test-seed#[765495B8CB018238]) [    ] o.a.s.s.SolrDispatchFilter \__ \/ _ \ | '_|  Install dir: null
   [junit4]   2> 1154446 INFO  (TEST-HdfsWriteToMultipleCollectionsTest.test-seed#[765495B8CB018238]) [    ] o.a.s.s.SolrDispatchFilter |___/\___/_|_|    Start time: 2017-01-30T23:17:38.602Z
   [junit4]   2> 1154451 INFO  (TEST-HdfsWriteToMultipleCollectionsTest.test-seed#[765495B8CB018238]) [    ] o.a.s.s.SolrDispatchFilter Loading solr.xml from SolrHome (not found in ZooKeeper)
   [junit4]   2> 1154451 INFO  (TEST-HdfsWriteToMultipleCollectionsTest.test-seed#[765495B8CB018238]) [    ] o.a.s.c.SolrXmlConfig Loading container configuration from /x1/jenkins/jenkins-slave/workspace/Lucene-Solr-NightlyTests-6.x/checkout/solr/build/solr-core/test/J1/temp/solr.cloud.hdfs.HdfsWriteToMultipleCollectionsTest_765495B8CB018238-001/shard-1-001/solr.xml
   [junit4]   2> 1154458 INFO  (TEST-HdfsWriteToMultipleCollectionsTest.test-seed#[765495B8CB018238]) [    ] o.a.s.u.UpdateShardHandler Creating UpdateShardHandler HTTP client with params: socketTimeout=340000&connTimeout=45000&retry=true
   [junit4]   2> 1154459 INFO  (TEST-HdfsWriteToMultipleCollectionsTest.test-seed#[765495B8CB018238]) [    ] o.a.s.c.ZkContainer Zookeeper client=127.0.0.1:59338/solr
   [junit4]   2> 1154473 INFO  (TEST-HdfsWriteToMultipleCollectionsTest.test-seed#[765495B8CB018238]) [n:127.0.0.1:58111_    ] o.a.s.c.c.ZkStateReader Updated live nodes from ZooKeeper... (0) -> (1)
   [junit4]   2> 1154480 INFO  (TEST-HdfsWriteToMultipleCollectionsTest.test-seed#[765495B8CB018238]) [n:127.0.0.1:58111_    ] o.a.s.c.ZkController Register node as live in ZooKeeper:/live_nodes/127.0.0.1:58111_
   [junit4]   2> 1154483 INFO  (zkCallback-1501-thread-1) [    ] o.a.s.c.c.ZkStateReader Updated live nodes from ZooKeeper... (1) -> (2)
   [junit4]   2> 1154488 INFO  (zkCallback-1497-thread-3-processing-n:127.0.0.1:33786_) [n:127.0.0.1:33786_    ] o.a.s.c.c.ZkStateReader Updated live nodes from ZooKeeper... (1) -> (2)
   [junit4]   2> 1154492 INFO  (zkCallback-1507-thread-1-processing-n:127.0.0.1:58111_) [n:127.0.0.1:58111_    ] o.a.s.c.c.ZkStateReader Updated live nodes from ZooKeeper... (1) -> (2)
   [junit4]   2> 1154590 INFO  (TEST-HdfsWriteToMultipleCollectionsTest.test-seed#[765495B8CB018238]) [n:127.0.0.1:58111_    ] o.a.s.c.CorePropertiesLocator Found 1 core definitions underneath /x1/jenkins/jenkins-slave/workspace/Lucene-Solr-NightlyTests-6.x/checkout/solr/build/solr-core/test/J1/temp/solr.cloud.hdfs.HdfsWriteToMultipleCollectionsTest_765495B8CB018238-001/shard-1-001/cores
   [junit4]   2> 1154590 INFO  (TEST-HdfsWriteToMultipleCollectionsTest.test-seed#[765495B8CB018238]) [n:127.0.0.1:58111_    ] o.a.s.c.CorePropertiesLocator Cores are: [collection1]
   [junit4]   2> 1154600 INFO  (OverseerStateUpdate-97374585016745988-127.0.0.1:33786_-n_0000000000) [n:127.0.0.1:33786_    ] o.a.s.c.o.ReplicaMutator Assigning new node to shard shard=shard1
   [junit4]   2> 1154703 INFO  (zkCallback-1507-thread-1-processing-n:127.0.0.1:58111_) [n:127.0.0.1:58111_    ] o.a.s.c.c.ZkStateReader A cluster state change: [WatchedEvent state:SyncConnected type:NodeDataChanged path:/collections/collection1/state.json] for collection [collection1] has occurred - updating... (live nodes size: [2])
   [junit4]   2> 1155614 WARN  (coreLoadExecutor-2162-thread-1-processing-n:127.0.0.1:58111_) [n:127.0.0.1:58111_ c:collection1   x:collection1] o.a.s.c.Config Beginning with Solr 5.5, <mergePolicy> is deprecated, use <mergePolicyFactory> instead.
   [junit4]   2> 1155615 INFO  (coreLoadExecutor-2162-thread-1-processing-n:127.0.0.1:58111_) [n:127.0.0.1:58111_ c:collection1   x:collection1] o.a.s.c.SolrConfig Using Lucene MatchVersion: 6.5.0
   [junit4]   2> 1155633 INFO  (coreLoadExecutor-2162-thread-1-processing-n:127.0.0.1:58111_) [n:127.0.0.1:58111_ c:collection1   x:collection1] o.a.s.s.IndexSchema [collection1] Schema name=test
   [junit4]   2> 1155761 WARN  (coreLoadExecutor-2162-thread-1-processing-n:127.0.0.1:58111_) [n:127.0.0.1:58111_ c:collection1   x:collection1] o.a.s.s.IndexSchema [collection1] default search field in schema is text. WARNING: Deprecated, please use 'df' on request instead.
   [junit4]   2> 1155763 INFO  (coreLoadExecutor-2162-thread-1-processing-n:127.0.0.1:58111_) [n:127.0.0.1:58111_ c:collection1   x:collection1] o.a.s.s.IndexSchema Loaded schema test/1.6 with uniqueid field id
   [junit4]   2> 1155779 INFO  (coreLoadExecutor-2162-thread-1-processing-n:127.0.0.1:58111_) [n:127.0.0.1:58111_ c:collection1   x:collection1] o.a.s.c.CoreContainer Creating SolrCore 'collection1' using configuration from collection collection1
   [junit4]   2> 1155780 INFO  (coreLoadExecutor-2162-thread-1-processing-n:127.0.0.1:58111_) [n:127.0.0.1:58111_ c:collection1   x:collection1] o.a.s.c.HdfsDirectoryFactory solr.hdfs.home=hdfs://localhost:40180/solr_hdfs_home
   [junit4]   2> 1155781 INFO  (coreLoadExecutor-2162-thread-1-processing-n:127.0.0.1:58111_) [n:127.0.0.1:58111_ c:collection1   x:collection1] o.a.s.c.HdfsDirectoryFactory Solr Kerberos Authentication disabled
   [junit4]   2> 1155781 INFO  (coreLoadExecutor-2162-thread-1-processing-n:127.0.0.1:58111_) [n:127.0.0.1:58111_ c:collection1   x:collection1] o.a.s.c.SolrCore [[collection1] ] Opening new SolrCore at [/x1/jenkins/jenkins-slave/workspace/Lucene-Solr-NightlyTests-6.x/checkout/solr/build/solr-core/test/J1/temp/solr.cloud.hdfs.HdfsWriteToMultipleCollectionsTest_765495B8CB018238-001/shard-1-001/cores/collection1], dataDir=[hdfs://localhost:40180/solr_hdfs_home/collection1/core_node1/data/]
   [junit4]   2> 1155781 INFO  (coreLoadExecutor-2162-thread-1-processing-n:127.0.0.1:58111_) [n:127.0.0.1:58111_ c:collection1   x:collection1] o.a.s.c.JmxMonitoredMap JMX monitoring is enabled. Adding Solr mbeans to JMX Server: com.sun.jmx.mbeanserver.JmxMBeanServer@2f136126
   [junit4]   2> 1155783 INFO  (coreLoadExecutor-2162-thread-1-processing-n:127.0.0.1:58111_) [n:127.0.0.1:58111_ c:collection1   x:collection1] o.a.s.c.HdfsDirectoryFactory creating directory factory for path hdfs://localhost:40180/solr_hdfs_home/collection1/core_node1/data/snapshot_metadata
   [junit4]   2> 1155795 INFO  (coreLoadExecutor-2162-thread-1-processing-n:127.0.0.1:58111_) [n:127.0.0.1:58111_ c:collection1   x:collection1] o.a.s.c.HdfsDirectoryFactory Number of slabs of block cache [1] with direct memory allocation set to [true]
   [junit4]   2> 1155795 INFO  (coreLoadExecutor-2162-thread-1-processing-n:127.0.0.1:58111_) [n:127.0.0.1:58111_ c:collection1   x:collection1] o.a.s.c.HdfsDirectoryFactory Block cache target memory usage, slab size of [8388608] will allocate [1] slabs and use ~[8388608] bytes
   [junit4]   2> 1155805 INFO  (coreLoadExecutor-2162-thread-1-processing-n:127.0.0.1:58111_) [n:127.0.0.1:58111_ c:collection1   x:collection1] o.a.s.s.b.BlockDirectory Block cache on write is disabled
   [junit4]   2> 1155809 INFO  (coreLoadExecutor-2162-thread-1-processing-n:127.0.0.1:58111_) [n:127.0.0.1:58111_ c:collection1   x:collection1] o.a.s.c.HdfsDirectoryFactory creating directory factory for path hdfs://localhost:40180/solr_hdfs_home/collection1/core_node1/data
   [junit4]   2> 1155866 INFO  (coreLoadExecutor-2162-thread-1-processing-n:127.0.0.1:58111_) [n:127.0.0.1:58111_ c:collection1   x:collection1] o.a.s.c.HdfsDirectoryFactory creating directory factory for path hdfs://localhost:40180/solr_hdfs_home/collection1/core_node1/data/index
   [junit4]   2> 1155918 INFO  (coreLoadExecutor-2162-thread-1-processing-n:127.0.0.1:58111_) [n:127.0.0.1:58111_ c:collection1   x:collection1] o.a.s.c.HdfsDirectoryFactory Number of slabs of block cache [1] with direct memory allocation set to [true]
   [junit4]   2> 1155919 INFO  (coreLoadExecutor-2162-thread-1-processing-n:127.0.0.1:58111_) [n:127.0.0.1:58111_ c:collection1   x:collection1] o.a.s.c.HdfsDirectoryFactory Block cache target memory usage, slab size of [8388608] will allocate [1] slabs and use ~[8388608] bytes
   [junit4]   2> 1155942 INFO  (coreLoadExecutor-2162-thread-1-processing-n:127.0.0.1:58111_) [n:127.0.0.1:58111_ c:collection1   x:collection1] o.a.s.s.b.BlockDirectory Block cache on write is disabled
   [junit4]   2> 1155948 INFO  (coreLoadExecutor-2162-thread-1-processing-n:127.0.0.1:58111_) [n:127.0.0.1:58111_ c:collection1   x:collection1] o.a.s.u.RandomMergePolicy RandomMergePolicy wrapping class org.apache.lucene.index.AlcoholicMergePolicy: [AlcoholicMergePolicy: minMergeSize=0, mergeFactor=10, maxMergeSize=1074057070, maxMergeSizeForForcedMerge=9223372036854775807, calibrateSizeByDeletes=true, maxMergeDocs=2147483647, maxCFSSegmentSizeMB=8.796093022207999E12, noCFSRatio=0.1]
   [junit4]   2> 1156119 INFO  (IPC Server handler 5 on 40180) [    ] BlockStateChange BLOCK* addStoredBlock: blockMap updated: 127.0.0.1:37960 is added to blk_1073741826_1002{UCState=UNDER_CONSTRUCTION, truncateBlock=null, primaryNodeIndex=-1, replicas=[ReplicaUC[[DISK]DS-eb907fae-6d6a-4936-8bbf-8d4eff1e29b5:NORMAL:127.0.0.1:44103|RBW], ReplicaUC[[DISK]DS-11a74713-8e73-41df-9f4c-ab42e176baf9:NORMAL:127.0.0.1:37960|FINALIZED]]} size 0
   [junit4]   2> 1156124 INFO  (IPC Server handler 7 on 40180) [    ] BlockStateChange BLOCK* addStoredBlock: blockMap updated: 127.0.0.1:44103 is added to blk_1073741826_1002{UCState=UNDER_CONSTRUCTION, truncateBlock=null, primaryNodeIndex=-1, replicas=[ReplicaUC[[DISK]DS-eb907fae-6d6a-4936-8bbf-8d4eff1e29b5:NORMAL:127.0.0.1:44103|RBW], ReplicaUC[[DISK]DS-11a74713-8e73-41df-9f4c-ab42e176baf9:NORMAL:127.0.0.1:37960|FINALIZED]]} size 0
   [junit4]   2> 1156168 WARN  (coreLoadExecutor-2162-thread-1-processing-n:127.0.0.1:58111_) [n:127.0.0.1:58111_ c:collection1   x:collection1] o.a.s.c.RequestHandlers INVALID paramSet a in requestHandler {type = requestHandler,name = /dump,class = DumpRequestHandler,attributes = {initParams=a, name=/dump, class=DumpRequestHandler},args = {defaults={a=A,b=B}}}
   [junit4]   2> 1156279 INFO  (coreLoadExecutor-2162-thread-1-processing-n:127.0.0.1:58111_) [n:127.0.0.1:58111_ c:collection1   x:collection1] o.a.s.u.UpdateHandler Using UpdateLog implementation: org.apache.solr.update.HdfsUpdateLog
   [junit4]   2> 1156279 INFO  (coreLoadExecutor-2162-thread-1-processing-n:127.0.0.1:58111_) [n:127.0.0.1:58111_ c:collection1   x:collection1] o.a.s.u.UpdateLog Initializing UpdateLog: dataDir= defaultSyncLevel=FLUSH numRecordsToKeep=100 maxNumLogsToKeep=10 numVersionBuckets=65536
   [junit4]   2> 1156279 INFO  (coreLoadExecutor-2162-thread-1-processing-n:127.0.0.1:58111_) [n:127.0.0.1:58111_ c:collection1   x:collection1] o.a.s.u.HdfsUpdateLog Initializing HdfsUpdateLog: tlogDfsReplication=2
   [junit4]   2> 1156315 INFO  (coreLoadExecutor-2162-thread-1-processing-n:127.0.0.1:58111_) [n:127.0.0.1:58111_ c:collection1   x:collection1] o.a.s.u.CommitTracker Hard AutoCommit: disabled
   [junit4]   2> 1156316 INFO  (coreLoadExecutor-2162-thread-1-processing-n:127.0.0.1:58111_) [n:127.0.0.1:58111_ c:collection1   x:collection1] o.a.s.u.CommitTracker Soft AutoCommit: disabled
   [junit4]   2> 1156321 INFO  (coreLoadExecutor-2162-thread-1-processing-n:127.0.0.1:58111_) [n:127.0.0.1:58111_ c:collection1   x:collection1] o.a.s.u.RandomMergePolicy RandomMergePolicy wrapping class org.apache.lucene.index.TieredMergePolicy: [TieredMergePolicy: maxMergeAtOnce=29, maxMergeAtOnceExplicit=45, maxMergedSegmentMB=1.0751953125, floorSegmentMB=0.625, forceMergeDeletesPctAllowed=3.7412116410685146, segmentsPerTier=48.0, maxCFSSegmentSizeMB=8.796093022207999E12, noCFSRatio=0.6234715550240746
   [junit4]   2> 1156386 INFO  (coreLoadExecutor-2162-thread-1-processing-n:127.0.0.1:58111_) [n:127.0.0.1:58111_ c:collection1   x:collection1] o.a.s.s.SolrIndexSearcher Opening [Searcher@7f46abb2[collection1] main]
   [junit4]   2> 1156387 INFO  (coreLoadExecutor-2162-thread-1-processing-n:127.0.0.1:58111_) [n:127.0.0.1:58111_ c:collection1   x:collection1] o.a.s.r.ManagedResourceStorage Configured ZooKeeperStorageIO with znodeBase: /configs/conf1
   [junit4]   2> 1156387 INFO  (coreLoadExecutor-2162-thread-1-processing-n:127.0.0.1:58111_) [n:127.0.0.1:58111_ c:collection1   x:collection1] o.a.s.r.ManagedResourceStorage Loaded null at path _rest_managed.json using ZooKeeperStorageIO:path=/configs/conf1
   [junit4]   2> 1156387 INFO  (coreLoadExecutor-2162-thread-1-processing-n:127.0.0.1:58111_) [n:127.0.0.1:58111_ c:collection1   x:collection1] o.a.s.h.ReplicationHandler Commits will be reserved for  10000
   [junit4]   2> 1156389 INFO  (searcherExecutor-2163-thread-1-processing-n:127.0.0.1:58111_ x:collection1 c:collection1) [n:127.0.0.1:58111_ c:collection1   x:collection1] o.a.s.c.SolrCore [collection1] Registered new searcher Searcher@7f46abb2[collection1] main{ExitableDirectoryReader(UninvertingDirectoryReader())}
   [junit4]   2> 1156397 INFO  (coreLoadExecutor-2162-thread-1-processing-n:127.0.0.1:58111_) [n:127.0.0.1:58111_ c:collection1   x:collection1] o.a.s.u.UpdateLog Could not find max version in index or recent updates, using new clock 1557993368377622528
   [junit4]   2> 1156428 INFO  (coreZkRegister-2157-thread-1-processing-n:127.0.0.1:58111_ x:collection1 c:collection1) [n:127.0.0.1:58111_ c:collection1 s:shard1 r:core_node1 x:collection1] o.a.s.c.ShardLeaderElectionContext Enough replicas found to continue.
   [junit4]   2> 1156428 INFO  (coreZkRegister-2157-thread-1-processing-n:127.0.0.1:58111_ x:collection1 c:collection1) [n:127.0.0.1:58111_ c:collection1 s:shard1 r:core_node1 x:collection1] o.a.s.c.ShardLeaderElectionContext I may be the new leader - try and sync
   [junit4]   2> 1156428 INFO  (coreZkRegister-2157-thread-1-processing-n:127.0.0.1:58111_ x:collection1 c:collection1) [n:127.0.0.1:58111_ c:collection1 s:shard1 r:core_node1 x:collection1] o.a.s.c.SyncStrategy Sync replicas to http://127.0.0.1:58111/collection1/
   [junit4]   2> 1156428 INFO  (coreZkRegister-2157-thread-1-processing-n:127.0.0.1:58111_ x:collection1 c:collection1) [n:127.0.0.1:58111_ c:collection1 s:shard1 r:core_node1 x:collection1] o.a.s.c.SyncStrategy Sync Success - now sync replicas to me
   [junit4]   2> 1156428 INFO  (coreZkRegister-2157-thread-1-processing-n:127.0.0.1:58111_ x:collection1 c:collection1) [n:127.0.0.1:58111_ c:collection1 s:shard1 r:core_node1 x:collection1] o.a.s.c.SyncStrategy http://127.0.0.1:58111/collection1/ has no replicas
   [junit4]   2> 1156431 INFO  (zkCallback-1507-thread-1-processing-n:127.0.0.1:58111_) [n:127.0.0.1:58111_    ] o.a.s.c.c.ZkStateReader A cluster state change: [WatchedEvent state:SyncConnected type:NodeDataChanged path:/collections/collection1/state.json] for collection [collection1] has occurred - updating... (live nodes size: [2])
   [junit4]   2> 1156436 INFO  (coreZkRegister-2157-thread-1-processing-n:127.0.0.1:58111_ x:collection1 c:collection1) [n:127.0.0.1:58111_ c:collection1 s:shard1 r:core_node1 x:collection1] o.a.s.c.ShardLeaderElectionContext I am the new leader: http://127.0.0.1:58111/collection1/ shard1
   [junit4]   2> 1156537 INFO  (zkCallback-1507-thread-1-processing-n:127.0.0.1:58111_) [n:127.0.0.1:58111_    ] o.a.s.c.c.ZkStateReader A cluster state change: [WatchedEvent state:SyncConnected type:NodeDataChanged path:/collections/collection1/state.json] for collection [collection1] has occurred - updating... (live nodes size: [2])
   [junit4]   2> 1156587 INFO  (coreZkRegister-2157-thread-1-processing-n:127.0.0.1:58111_ x:collection1 c:collection1) [n:127.0.0.1:58111_ c:collection1 s:shard1 r:core_node1 x:collection1] o.a.s.c.ZkController I am the leader, no recovery necessary
   [junit4]   2> 1156692 INFO  (zkCallback-1507-thread-1-processing-n:127.0.0.1:58111_) [n:127.0.0.1:58111_    ] o.a.s.c.c.ZkStateReader A cluster state change: [WatchedEvent state:SyncConnected type:NodeDataChanged path:/collections/collection1/state.json] for collection [collection1] has occurred - updating... (live nodes size: [2])
   [junit4]   2> 1156934 INFO  (TEST-HdfsWriteToMultipleCollectionsTest.test-seed#[765495B8CB018238]) [    ] o.a.s.SolrTestCaseJ4 Writing core.properties file to /x1/jenkins/jenkins-slave/workspace/Lucene-Solr-NightlyTests-6.x/checkout/solr/build/solr-core/test/J1/temp/solr.cloud.hdfs.HdfsWriteToMultipleCollectionsTest_765495B8CB018238-001/shard-2-001/cores/collection1
   [junit4]   2> 1156935 INFO  (TEST-HdfsWriteToMultipleCollectionsTest.test-seed#[765495B8CB018238]) [    ] o.a.s.c.AbstractFullDistribZkTestBase create jetty 2 in directory /x1/jenkins/jenkins-slave/workspace/Lucene-Solr-NightlyTests-6.x/checkout/solr/build/solr-core/test/J1/temp/solr.cloud.hdfs.HdfsWriteToMultipleCollectionsTest_765495B8CB018238-001/shard-2-001
   [junit4]   2> 1156937 INFO  (TEST-HdfsWriteToMultipleCollectionsTest.test-seed#[765495B8CB018238]) [    ] o.e.j.s.Server jetty-9.3.14.v20161028
   [junit4]   2> 1156939 INFO  (TEST-HdfsWriteToMultipleCollectionsTest.test-seed#[765495B8CB018238]) [    ] o.e.j.s.h.ContextHandler Started o.e.j.s.ServletContextHandler@7d03d0be{/,null,AVAILABLE}
   [junit4]   2> 1156939 INFO  (TEST-HdfsWriteToMultipleCollectionsTest.test-seed#[765495B8CB018238]) [    ] o.e.j.s.AbstractConnector Started ServerConnector@a111853{HTTP/1.1,[http/1.1]}{127.0.0.1:51691}
   [junit4]   2> 1156939 INFO  (TEST-HdfsWriteToMultipleCollectionsTest.test-seed#[765495B8CB018238]) [    ] o.e.j.s.Server Started @1160833ms
   [junit4]   2> 1156939 INFO  (TEST-HdfsWriteToMultipleCollectionsTest.test-seed#[765495B8CB018238]) [    ] o.a.s.c.s.e.JettySolrRunner Jetty properties: {solr.data.dir=hdfs://localhost:40180/hdfs__localhost_40180__x1_jenkins_jenkins-slave_workspace_Lucene-Solr-NightlyTests-6.x_checkout_solr_build_solr-core_test_J1_temp_solr.cloud.hdfs.HdfsWriteToMultipleCollectionsTest_765495B8CB018238-001_tempDir-002_jetty2, solrconfig=solrconfig.xml, hostContext=/, hostPort=51691, coreRootDirectory=/x1/jenkins/jenkins-slave/workspace/Lucene-Solr-NightlyTests-6.x/checkout/solr/build/solr-core/test/J1/../../../../../../../../../../../x1/jenkins/jenkins-slave/workspace/Lucene-Solr-NightlyTests-6.x/checkout/solr/build/solr-core/test/J1/temp/solr.cloud.hdfs.HdfsWriteToMultipleCollectionsTest_765495B8CB018238-001/shard-2-001/cores}
   [junit4]   2> 1156940 ERROR (TEST-HdfsWriteToMultipleCollectionsTest.test-seed#[765495B8CB018238]) [    ] o.a.s.s.StartupLoggingUtils Missing Java Option solr.log.dir. Logging may be missing or incomplete.
   [junit4]   2> 1156941 INFO  (TEST-HdfsWriteToMultipleCollectionsTest.test-seed#[765495B8CB018238]) [    ] o.a.s.s.SolrDispatchFilter  ___      _       Welcome to Apache Solr? version 6.5.0
   [junit4]   2> 1156941 INFO  (TEST-HdfsWriteToMultipleCollectionsTest.test-seed#[765495B8CB018238]) [    ] o.a.s.s.SolrDispatchFilter / __| ___| |_ _   Starting in cloud mode on port null
   [junit4]   2> 1156941 INFO  (TEST-HdfsWriteToMultipleCollectionsTest.test-seed#[765495B8CB018238]) [    ] o.a.s.s.SolrDispatchFilter \__ \/ _ \ | '_|  Install dir: null
   [junit4]   2> 1156941 INFO  (TEST-HdfsWriteToMultipleCollectionsTest.test-seed#[765495B8CB018238]) [    ] o.a.s.s.SolrDispatchFilter |___/\___/_|_|    Start time: 2017-01-30T23:17:41.097Z
   [junit4]   2> 1156946 INFO  (TEST-HdfsWriteToMultipleCollectionsTest.test-seed#[765495B8CB018238]) [    ] o.a.s.s.SolrDispatchFilter Loading solr.xml from SolrHome (not found in ZooKeeper)
   [junit4]   2> 1156946 INFO  (TEST-HdfsWriteToMultipleCollectionsTest.test-seed#[765495B8CB018238]) [    ] o.a.s.c.SolrXmlConfig Loading container configuration from /x1/jenkins/jenkins-slave/workspace/Lucene-Solr-NightlyTests-6.x/checkout/solr/build/solr-core/test/J1/temp/solr.cloud.hdfs.HdfsWriteToMultipleCollectionsTest_765495B8CB018238-001/shard-2-001/solr.xml
   [junit4]   2> 1156953 INFO  (TEST-HdfsWriteToMultipleCollectionsTest.test-seed#[765495B8CB018238]) [    ] o.a.s.u.UpdateShardHandler Creating UpdateShardHandler HTTP client with params: socketTimeout=340000&connTimeout=45000&retry=true
   [junit4]   2> 1156954 INFO  (TEST-HdfsWriteToMultipleCollectionsTest.test-seed#[765495B8CB018238]) [    ] o.a.s.c.ZkContainer Zookeeper client=127.0.0.1:59338/solr
   [junit4]   2> 1156966 INFO  (TEST-HdfsWriteToMultipleCollectionsTest.test-seed#[765495B8CB018238]) [n:127.0.0.1:51691_    ] o.a.s.c.c.ZkStateReader Updated live nodes from ZooKeeper... (0) -> (2)
   [junit4]   2> 1156985 INFO  (TEST-HdfsWriteToMultipleCollectionsTest.test-seed#[765495B8CB018238]) [n:127.0.0.1:51691_    ] o.a.s.c.ZkController Register node as live in ZooKeeper:/live_nodes/127.0.0.1:51691_
   [junit4]   2> 1156993 INFO  (zkCallback-1513-thread-1-processing-n:127.0.0.1:51691_) [n:127.0.0.1:51691_    ] o.a.s.c.c.ZkStateReader Updated live nodes from ZooKeeper... (2) -> (3)
   [junit4]   2> 1157000 INFO  (zkCallback-1507-thread-1-processing-n:127.0.0.1:58111_) [n:127.0.0.1:58111_    ] o.a.s.c.c.ZkStateReader Updated live nodes from ZooKeeper... (2) -> (3)
   [junit4]   2> 1157000 INFO  (zkCallback-1501-thread-1) [    ] o.a.s.c.c.ZkStateReader Updated live nodes from ZooKeeper... (2) -> (3)
   [junit4]   2> 1157000 INFO  (zkCallback-1497-thread-3-processing-n:127.0.0.1:33786_) [n:127.0.0.1:33786_    ] o.a.s.c.c.ZkStateReader Updated live nodes from ZooKeeper... (2) -> (3)
   [junit4]   2> 1157056 INFO  (TEST-HdfsWriteToMultipleCollectionsTest.test-seed#[765495B8CB018238]) [n:127.0.0.1:51691_    ] o.a.s.c.CorePropertiesLocator Found 1 core definitions underneath /x1/jenkins/jenkins-slave/workspace/Lucene-Solr-NightlyTests-6.x/checkout/solr/build/solr-core/test/J1/../../../../../../../../../../../x1/jenkins/jenkins-slave/workspace/Lucene-Solr-NightlyTests-6.x/checkout/solr/build/solr-core/test/J1/temp/solr.cloud.hdfs.HdfsWriteToMultipleCollectionsTest_765495B8CB018238-001/shard-2-001/cores
   [junit4]   2> 1157056 INFO  (TEST-HdfsWriteToMultipleCollectionsTest.test-seed#[765495B8CB018238]) [n:127.0.0.1:51691_    ] o.a.s.c.CorePropertiesLocator Cores are: [collection1]
   [junit4]   2> 1157070 INFO  (OverseerStateUpdate-97374585016745988-127.0.0.1:33786_-n_0000000000) [n:127.0.0.1:33786_    ] o.a.s.c.o.ReplicaMutator Assigning new node to shard shard=shard1
   [junit4]   2> 1157172 INFO  (zkCallback-1507-thread-1-processing-n:127.0.0.1:58111_) [n:127.0.0.1:58111_    ] o.a.s.c.c.ZkStateReader A cluster state change: [WatchedEvent state:SyncConnected type:NodeDataChanged path:/collections/collection1/state.json] for collection [collection1] has occurred - updating... (live nodes size: [3])
   [junit4]   2> 1157172 INFO  (zkCallback-1513-thread-1-processing-n:127.0.0.1:51691_) [n:127.0.0.1:51691_    ] o.a.s.c.c.ZkStateReader A cluster state change: [WatchedEvent state:SyncConnected type:NodeDataChanged path:/collections/collection1/state.json] for collection [collection1] has occurred - updating... (live nodes size: [3])
   [junit4]   2> 1158102 WARN  (coreLoadExecutor-2173-thread-1-processing-n:127.0.0.1:51691_) [n:127.0.0.1:51691_ c:collection1   x:collection1] o.a.s.c.Config Beginning with Solr 5.5, <mergePolicy> is deprecated, use <mergePolicyFactory> instead.
   [junit4]   2> 1158103 INFO  (coreLoadExecutor-2173-thread-1-processing-n:127.0.0.1:51691_) [n:127.0.0.1:51691_ c:collection1   x:collection1] o.a.s.c.SolrConfig Using Lucene MatchVersion: 6.5.0
   [junit4]   2> 1158117 INFO  (coreLoadExecutor-2173-thread-1-processing-n:127.0.0.1:51691_) [n:127.0.0.1:51691_ c:collection1   x:collection1] o.a.s.s.IndexSchema [collection1] Schema name=test
   [junit4]   2> 1158220 WARN  (coreLoadExecutor-2173-thread-1-processing-n:127.0.0.1:51691_) [n:127.0.0.1:51691_ c:collection1   x:collection1] o.a.s.s.IndexSchema [collection1] default search field in schema is text. WARNING: Deprecated, please use 'df' on request instead.
   [junit4]   2> 1158222 INFO  (coreLoadExecutor-2173-thread-1-processing-n:127.0.0.1:51691_) [n:127.0.0.1:51691_ c:collection1   x:collection1] o.a.s.s.IndexSchema Loaded schema test/1.6 with uniqueid field id
   [junit4]   2> 1158240 INFO  (coreLoadExecutor-2173-thread-1-processing-n:127.0.0.1:51691_) [n:127.0.0.1:51691_ c:collection1   x:collection1] o.a.s.c.CoreContainer Creating SolrCore 'collection1' using configuration from collection collection1
   [junit4]   2> 1158240 INFO  (coreLoadExecutor-2173-thread-1-processing-n:127.0.0.1:51691_) [n:127.0.0.1:51691_ c:collection1   x:collection1] o.a.s.c.HdfsDirectoryFactory solr.hdfs.home=hdfs://localhost:40180/solr_hdfs_home
   [junit4]   2> 1158240 INFO  (coreLoadExecutor-2173-thread-1-processing-n:127.0.0.1:51691_) [n:127.0.0.1:51691_ c:collection1   x:collection1] o.a.s.c.HdfsDirectoryFactory Solr Kerberos Authentication disabled
   [junit4]   2> 1158240 INFO  (coreLoadExecutor-2173-thread-1-processing-n:127.0.0.1:51691_) [n:127.0.0.1:51691_ c:collection1   x:collection1] o.a.s.c.SolrCore [[collection1] ] Opening new SolrCore at [/x1/jenkins/jenkins-slave/workspace/Lucene-Solr-NightlyTests-6.x/checkout/solr/build/solr-core/test/J1/temp/solr.cloud.hdfs.HdfsWriteToMultipleCollectionsTest_765495B8CB018238-001/shard-2-001/cores/collection1], dataDir=[hdfs://localhost:40180/solr_hdfs_home/collection1/core_node2/data/]
   [junit4]   2> 1158240 INFO  (coreLoadExecutor-2173-thread-1-processing-n:127.0.0.1:51691_) [n:127.0.0.1:51691_ c:collection1   x:collection1] o.a.s.c.JmxMonitoredMap JMX monitoring is enabled. Adding Solr mbeans to JMX Server: com.sun.jmx.mbeanserver.JmxMBeanServer@2f136126
   [junit4]   2> 1158241 INFO  (coreLoadExecutor-2173-thread-1-processing-n:127.0.0.1:51691_) [n:127.0.0.1:51691_ c:collection1   x:collection1] o.a.s.c.HdfsDirectoryFactory creating directory factory for path hdfs://localhost:40180/solr_hdfs_home/collection1/core_node2/data/snapshot_metadata
   [junit4]   2> 1158251 INFO  (coreLoadExecutor-2173-thread-1-processing-n:127.0.0.1:51691_) [n:127.0.0.1:51691_ c:collection1   x:collection1] o.a.s.c.HdfsDirectoryFactory Number of slabs of block cache [1] with direct memory allocation set to [true]
   [junit4]   2> 1158251 INFO  (coreLoadExecutor-2173-thread-1-processing-n:127.0.0.1:51691_) [n:127.0.0.1:51691_ c:collection1   x:collection1] o.a.s.c.HdfsDirectoryFactory Block cache target memory usage, slab size of [8388608] will allocate [1] slabs and use ~[8388608] bytes
   [junit4]   2> 1158260 INFO  (coreLoadExecutor-2173-thread-1-processing-n:127.0.0.1:51691_) [n:127.0.0.1:51691_ c:collection1   x:collection1] o.a.s.s.b.BlockDirectory Block cache on write is disabled
   [junit4]   2> 1158261 INFO  (coreLoadExecutor-2173-thread-1-processing-n:127.0.0.1:51691_) [n:127.0.0.1:51691_ c:collection1   x:collection1] o.a.s.c.HdfsDirectoryFactory creating directory factory for path hdfs://localhost:40180/solr_hdfs_home/collection1/core_node2/data
   [junit4]   2> 1158284 INFO  (coreLoadExecutor-2173-thread-1-processing-n:127.0.0.1:51691_) [n:127.0.0.1:51691_ c:collection1   x:collection1] o.a.s.c.HdfsDirectoryFactory creating directory factory for path hdfs://localhost:40180/solr_hdfs_home/collection1/core_node2/data/index
   [junit4]   2> 1158291 INFO  (coreLoadExecutor-2173-thread-1-processing-n:127.0.0.1:51691_) [n:127.0.0.1:51691_ c:collection1   x:collection1] o.a.s.c.HdfsDirectoryFactory Number of slabs of block cache [1] with direct memory allocation set to [true]
   [junit4]   2> 1158291 INFO  (coreLoadExecutor-2173-thread-1-processing-n:127.0.0.1:51691_) [n:127.0.0.1:51691_ c:collection1   x:collection1] o.a.s.c.HdfsDirectoryFactory Block cache target memory usage, slab size of [8388608] will allocate [1] slabs and use ~[8388608] bytes
   [junit4]   2> 1158304 INFO  (coreLoadExecutor-2173-thread-1-processing-n:127.0.0.1:51691_) [n:127.0.0.1:51691_ c:collection1   x:collection1] o.a.s.s.b.BlockDirectory Block cache on write is disabled
   [junit4]   2> 1158305 INFO  (coreLoadExecutor-2173-thread-1-processing-n:127.0.0.1:51691_) [n:127.0.0.1:51691_ c:collection1   x:collection1] o.a.s.u.RandomMergePolicy RandomMergePolicy wrapping class org.apache.lucene.index.AlcoholicMergePolicy: [AlcoholicMergePolicy: minMergeSize=0, mergeFactor=10, maxMergeSize=1074057070, maxMergeSizeForForcedMerge=9223372036854775807, calibrateSizeByDeletes=true, maxMergeDocs=2147483647, maxCFSSegmentSizeMB=8.796093022207999E12, noCFSRatio=0.1]
   [junit4]   2> 1158356 INFO  (IPC Server handler 1 on 40180) [    ] BlockStateChange BLOCK* addStoredBlock: blockMap updated: 127.0.0.1:44103 is added to blk_1073741827_1003{UCState=UNDER_CONSTRUCTION, truncateBlock=null, primaryNodeIndex=-1, replicas=[ReplicaUC[[DISK]DS-659df4cb-91ea-4367-a007-b56c84862e7a:NORMAL:127.0.0.1:37960|RBW], ReplicaUC[[DISK]DS-ae22a632-cd5f-4c52-be91-c8876c0439cc:NORMAL:127.0.0.1:44103|FINALIZED]]} size 0
   [junit4]   2> 1158363 INFO  (IPC Server handler 5 on 40180) [    ] BlockStateChange BLOCK* addStoredBlock: blockMap updated: 127.0.0.1:37960 is added to blk_1073741827_1003{UCState=UNDER_CONSTRUCTION, truncateBlock=null, primaryNodeIndex=-1, replicas=[ReplicaUC[[DISK]DS-659df4cb-91ea-4367-a007-b56c84862e7a:NORMAL:127.0.0.1:37960|RBW], ReplicaUC[[DISK]DS-ae22a632-cd5f-4c52-be91-c8876c0439cc:NORMAL:127.0.0.1:44103|FINALIZED]]} size 0
   [junit4]   2> 1158377 WARN  (coreLoadExecutor-2173-thread-1-processing-n:127.0.0.1:51691_) [n:127.0.0.1:51691_ c:collection1   x:collection1] o.a.s.c.RequestHandlers INVALID paramSet a in requestHandler {type = requestHandler,name = /dump,class = DumpRequestHandler,attributes = {initParams=a, name=/dump, class=DumpRequestHandler},args = {defaults={a=A,b=B}}}
   [junit4]   2> 1158423 INFO  (coreLoadExecutor-2173-thread-1-processing-n:127.0.0.1:51691_) [n:127.0.0.1:51691_ c:collection1   x:collection1] o.a.s.u.UpdateHandler Using UpdateLog implementation: org.apache.solr.update.HdfsUpdateLog
   [junit4]   2> 1158423 INFO  (coreLoadExecutor-2173-thread-1-processing-n:127.0.0.1:51691_) [n:127.0.0.1:51691_ c:collection1   x:collection1] o.a.s.u.UpdateLog Initializing UpdateLog: dataDir= defaultSyncLevel=FLUSH numRecordsToKeep=100 maxNumLogsToKeep=10 numVersionBuckets=65536
   [junit4]   2> 1158423 INFO  (coreLoadExecutor-2173-thread-1-processing-n:127.0.0.1:51691_) [n:127.0.0.1:51691_ c:collection1   x:collection1] o.a.s.u.HdfsUpdateLog Initializing HdfsUpdateLog: tlogDfsReplication=2
   [junit4]   2> 1158446 INFO  (coreLoadExecutor-2173-thread-1-processing-n:127.0.0.1:51691_) [n:127.0.0.1:51691_ c:collection1   x:collection1] o.a.s.u.CommitTracker Hard AutoCommit: disabled
   [junit4]   2> 1158446 INFO  (coreLoadExecutor-2173-thread-1-processing-n:127.0.0.1:51691_) [n:127.0.0.1:51691_ c:collection1   x:collection1] o.a.s.u.CommitTracker Soft AutoCommit: disabled
   [junit4]   2> 1158455 INFO  (coreLoadExecutor-2173-thread-1-processing-n:127.0.0.1:51691_) [n:127.0.0.1:51691_ c:collection1   x:collection1] o.a.s.u.RandomMergePolicy RandomMergePolicy wrapping class org.apache.lucene.index.TieredMergePolicy: [TieredMergePolicy: maxMergeAtOnce=29, maxMergeAtOnceExplicit=45, maxMergedSegmentMB=1.0751953125, floorSegmentMB=0.625, forceMergeDeletesPctAllowed=3.7412116410685146, segmentsPerTier=48.0, maxCFSSegmentSizeMB=8.796093022207999E12, noCFSRatio=0.6234715550240746
   [junit4]   2> 1158481 INFO  (coreLoadExecutor-2173-thread-1-processing-n:127.0.0.1:51691_) [n:127.0.0.1:51691_ c:collection1   x:collection1] o.a.s.s.SolrIndexSearcher Opening [Searcher@303b7da1[collection1] main]
   [junit4]   2> 1158484 INFO  (coreLoadExecutor-2173-thread-1-processing-n:127.0.0.1:51691_) [n:127.0.0.1:51691_ c:collection1   x:collection1] o.a.s.r.ManagedResourceStorage Configured ZooKeeperStorageIO with znodeBase: /configs/conf1
   [junit4]   2> 1158485 INFO  (coreLoadExecutor-2173-thread-1-processing-n:127.0.0.1:51691_) [n:127.0.0.1:51691_ c:collection1   x:collection1] o.a.s.r.ManagedResourceStorage Loaded null at path _rest_managed.json using ZooKeeperStorageIO:path=/configs/conf1
   [junit4]   2> 1158485 INFO  (coreLoadExecutor-2173-thread-1-processing-n:127.0.0.1:51691_) [n:127.0.0.1:51691_ c:collection1   x:collection1] o.a.s.h.ReplicationHandler Commits will be reserved for  10000
   [junit4]   2> 1158486 INFO  (searcherExecutor-2174-thread-1-processing-n:127.0.0.1:51691_ x:collection1 c:collection1) [n:127.0.0.1:51691_ c:collection1   x:collection1] o.a.s.c.SolrCore [collection1] Registered new searcher Searcher@303b7da1[collection1] main{ExitableDirectoryReader(UninvertingDirectoryReader())}
   [junit4]   2> 1158497 INFO  (coreLoadExecutor-2173-thread-1-processing-n:127.0.0.1:51691_) [n:127.0.0.1:51691_ c:collection1   x:collection1] o.a.s.u.UpdateLog Could not find max version in index or recent updates, using new clock 1557993370579632128
   [junit4]   2> 1158502 INFO  (coreZkRegister-2168-thread-1-processing-n:127.0.0.1:51691_ x:collection1 c:collection1) [n:127.0.0.1:51691_ c:collection1 s:shard1 r:core_node2 x:collection1] o.a.s.c.ZkController Core needs to recover:collection1
   [junit4]   2> 1158503 INFO  (updateExecutor-1510-thread-1-processing-n:127.0.0.1:51691_ x:collection1 s:shard1 c:collection1 r:core_node2) [n:127.0.0.1:51691_ c:collection1 s:shard1 r:core_node2 x:collection1] o.a.s.u.DefaultSolrCoreState Running recovery
   [junit4]   2> 1158504 INFO  (recoveryExecutor-1511-thread-1-processing-n:127.0.0.1:51691_ x:collection1 s:shard1 c:collection1 r:core_node2) [n:127.0.0.1:51691_ c:collection1 s:shard1 r:core_node2 x:collection1] o.a.s.c.RecoveryStrategy Starting recovery process. recoveringAfterStartup=true
   [junit4]   2> 1158504 INFO  (recoveryExecutor-1511-thread-1-processing-n:127.0.0.1:51691_ x:collection1 s:shard1 c:collection1 r:core_node2) [n:127.0.0.1:51691_ c:collection1 s:shard1 r:core_node2 x:collection1] o.a.s.c.RecoveryStrategy ###### startupVersions=[[]]
   [junit4]   2> 1158504 INFO  (recoveryExecutor-1511-thread-1-processing-n:127.0.0.1:51691_ x:collection1 s:shard1 c:collection1 r:core_node2) [n:127.0.0.1:51691_ c:collection1 s:shard1 r:core_node2 x:collection1] o.a.s.c.RecoveryStrategy Begin buffering updates. core=[collection1]
   [junit4]   2> 1158505 INFO  (recoveryExecutor-1511-thread-1-processing-n:127.0.0.1:51691_ x:collection1 s:shard1 c:collection1 r:core_node2) [n:127.0.0.1:51691_ c:collection1 s:shard1 r:core_node2 x:collection1] o.a.s.u.UpdateLog Starting to buffer updates. HDFSUpdateLog{state=ACTIVE, tlog=null}
   [junit4]   2> 1158505 INFO  (recoveryExecutor-1511-thread-1-processing-n:127.0.0.1:51691_ x:collection1 s:shard1 c:collection1 r:core_node2) [n:127.0.0.1:51691_ c:collection1 s:shard1 r:core_node2 x:collection1] o.a.s.c.RecoveryStrategy Publishing state of core [collection1] as recovering, leader is [http://127.0.0.1:58111/collection1/] and I am [http://127.0.0.1:51691/collection1/]
   [junit4]   2> 1158515 INFO  (recoveryExecutor-1511-thread-1-processing-n:127.0.0.1:51691_ x:collection1 s:shard1 c:collection1 r:core_node2) [n:127.0.0.1:51691_ c:collection1 s:shard1 r:core_node2 x:collection1] o.a.s.c.RecoveryStrategy Sending prep recovery command to [http://127.0.0.1:58111]; [WaitForState: action=PREPRECOVERY&core=collection1&nodeName=127.0.0.1:51691_&coreNodeName=core_node2&state=recovering&checkLive=true&onlyIfLeader=true&onlyIfLeaderActive=true]
   [junit4]   2> 1158517 INFO  (qtp657363498-6186) [n:127.0.0.1:58111_    ] o.a.s.h.a.PrepRecoveryOp Going to wait for coreNodeName: core_node2, state: recovering, checkLive: true, onlyIfLeader: true, onlyIfLeaderActive: true
   [junit4]   2> 1158518 INFO  (qtp657363498-6186) [n:127.0.0.1:58111_    ] o.a.s.h.a.PrepRecoveryOp Will wait a max of 183 seconds to see collection1 (shard1 of collection1) have state: recovering
   [junit4]   2> 1158518 INFO  (qtp657363498-6186) [n:127.0.0.1:58111_    ] o.a.s.h.a.PrepRecoveryOp In WaitForState(recovering): collection=collection1, shard=shard1, thisCore=collection1, leaderDoesNotNeedRecovery=false, isLeader? true, live=true, checkLive=true, currentState=down, localState=active, nodeName=127.0.0.1:51691_, coreNodeName=core_node2, onlyIfActiveCheckResult=false, nodeProps: core_node2:{"core":"collection1","base_url":"http://127.0.0.1:51691","node_name":"127.0.0.1:51691_","state":"down"}
   [junit4]   2> 1158609 INFO  (zkCallback-1507-thread-1-processing-n:127.0.0.1:58111_) [n:127.0.0.1:58111_    ] o.a.s.c.c.ZkStateReader A cluster state change: [WatchedEvent state:SyncConnected type:NodeDataChanged path:/collections/collection1/state.json] for collection [collection1] has occurred - updating... (live nodes size: [3])
   [junit4]   2> 1158609 INFO  (zkCallback-1513-thread-1-processing-n:127.0.0.1:51691_) [n:127.0.0.1:51691_    ] o.a.s.c.c.ZkStateReader A cluster state change: [WatchedEvent state:SyncConnected type:NodeDataChanged path:/collections/collection1/state.json] for collection [collection1] has occurred - updating... (live nodes size: [3])
   [junit4]   2> 1158820 INFO  (TEST-HdfsWriteToMultipleCollectionsTest.test-seed#[765495B8CB018238]) [    ] o.a.s.SolrTestCaseJ4 Writing core.properties file to /x1/jenkins/jenkins-slave/workspace/Lucene-Solr-NightlyTests-6.x/checkout/solr/build/solr-core/test/J1/temp/solr.cloud.hdfs.HdfsWriteToMultipleCollectionsTest_765495B8CB018238-001/shard-3-001/cores/collection1
   [junit4]   2> 1158820 INFO  (TEST-HdfsWriteToMultipleCollectionsTest.test-seed#[765495B8CB018238]) [    ] o.a.s.c.AbstractFullDistribZkTestBase create jetty 3 in directory /x1/jenkins/jenkins-slave/workspace/Lucene-Solr-NightlyTests-6.x/checkout/solr/build/solr-core/test/J1/temp/solr.cloud.hdfs.HdfsWriteToMultipleCollectionsTest_765495B8CB018238-001/shard-3-001
   [junit4]   2> 1158821 INFO  (TEST-HdfsWriteToMultipleCollectionsTest.test-seed#[765495B8CB018238]) [    ] o.e.j.s.Server jetty-9.3.14.v20161028
   [junit4]   2> 1158831 INFO  (TEST-HdfsWriteToMultipleCollectionsTest.test-seed#[765495B8CB018238]) [    ] o.e.j.s.h.ContextHandler Started o.e.j.s.ServletContextHandler@5eca55b2{/,null,AVAILABLE}
   [junit4]   2> 1158831 INFO  (TEST-HdfsWriteToMultipleCollectionsTest.test-seed#[765495B8CB018238]) [    ] o.e.j.s.AbstractConnector Started ServerConnector@70122c34{HTTP/1.1,[http/1.1]}{127.0.0.1:44901}
   [junit4]   2> 1158831 INFO  (TEST-HdfsWriteToMultipleCollectionsTest.test-seed#[765495B8CB018238]) [    ] o.e.j.s.Server Started @1162725ms
   [junit4]   2> 1158832 INFO  (TEST-HdfsWriteToMultipleCollectionsTest.test-seed#[765495B8CB018238]) [    ] o.a.s.c.s.e.JettySolrRunner Jetty properties: {solr.data.dir=hdfs://localhost:40180/hdfs__localhost_40180__x1_jenkins_jenkins-slave_workspace_Lucene-Solr-NightlyTests-6.x_checkout_solr_build_solr-core_test_J1_temp_solr.cloud.hdfs.HdfsWriteToMultipleCollectionsTest_765495B8CB018238-001_tempDir-002_jetty3, solrconfig=solrconfig.xml, hostContext=/, hostPort=44901, coreRootDirectory=/x1/jenkins/jenkins-slave/workspace/Lucene-Solr-NightlyTests-6.x/checkout/solr/build/solr-core/test/J1/temp/solr.cloud.hdfs.HdfsWriteToMultipleCollectionsTest_765495B8CB018238-001/shard-3-001/cores}
   [junit4]   2> 1158832 ERROR (TEST-HdfsWriteToMultipleCollectionsTest.test-seed#[765495B8CB018238]) [    ] o.a.s.s.StartupLoggingUtils Missing Java Option solr.log.dir. Logging may be missing or incomplete.
   [junit4]   2> 1158841 INFO  (TEST-HdfsWriteToMultipleCollectionsTest.test-seed#[765495B8CB018238]) [    ] o.a.s.s.SolrDispatchFilter  ___      _       Welcome to Apache Solr? version 6.5.0
   [junit4]   2> 1158841 INFO  (TEST-HdfsWriteToMultipleCollectionsTest.test-seed#[765495B8CB018238]) [    ] o.a.s.s.SolrDispatchFilter / __| ___| |_ _   Starting in cloud mode on port null
   [junit4]   2> 1158841 INFO  (TEST-HdfsWriteToMultipleCollectionsTest.test-seed#[765495B8CB018238]) [    ] o.a.s.s.SolrDispatchFilter \__ \/ _ \ | '_|  Install dir: null
   [junit4]   2> 1158842 INFO  (TEST-HdfsWriteToMultipleCollectionsTest.test-seed#[765495B8CB018238]) [    ] o.a.s.s.SolrDispatchFilter |___/\___/_|_|    Start time: 2017-01-30T23:17:42.997Z
   [junit4]   2> 1158866 INFO  (TEST-HdfsWriteToMultipleCollectionsTest.test-seed#[765495B8CB018238]) [    ] o.a.s.s.SolrDispatchFilter Loading solr.xml from SolrHome (not found in ZooKeeper)
   [junit4]   2> 1158866 INFO  (TEST-HdfsWriteToMultipleCollectionsTest.test-seed#[765495B8CB018238]) [    ] o.a.s.c.SolrXmlConfig Loading container configuration from /x1/jenkins/jenkins-slave/workspace/Lucene-Solr-NightlyTests-6.x/checkout/solr/build/solr-core/test/J1/temp/solr.cloud.hdfs.HdfsWriteToMultipleCollectionsTest_765495B8CB018238-001/shard-3-001/solr.xml
   [junit4]   2> 1158891 INFO  (TEST-HdfsWriteToMultipleCollectionsTest.test-seed#[765495B8CB018238]) [    ] o.a.s.u.UpdateShardHandler Creating UpdateShardHandler HTTP client with params: socketTimeout=340000&connTimeout=45000&retry=true
   [junit4]   2> 1158892 INFO  (TEST-HdfsWriteToMultipleCollectionsTest.test-seed#[765495B8CB018238]) [    ] o.a.s.c.ZkContainer Zookeeper client=127.0.0.1:59338/solr
   [junit4]   2> 1158919 INFO  (TEST-HdfsWriteToMultipleCollectionsTest.test-seed#[765495B8CB018238]) [n:127.0.0.1:44901_    ] o.a.s.c.c.ZkStateReader Updated live nodes from ZooKeeper... (0) -> (3)
   [junit4]   2> 1158923 INFO  (TEST-HdfsWriteToMultipleCollectionsTest.test-seed#[765495B8CB018238]) [n:127.0.0.1:44901_    ] o.a.s.c.ZkController Register node as live in ZooKeeper:/live_nodes/127.0.0.1:44901_
   [junit4]   2> 1158937 INFO  (zkCallback-1501-thread-1) [    ] o.a.s.c.c.ZkStateReader Updated live nodes from ZooKeeper... (3) -> (4)
   [junit4]   2> 1158937 INFO  (zkCallback-1513-thread-1-processing-n:127.0.0.1:51691_) [n:127.0.0.1:51691_    ] o.a.s.c.c.ZkStateReader Updated live nodes from ZooKeeper... (3) -> (4)
   [junit4]   2> 1158938 INFO  (zkCallback-1507-thread-1-processing-n:127.0.0.1:58111_) [n:127.0.0.1:58111_    ] o.a.s.c.c.ZkStateReader Updated live nodes from ZooKeeper... (3) -> (4)
   [junit4]   2> 1158937 INFO  (zkCallback-1497-thread-2-processing-n:127.0.0.1:33786_) [n:127.0.0.1:33786_    ] o.a.s.c.c.ZkStateReader Updated live nodes from ZooKeeper... (3) -> (4)
   [junit4]   2> 1158952 INFO  (zkCallback-1520-thread-2-processing-n:127.0.0.1:44901_) [n:127.0.0.1:44901_    ] o.a.s.c.c.ZkStateReader Updated live nodes from ZooKeeper... (3) -> (4)
   [junit4]   2> 1159029 INFO  (zkCallback-1513-thread-1-processing-n:127.0.0.1:51691_) [n:127.0.0.1:51691_    ] o.a.s.c.c.ZkStateReader A cluster state change: [WatchedEvent state:SyncConnected type:NodeDataChanged path:/collections/collection1/state.json] for collection [collection1] has occurred - updating... (live nodes size: [4])
   [junit4]   2> 1159029 INFO  (zkCallback-1507-thread-1-processing-n:127.0.0.1:58111_) [n:127.0.0.1:58111_    ] o.a.s.c.c.ZkStateReader A cluster state change: [WatchedEvent state:SyncConnected type:NodeDataChanged path:/collections/collection1/state.json] for collection [collection1] has occurred - updating... (live nodes size: [4])
   [junit4]   2> 1159048 INFO  (TEST-HdfsWriteToMultipleCollectionsTest.test-seed#[765495B8CB018238]) [n:127.0.0.1:44901_    ] o.a.s.c.CorePropertiesLocator Found 1 core definitions underneath /x1/jenkins/jenkins-slave/workspace/Lucene-Solr-NightlyTests-6.x/checkout/solr/build/solr-core/test/J1/temp/solr.cloud.hdfs.HdfsWriteToMultipleCollectionsTest_765495B8CB018238-001/shard-3-001/cores
   [junit4]   2> 1159048 INFO  (TEST-HdfsWriteToMultipleCollectionsTest.test-seed#[765495B8CB018238]) [n:127.0.0.1:44901_    ] o.a.s.c.CorePropertiesLocator Cores are: [collection1]
   [junit4]   2> 1159053 INFO  (OverseerStateUpdate-97374585016745988-127.0.0.1:33786_-n_0000000000) [n:127.0.0.1:33786_    ] o.a.s.c.o.ReplicaMutator Assigning new node to shard shard=shard1
   [junit4]   2> 1159155 INFO  (zkCallback-1507-thread-1-processing-n:127.0.0.1:58111_) [n:127.0.0.1:58111_    ] o.a.s.c.c.ZkStateReader A cluster state change: [WatchedEvent state:SyncConnected type:NodeDataChanged path:/collections/collection1/state.json] for collection [collection1] has occurred - updating... (live nodes size: [4])
   [junit4]   2> 1159156 INFO  (zkCallback-1513-thread-1-processing-n:127.0.0.1:51691_) [n:127.0.0.1:51691_    ] o.a.s.c.c.ZkStateReader A cluster state change: [WatchedEvent state:SyncConnected type:NodeDataChanged path:/collections/collection1/state.json] for collection [collection1] has occurred - updating... (live nodes size: [4])
   [junit4]   2> 1159156 INFO  (zkCallback-1520-thread-2-processing-n:127.0.0.1:44901_) [n:127.0.0.1:44901_    ] o.a.s.c.c.ZkStateReader A cluster state change: [WatchedEvent state:SyncConnected type:NodeDataChanged path:/collections/collection1/state.json] for collection [collection1] has occurred - updating... (live nodes size: [4])
   [junit4]   2> 1159518 INFO  (qtp657363498-6186) [n:127.0.0.1:58111_    ] o.a.s.h.a.PrepRecoveryOp In WaitForState(recovering): collection=collection1, shard=shard1, thisCore=collection1, leaderDoesNotNeedRecovery=false, isLeader? true, live=true, checkLive=true, currentState=recovering, localState=active, nodeName=127.0.0.1:51691_, coreNodeName=core_node2, onlyIfActiveCheckResult=false, nodeProps: core_node2:{"core":"collection1","dataDir":"hdfs://localhost:40180/solr_hdfs_home/collection1/core_node2/data/","base_url":"http://127.0.0.1:51691","node_name":"127.0.0.1:51691_","state":"recovering","ulogDir":"hdfs://localhost:40180/solr_hdfs_home/collection1/core_node2/data/tlog"}
   [junit4]   2> 1159518 INFO  (qtp657363498-6186) [n:127.0.0.1:58111_    ] o.a.s.h.a.PrepRecoveryOp Waited coreNodeName: core_node2, state: recovering, checkLive: true, onlyIfLeader: true for: 1 seconds.
   [junit4]   2> 1159518 INFO  (qtp657363498-6186) [n:127.0.0.1:58111_    ] o.a.s.s.HttpSolrCall [admin] webapp=null path=/admin/cores params={nodeName=127.0.0.1:51691_&onlyIfLeaderActive=true&core=collection1&coreNodeName=core_node2&action=PREPRECOVERY&checkLive=true&state=recovering&onlyIfLeader=true&wt=javabin&version=2} status=0 QTime=1001
   [junit4]   2> 1160077 WARN  (coreLoadExecutor-2184-thread-1-processing-n:127.0.0.1:44901_) [n:127.0.0.1:44901_ c:collection1   x:collection1] o.a.s.c.Config Beginning with Solr 5.5, <mergePolicy> is deprecated, use <mergePolicyFactory> instead.
   [junit4]   2> 1160078 INFO  (coreLoadExecutor-2184-thread-1-processing-n:127.0.0.1:44901_) [n:127.0.0.1:44901_ c:collection1   x:collection1] o.a.s.c.SolrConfig Using Lucene MatchVersion: 6.5.0
   [junit4]   2> 1160102 INFO  (coreLoadExecutor-2184-thread-1-processing-n:127.0.0.1:44901_) [n:127.0.0.1:44901_ c:collection1   x:collection1] o.a.s.s.IndexSchema [collection1] Schema name=test
   [junit4]   2> 1160230 WARN  (coreLoadExecutor-2184-thread-1-processing-n:127.0.0.1:44901_) [n:127.0.0.1:44901_ c:collection1   x:collection1] o.a.s.s.IndexSchema [collection1] default search field in schema is text. WARNING: Deprecated, please use 'df' on request instead.
   [junit4]   2> 1160231 INFO  (coreLoadExecutor-2184-thread-1-processing-n:127.0.0.1:44901_) [n:127.0.0.1:44901_ c:collection1   x:collection1] o.a.s.s.IndexSchema Loaded schema test/1.6 with uniqueid field id
   [junit4]   2> 1160249 INFO  (coreLoadExecutor-2184-thread-1-processing-n:127.0.0.1:44901_) [n:127.0.0.1:44901_ c:collection1   x:collection1] o.a.s.c.CoreContainer Creating SolrCore 'collection1' using configuration from collection collection1
   [junit4]   2> 1160249 INFO  (coreLoadExecutor-2184-thread-1-processing-n:127.0.0.1:44901_) [n:127.0.0.1:44901_ c:collect

[...truncated too long message...]

junit4]   2> 	at org.apache.hadoop.metrics2.impl.MetricsSystemImpl.stop(MetricsSystemImpl.java:213)
   [junit4]   2> 	at org.apache.hadoop.metrics2.impl.MetricsSystemImpl.shutdown(MetricsSystemImpl.java:594)
   [junit4]   2> 	at org.apache.hadoop.metrics2.lib.DefaultMetricsSystem.shutdownInstance(DefaultMetricsSystem.java:72)
   [junit4]   2> 	at org.apache.hadoop.metrics2.lib.DefaultMetricsSystem.shutdown(DefaultMetricsSystem.java:68)
   [junit4]   2> 	at org.apache.hadoop.hdfs.server.namenode.metrics.NameNodeMetrics.shutdown(NameNodeMetrics.java:171)
   [junit4]   2> 	at org.apache.hadoop.hdfs.server.namenode.NameNode.stop(NameNode.java:872)
   [junit4]   2> 	at org.apache.hadoop.hdfs.MiniDFSCluster.shutdown(MiniDFSCluster.java:1726)
   [junit4]   2> 	at org.apache.hadoop.hdfs.MiniDFSCluster.shutdown(MiniDFSCluster.java:1705)
   [junit4]   2> 	at org.apache.solr.cloud.hdfs.HdfsTestUtil.teardownClass(HdfsTestUtil.java:198)
   [junit4]   2> 	at org.apache.solr.cloud.hdfs.StressHdfsTest.teardownClass(StressHdfsTest.java:77)
   [junit4]   2> 	at sun.reflect.NativeMethodAccessorImpl.invoke0(Native Method)
   [junit4]   2> 	at sun.reflect.NativeMethodAccessorImpl.invoke(NativeMethodAccessorImpl.java:62)
   [junit4]   2> 	at sun.reflect.DelegatingMethodAccessorImpl.invoke(DelegatingMethodAccessorImpl.java:43)
   [junit4]   2> 	at java.lang.reflect.Method.invoke(Method.java:498)
   [junit4]   2> 	at com.carrotsearch.randomizedtesting.RandomizedRunner.invoke(RandomizedRunner.java:1713)
   [junit4]   2> 	at com.carrotsearch.randomizedtesting.RandomizedRunner$7.evaluate(RandomizedRunner.java:870)
   [junit4]   2> 	at com.carrotsearch.randomizedtesting.rules.StatementAdapter.evaluate(StatementAdapter.java:36)
   [junit4]   2> 	at com.carrotsearch.randomizedtesting.rules.SystemPropertiesRestoreRule$1.evaluate(SystemPropertiesRestoreRule.java:57)
   [junit4]   2> 	at org.apache.lucene.util.AbstractBeforeAfterRule$1.evaluate(AbstractBeforeAfterRule.java:45)
   [junit4]   2> 	at com.carrotsearch.randomizedtesting.rules.StatementAdapter.evaluate(StatementAdapter.java:36)
   [junit4]   2> 	at org.apache.lucene.util.TestRuleStoreClassName$1.evaluate(TestRuleStoreClassName.java:41)
   [junit4]   2> 	at com.carrotsearch.randomizedtesting.rules.NoShadowingOrOverridesOnMethodsRule$1.evaluate(NoShadowingOrOverridesOnMethodsRule.java:40)
   [junit4]   2> 	at com.carrotsearch.randomizedtesting.rules.NoShadowingOrOverridesOnMethodsRule$1.evaluate(NoShadowingOrOverridesOnMethodsRule.java:40)
   [junit4]   2> 	at com.carrotsearch.randomizedtesting.rules.StatementAdapter.evaluate(StatementAdapter.java:36)
   [junit4]   2> 	at com.carrotsearch.randomizedtesting.rules.StatementAdapter.evaluate(StatementAdapter.java:36)
   [junit4]   2> 	at com.carrotsearch.randomizedtesting.rules.StatementAdapter.evaluate(StatementAdapter.java:36)
   [junit4]   2> 	at org.apache.lucene.util.TestRuleAssertionsRequired$1.evaluate(TestRuleAssertionsRequired.java:53)
   [junit4]   2> 	at org.apache.lucene.util.TestRuleMarkFailure$1.evaluate(TestRuleMarkFailure.java:47)
   [junit4]   2> 	at org.apache.lucene.util.TestRuleIgnoreAfterMaxFailures$1.evaluate(TestRuleIgnoreAfterMaxFailures.java:64)
   [junit4]   2> 	at org.apache.lucene.util.TestRuleIgnoreTestSuites$1.evaluate(TestRuleIgnoreTestSuites.java:54)
   [junit4]   2> 	at com.carrotsearch.randomizedtesting.rules.StatementAdapter.evaluate(StatementAdapter.java:36)
   [junit4]   2> 	at com.carrotsearch.randomizedtesting.ThreadLeakControl$StatementRunner.run(ThreadLeakControl.java:368)
   [junit4]   2> 	at java.lang.Thread.run(Thread.java:745)
   [junit4]   2> Caused by: java.lang.NullPointerException
   [junit4]   2> 	at org.apache.hadoop.hdfs.server.blockmanagement.BlocksMap.size(BlocksMap.java:203)
   [junit4]   2> 	at org.apache.hadoop.hdfs.server.blockmanagement.BlockManager.getTotalBlocks(BlockManager.java:3370)
   [junit4]   2> 	at org.apache.hadoop.hdfs.server.namenode.FSNamesystem.getBlocksTotal(FSNamesystem.java:5729)
   [junit4]   2> 	... 53 more
   [junit4]   2> 5339426 INFO  (SUITE-StressHdfsTest-seed#[765495B8CB018238]-worker) [    ] o.a.s.SolrTestCaseJ4 ###deleteCore
   [junit4]   2> NOTE: leaving temporary files on disk at: /x1/jenkins/jenkins-slave/workspace/Lucene-Solr-NightlyTests-6.x/checkout/solr/build/solr-core/test/J2/temp/solr.cloud.hdfs.StressHdfsTest_765495B8CB018238-001
   [junit4]   2> Jan 31, 2017 12:27:23 AM com.carrotsearch.randomizedtesting.ThreadLeakControl checkThreadLeaks
   [junit4]   2> WARNING: Will linger awaiting termination of 35 leaked thread(s).
   [junit4]   2> NOTE: test params are: codec=Asserting(Lucene62): {range_facet_l_dv=PostingsFormat(name=Memory doPackFST= true), _version_=PostingsFormat(name=Memory doPackFST= false), multiDefault=TestBloomFilteredLucenePostings(BloomFilteringPostingsFormat(Lucene50(blocksize=128))), intDefault=PostingsFormat(name=Memory doPackFST= false), id=PostingsFormat(name=Memory doPackFST= true), range_facet_i_dv=PostingsFormat(name=Memory doPackFST= false), text=FST50, range_facet_l=PostingsFormat(name=Memory doPackFST= false), timestamp=PostingsFormat(name=Memory doPackFST= false), txt_t=FST50}, docValues:{range_facet_l_dv=DocValuesFormat(name=Lucene54), range_facet_i_dv=DocValuesFormat(name=Lucene54), timestamp=DocValuesFormat(name=Lucene54)}, maxPointsInLeafNode=561, maxMBSortInHeap=7.02527385553887, sim=RandomSimilarity(queryNorm=true,coord=yes): {}, locale=ar-JO, timezone=Canada/Newfoundland
   [junit4]   2> NOTE: Linux 3.13.0-85-generic amd64/Oracle Corporation 1.8.0_102 (64-bit)/cpus=4,threads=2,free=245339256,total=535298048
   [junit4]   2> NOTE: All tests run in this JVM: [TestXIncludeConfig, TestFieldCacheSortRandom, TestMinMaxOnMultiValuedField, CoreAdminCreateDiscoverTest, ConnectionManagerTest, PrimUtilsTest, TestUtils, DistributedExpandComponentTest, TestExactSharedStatsCache, DistributedSuggestComponentTest, TestRawTransformer, DocValuesMissingTest, TestPhraseSuggestions, TestGroupingSearch, RulesTest, TestConfigSetsAPIExclusivity, TestReloadAndDeleteDocs, HdfsLockFactoryTest, TestConfigReload, SharedFSAutoReplicaFailoverTest, TestRandomCollapseQParserPlugin, TestMiniSolrCloudClusterSSL, OverseerStatusTest, DistributedFacetPivotLongTailTest, TestDeleteCollectionOnDownNodes, SSLMigrationTest, CdcrBootstrapTest, BasicAuthIntegrationTest, TestSolrCoreSnapshots, TestStressUserVersions, HdfsRestartWhileUpdatingTest, ZkStateWriterTest, TestClusterProperties, MinimalSchemaTest, TestCollationField, TestLegacyFieldCache, ReplicationFactorTest, HdfsChaosMonkeyNothingIsSafeTest, TestPKIAuthenticationPlugin, TolerantUpdateProcessorTest, SmileWriterTest, DOMUtilTest, QueryParsingTest, HdfsNNFailoverTest, IgnoreCommitOptimizeUpdateProcessorFactoryTest, UpdateParamsTest, DirectUpdateHandlerOptimizeTest, OverseerCollectionConfigSetProcessorTest, TestExtendedDismaxParser, TestReversedWildcardFilterFactory, AssignTest, TestAuthenticationFramework, DistribCursorPagingTest, TestTolerantUpdateProcessorRandomCloud, TestIndexingPerformance, TestCoreDiscovery, DocValuesMultiTest, HighlighterMaxOffsetTest, TestAnalyzedSuggestions, LukeRequestHandlerTest, TestSQLHandlerNonCloud, SuggesterTSTTest, TestFieldTypeResource, TestAnalyzeInfixSuggestions, TestFreeTextSuggestions, TestSolrQueryParser, DebugComponentTest, SuggesterTest, TestBulkSchemaAPI, TestStressCloudBlindAtomicUpdates, TestIndexSearcher, RecoveryZkTest, TestJmxMonitoredMap, TestZkChroot, BadIndexSchemaTest, SimpleFacetsTest, ResponseLogComponentTest, TestSolrQueryParserDefaultOperatorResource, TestLFUCache, TestConfig, TestDistributedMissingSort, TestFieldCacheReopen, SolrTestCaseJ4Test, PluginInfoTest, TestDefaultSearchFieldResource, TestExclusionRuleCollectionAccess, TestSolrDeletionPolicy1, OverseerTest, DistributedQueueTest, LeaderFailoverAfterPartitionTest, TestManagedSchemaThreadSafety, TestRecovery, StatelessScriptUpdateProcessorFactoryTest, TestUninvertingReader, RecoveryAfterSoftCommitTest, DeleteInactiveReplicaTest, OpenExchangeRatesOrgProviderTest, TestRequestForwarding, ShufflingReplicaListTransformerTest, LeaderInitiatedRecoveryOnShardRestartTest, CollectionStateFormat2Test, TestCloudManagedSchema, CollectionsAPISolrJTest, CurrencyFieldXmlFileTest, BJQParserTest, RequestHandlersTest, SegmentsInfoRequestHandlerTest, TestSchemaSimilarityResource, ChaosMonkeySafeLeaderTest, BasicDistributedZk2Test, UnloadDistributedZkTest, CollectionsAPIDistributedZkTest, SyncSliceTest, LeaderElectionIntegrationTest, FullSolrCloudDistribCmdsTest, ShardRoutingCustomTest, AutoCommitTest, TestDistributedGrouping, TermVectorComponentDistributedTest, TestStressReorder, DistributedTermsComponentTest, SolrCoreTest, SpellCheckComponentTest, ConvertedLegacyTest, TestSort, ShowFileRequestHandlerTest, CurrencyFieldOpenExchangeTest, SolrRequestParserTest, TestStressLucene, TestTrie, SuggesterWFSTTest, SolrCoreCheckLockOnStartupTest, FieldMutatingUpdateProcessorTest, TestRemoteStreaming, DisMaxRequestHandlerTest, PrimitiveFieldTypeTest, TestOmitPositions, XmlUpdateRequestHandlerTest, RequiredFieldsTest, RegexBoostProcessorTest, SolrPluginUtilsTest, ReturnFieldsTest, MBeansHandlerTest, CSVRequestHandlerTest, SOLR749Test, TestQuerySenderListener, AlternateDirectoryTest, TestSolrIndexConfig, CopyFieldTest, SolrIndexConfigTest, BadComponentTest, TestStressRecovery, TestTolerantSearch, ConnectionReuseTest, CdcrRequestHandlerTest, ConfigSetsAPITest, CustomCollectionTest, DeleteLastCustomShardedReplicaTest, DeleteShardTest, DeleteStatusTest, DistribJoinFromCollectionTest, DistributedVersionInfoTest, HttpPartitionTest, OverriddenZkACLAndCredentialsProvidersTest, OverseerModifyCollectionTest, PeerSyncReplicationTest, ShardSplitTest, TestRandomRequestDistribution, TestSegmentSorting, TlogReplayBufferedWhileIndexingTest, HdfsThreadLeakTest, HdfsTlogReplayBufferedWhileIndexingTest, StressHdfsTest]
   [junit4] Completed [552/681 (2!)] on J2 in 191.14s, 1 test, 1 error <<< FAILURES!

[...truncated 62826 lines...]



Mime
View raw message