lucene-dev mailing list archives

Site index · List index
Message view « Date » · « Thread »
Top « Date » · « Thread »
From Apache Jenkins Server <jenk...@builds.apache.org>
Subject [JENKINS] Lucene-Solr-NightlyTests-6.x - Build # 251 - Still Unstable
Date Sun, 08 Jan 2017 13:29:06 GMT
Build: https://builds.apache.org/job/Lucene-Solr-NightlyTests-6.x/251/

11 tests failed.
FAILED:  org.apache.solr.cloud.CdcrReplicationDistributedZkTest.testReplicationAfterRestart

Error Message:
Timeout waiting for CDCR replication to complete @source_collection:shard2

Stack Trace:
java.lang.RuntimeException: Timeout waiting for CDCR replication to complete @source_collection:shard2
	at __randomizedtesting.SeedInfo.seed([9C544F75B30F79F6:C049A8F47D2FCDC0]:0)
	at org.apache.solr.cloud.BaseCdcrDistributedZkTest.waitForReplicationToComplete(BaseCdcrDistributedZkTest.java:795)
	at org.apache.solr.cloud.CdcrReplicationDistributedZkTest.testReplicationAfterRestart(CdcrReplicationDistributedZkTest.java:236)
	at sun.reflect.NativeMethodAccessorImpl.invoke0(Native Method)
	at sun.reflect.NativeMethodAccessorImpl.invoke(NativeMethodAccessorImpl.java:62)
	at sun.reflect.DelegatingMethodAccessorImpl.invoke(DelegatingMethodAccessorImpl.java:43)
	at java.lang.reflect.Method.invoke(Method.java:498)
	at com.carrotsearch.randomizedtesting.RandomizedRunner.invoke(RandomizedRunner.java:1713)
	at com.carrotsearch.randomizedtesting.RandomizedRunner$8.evaluate(RandomizedRunner.java:907)
	at com.carrotsearch.randomizedtesting.RandomizedRunner$9.evaluate(RandomizedRunner.java:943)
	at com.carrotsearch.randomizedtesting.RandomizedRunner$10.evaluate(RandomizedRunner.java:957)
	at org.apache.solr.BaseDistributedSearchTestCase$ShardsRepeatRule$ShardsFixedStatement.callStatement(BaseDistributedSearchTestCase.java:992)
	at org.apache.solr.BaseDistributedSearchTestCase$ShardsRepeatRule$ShardsStatement.evaluate(BaseDistributedSearchTestCase.java:967)
	at com.carrotsearch.randomizedtesting.rules.SystemPropertiesRestoreRule$1.evaluate(SystemPropertiesRestoreRule.java:57)
	at org.apache.lucene.util.TestRuleSetupTeardownChained$1.evaluate(TestRuleSetupTeardownChained.java:49)
	at org.apache.lucene.util.AbstractBeforeAfterRule$1.evaluate(AbstractBeforeAfterRule.java:45)
	at org.apache.lucene.util.TestRuleThreadAndTestName$1.evaluate(TestRuleThreadAndTestName.java:48)
	at org.apache.lucene.util.TestRuleIgnoreAfterMaxFailures$1.evaluate(TestRuleIgnoreAfterMaxFailures.java:64)
	at org.apache.lucene.util.TestRuleMarkFailure$1.evaluate(TestRuleMarkFailure.java:47)
	at com.carrotsearch.randomizedtesting.rules.StatementAdapter.evaluate(StatementAdapter.java:36)
	at com.carrotsearch.randomizedtesting.ThreadLeakControl$StatementRunner.run(ThreadLeakControl.java:367)
	at com.carrotsearch.randomizedtesting.ThreadLeakControl.forkTimeoutingTask(ThreadLeakControl.java:811)
	at com.carrotsearch.randomizedtesting.ThreadLeakControl$3.evaluate(ThreadLeakControl.java:462)
	at com.carrotsearch.randomizedtesting.RandomizedRunner.runSingleTest(RandomizedRunner.java:916)
	at com.carrotsearch.randomizedtesting.RandomizedRunner$5.evaluate(RandomizedRunner.java:802)
	at com.carrotsearch.randomizedtesting.RandomizedRunner$6.evaluate(RandomizedRunner.java:852)
	at com.carrotsearch.randomizedtesting.RandomizedRunner$7.evaluate(RandomizedRunner.java:863)
	at com.carrotsearch.randomizedtesting.rules.StatementAdapter.evaluate(StatementAdapter.java:36)
	at com.carrotsearch.randomizedtesting.rules.SystemPropertiesRestoreRule$1.evaluate(SystemPropertiesRestoreRule.java:57)
	at org.apache.lucene.util.AbstractBeforeAfterRule$1.evaluate(AbstractBeforeAfterRule.java:45)
	at com.carrotsearch.randomizedtesting.rules.StatementAdapter.evaluate(StatementAdapter.java:36)
	at org.apache.lucene.util.TestRuleStoreClassName$1.evaluate(TestRuleStoreClassName.java:41)
	at com.carrotsearch.randomizedtesting.rules.NoShadowingOrOverridesOnMethodsRule$1.evaluate(NoShadowingOrOverridesOnMethodsRule.java:40)
	at com.carrotsearch.randomizedtesting.rules.NoShadowingOrOverridesOnMethodsRule$1.evaluate(NoShadowingOrOverridesOnMethodsRule.java:40)
	at com.carrotsearch.randomizedtesting.rules.StatementAdapter.evaluate(StatementAdapter.java:36)
	at com.carrotsearch.randomizedtesting.rules.StatementAdapter.evaluate(StatementAdapter.java:36)
	at com.carrotsearch.randomizedtesting.rules.StatementAdapter.evaluate(StatementAdapter.java:36)
	at org.apache.lucene.util.TestRuleAssertionsRequired$1.evaluate(TestRuleAssertionsRequired.java:53)
	at org.apache.lucene.util.TestRuleMarkFailure$1.evaluate(TestRuleMarkFailure.java:47)
	at org.apache.lucene.util.TestRuleIgnoreAfterMaxFailures$1.evaluate(TestRuleIgnoreAfterMaxFailures.java:64)
	at org.apache.lucene.util.TestRuleIgnoreTestSuites$1.evaluate(TestRuleIgnoreTestSuites.java:54)
	at com.carrotsearch.randomizedtesting.rules.StatementAdapter.evaluate(StatementAdapter.java:36)
	at com.carrotsearch.randomizedtesting.ThreadLeakControl$StatementRunner.run(ThreadLeakControl.java:367)
	at java.lang.Thread.run(Thread.java:745)


FAILED:  org.apache.solr.cloud.hdfs.HdfsCollectionsAPIDistributedZkTest.testCollectionReload

Error Message:
Could not find collection : reloaded_collection

Stack Trace:
org.apache.solr.common.SolrException: Could not find collection : reloaded_collection
	at __randomizedtesting.SeedInfo.seed([9C544F75B30F79F6:9DED634B6680D669]:0)
	at org.apache.solr.common.cloud.ClusterState.getCollection(ClusterState.java:194)
	at org.apache.solr.cloud.SolrCloudTestCase.getCollectionState(SolrCloudTestCase.java:245)
	at org.apache.solr.cloud.CollectionsAPIDistributedZkTest.collectStartTimes(CollectionsAPIDistributedZkTest.java:588)
	at org.apache.solr.cloud.CollectionsAPIDistributedZkTest.testCollectionReload(CollectionsAPIDistributedZkTest.java:529)
	at sun.reflect.NativeMethodAccessorImpl.invoke0(Native Method)
	at sun.reflect.NativeMethodAccessorImpl.invoke(NativeMethodAccessorImpl.java:62)
	at sun.reflect.DelegatingMethodAccessorImpl.invoke(DelegatingMethodAccessorImpl.java:43)
	at java.lang.reflect.Method.invoke(Method.java:498)
	at com.carrotsearch.randomizedtesting.RandomizedRunner.invoke(RandomizedRunner.java:1713)
	at com.carrotsearch.randomizedtesting.RandomizedRunner$8.evaluate(RandomizedRunner.java:907)
	at com.carrotsearch.randomizedtesting.RandomizedRunner$9.evaluate(RandomizedRunner.java:943)
	at com.carrotsearch.randomizedtesting.RandomizedRunner$10.evaluate(RandomizedRunner.java:957)
	at com.carrotsearch.randomizedtesting.rules.SystemPropertiesRestoreRule$1.evaluate(SystemPropertiesRestoreRule.java:57)
	at org.apache.lucene.util.TestRuleSetupTeardownChained$1.evaluate(TestRuleSetupTeardownChained.java:49)
	at org.apache.lucene.util.AbstractBeforeAfterRule$1.evaluate(AbstractBeforeAfterRule.java:45)
	at org.apache.lucene.util.TestRuleThreadAndTestName$1.evaluate(TestRuleThreadAndTestName.java:48)
	at org.apache.lucene.util.TestRuleIgnoreAfterMaxFailures$1.evaluate(TestRuleIgnoreAfterMaxFailures.java:64)
	at org.apache.lucene.util.TestRuleMarkFailure$1.evaluate(TestRuleMarkFailure.java:47)
	at com.carrotsearch.randomizedtesting.rules.StatementAdapter.evaluate(StatementAdapter.java:36)
	at com.carrotsearch.randomizedtesting.ThreadLeakControl$StatementRunner.run(ThreadLeakControl.java:367)
	at com.carrotsearch.randomizedtesting.ThreadLeakControl.forkTimeoutingTask(ThreadLeakControl.java:811)
	at com.carrotsearch.randomizedtesting.ThreadLeakControl$3.evaluate(ThreadLeakControl.java:462)
	at com.carrotsearch.randomizedtesting.RandomizedRunner.runSingleTest(RandomizedRunner.java:916)
	at com.carrotsearch.randomizedtesting.RandomizedRunner$5.evaluate(RandomizedRunner.java:802)
	at com.carrotsearch.randomizedtesting.RandomizedRunner$6.evaluate(RandomizedRunner.java:852)
	at com.carrotsearch.randomizedtesting.RandomizedRunner$7.evaluate(RandomizedRunner.java:863)
	at com.carrotsearch.randomizedtesting.rules.StatementAdapter.evaluate(StatementAdapter.java:36)
	at com.carrotsearch.randomizedtesting.rules.SystemPropertiesRestoreRule$1.evaluate(SystemPropertiesRestoreRule.java:57)
	at org.apache.lucene.util.AbstractBeforeAfterRule$1.evaluate(AbstractBeforeAfterRule.java:45)
	at com.carrotsearch.randomizedtesting.rules.StatementAdapter.evaluate(StatementAdapter.java:36)
	at org.apache.lucene.util.TestRuleStoreClassName$1.evaluate(TestRuleStoreClassName.java:41)
	at com.carrotsearch.randomizedtesting.rules.NoShadowingOrOverridesOnMethodsRule$1.evaluate(NoShadowingOrOverridesOnMethodsRule.java:40)
	at com.carrotsearch.randomizedtesting.rules.NoShadowingOrOverridesOnMethodsRule$1.evaluate(NoShadowingOrOverridesOnMethodsRule.java:40)
	at com.carrotsearch.randomizedtesting.rules.StatementAdapter.evaluate(StatementAdapter.java:36)
	at com.carrotsearch.randomizedtesting.rules.StatementAdapter.evaluate(StatementAdapter.java:36)
	at com.carrotsearch.randomizedtesting.rules.StatementAdapter.evaluate(StatementAdapter.java:36)
	at org.apache.lucene.util.TestRuleAssertionsRequired$1.evaluate(TestRuleAssertionsRequired.java:53)
	at org.apache.lucene.util.TestRuleMarkFailure$1.evaluate(TestRuleMarkFailure.java:47)
	at org.apache.lucene.util.TestRuleIgnoreAfterMaxFailures$1.evaluate(TestRuleIgnoreAfterMaxFailures.java:64)
	at org.apache.lucene.util.TestRuleIgnoreTestSuites$1.evaluate(TestRuleIgnoreTestSuites.java:54)
	at com.carrotsearch.randomizedtesting.rules.StatementAdapter.evaluate(StatementAdapter.java:36)
	at com.carrotsearch.randomizedtesting.ThreadLeakControl$StatementRunner.run(ThreadLeakControl.java:367)
	at java.lang.Thread.run(Thread.java:745)


FAILED:  org.apache.solr.cloud.hdfs.HdfsCollectionsAPIDistributedZkTest.deletePartiallyCreatedCollection

Error Message:
Error from server at https://127.0.0.1:54090/solr: Error CREATEing SolrCore 'halfdeletedcollection_shard1_replica1': Unable to create core [halfdeletedcollection_shard1_replica1] Caused by: Direct buffer memory

Stack Trace:
org.apache.solr.client.solrj.impl.HttpSolrClient$RemoteSolrException: Error from server at https://127.0.0.1:54090/solr: Error CREATEing SolrCore 'halfdeletedcollection_shard1_replica1': Unable to create core [halfdeletedcollection_shard1_replica1] Caused by: Direct buffer memory
	at __randomizedtesting.SeedInfo.seed([9C544F75B30F79F6:B6D4239004D5593E]:0)
	at org.apache.solr.client.solrj.impl.HttpSolrClient.executeMethod(HttpSolrClient.java:610)
	at org.apache.solr.client.solrj.impl.HttpSolrClient.request(HttpSolrClient.java:279)
	at org.apache.solr.client.solrj.impl.HttpSolrClient.request(HttpSolrClient.java:268)
	at org.apache.solr.client.solrj.impl.LBHttpSolrClient.doRequest(LBHttpSolrClient.java:435)
	at org.apache.solr.client.solrj.impl.LBHttpSolrClient.request(LBHttpSolrClient.java:387)
	at org.apache.solr.client.solrj.impl.CloudSolrClient.sendRequest(CloudSolrClient.java:1344)
	at org.apache.solr.client.solrj.impl.CloudSolrClient.requestWithRetryOnStaleState(CloudSolrClient.java:1095)
	at org.apache.solr.client.solrj.impl.CloudSolrClient.request(CloudSolrClient.java:1037)
	at org.apache.solr.client.solrj.SolrRequest.process(SolrRequest.java:149)
	at org.apache.solr.client.solrj.SolrRequest.process(SolrRequest.java:166)
	at org.apache.solr.cloud.CollectionsAPIDistributedZkTest.deletePartiallyCreatedCollection(CollectionsAPIDistributedZkTest.java:155)
	at sun.reflect.NativeMethodAccessorImpl.invoke0(Native Method)
	at sun.reflect.NativeMethodAccessorImpl.invoke(NativeMethodAccessorImpl.java:62)
	at sun.reflect.DelegatingMethodAccessorImpl.invoke(DelegatingMethodAccessorImpl.java:43)
	at java.lang.reflect.Method.invoke(Method.java:498)
	at com.carrotsearch.randomizedtesting.RandomizedRunner.invoke(RandomizedRunner.java:1713)
	at com.carrotsearch.randomizedtesting.RandomizedRunner$8.evaluate(RandomizedRunner.java:907)
	at com.carrotsearch.randomizedtesting.RandomizedRunner$9.evaluate(RandomizedRunner.java:943)
	at com.carrotsearch.randomizedtesting.RandomizedRunner$10.evaluate(RandomizedRunner.java:957)
	at com.carrotsearch.randomizedtesting.rules.SystemPropertiesRestoreRule$1.evaluate(SystemPropertiesRestoreRule.java:57)
	at org.apache.lucene.util.TestRuleSetupTeardownChained$1.evaluate(TestRuleSetupTeardownChained.java:49)
	at org.apache.lucene.util.AbstractBeforeAfterRule$1.evaluate(AbstractBeforeAfterRule.java:45)
	at org.apache.lucene.util.TestRuleThreadAndTestName$1.evaluate(TestRuleThreadAndTestName.java:48)
	at org.apache.lucene.util.TestRuleIgnoreAfterMaxFailures$1.evaluate(TestRuleIgnoreAfterMaxFailures.java:64)
	at org.apache.lucene.util.TestRuleMarkFailure$1.evaluate(TestRuleMarkFailure.java:47)
	at com.carrotsearch.randomizedtesting.rules.StatementAdapter.evaluate(StatementAdapter.java:36)
	at com.carrotsearch.randomizedtesting.ThreadLeakControl$StatementRunner.run(ThreadLeakControl.java:367)
	at com.carrotsearch.randomizedtesting.ThreadLeakControl.forkTimeoutingTask(ThreadLeakControl.java:811)
	at com.carrotsearch.randomizedtesting.ThreadLeakControl$3.evaluate(ThreadLeakControl.java:462)
	at com.carrotsearch.randomizedtesting.RandomizedRunner.runSingleTest(RandomizedRunner.java:916)
	at com.carrotsearch.randomizedtesting.RandomizedRunner$5.evaluate(RandomizedRunner.java:802)
	at com.carrotsearch.randomizedtesting.RandomizedRunner$6.evaluate(RandomizedRunner.java:852)
	at com.carrotsearch.randomizedtesting.RandomizedRunner$7.evaluate(RandomizedRunner.java:863)
	at com.carrotsearch.randomizedtesting.rules.StatementAdapter.evaluate(StatementAdapter.java:36)
	at com.carrotsearch.randomizedtesting.rules.SystemPropertiesRestoreRule$1.evaluate(SystemPropertiesRestoreRule.java:57)
	at org.apache.lucene.util.AbstractBeforeAfterRule$1.evaluate(AbstractBeforeAfterRule.java:45)
	at com.carrotsearch.randomizedtesting.rules.StatementAdapter.evaluate(StatementAdapter.java:36)
	at org.apache.lucene.util.TestRuleStoreClassName$1.evaluate(TestRuleStoreClassName.java:41)
	at com.carrotsearch.randomizedtesting.rules.NoShadowingOrOverridesOnMethodsRule$1.evaluate(NoShadowingOrOverridesOnMethodsRule.java:40)
	at com.carrotsearch.randomizedtesting.rules.NoShadowingOrOverridesOnMethodsRule$1.evaluate(NoShadowingOrOverridesOnMethodsRule.java:40)
	at com.carrotsearch.randomizedtesting.rules.StatementAdapter.evaluate(StatementAdapter.java:36)
	at com.carrotsearch.randomizedtesting.rules.StatementAdapter.evaluate(StatementAdapter.java:36)
	at com.carrotsearch.randomizedtesting.rules.StatementAdapter.evaluate(StatementAdapter.java:36)
	at org.apache.lucene.util.TestRuleAssertionsRequired$1.evaluate(TestRuleAssertionsRequired.java:53)
	at org.apache.lucene.util.TestRuleMarkFailure$1.evaluate(TestRuleMarkFailure.java:47)
	at org.apache.lucene.util.TestRuleIgnoreAfterMaxFailures$1.evaluate(TestRuleIgnoreAfterMaxFailures.java:64)
	at org.apache.lucene.util.TestRuleIgnoreTestSuites$1.evaluate(TestRuleIgnoreTestSuites.java:54)
	at com.carrotsearch.randomizedtesting.rules.StatementAdapter.evaluate(StatementAdapter.java:36)
	at com.carrotsearch.randomizedtesting.ThreadLeakControl$StatementRunner.run(ThreadLeakControl.java:367)
	at java.lang.Thread.run(Thread.java:745)


FAILED:  org.apache.solr.cloud.hdfs.HdfsCollectionsAPIDistributedZkTest.testNoCollectionSpecified

Error Message:
Error from server at https://127.0.0.1:54090/solr: Error CREATEing SolrCore 'corewithnocollection2': Unable to create core [corewithnocollection2] Caused by: Direct buffer memory

Stack Trace:
org.apache.solr.client.solrj.impl.HttpSolrClient$RemoteSolrException: Error from server at https://127.0.0.1:54090/solr: Error CREATEing SolrCore 'corewithnocollection2': Unable to create core [corewithnocollection2] Caused by: Direct buffer memory
	at __randomizedtesting.SeedInfo.seed([9C544F75B30F79F6:EFF7CF8507672CD4]:0)
	at org.apache.solr.client.solrj.impl.HttpSolrClient.executeMethod(HttpSolrClient.java:610)
	at org.apache.solr.client.solrj.impl.HttpSolrClient.request(HttpSolrClient.java:279)
	at org.apache.solr.client.solrj.impl.HttpSolrClient.request(HttpSolrClient.java:268)
	at org.apache.solr.client.solrj.impl.LBHttpSolrClient.doRequest(LBHttpSolrClient.java:435)
	at org.apache.solr.client.solrj.impl.LBHttpSolrClient.request(LBHttpSolrClient.java:387)
	at org.apache.solr.client.solrj.impl.CloudSolrClient.sendRequest(CloudSolrClient.java:1344)
	at org.apache.solr.client.solrj.impl.CloudSolrClient.requestWithRetryOnStaleState(CloudSolrClient.java:1095)
	at org.apache.solr.client.solrj.impl.CloudSolrClient.request(CloudSolrClient.java:1037)
	at org.apache.solr.client.solrj.SolrClient.request(SolrClient.java:1219)
	at org.apache.solr.cloud.CollectionsAPIDistributedZkTest.testNoCollectionSpecified(CollectionsAPIDistributedZkTest.java:339)
	at sun.reflect.NativeMethodAccessorImpl.invoke0(Native Method)
	at sun.reflect.NativeMethodAccessorImpl.invoke(NativeMethodAccessorImpl.java:62)
	at sun.reflect.DelegatingMethodAccessorImpl.invoke(DelegatingMethodAccessorImpl.java:43)
	at java.lang.reflect.Method.invoke(Method.java:498)
	at com.carrotsearch.randomizedtesting.RandomizedRunner.invoke(RandomizedRunner.java:1713)
	at com.carrotsearch.randomizedtesting.RandomizedRunner$8.evaluate(RandomizedRunner.java:907)
	at com.carrotsearch.randomizedtesting.RandomizedRunner$9.evaluate(RandomizedRunner.java:943)
	at com.carrotsearch.randomizedtesting.RandomizedRunner$10.evaluate(RandomizedRunner.java:957)
	at com.carrotsearch.randomizedtesting.rules.SystemPropertiesRestoreRule$1.evaluate(SystemPropertiesRestoreRule.java:57)
	at org.apache.lucene.util.TestRuleSetupTeardownChained$1.evaluate(TestRuleSetupTeardownChained.java:49)
	at org.apache.lucene.util.AbstractBeforeAfterRule$1.evaluate(AbstractBeforeAfterRule.java:45)
	at org.apache.lucene.util.TestRuleThreadAndTestName$1.evaluate(TestRuleThreadAndTestName.java:48)
	at org.apache.lucene.util.TestRuleIgnoreAfterMaxFailures$1.evaluate(TestRuleIgnoreAfterMaxFailures.java:64)
	at org.apache.lucene.util.TestRuleMarkFailure$1.evaluate(TestRuleMarkFailure.java:47)
	at com.carrotsearch.randomizedtesting.rules.StatementAdapter.evaluate(StatementAdapter.java:36)
	at com.carrotsearch.randomizedtesting.ThreadLeakControl$StatementRunner.run(ThreadLeakControl.java:367)
	at com.carrotsearch.randomizedtesting.ThreadLeakControl.forkTimeoutingTask(ThreadLeakControl.java:811)
	at com.carrotsearch.randomizedtesting.ThreadLeakControl$3.evaluate(ThreadLeakControl.java:462)
	at com.carrotsearch.randomizedtesting.RandomizedRunner.runSingleTest(RandomizedRunner.java:916)
	at com.carrotsearch.randomizedtesting.RandomizedRunner$5.evaluate(RandomizedRunner.java:802)
	at com.carrotsearch.randomizedtesting.RandomizedRunner$6.evaluate(RandomizedRunner.java:852)
	at com.carrotsearch.randomizedtesting.RandomizedRunner$7.evaluate(RandomizedRunner.java:863)
	at com.carrotsearch.randomizedtesting.rules.StatementAdapter.evaluate(StatementAdapter.java:36)
	at com.carrotsearch.randomizedtesting.rules.SystemPropertiesRestoreRule$1.evaluate(SystemPropertiesRestoreRule.java:57)
	at org.apache.lucene.util.AbstractBeforeAfterRule$1.evaluate(AbstractBeforeAfterRule.java:45)
	at com.carrotsearch.randomizedtesting.rules.StatementAdapter.evaluate(StatementAdapter.java:36)
	at org.apache.lucene.util.TestRuleStoreClassName$1.evaluate(TestRuleStoreClassName.java:41)
	at com.carrotsearch.randomizedtesting.rules.NoShadowingOrOverridesOnMethodsRule$1.evaluate(NoShadowingOrOverridesOnMethodsRule.java:40)
	at com.carrotsearch.randomizedtesting.rules.NoShadowingOrOverridesOnMethodsRule$1.evaluate(NoShadowingOrOverridesOnMethodsRule.java:40)
	at com.carrotsearch.randomizedtesting.rules.StatementAdapter.evaluate(StatementAdapter.java:36)
	at com.carrotsearch.randomizedtesting.rules.StatementAdapter.evaluate(StatementAdapter.java:36)
	at com.carrotsearch.randomizedtesting.rules.StatementAdapter.evaluate(StatementAdapter.java:36)
	at org.apache.lucene.util.TestRuleAssertionsRequired$1.evaluate(TestRuleAssertionsRequired.java:53)
	at org.apache.lucene.util.TestRuleMarkFailure$1.evaluate(TestRuleMarkFailure.java:47)
	at org.apache.lucene.util.TestRuleIgnoreAfterMaxFailures$1.evaluate(TestRuleIgnoreAfterMaxFailures.java:64)
	at org.apache.lucene.util.TestRuleIgnoreTestSuites$1.evaluate(TestRuleIgnoreTestSuites.java:54)
	at com.carrotsearch.randomizedtesting.rules.StatementAdapter.evaluate(StatementAdapter.java:36)
	at com.carrotsearch.randomizedtesting.ThreadLeakControl$StatementRunner.run(ThreadLeakControl.java:367)
	at java.lang.Thread.run(Thread.java:745)


FAILED:  org.apache.solr.cloud.hdfs.HdfsCollectionsAPIDistributedZkTest.testDeleteNonExistentCollection

Error Message:
Collection creation after a bad delete failed null Last available state: null

Stack Trace:
java.lang.AssertionError: Collection creation after a bad delete failed
null
Last available state: null
	at __randomizedtesting.SeedInfo.seed([9C544F75B30F79F6:7B735F48A46C060F]:0)
	at org.junit.Assert.fail(Assert.java:93)
	at org.apache.solr.cloud.SolrCloudTestCase.waitForState(SolrCloudTestCase.java:265)
	at org.apache.solr.cloud.CollectionsAPIDistributedZkTest.testDeleteNonExistentCollection(CollectionsAPIDistributedZkTest.java:418)
	at sun.reflect.NativeMethodAccessorImpl.invoke0(Native Method)
	at sun.reflect.NativeMethodAccessorImpl.invoke(NativeMethodAccessorImpl.java:62)
	at sun.reflect.DelegatingMethodAccessorImpl.invoke(DelegatingMethodAccessorImpl.java:43)
	at java.lang.reflect.Method.invoke(Method.java:498)
	at com.carrotsearch.randomizedtesting.RandomizedRunner.invoke(RandomizedRunner.java:1713)
	at com.carrotsearch.randomizedtesting.RandomizedRunner$8.evaluate(RandomizedRunner.java:907)
	at com.carrotsearch.randomizedtesting.RandomizedRunner$9.evaluate(RandomizedRunner.java:943)
	at com.carrotsearch.randomizedtesting.RandomizedRunner$10.evaluate(RandomizedRunner.java:957)
	at com.carrotsearch.randomizedtesting.rules.SystemPropertiesRestoreRule$1.evaluate(SystemPropertiesRestoreRule.java:57)
	at org.apache.lucene.util.TestRuleSetupTeardownChained$1.evaluate(TestRuleSetupTeardownChained.java:49)
	at org.apache.lucene.util.AbstractBeforeAfterRule$1.evaluate(AbstractBeforeAfterRule.java:45)
	at org.apache.lucene.util.TestRuleThreadAndTestName$1.evaluate(TestRuleThreadAndTestName.java:48)
	at org.apache.lucene.util.TestRuleIgnoreAfterMaxFailures$1.evaluate(TestRuleIgnoreAfterMaxFailures.java:64)
	at org.apache.lucene.util.TestRuleMarkFailure$1.evaluate(TestRuleMarkFailure.java:47)
	at com.carrotsearch.randomizedtesting.rules.StatementAdapter.evaluate(StatementAdapter.java:36)
	at com.carrotsearch.randomizedtesting.ThreadLeakControl$StatementRunner.run(ThreadLeakControl.java:367)
	at com.carrotsearch.randomizedtesting.ThreadLeakControl.forkTimeoutingTask(ThreadLeakControl.java:811)
	at com.carrotsearch.randomizedtesting.ThreadLeakControl$3.evaluate(ThreadLeakControl.java:462)
	at com.carrotsearch.randomizedtesting.RandomizedRunner.runSingleTest(RandomizedRunner.java:916)
	at com.carrotsearch.randomizedtesting.RandomizedRunner$5.evaluate(RandomizedRunner.java:802)
	at com.carrotsearch.randomizedtesting.RandomizedRunner$6.evaluate(RandomizedRunner.java:852)
	at com.carrotsearch.randomizedtesting.RandomizedRunner$7.evaluate(RandomizedRunner.java:863)
	at com.carrotsearch.randomizedtesting.rules.StatementAdapter.evaluate(StatementAdapter.java:36)
	at com.carrotsearch.randomizedtesting.rules.SystemPropertiesRestoreRule$1.evaluate(SystemPropertiesRestoreRule.java:57)
	at org.apache.lucene.util.AbstractBeforeAfterRule$1.evaluate(AbstractBeforeAfterRule.java:45)
	at com.carrotsearch.randomizedtesting.rules.StatementAdapter.evaluate(StatementAdapter.java:36)
	at org.apache.lucene.util.TestRuleStoreClassName$1.evaluate(TestRuleStoreClassName.java:41)
	at com.carrotsearch.randomizedtesting.rules.NoShadowingOrOverridesOnMethodsRule$1.evaluate(NoShadowingOrOverridesOnMethodsRule.java:40)
	at com.carrotsearch.randomizedtesting.rules.NoShadowingOrOverridesOnMethodsRule$1.evaluate(NoShadowingOrOverridesOnMethodsRule.java:40)
	at com.carrotsearch.randomizedtesting.rules.StatementAdapter.evaluate(StatementAdapter.java:36)
	at com.carrotsearch.randomizedtesting.rules.StatementAdapter.evaluate(StatementAdapter.java:36)
	at com.carrotsearch.randomizedtesting.rules.StatementAdapter.evaluate(StatementAdapter.java:36)
	at org.apache.lucene.util.TestRuleAssertionsRequired$1.evaluate(TestRuleAssertionsRequired.java:53)
	at org.apache.lucene.util.TestRuleMarkFailure$1.evaluate(TestRuleMarkFailure.java:47)
	at org.apache.lucene.util.TestRuleIgnoreAfterMaxFailures$1.evaluate(TestRuleIgnoreAfterMaxFailures.java:64)
	at org.apache.lucene.util.TestRuleIgnoreTestSuites$1.evaluate(TestRuleIgnoreTestSuites.java:54)
	at com.carrotsearch.randomizedtesting.rules.StatementAdapter.evaluate(StatementAdapter.java:36)
	at com.carrotsearch.randomizedtesting.ThreadLeakControl$StatementRunner.run(ThreadLeakControl.java:367)
	at java.lang.Thread.run(Thread.java:745)


FAILED:  org.apache.solr.cloud.hdfs.HdfsCollectionsAPIDistributedZkTest.testCreateShouldFailOnExistingCore

Error Message:
Error from server at https://127.0.0.1:33928/solr: Error CREATEing SolrCore 'halfcollection_shard1_replica1': Unable to create core [halfcollection_shard1_replica1] Caused by: Direct buffer memory

Stack Trace:
org.apache.solr.client.solrj.impl.HttpSolrClient$RemoteSolrException: Error from server at https://127.0.0.1:33928/solr: Error CREATEing SolrCore 'halfcollection_shard1_replica1': Unable to create core [halfcollection_shard1_replica1] Caused by: Direct buffer memory
	at __randomizedtesting.SeedInfo.seed([9C544F75B30F79F6:7092E2C14893C412]:0)
	at org.apache.solr.client.solrj.impl.HttpSolrClient.executeMethod(HttpSolrClient.java:610)
	at org.apache.solr.client.solrj.impl.HttpSolrClient.request(HttpSolrClient.java:279)
	at org.apache.solr.client.solrj.impl.HttpSolrClient.request(HttpSolrClient.java:268)
	at org.apache.solr.client.solrj.SolrClient.request(SolrClient.java:1219)
	at org.apache.solr.cloud.CollectionsAPIDistributedZkTest.testCreateShouldFailOnExistingCore(CollectionsAPIDistributedZkTest.java:283)
	at sun.reflect.NativeMethodAccessorImpl.invoke0(Native Method)
	at sun.reflect.NativeMethodAccessorImpl.invoke(NativeMethodAccessorImpl.java:62)
	at sun.reflect.DelegatingMethodAccessorImpl.invoke(DelegatingMethodAccessorImpl.java:43)
	at java.lang.reflect.Method.invoke(Method.java:498)
	at com.carrotsearch.randomizedtesting.RandomizedRunner.invoke(RandomizedRunner.java:1713)
	at com.carrotsearch.randomizedtesting.RandomizedRunner$8.evaluate(RandomizedRunner.java:907)
	at com.carrotsearch.randomizedtesting.RandomizedRunner$9.evaluate(RandomizedRunner.java:943)
	at com.carrotsearch.randomizedtesting.RandomizedRunner$10.evaluate(RandomizedRunner.java:957)
	at com.carrotsearch.randomizedtesting.rules.SystemPropertiesRestoreRule$1.evaluate(SystemPropertiesRestoreRule.java:57)
	at org.apache.lucene.util.TestRuleSetupTeardownChained$1.evaluate(TestRuleSetupTeardownChained.java:49)
	at org.apache.lucene.util.AbstractBeforeAfterRule$1.evaluate(AbstractBeforeAfterRule.java:45)
	at org.apache.lucene.util.TestRuleThreadAndTestName$1.evaluate(TestRuleThreadAndTestName.java:48)
	at org.apache.lucene.util.TestRuleIgnoreAfterMaxFailures$1.evaluate(TestRuleIgnoreAfterMaxFailures.java:64)
	at org.apache.lucene.util.TestRuleMarkFailure$1.evaluate(TestRuleMarkFailure.java:47)
	at com.carrotsearch.randomizedtesting.rules.StatementAdapter.evaluate(StatementAdapter.java:36)
	at com.carrotsearch.randomizedtesting.ThreadLeakControl$StatementRunner.run(ThreadLeakControl.java:367)
	at com.carrotsearch.randomizedtesting.ThreadLeakControl.forkTimeoutingTask(ThreadLeakControl.java:811)
	at com.carrotsearch.randomizedtesting.ThreadLeakControl$3.evaluate(ThreadLeakControl.java:462)
	at com.carrotsearch.randomizedtesting.RandomizedRunner.runSingleTest(RandomizedRunner.java:916)
	at com.carrotsearch.randomizedtesting.RandomizedRunner$5.evaluate(RandomizedRunner.java:802)
	at com.carrotsearch.randomizedtesting.RandomizedRunner$6.evaluate(RandomizedRunner.java:852)
	at com.carrotsearch.randomizedtesting.RandomizedRunner$7.evaluate(RandomizedRunner.java:863)
	at com.carrotsearch.randomizedtesting.rules.StatementAdapter.evaluate(StatementAdapter.java:36)
	at com.carrotsearch.randomizedtesting.rules.SystemPropertiesRestoreRule$1.evaluate(SystemPropertiesRestoreRule.java:57)
	at org.apache.lucene.util.AbstractBeforeAfterRule$1.evaluate(AbstractBeforeAfterRule.java:45)
	at com.carrotsearch.randomizedtesting.rules.StatementAdapter.evaluate(StatementAdapter.java:36)
	at org.apache.lucene.util.TestRuleStoreClassName$1.evaluate(TestRuleStoreClassName.java:41)
	at com.carrotsearch.randomizedtesting.rules.NoShadowingOrOverridesOnMethodsRule$1.evaluate(NoShadowingOrOverridesOnMethodsRule.java:40)
	at com.carrotsearch.randomizedtesting.rules.NoShadowingOrOverridesOnMethodsRule$1.evaluate(NoShadowingOrOverridesOnMethodsRule.java:40)
	at com.carrotsearch.randomizedtesting.rules.StatementAdapter.evaluate(StatementAdapter.java:36)
	at com.carrotsearch.randomizedtesting.rules.StatementAdapter.evaluate(StatementAdapter.java:36)
	at com.carrotsearch.randomizedtesting.rules.StatementAdapter.evaluate(StatementAdapter.java:36)
	at org.apache.lucene.util.TestRuleAssertionsRequired$1.evaluate(TestRuleAssertionsRequired.java:53)
	at org.apache.lucene.util.TestRuleMarkFailure$1.evaluate(TestRuleMarkFailure.java:47)
	at org.apache.lucene.util.TestRuleIgnoreAfterMaxFailures$1.evaluate(TestRuleIgnoreAfterMaxFailures.java:64)
	at org.apache.lucene.util.TestRuleIgnoreTestSuites$1.evaluate(TestRuleIgnoreTestSuites.java:54)
	at com.carrotsearch.randomizedtesting.rules.StatementAdapter.evaluate(StatementAdapter.java:36)
	at com.carrotsearch.randomizedtesting.ThreadLeakControl$StatementRunner.run(ThreadLeakControl.java:367)
	at java.lang.Thread.run(Thread.java:745)


FAILED:  org.apache.solr.cloud.hdfs.HdfsCollectionsAPIDistributedZkTest.deleteCollectionOnlyInZk

Error Message:


Stack Trace:
java.lang.AssertionError
	at __randomizedtesting.SeedInfo.seed([9C544F75B30F79F6:28B413F44509D9E7]:0)
	at org.junit.Assert.fail(Assert.java:92)
	at org.junit.Assert.assertTrue(Assert.java:43)
	at org.junit.Assert.assertTrue(Assert.java:54)
	at org.apache.solr.cloud.CollectionsAPIDistributedZkTest.deleteCollectionOnlyInZk(CollectionsAPIDistributedZkTest.java:184)
	at sun.reflect.NativeMethodAccessorImpl.invoke0(Native Method)
	at sun.reflect.NativeMethodAccessorImpl.invoke(NativeMethodAccessorImpl.java:62)
	at sun.reflect.DelegatingMethodAccessorImpl.invoke(DelegatingMethodAccessorImpl.java:43)
	at java.lang.reflect.Method.invoke(Method.java:498)
	at com.carrotsearch.randomizedtesting.RandomizedRunner.invoke(RandomizedRunner.java:1713)
	at com.carrotsearch.randomizedtesting.RandomizedRunner$8.evaluate(RandomizedRunner.java:907)
	at com.carrotsearch.randomizedtesting.RandomizedRunner$9.evaluate(RandomizedRunner.java:943)
	at com.carrotsearch.randomizedtesting.RandomizedRunner$10.evaluate(RandomizedRunner.java:957)
	at com.carrotsearch.randomizedtesting.rules.SystemPropertiesRestoreRule$1.evaluate(SystemPropertiesRestoreRule.java:57)
	at org.apache.lucene.util.TestRuleSetupTeardownChained$1.evaluate(TestRuleSetupTeardownChained.java:49)
	at org.apache.lucene.util.AbstractBeforeAfterRule$1.evaluate(AbstractBeforeAfterRule.java:45)
	at org.apache.lucene.util.TestRuleThreadAndTestName$1.evaluate(TestRuleThreadAndTestName.java:48)
	at org.apache.lucene.util.TestRuleIgnoreAfterMaxFailures$1.evaluate(TestRuleIgnoreAfterMaxFailures.java:64)
	at org.apache.lucene.util.TestRuleMarkFailure$1.evaluate(TestRuleMarkFailure.java:47)
	at com.carrotsearch.randomizedtesting.rules.StatementAdapter.evaluate(StatementAdapter.java:36)
	at com.carrotsearch.randomizedtesting.ThreadLeakControl$StatementRunner.run(ThreadLeakControl.java:367)
	at com.carrotsearch.randomizedtesting.ThreadLeakControl.forkTimeoutingTask(ThreadLeakControl.java:811)
	at com.carrotsearch.randomizedtesting.ThreadLeakControl$3.evaluate(ThreadLeakControl.java:462)
	at com.carrotsearch.randomizedtesting.RandomizedRunner.runSingleTest(RandomizedRunner.java:916)
	at com.carrotsearch.randomizedtesting.RandomizedRunner$5.evaluate(RandomizedRunner.java:802)
	at com.carrotsearch.randomizedtesting.RandomizedRunner$6.evaluate(RandomizedRunner.java:852)
	at com.carrotsearch.randomizedtesting.RandomizedRunner$7.evaluate(RandomizedRunner.java:863)
	at com.carrotsearch.randomizedtesting.rules.StatementAdapter.evaluate(StatementAdapter.java:36)
	at com.carrotsearch.randomizedtesting.rules.SystemPropertiesRestoreRule$1.evaluate(SystemPropertiesRestoreRule.java:57)
	at org.apache.lucene.util.AbstractBeforeAfterRule$1.evaluate(AbstractBeforeAfterRule.java:45)
	at com.carrotsearch.randomizedtesting.rules.StatementAdapter.evaluate(StatementAdapter.java:36)
	at org.apache.lucene.util.TestRuleStoreClassName$1.evaluate(TestRuleStoreClassName.java:41)
	at com.carrotsearch.randomizedtesting.rules.NoShadowingOrOverridesOnMethodsRule$1.evaluate(NoShadowingOrOverridesOnMethodsRule.java:40)
	at com.carrotsearch.randomizedtesting.rules.NoShadowingOrOverridesOnMethodsRule$1.evaluate(NoShadowingOrOverridesOnMethodsRule.java:40)
	at com.carrotsearch.randomizedtesting.rules.StatementAdapter.evaluate(StatementAdapter.java:36)
	at com.carrotsearch.randomizedtesting.rules.StatementAdapter.evaluate(StatementAdapter.java:36)
	at com.carrotsearch.randomizedtesting.rules.StatementAdapter.evaluate(StatementAdapter.java:36)
	at org.apache.lucene.util.TestRuleAssertionsRequired$1.evaluate(TestRuleAssertionsRequired.java:53)
	at org.apache.lucene.util.TestRuleMarkFailure$1.evaluate(TestRuleMarkFailure.java:47)
	at org.apache.lucene.util.TestRuleIgnoreAfterMaxFailures$1.evaluate(TestRuleIgnoreAfterMaxFailures.java:64)
	at org.apache.lucene.util.TestRuleIgnoreTestSuites$1.evaluate(TestRuleIgnoreTestSuites.java:54)
	at com.carrotsearch.randomizedtesting.rules.StatementAdapter.evaluate(StatementAdapter.java:36)
	at com.carrotsearch.randomizedtesting.ThreadLeakControl$StatementRunner.run(ThreadLeakControl.java:367)
	at java.lang.Thread.run(Thread.java:745)


FAILED:  org.apache.solr.cloud.LeaderInitiatedRecoveryOnShardRestartTest.testRestartWithAllInLIR

Error Message:
There are still nodes recoverying - waited for 330 seconds

Stack Trace:
java.lang.AssertionError: There are still nodes recoverying - waited for 330 seconds
	at __randomizedtesting.SeedInfo.seed([9C544F75B30F79F6:42DE210888AD1B05]:0)
	at org.junit.Assert.fail(Assert.java:93)
	at org.apache.solr.cloud.AbstractDistribZkTestBase.waitForRecoveriesToFinish(AbstractDistribZkTestBase.java:188)
	at org.apache.solr.cloud.AbstractDistribZkTestBase.waitForRecoveriesToFinish(AbstractDistribZkTestBase.java:145)
	at org.apache.solr.cloud.AbstractDistribZkTestBase.waitForRecoveriesToFinish(AbstractDistribZkTestBase.java:140)
	at org.apache.solr.cloud.AbstractFullDistribZkTestBase.waitForRecoveriesToFinish(AbstractFullDistribZkTestBase.java:856)
	at org.apache.solr.cloud.LeaderInitiatedRecoveryOnShardRestartTest.testRestartWithAllInLIR(LeaderInitiatedRecoveryOnShardRestartTest.java:158)
	at sun.reflect.NativeMethodAccessorImpl.invoke0(Native Method)
	at sun.reflect.NativeMethodAccessorImpl.invoke(NativeMethodAccessorImpl.java:62)
	at sun.reflect.DelegatingMethodAccessorImpl.invoke(DelegatingMethodAccessorImpl.java:43)
	at java.lang.reflect.Method.invoke(Method.java:498)
	at com.carrotsearch.randomizedtesting.RandomizedRunner.invoke(RandomizedRunner.java:1713)
	at com.carrotsearch.randomizedtesting.RandomizedRunner$8.evaluate(RandomizedRunner.java:907)
	at com.carrotsearch.randomizedtesting.RandomizedRunner$9.evaluate(RandomizedRunner.java:943)
	at com.carrotsearch.randomizedtesting.RandomizedRunner$10.evaluate(RandomizedRunner.java:957)
	at org.apache.solr.BaseDistributedSearchTestCase$ShardsRepeatRule$ShardsFixedStatement.callStatement(BaseDistributedSearchTestCase.java:992)
	at org.apache.solr.BaseDistributedSearchTestCase$ShardsRepeatRule$ShardsStatement.evaluate(BaseDistributedSearchTestCase.java:967)
	at com.carrotsearch.randomizedtesting.rules.SystemPropertiesRestoreRule$1.evaluate(SystemPropertiesRestoreRule.java:57)
	at org.apache.lucene.util.TestRuleSetupTeardownChained$1.evaluate(TestRuleSetupTeardownChained.java:49)
	at org.apache.lucene.util.AbstractBeforeAfterRule$1.evaluate(AbstractBeforeAfterRule.java:45)
	at org.apache.lucene.util.TestRuleThreadAndTestName$1.evaluate(TestRuleThreadAndTestName.java:48)
	at org.apache.lucene.util.TestRuleIgnoreAfterMaxFailures$1.evaluate(TestRuleIgnoreAfterMaxFailures.java:64)
	at org.apache.lucene.util.TestRuleMarkFailure$1.evaluate(TestRuleMarkFailure.java:47)
	at com.carrotsearch.randomizedtesting.rules.StatementAdapter.evaluate(StatementAdapter.java:36)
	at com.carrotsearch.randomizedtesting.ThreadLeakControl$StatementRunner.run(ThreadLeakControl.java:367)
	at com.carrotsearch.randomizedtesting.ThreadLeakControl.forkTimeoutingTask(ThreadLeakControl.java:811)
	at com.carrotsearch.randomizedtesting.ThreadLeakControl$3.evaluate(ThreadLeakControl.java:462)
	at com.carrotsearch.randomizedtesting.RandomizedRunner.runSingleTest(RandomizedRunner.java:916)
	at com.carrotsearch.randomizedtesting.RandomizedRunner$5.evaluate(RandomizedRunner.java:802)
	at com.carrotsearch.randomizedtesting.RandomizedRunner$6.evaluate(RandomizedRunner.java:852)
	at com.carrotsearch.randomizedtesting.RandomizedRunner$7.evaluate(RandomizedRunner.java:863)
	at com.carrotsearch.randomizedtesting.rules.StatementAdapter.evaluate(StatementAdapter.java:36)
	at com.carrotsearch.randomizedtesting.rules.SystemPropertiesRestoreRule$1.evaluate(SystemPropertiesRestoreRule.java:57)
	at org.apache.lucene.util.AbstractBeforeAfterRule$1.evaluate(AbstractBeforeAfterRule.java:45)
	at com.carrotsearch.randomizedtesting.rules.StatementAdapter.evaluate(StatementAdapter.java:36)
	at org.apache.lucene.util.TestRuleStoreClassName$1.evaluate(TestRuleStoreClassName.java:41)
	at com.carrotsearch.randomizedtesting.rules.NoShadowingOrOverridesOnMethodsRule$1.evaluate(NoShadowingOrOverridesOnMethodsRule.java:40)
	at com.carrotsearch.randomizedtesting.rules.NoShadowingOrOverridesOnMethodsRule$1.evaluate(NoShadowingOrOverridesOnMethodsRule.java:40)
	at com.carrotsearch.randomizedtesting.rules.StatementAdapter.evaluate(StatementAdapter.java:36)
	at com.carrotsearch.randomizedtesting.rules.StatementAdapter.evaluate(StatementAdapter.java:36)
	at com.carrotsearch.randomizedtesting.rules.StatementAdapter.evaluate(StatementAdapter.java:36)
	at org.apache.lucene.util.TestRuleAssertionsRequired$1.evaluate(TestRuleAssertionsRequired.java:53)
	at org.apache.lucene.util.TestRuleMarkFailure$1.evaluate(TestRuleMarkFailure.java:47)
	at org.apache.lucene.util.TestRuleIgnoreAfterMaxFailures$1.evaluate(TestRuleIgnoreAfterMaxFailures.java:64)
	at org.apache.lucene.util.TestRuleIgnoreTestSuites$1.evaluate(TestRuleIgnoreTestSuites.java:54)
	at com.carrotsearch.randomizedtesting.rules.StatementAdapter.evaluate(StatementAdapter.java:36)
	at com.carrotsearch.randomizedtesting.ThreadLeakControl$StatementRunner.run(ThreadLeakControl.java:367)
	at java.lang.Thread.run(Thread.java:745)


FAILED:  org.apache.solr.cloud.hdfs.HdfsWriteToMultipleCollectionsTest.test

Error Message:


Stack Trace:
java.lang.AssertionError
	at __randomizedtesting.SeedInfo.seed([9C544F75B30F79F6:140070AF1DF3140E]:0)
	at org.junit.Assert.fail(Assert.java:92)
	at org.junit.Assert.assertTrue(Assert.java:43)
	at org.junit.Assert.assertTrue(Assert.java:54)
	at org.apache.solr.cloud.hdfs.HdfsWriteToMultipleCollectionsTest.test(HdfsWriteToMultipleCollectionsTest.java:137)
	at sun.reflect.NativeMethodAccessorImpl.invoke0(Native Method)
	at sun.reflect.NativeMethodAccessorImpl.invoke(NativeMethodAccessorImpl.java:62)
	at sun.reflect.DelegatingMethodAccessorImpl.invoke(DelegatingMethodAccessorImpl.java:43)
	at java.lang.reflect.Method.invoke(Method.java:498)
	at com.carrotsearch.randomizedtesting.RandomizedRunner.invoke(RandomizedRunner.java:1713)
	at com.carrotsearch.randomizedtesting.RandomizedRunner$8.evaluate(RandomizedRunner.java:907)
	at com.carrotsearch.randomizedtesting.RandomizedRunner$9.evaluate(RandomizedRunner.java:943)
	at com.carrotsearch.randomizedtesting.RandomizedRunner$10.evaluate(RandomizedRunner.java:957)
	at org.apache.solr.BaseDistributedSearchTestCase$ShardsRepeatRule$ShardsFixedStatement.callStatement(BaseDistributedSearchTestCase.java:992)
	at org.apache.solr.BaseDistributedSearchTestCase$ShardsRepeatRule$ShardsStatement.evaluate(BaseDistributedSearchTestCase.java:967)
	at com.carrotsearch.randomizedtesting.rules.SystemPropertiesRestoreRule$1.evaluate(SystemPropertiesRestoreRule.java:57)
	at org.apache.lucene.util.TestRuleSetupTeardownChained$1.evaluate(TestRuleSetupTeardownChained.java:49)
	at org.apache.lucene.util.AbstractBeforeAfterRule$1.evaluate(AbstractBeforeAfterRule.java:45)
	at org.apache.lucene.util.TestRuleThreadAndTestName$1.evaluate(TestRuleThreadAndTestName.java:48)
	at org.apache.lucene.util.TestRuleIgnoreAfterMaxFailures$1.evaluate(TestRuleIgnoreAfterMaxFailures.java:64)
	at org.apache.lucene.util.TestRuleMarkFailure$1.evaluate(TestRuleMarkFailure.java:47)
	at com.carrotsearch.randomizedtesting.rules.StatementAdapter.evaluate(StatementAdapter.java:36)
	at com.carrotsearch.randomizedtesting.ThreadLeakControl$StatementRunner.run(ThreadLeakControl.java:367)
	at com.carrotsearch.randomizedtesting.ThreadLeakControl.forkTimeoutingTask(ThreadLeakControl.java:811)
	at com.carrotsearch.randomizedtesting.ThreadLeakControl$3.evaluate(ThreadLeakControl.java:462)
	at com.carrotsearch.randomizedtesting.RandomizedRunner.runSingleTest(RandomizedRunner.java:916)
	at com.carrotsearch.randomizedtesting.RandomizedRunner$5.evaluate(RandomizedRunner.java:802)
	at com.carrotsearch.randomizedtesting.RandomizedRunner$6.evaluate(RandomizedRunner.java:852)
	at com.carrotsearch.randomizedtesting.RandomizedRunner$7.evaluate(RandomizedRunner.java:863)
	at com.carrotsearch.randomizedtesting.rules.StatementAdapter.evaluate(StatementAdapter.java:36)
	at com.carrotsearch.randomizedtesting.rules.SystemPropertiesRestoreRule$1.evaluate(SystemPropertiesRestoreRule.java:57)
	at org.apache.lucene.util.AbstractBeforeAfterRule$1.evaluate(AbstractBeforeAfterRule.java:45)
	at com.carrotsearch.randomizedtesting.rules.StatementAdapter.evaluate(StatementAdapter.java:36)
	at org.apache.lucene.util.TestRuleStoreClassName$1.evaluate(TestRuleStoreClassName.java:41)
	at com.carrotsearch.randomizedtesting.rules.NoShadowingOrOverridesOnMethodsRule$1.evaluate(NoShadowingOrOverridesOnMethodsRule.java:40)
	at com.carrotsearch.randomizedtesting.rules.NoShadowingOrOverridesOnMethodsRule$1.evaluate(NoShadowingOrOverridesOnMethodsRule.java:40)
	at com.carrotsearch.randomizedtesting.rules.StatementAdapter.evaluate(StatementAdapter.java:36)
	at com.carrotsearch.randomizedtesting.rules.StatementAdapter.evaluate(StatementAdapter.java:36)
	at com.carrotsearch.randomizedtesting.rules.StatementAdapter.evaluate(StatementAdapter.java:36)
	at org.apache.lucene.util.TestRuleAssertionsRequired$1.evaluate(TestRuleAssertionsRequired.java:53)
	at org.apache.lucene.util.TestRuleMarkFailure$1.evaluate(TestRuleMarkFailure.java:47)
	at org.apache.lucene.util.TestRuleIgnoreAfterMaxFailures$1.evaluate(TestRuleIgnoreAfterMaxFailures.java:64)
	at org.apache.lucene.util.TestRuleIgnoreTestSuites$1.evaluate(TestRuleIgnoreTestSuites.java:54)
	at com.carrotsearch.randomizedtesting.rules.StatementAdapter.evaluate(StatementAdapter.java:36)
	at com.carrotsearch.randomizedtesting.ThreadLeakControl$StatementRunner.run(ThreadLeakControl.java:367)
	at java.lang.Thread.run(Thread.java:745)


FAILED:  org.apache.solr.cloud.hdfs.HdfsCollectionsAPIDistributedZkTest.testSpecificConfigsets

Error Message:
KeeperErrorCode = NoNode for /collections/withconfigset2

Stack Trace:
org.apache.zookeeper.KeeperException$NoNodeException: KeeperErrorCode = NoNode for /collections/withconfigset2
	at __randomizedtesting.SeedInfo.seed([9C544F75B30F79F6:B12A002F442BC3FA]:0)
	at org.apache.zookeeper.KeeperException.create(KeeperException.java:111)
	at org.apache.zookeeper.KeeperException.create(KeeperException.java:51)
	at org.apache.zookeeper.ZooKeeper.getData(ZooKeeper.java:1155)
	at org.apache.solr.common.cloud.SolrZkClient$7.execute(SolrZkClient.java:356)
	at org.apache.solr.common.cloud.SolrZkClient$7.execute(SolrZkClient.java:353)
	at org.apache.solr.common.cloud.ZkCmdExecutor.retryOperation(ZkCmdExecutor.java:60)
	at org.apache.solr.common.cloud.SolrZkClient.getData(SolrZkClient.java:353)
	at org.apache.solr.cloud.CollectionsAPIDistributedZkTest.testSpecificConfigsets(CollectionsAPIDistributedZkTest.java:425)
	at sun.reflect.NativeMethodAccessorImpl.invoke0(Native Method)
	at sun.reflect.NativeMethodAccessorImpl.invoke(NativeMethodAccessorImpl.java:62)
	at sun.reflect.DelegatingMethodAccessorImpl.invoke(DelegatingMethodAccessorImpl.java:43)
	at java.lang.reflect.Method.invoke(Method.java:498)
	at com.carrotsearch.randomizedtesting.RandomizedRunner.invoke(RandomizedRunner.java:1713)
	at com.carrotsearch.randomizedtesting.RandomizedRunner$8.evaluate(RandomizedRunner.java:907)
	at com.carrotsearch.randomizedtesting.RandomizedRunner$9.evaluate(RandomizedRunner.java:943)
	at com.carrotsearch.randomizedtesting.RandomizedRunner$10.evaluate(RandomizedRunner.java:957)
	at com.carrotsearch.randomizedtesting.rules.SystemPropertiesRestoreRule$1.evaluate(SystemPropertiesRestoreRule.java:57)
	at org.apache.lucene.util.TestRuleSetupTeardownChained$1.evaluate(TestRuleSetupTeardownChained.java:49)
	at org.apache.lucene.util.AbstractBeforeAfterRule$1.evaluate(AbstractBeforeAfterRule.java:45)
	at org.apache.lucene.util.TestRuleThreadAndTestName$1.evaluate(TestRuleThreadAndTestName.java:48)
	at org.apache.lucene.util.TestRuleIgnoreAfterMaxFailures$1.evaluate(TestRuleIgnoreAfterMaxFailures.java:64)
	at org.apache.lucene.util.TestRuleMarkFailure$1.evaluate(TestRuleMarkFailure.java:47)
	at com.carrotsearch.randomizedtesting.rules.StatementAdapter.evaluate(StatementAdapter.java:36)
	at com.carrotsearch.randomizedtesting.ThreadLeakControl$StatementRunner.run(ThreadLeakControl.java:367)
	at com.carrotsearch.randomizedtesting.ThreadLeakControl.forkTimeoutingTask(ThreadLeakControl.java:811)
	at com.carrotsearch.randomizedtesting.ThreadLeakControl$3.evaluate(ThreadLeakControl.java:462)
	at com.carrotsearch.randomizedtesting.RandomizedRunner.runSingleTest(RandomizedRunner.java:916)
	at com.carrotsearch.randomizedtesting.RandomizedRunner$5.evaluate(RandomizedRunner.java:802)
	at com.carrotsearch.randomizedtesting.RandomizedRunner$6.evaluate(RandomizedRunner.java:852)
	at com.carrotsearch.randomizedtesting.RandomizedRunner$7.evaluate(RandomizedRunner.java:863)
	at com.carrotsearch.randomizedtesting.rules.StatementAdapter.evaluate(StatementAdapter.java:36)
	at com.carrotsearch.randomizedtesting.rules.SystemPropertiesRestoreRule$1.evaluate(SystemPropertiesRestoreRule.java:57)
	at org.apache.lucene.util.AbstractBeforeAfterRule$1.evaluate(AbstractBeforeAfterRule.java:45)
	at com.carrotsearch.randomizedtesting.rules.StatementAdapter.evaluate(StatementAdapter.java:36)
	at org.apache.lucene.util.TestRuleStoreClassName$1.evaluate(TestRuleStoreClassName.java:41)
	at com.carrotsearch.randomizedtesting.rules.NoShadowingOrOverridesOnMethodsRule$1.evaluate(NoShadowingOrOverridesOnMethodsRule.java:40)
	at com.carrotsearch.randomizedtesting.rules.NoShadowingOrOverridesOnMethodsRule$1.evaluate(NoShadowingOrOverridesOnMethodsRule.java:40)
	at com.carrotsearch.randomizedtesting.rules.StatementAdapter.evaluate(StatementAdapter.java:36)
	at com.carrotsearch.randomizedtesting.rules.StatementAdapter.evaluate(StatementAdapter.java:36)
	at com.carrotsearch.randomizedtesting.rules.StatementAdapter.evaluate(StatementAdapter.java:36)
	at org.apache.lucene.util.TestRuleAssertionsRequired$1.evaluate(TestRuleAssertionsRequired.java:53)
	at org.apache.lucene.util.TestRuleMarkFailure$1.evaluate(TestRuleMarkFailure.java:47)
	at org.apache.lucene.util.TestRuleIgnoreAfterMaxFailures$1.evaluate(TestRuleIgnoreAfterMaxFailures.java:64)
	at org.apache.lucene.util.TestRuleIgnoreTestSuites$1.evaluate(TestRuleIgnoreTestSuites.java:54)
	at com.carrotsearch.randomizedtesting.rules.StatementAdapter.evaluate(StatementAdapter.java:36)
	at com.carrotsearch.randomizedtesting.ThreadLeakControl$StatementRunner.run(ThreadLeakControl.java:367)
	at java.lang.Thread.run(Thread.java:745)


FAILED:  org.apache.solr.cloud.hdfs.HdfsCollectionsAPIDistributedZkTest.testCollectionsAPI

Error Message:
Expected to see collection awhollynewcollection_0 null Last available state: DocCollection(awhollynewcollection_0//collections/awhollynewcollection_0/state.json/5)={   "replicationFactor":"1",   "shards":{     "shard1":{       "range":"80000000-bfffffff",       "state":"active",       "replicas":{}},     "shard2":{       "range":"c0000000-ffffffff",       "state":"active",       "replicas":{}},     "shard3":{       "range":"0-3fffffff",       "state":"active",       "replicas":{}},     "shard4":{       "range":"40000000-7fffffff",       "state":"active",       "replicas":{}}},   "router":{"name":"compositeId"},   "maxShardsPerNode":"2",   "autoAddReplicas":"false"}

Stack Trace:
java.lang.AssertionError: Expected to see collection awhollynewcollection_0
null
Last available state: DocCollection(awhollynewcollection_0//collections/awhollynewcollection_0/state.json/5)={
  "replicationFactor":"1",
  "shards":{
    "shard1":{
      "range":"80000000-bfffffff",
      "state":"active",
      "replicas":{}},
    "shard2":{
      "range":"c0000000-ffffffff",
      "state":"active",
      "replicas":{}},
    "shard3":{
      "range":"0-3fffffff",
      "state":"active",
      "replicas":{}},
    "shard4":{
      "range":"40000000-7fffffff",
      "state":"active",
      "replicas":{}}},
  "router":{"name":"compositeId"},
  "maxShardsPerNode":"2",
  "autoAddReplicas":"false"}
	at __randomizedtesting.SeedInfo.seed([9C544F75B30F79F6:D4213BC1B53C5663]:0)
	at org.junit.Assert.fail(Assert.java:93)
	at org.apache.solr.cloud.SolrCloudTestCase.waitForState(SolrCloudTestCase.java:265)
	at org.apache.solr.cloud.CollectionsAPIDistributedZkTest.testCollectionsAPI(CollectionsAPIDistributedZkTest.java:496)
	at sun.reflect.NativeMethodAccessorImpl.invoke0(Native Method)
	at sun.reflect.NativeMethodAccessorImpl.invoke(NativeMethodAccessorImpl.java:62)
	at sun.reflect.DelegatingMethodAccessorImpl.invoke(DelegatingMethodAccessorImpl.java:43)
	at java.lang.reflect.Method.invoke(Method.java:498)
	at com.carrotsearch.randomizedtesting.RandomizedRunner.invoke(RandomizedRunner.java:1713)
	at com.carrotsearch.randomizedtesting.RandomizedRunner$8.evaluate(RandomizedRunner.java:907)
	at com.carrotsearch.randomizedtesting.RandomizedRunner$9.evaluate(RandomizedRunner.java:943)
	at com.carrotsearch.randomizedtesting.RandomizedRunner$10.evaluate(RandomizedRunner.java:957)
	at com.carrotsearch.randomizedtesting.rules.SystemPropertiesRestoreRule$1.evaluate(SystemPropertiesRestoreRule.java:57)
	at org.apache.lucene.util.TestRuleSetupTeardownChained$1.evaluate(TestRuleSetupTeardownChained.java:49)
	at org.apache.lucene.util.AbstractBeforeAfterRule$1.evaluate(AbstractBeforeAfterRule.java:45)
	at org.apache.lucene.util.TestRuleThreadAndTestName$1.evaluate(TestRuleThreadAndTestName.java:48)
	at org.apache.lucene.util.TestRuleIgnoreAfterMaxFailures$1.evaluate(TestRuleIgnoreAfterMaxFailures.java:64)
	at org.apache.lucene.util.TestRuleMarkFailure$1.evaluate(TestRuleMarkFailure.java:47)
	at com.carrotsearch.randomizedtesting.rules.StatementAdapter.evaluate(StatementAdapter.java:36)
	at com.carrotsearch.randomizedtesting.ThreadLeakControl$StatementRunner.run(ThreadLeakControl.java:367)
	at com.carrotsearch.randomizedtesting.ThreadLeakControl.forkTimeoutingTask(ThreadLeakControl.java:811)
	at com.carrotsearch.randomizedtesting.ThreadLeakControl$3.evaluate(ThreadLeakControl.java:462)
	at com.carrotsearch.randomizedtesting.RandomizedRunner.runSingleTest(RandomizedRunner.java:916)
	at com.carrotsearch.randomizedtesting.RandomizedRunner$5.evaluate(RandomizedRunner.java:802)
	at com.carrotsearch.randomizedtesting.RandomizedRunner$6.evaluate(RandomizedRunner.java:852)
	at com.carrotsearch.randomizedtesting.RandomizedRunner$7.evaluate(RandomizedRunner.java:863)
	at com.carrotsearch.randomizedtesting.rules.StatementAdapter.evaluate(StatementAdapter.java:36)
	at com.carrotsearch.randomizedtesting.rules.SystemPropertiesRestoreRule$1.evaluate(SystemPropertiesRestoreRule.java:57)
	at org.apache.lucene.util.AbstractBeforeAfterRule$1.evaluate(AbstractBeforeAfterRule.java:45)
	at com.carrotsearch.randomizedtesting.rules.StatementAdapter.evaluate(StatementAdapter.java:36)
	at org.apache.lucene.util.TestRuleStoreClassName$1.evaluate(TestRuleStoreClassName.java:41)
	at com.carrotsearch.randomizedtesting.rules.NoShadowingOrOverridesOnMethodsRule$1.evaluate(NoShadowingOrOverridesOnMethodsRule.java:40)
	at com.carrotsearch.randomizedtesting.rules.NoShadowingOrOverridesOnMethodsRule$1.evaluate(NoShadowingOrOverridesOnMethodsRule.java:40)
	at com.carrotsearch.randomizedtesting.rules.StatementAdapter.evaluate(StatementAdapter.java:36)
	at com.carrotsearch.randomizedtesting.rules.StatementAdapter.evaluate(StatementAdapter.java:36)
	at com.carrotsearch.randomizedtesting.rules.StatementAdapter.evaluate(StatementAdapter.java:36)
	at org.apache.lucene.util.TestRuleAssertionsRequired$1.evaluate(TestRuleAssertionsRequired.java:53)
	at org.apache.lucene.util.TestRuleMarkFailure$1.evaluate(TestRuleMarkFailure.java:47)
	at org.apache.lucene.util.TestRuleIgnoreAfterMaxFailures$1.evaluate(TestRuleIgnoreAfterMaxFailures.java:64)
	at org.apache.lucene.util.TestRuleIgnoreTestSuites$1.evaluate(TestRuleIgnoreTestSuites.java:54)
	at com.carrotsearch.randomizedtesting.rules.StatementAdapter.evaluate(StatementAdapter.java:36)
	at com.carrotsearch.randomizedtesting.ThreadLeakControl$StatementRunner.run(ThreadLeakControl.java:367)
	at java.lang.Thread.run(Thread.java:745)




Build Log:
[...truncated 12297 lines...]
   [junit4] Suite: org.apache.solr.cloud.CdcrReplicationDistributedZkTest
   [junit4]   2> Creating dataDir: /x1/jenkins/jenkins-slave/workspace/Lucene-Solr-NightlyTests-6.x/checkout/solr/build/solr-core/test/J0/temp/solr.cloud.CdcrReplicationDistributedZkTest_9C544F75B30F79F6-001/init-core-data-001
   [junit4]   2> 331742 INFO  (SUITE-CdcrReplicationDistributedZkTest-seed#[9C544F75B30F79F6]-worker) [    ] o.a.s.SolrTestCaseJ4 Randomized ssl (true) and clientAuth (true) via: @org.apache.solr.util.RandomizeSSL(reason=, value=NaN, ssl=NaN, clientAuth=NaN)
   [junit4]   2> 331743 INFO  (SUITE-CdcrReplicationDistributedZkTest-seed#[9C544F75B30F79F6]-worker) [    ] o.a.s.BaseDistributedSearchTestCase Setting hostContext system property: /_s/o
   [junit4]   2> 331744 INFO  (TEST-CdcrReplicationDistributedZkTest.testOps-seed#[9C544F75B30F79F6]) [    ] o.a.s.c.ZkTestServer STARTING ZK TEST SERVER
   [junit4]   2> 331754 INFO  (Thread-611) [    ] o.a.s.c.ZkTestServer client port:0.0.0.0/0.0.0.0:0
   [junit4]   2> 331755 INFO  (Thread-611) [    ] o.a.s.c.ZkTestServer Starting server
   [junit4]   2> 331855 INFO  (TEST-CdcrReplicationDistributedZkTest.testOps-seed#[9C544F75B30F79F6]) [    ] o.a.s.c.ZkTestServer start zk server on port:44878
   [junit4]   2> 331871 INFO  (TEST-CdcrReplicationDistributedZkTest.testOps-seed#[9C544F75B30F79F6]) [    ] o.a.s.c.AbstractZkTestCase put /x1/jenkins/jenkins-slave/workspace/Lucene-Solr-NightlyTests-6.x/checkout/solr/core/src/test-files/solr/collection1/conf/solrconfig-cdcr.xml to /configs/conf1/solrconfig.xml
   [junit4]   2> 331873 INFO  (TEST-CdcrReplicationDistributedZkTest.testOps-seed#[9C544F75B30F79F6]) [    ] o.a.s.c.AbstractZkTestCase put /x1/jenkins/jenkins-slave/workspace/Lucene-Solr-NightlyTests-6.x/checkout/solr/core/src/test-files/solr/collection1/conf/schema15.xml to /configs/conf1/schema.xml
   [junit4]   2> 331874 INFO  (TEST-CdcrReplicationDistributedZkTest.testOps-seed#[9C544F75B30F79F6]) [    ] o.a.s.c.AbstractZkTestCase put /x1/jenkins/jenkins-slave/workspace/Lucene-Solr-NightlyTests-6.x/checkout/solr/core/src/test-files/solr/collection1/conf/solrconfig.snippet.randomindexconfig.xml to /configs/conf1/solrconfig.snippet.randomindexconfig.xml
   [junit4]   2> 331874 INFO  (TEST-CdcrReplicationDistributedZkTest.testOps-seed#[9C544F75B30F79F6]) [    ] o.a.s.c.AbstractZkTestCase put /x1/jenkins/jenkins-slave/workspace/Lucene-Solr-NightlyTests-6.x/checkout/solr/core/src/test-files/solr/collection1/conf/stopwords.txt to /configs/conf1/stopwords.txt
   [junit4]   2> 331875 INFO  (TEST-CdcrReplicationDistributedZkTest.testOps-seed#[9C544F75B30F79F6]) [    ] o.a.s.c.AbstractZkTestCase put /x1/jenkins/jenkins-slave/workspace/Lucene-Solr-NightlyTests-6.x/checkout/solr/core/src/test-files/solr/collection1/conf/protwords.txt to /configs/conf1/protwords.txt
   [junit4]   2> 331876 INFO  (TEST-CdcrReplicationDistributedZkTest.testOps-seed#[9C544F75B30F79F6]) [    ] o.a.s.c.AbstractZkTestCase put /x1/jenkins/jenkins-slave/workspace/Lucene-Solr-NightlyTests-6.x/checkout/solr/core/src/test-files/solr/collection1/conf/currency.xml to /configs/conf1/currency.xml
   [junit4]   2> 331877 INFO  (TEST-CdcrReplicationDistributedZkTest.testOps-seed#[9C544F75B30F79F6]) [    ] o.a.s.c.AbstractZkTestCase put /x1/jenkins/jenkins-slave/workspace/Lucene-Solr-NightlyTests-6.x/checkout/solr/core/src/test-files/solr/collection1/conf/enumsConfig.xml to /configs/conf1/enumsConfig.xml
   [junit4]   2> 331878 INFO  (TEST-CdcrReplicationDistributedZkTest.testOps-seed#[9C544F75B30F79F6]) [    ] o.a.s.c.AbstractZkTestCase put /x1/jenkins/jenkins-slave/workspace/Lucene-Solr-NightlyTests-6.x/checkout/solr/core/src/test-files/solr/collection1/conf/open-exchange-rates.json to /configs/conf1/open-exchange-rates.json
   [junit4]   2> 331878 INFO  (TEST-CdcrReplicationDistributedZkTest.testOps-seed#[9C544F75B30F79F6]) [    ] o.a.s.c.AbstractZkTestCase put /x1/jenkins/jenkins-slave/workspace/Lucene-Solr-NightlyTests-6.x/checkout/solr/core/src/test-files/solr/collection1/conf/mapping-ISOLatin1Accent.txt to /configs/conf1/mapping-ISOLatin1Accent.txt
   [junit4]   2> 331879 INFO  (TEST-CdcrReplicationDistributedZkTest.testOps-seed#[9C544F75B30F79F6]) [    ] o.a.s.c.AbstractZkTestCase put /x1/jenkins/jenkins-slave/workspace/Lucene-Solr-NightlyTests-6.x/checkout/solr/core/src/test-files/solr/collection1/conf/old_synonyms.txt to /configs/conf1/old_synonyms.txt
   [junit4]   2> 331880 INFO  (TEST-CdcrReplicationDistributedZkTest.testOps-seed#[9C544F75B30F79F6]) [    ] o.a.s.c.AbstractZkTestCase put /x1/jenkins/jenkins-slave/workspace/Lucene-Solr-NightlyTests-6.x/checkout/solr/core/src/test-files/solr/collection1/conf/synonyms.txt to /configs/conf1/synonyms.txt
   [junit4]   2> 331909 INFO  (TEST-CdcrReplicationDistributedZkTest.testOps-seed#[9C544F75B30F79F6]) [    ] o.a.s.SolrTestCaseJ4 ###Starting testOps
   [junit4]   2> 331987 INFO  (TEST-CdcrReplicationDistributedZkTest.testOps-seed#[9C544F75B30F79F6]) [    ] o.a.s.SolrTestCaseJ4 Writing core.properties file to /x1/jenkins/jenkins-slave/workspace/Lucene-Solr-NightlyTests-6.x/checkout/solr/build/solr-core/test/J0/temp/solr.cloud.CdcrReplicationDistributedZkTest_9C544F75B30F79F6-001/jetty-001/cores/collection1
   [junit4]   2> 331991 INFO  (TEST-CdcrReplicationDistributedZkTest.testOps-seed#[9C544F75B30F79F6]) [    ] o.e.j.s.Server jetty-9.3.14.v20161028
   [junit4]   2> 331992 INFO  (TEST-CdcrReplicationDistributedZkTest.testOps-seed#[9C544F75B30F79F6]) [    ] o.e.j.s.h.ContextHandler Started o.e.j.s.ServletContextHandler@5bb40691{/_s/o,null,AVAILABLE}
   [junit4]   2> 331994 INFO  (TEST-CdcrReplicationDistributedZkTest.testOps-seed#[9C544F75B30F79F6]) [    ] o.e.j.s.AbstractConnector Started ServerConnector@7bf315bd{SSL,[ssl, http/1.1]}{127.0.0.1:41142}
   [junit4]   2> 331994 INFO  (TEST-CdcrReplicationDistributedZkTest.testOps-seed#[9C544F75B30F79F6]) [    ] o.e.j.s.Server Started @335213ms
   [junit4]   2> 331994 INFO  (TEST-CdcrReplicationDistributedZkTest.testOps-seed#[9C544F75B30F79F6]) [    ] o.a.s.c.s.e.JettySolrRunner Jetty properties: {shards=shard1, hostContext=/_s/o, hostPort=41142, coreRootDirectory=/x1/jenkins/jenkins-slave/workspace/Lucene-Solr-NightlyTests-6.x/checkout/solr/build/solr-core/test/J0/temp/solr.cloud.CdcrReplicationDistributedZkTest_9C544F75B30F79F6-001/jetty-001/cores}
   [junit4]   2> 331994 ERROR (TEST-CdcrReplicationDistributedZkTest.testOps-seed#[9C544F75B30F79F6]) [    ] o.a.s.s.StartupLoggingUtils Missing Java Option solr.log.dir. Logging may be missing or incomplete.
   [junit4]   2> 331994 INFO  (TEST-CdcrReplicationDistributedZkTest.testOps-seed#[9C544F75B30F79F6]) [    ] o.a.s.s.SolrDispatchFilter  ___      _       Welcome to Apache Solr™ version 6.4.0
   [junit4]   2> 331994 INFO  (TEST-CdcrReplicationDistributedZkTest.testOps-seed#[9C544F75B30F79F6]) [    ] o.a.s.s.SolrDispatchFilter / __| ___| |_ _   Starting in cloud mode on port null
   [junit4]   2> 331995 INFO  (TEST-CdcrReplicationDistributedZkTest.testOps-seed#[9C544F75B30F79F6]) [    ] o.a.s.s.SolrDispatchFilter \__ \/ _ \ | '_|  Install dir: null
   [junit4]   2> 331995 INFO  (TEST-CdcrReplicationDistributedZkTest.testOps-seed#[9C544F75B30F79F6]) [    ] o.a.s.s.SolrDispatchFilter |___/\___/_|_|    Start time: 2017-01-08T11:48:48.919Z
   [junit4]   2> 331997 INFO  (TEST-CdcrReplicationDistributedZkTest.testOps-seed#[9C544F75B30F79F6]) [    ] o.a.s.s.SolrDispatchFilter Loading solr.xml from SolrHome (not found in ZooKeeper)
   [junit4]   2> 331997 INFO  (TEST-CdcrReplicationDistributedZkTest.testOps-seed#[9C544F75B30F79F6]) [    ] o.a.s.c.SolrXmlConfig Loading container configuration from /x1/jenkins/jenkins-slave/workspace/Lucene-Solr-NightlyTests-6.x/checkout/solr/build/solr-core/test/J0/temp/solr.cloud.CdcrReplicationDistributedZkTest_9C544F75B30F79F6-001/jetty-001/solr.xml
   [junit4]   2> 332003 INFO  (TEST-CdcrReplicationDistributedZkTest.testOps-seed#[9C544F75B30F79F6]) [    ] o.a.s.u.UpdateShardHandler Creating UpdateShardHandler HTTP client with params: socketTimeout=340000&connTimeout=45000&retry=true
   [junit4]   2> 332003 INFO  (TEST-CdcrReplicationDistributedZkTest.testOps-seed#[9C544F75B30F79F6]) [    ] o.a.s.c.ZkContainer Zookeeper client=127.0.0.1:44878/solr
   [junit4]   2> 332026 INFO  (TEST-CdcrReplicationDistributedZkTest.testOps-seed#[9C544F75B30F79F6]) [n:127.0.0.1:41142__s%2Fo    ] o.a.s.c.OverseerElectionContext I am going to be the leader 127.0.0.1:41142__s%2Fo
   [junit4]   2> 332027 INFO  (TEST-CdcrReplicationDistributedZkTest.testOps-seed#[9C544F75B30F79F6]) [n:127.0.0.1:41142__s%2Fo    ] o.a.s.c.Overseer Overseer (id=97247305969369093-127.0.0.1:41142__s%2Fo-n_0000000000) starting
   [junit4]   2> 332051 INFO  (TEST-CdcrReplicationDistributedZkTest.testOps-seed#[9C544F75B30F79F6]) [n:127.0.0.1:41142__s%2Fo    ] o.a.s.c.ZkController Register node as live in ZooKeeper:/live_nodes/127.0.0.1:41142__s%2Fo
   [junit4]   2> 332052 INFO  (zkCallback-350-thread-1-processing-n:127.0.0.1:41142__s%2Fo) [n:127.0.0.1:41142__s%2Fo    ] o.a.s.c.c.ZkStateReader Updated live nodes from ZooKeeper... (0) -> (1)
   [junit4]   2> 332096 INFO  (TEST-CdcrReplicationDistributedZkTest.testOps-seed#[9C544F75B30F79F6]) [n:127.0.0.1:41142__s%2Fo    ] o.a.s.c.CorePropertiesLocator Found 1 core definitions underneath /x1/jenkins/jenkins-slave/workspace/Lucene-Solr-NightlyTests-6.x/checkout/solr/build/solr-core/test/J0/temp/solr.cloud.CdcrReplicationDistributedZkTest_9C544F75B30F79F6-001/jetty-001/cores
   [junit4]   2> 332096 INFO  (TEST-CdcrReplicationDistributedZkTest.testOps-seed#[9C544F75B30F79F6]) [n:127.0.0.1:41142__s%2Fo    ] o.a.s.c.CorePropertiesLocator Cores are: [collection1]
   [junit4]   2> 332115 INFO  (OverseerStateUpdate-97247305969369093-127.0.0.1:41142__s%2Fo-n_0000000000) [n:127.0.0.1:41142__s%2Fo    ] o.a.s.c.o.ReplicaMutator Assigning new node to shard shard=shard2
   [junit4]   2> 332124 INFO  (coreLoadExecutor-1030-thread-1-processing-n:127.0.0.1:41142__s%2Fo) [n:127.0.0.1:41142__s%2Fo c:tmp_collection   x:collection1] o.a.s.c.CreateCollectionCmd Only one config set found in zk - using it:conf1
   [junit4]   2> 332137 INFO  (coreLoadExecutor-1030-thread-1-processing-n:127.0.0.1:41142__s%2Fo) [n:127.0.0.1:41142__s%2Fo c:tmp_collection   x:collection1] o.a.s.c.SolrConfig Using Lucene MatchVersion: 6.4.0
   [junit4]   2> 332146 INFO  (coreLoadExecutor-1030-thread-1-processing-n:127.0.0.1:41142__s%2Fo) [n:127.0.0.1:41142__s%2Fo c:tmp_collection   x:collection1] o.a.s.s.IndexSchema [collection1] Schema name=test
   [junit4]   2> 332288 WARN  (coreLoadExecutor-1030-thread-1-processing-n:127.0.0.1:41142__s%2Fo) [n:127.0.0.1:41142__s%2Fo c:tmp_collection   x:collection1] o.a.s.s.IndexSchema [collection1] default search field in schema is text. WARNING: Deprecated, please use 'df' on request instead.
   [junit4]   2> 332289 INFO  (coreLoadExecutor-1030-thread-1-processing-n:127.0.0.1:41142__s%2Fo) [n:127.0.0.1:41142__s%2Fo c:tmp_collection   x:collection1] o.a.s.s.IndexSchema Loaded schema test/1.6 with uniqueid field id
   [junit4]   2> 332309 INFO  (coreLoadExecutor-1030-thread-1-processing-n:127.0.0.1:41142__s%2Fo) [n:127.0.0.1:41142__s%2Fo c:tmp_collection   x:collection1] o.a.s.c.CoreContainer Creating SolrCore 'collection1' using configuration from collection tmp_collection
   [junit4]   2> 332309 INFO  (coreLoadExecutor-1030-thread-1-processing-n:127.0.0.1:41142__s%2Fo) [n:127.0.0.1:41142__s%2Fo c:tmp_collection   x:collection1] o.a.s.c.SolrCore [[collection1] ] Opening new SolrCore at [/x1/jenkins/jenkins-slave/workspace/Lucene-Solr-NightlyTests-6.x/checkout/solr/build/solr-core/test/J0/temp/solr.cloud.CdcrReplicationDistributedZkTest_9C544F75B30F79F6-001/jetty-001/cores/collection1], dataDir=[/x1/jenkins/jenkins-slave/workspace/Lucene-Solr-NightlyTests-6.x/checkout/solr/build/solr-core/test/J0/temp/solr.cloud.CdcrReplicationDistributedZkTest_9C544F75B30F79F6-001/jetty-001/cores/collection1/data/]
   [junit4]   2> 332309 INFO  (coreLoadExecutor-1030-thread-1-processing-n:127.0.0.1:41142__s%2Fo) [n:127.0.0.1:41142__s%2Fo c:tmp_collection   x:collection1] o.a.s.c.JmxMonitoredMap JMX monitoring is enabled. Adding Solr mbeans to JMX Server: com.sun.jmx.mbeanserver.JmxMBeanServer@60def400
   [junit4]   2> 332310 INFO  (coreLoadExecutor-1030-thread-1-processing-n:127.0.0.1:41142__s%2Fo) [n:127.0.0.1:41142__s%2Fo c:tmp_collection   x:collection1] o.a.s.u.RandomMergePolicy RandomMergePolicy wrapping class org.apache.lucene.index.TieredMergePolicy: [TieredMergePolicy: maxMergeAtOnce=35, maxMergeAtOnceExplicit=45, maxMergedSegmentMB=90.5546875, floorSegmentMB=0.796875, forceMergeDeletesPctAllowed=21.103255837142616, segmentsPerTier=2.0, maxCFSSegmentSizeMB=8.796093022207999E12, noCFSRatio=0.5880345511071456
   [junit4]   2> 332366 INFO  (coreLoadExecutor-1030-thread-1-processing-n:127.0.0.1:41142__s%2Fo) [n:127.0.0.1:41142__s%2Fo c:tmp_collection   x:collection1] o.a.s.u.UpdateHandler Using UpdateLog implementation: org.apache.solr.update.CdcrUpdateLog
   [junit4]   2> 332366 INFO  (coreLoadExecutor-1030-thread-1-processing-n:127.0.0.1:41142__s%2Fo) [n:127.0.0.1:41142__s%2Fo c:tmp_collection   x:collection1] o.a.s.u.UpdateLog Initializing UpdateLog: dataDir= defaultSyncLevel=FLUSH numRecordsToKeep=100 maxNumLogsToKeep=10 numVersionBuckets=65536
   [junit4]   2> 332366 INFO  (coreLoadExecutor-1030-thread-1-processing-n:127.0.0.1:41142__s%2Fo) [n:127.0.0.1:41142__s%2Fo c:tmp_collection   x:collection1] o.a.s.u.CommitTracker Hard AutoCommit: disabled
   [junit4]   2> 332366 INFO  (coreLoadExecutor-1030-thread-1-processing-n:127.0.0.1:41142__s%2Fo) [n:127.0.0.1:41142__s%2Fo c:tmp_collection   x:collection1] o.a.s.u.CommitTracker Soft AutoCommit: disabled
   [junit4]   2> 332367 INFO  (coreLoadExecutor-1030-thread-1-processing-n:127.0.0.1:41142__s%2Fo) [n:127.0.0.1:41142__s%2Fo c:tmp_collection   x:collection1] o.a.s.u.RandomMergePolicy RandomMergePolicy wrapping class org.apache.lucene.index.TieredMergePolicy: [TieredMergePolicy: maxMergeAtOnce=34, maxMergeAtOnceExplicit=10, maxMergedSegmentMB=69.6923828125, floorSegmentMB=1.2529296875, forceMergeDeletesPctAllowed=29.220472234281342, segmentsPerTier=5.0, maxCFSSegmentSizeMB=2.125, noCFSRatio=0.0
   [junit4]   2> 332367 INFO  (coreLoadExecutor-1030-thread-1-processing-n:127.0.0.1:41142__s%2Fo) [n:127.0.0.1:41142__s%2Fo c:tmp_collection   x:collection1] o.a.s.s.SolrIndexSearcher Opening [Searcher@13be8f12[collection1] main]
   [junit4]   2> 332368 INFO  (coreLoadExecutor-1030-thread-1-processing-n:127.0.0.1:41142__s%2Fo) [n:127.0.0.1:41142__s%2Fo c:tmp_collection   x:collection1] o.a.s.r.ManagedResourceStorage Configured ZooKeeperStorageIO with znodeBase: /configs/conf1
   [junit4]   2> 332369 INFO  (coreLoadExecutor-1030-thread-1-processing-n:127.0.0.1:41142__s%2Fo) [n:127.0.0.1:41142__s%2Fo c:tmp_collection   x:collection1] o.a.s.r.ManagedResourceStorage Loaded null at path _rest_managed.json using ZooKeeperStorageIO:path=/configs/conf1
   [junit4]   2> 332369 INFO  (coreLoadExecutor-1030-thread-1-processing-n:127.0.0.1:41142__s%2Fo) [n:127.0.0.1:41142__s%2Fo c:tmp_collection   x:collection1] o.a.s.h.ReplicationHandler Commits will be reserved for  10000
   [junit4]   2> 332373 INFO  (coreLoadExecutor-1030-thread-1-processing-n:127.0.0.1:41142__s%2Fo) [n:127.0.0.1:41142__s%2Fo c:tmp_collection   x:collection1] o.a.s.h.CdcrBufferStateManager Created znode /collections/tmp_collection/cdcr/state/buffer
   [junit4]   2> 332375 INFO  (coreLoadExecutor-1030-thread-1-processing-n:127.0.0.1:41142__s%2Fo) [n:127.0.0.1:41142__s%2Fo c:tmp_collection   x:collection1] o.a.s.h.CdcrProcessStateManager Created znode /collections/tmp_collection/cdcr/state/process
   [junit4]   2> 332389 INFO  (searcherExecutor-1031-thread-1-processing-n:127.0.0.1:41142__s%2Fo x:collection1 c:tmp_collection) [n:127.0.0.1:41142__s%2Fo c:tmp_collection   x:collection1] o.a.s.c.SolrCore [collection1] Registered new searcher Searcher@13be8f12[collection1] main{ExitableDirectoryReader(UninvertingDirectoryReader())}
   [junit4]   2> 332390 INFO  (coreLoadExecutor-1030-thread-1-processing-n:127.0.0.1:41142__s%2Fo) [n:127.0.0.1:41142__s%2Fo c:tmp_collection   x:collection1] o.a.s.u.UpdateLog Could not find max version in index or recent updates, using new clock 1555956896171556864
   [junit4]   2> 332396 INFO  (coreZkRegister-1023-thread-1-processing-n:127.0.0.1:41142__s%2Fo x:collection1 c:tmp_collection) [n:127.0.0.1:41142__s%2Fo c:tmp_collection s:shard2 r:core_node1 x:collection1] o.a.s.c.ShardLeaderElectionContext Enough replicas found to continue.
   [junit4]   2> 332396 INFO  (coreZkRegister-1023-thread-1-processing-n:127.0.0.1:41142__s%2Fo x:collection1 c:tmp_collection) [n:127.0.0.1:41142__s%2Fo c:tmp_collection s:shard2 r:core_node1 x:collection1] o.a.s.c.ShardLeaderElectionContext I may be the new leader - try and sync
   [junit4]   2> 332396 INFO  (coreZkRegister-1023-thread-1-processing-n:127.0.0.1:41142__s%2Fo x:collection1 c:tmp_collection) [n:127.0.0.1:41142__s%2Fo c:tmp_collection s:shard2 r:core_node1 x:collection1] o.a.s.c.SyncStrategy Sync replicas to https://127.0.0.1:41142/_s/o/collection1/
   [junit4]   2> 332396 INFO  (coreZkRegister-1023-thread-1-processing-n:127.0.0.1:41142__s%2Fo x:collection1 c:tmp_collection) [n:127.0.0.1:41142__s%2Fo c:tmp_collection s:shard2 r:core_node1 x:collection1] o.a.s.c.SyncStrategy Sync Success - now sync replicas to me
   [junit4]   2> 332396 INFO  (coreZkRegister-1023-thread-1-processing-n:127.0.0.1:41142__s%2Fo x:collection1 c:tmp_collection) [n:127.0.0.1:41142__s%2Fo c:tmp_collection s:shard2 r:core_node1 x:collection1] o.a.s.c.SyncStrategy https://127.0.0.1:41142/_s/o/collection1/ has no replicas
   [junit4]   2> 332399 INFO  (coreZkRegister-1023-thread-1-processing-n:127.0.0.1:41142__s%2Fo x:collection1 c:tmp_collection) [n:127.0.0.1:41142__s%2Fo c:tmp_collection s:shard2 r:core_node1 x:collection1] o.a.s.c.ShardLeaderElectionContext I am the new leader: https://127.0.0.1:41142/_s/o/collection1/ shard2
   [junit4]   2> 332400 INFO  (zkCallback-350-thread-3-processing-n:127.0.0.1:41142__s%2Fo) [n:127.0.0.1:41142__s%2Fo    ] o.a.s.h.CdcrLeaderStateManager Received new leader state @ tmp_collection:shard2
   [junit4]   2> 332549 INFO  (coreZkRegister-1023-thread-1-processing-n:127.0.0.1:41142__s%2Fo x:collection1 c:tmp_collection) [n:127.0.0.1:41142__s%2Fo c:tmp_collection s:shard2 r:core_node1 x:collection1] o.a.s.c.ZkController I am the leader, no recovery necessary
   [junit4]   2> 332891 INFO  (TEST-CdcrReplicationDistributedZkTest.testOps-seed#[9C544F75B30F79F6]) [    ] o.a.s.SolrTestCaseJ4 Writing core.properties file to /x1/jenkins/jenkins-slave/workspace/Lucene-Solr-NightlyTests-6.x/checkout/solr/build/solr-core/test/J0/temp/solr.cloud.CdcrReplicationDistributedZkTest_9C544F75B30F79F6-001/jetty-002/cores/collection1
   [junit4]   2> 332893 INFO  (TEST-CdcrReplicationDistributedZkTest.testOps-seed#[9C544F75B30F79F6]) [    ] o.e.j.s.Server jetty-9.3.14.v20161028
   [junit4]   2> 332896 INFO  (TEST-CdcrReplicationDistributedZkTest.testOps-seed#[9C544F75B30F79F6]) [    ] o.e.j.s.h.ContextHandler Started o.e.j.s.ServletContextHandler@f95fc7a{/_s/o,null,AVAILABLE}
   [junit4]   2> 332898 INFO  (TEST-CdcrReplicationDistributedZkTest.testOps-seed#[9C544F75B30F79F6]) [    ] o.e.j.s.AbstractConnector Started ServerConnector@2b47dd0a{SSL,[ssl, http/1.1]}{127.0.0.1:39798}
   [junit4]   2> 332898 INFO  (TEST-CdcrReplicationDistributedZkTest.testOps-seed#[9C544F75B30F79F6]) [    ] o.e.j.s.Server Started @336117ms
   [junit4]   2> 332898 INFO  (TEST-CdcrReplicationDistributedZkTest.testOps-seed#[9C544F75B30F79F6]) [    ] o.a.s.c.s.e.JettySolrRunner Jetty properties: {shards=shard2, hostContext=/_s/o, hostPort=39798, coreRootDirectory=/x1/jenkins/jenkins-slave/workspace/Lucene-Solr-NightlyTests-6.x/checkout/solr/build/solr-core/test/J0/temp/solr.cloud.CdcrReplicationDistributedZkTest_9C544F75B30F79F6-001/jetty-002/cores}
   [junit4]   2> 332898 ERROR (TEST-CdcrReplicationDistributedZkTest.testOps-seed#[9C544F75B30F79F6]) [    ] o.a.s.s.StartupLoggingUtils Missing Java Option solr.log.dir. Logging may be missing or incomplete.
   [junit4]   2> 332906 INFO  (TEST-CdcrReplicationDistributedZkTest.testOps-seed#[9C544F75B30F79F6]) [    ] o.a.s.s.SolrDispatchFilter  ___      _       Welcome to Apache Solr™ version 6.4.0
   [junit4]   2> 332906 INFO  (TEST-CdcrReplicationDistributedZkTest.testOps-seed#[9C544F75B30F79F6]) [    ] o.a.s.s.SolrDispatchFilter / __| ___| |_ _   Starting in cloud mode on port null
   [junit4]   2> 332907 INFO  (TEST-CdcrReplicationDistributedZkTest.testOps-seed#[9C544F75B30F79F6]) [    ] o.a.s.s.SolrDispatchFilter \__ \/ _ \ | '_|  Install dir: null
   [junit4]   2> 332907 INFO  (TEST-CdcrReplicationDistributedZkTest.testOps-seed#[9C544F75B30F79F6]) [    ] o.a.s.s.SolrDispatchFilter |___/\___/_|_|    Start time: 2017-01-08T11:48:49.831Z
   [junit4]   2> 332919 INFO  (TEST-CdcrReplicationDistributedZkTest.testOps-seed#[9C544F75B30F79F6]) [    ] o.a.s.s.SolrDispatchFilter Loading solr.xml from SolrHome (not found in ZooKeeper)
   [junit4]   2> 332919 INFO  (TEST-CdcrReplicationDistributedZkTest.testOps-seed#[9C544F75B30F79F6]) [    ] o.a.s.c.SolrXmlConfig Loading container configuration from /x1/jenkins/jenkins-slave/workspace/Lucene-Solr-NightlyTests-6.x/checkout/solr/build/solr-core/test/J0/temp/solr.cloud.CdcrReplicationDistributedZkTest_9C544F75B30F79F6-001/jetty-002/solr.xml
   [junit4]   2> 332939 INFO  (TEST-CdcrReplicationDistributedZkTest.testOps-seed#[9C544F75B30F79F6]) [    ] o.a.s.u.UpdateShardHandler Creating UpdateShardHandler HTTP client with params: socketTimeout=340000&connTimeout=45000&retry=true
   [junit4]   2> 332940 INFO  (TEST-CdcrReplicationDistributedZkTest.testOps-seed#[9C544F75B30F79F6]) [    ] o.a.s.c.ZkContainer Zookeeper client=127.0.0.1:44878/solr
   [junit4]   2> 332946 INFO  (TEST-CdcrReplicationDistributedZkTest.testOps-seed#[9C544F75B30F79F6]) [n:127.0.0.1:39798__s%2Fo    ] o.a.s.c.c.ZkStateReader Updated live nodes from ZooKeeper... (0) -> (1)
   [junit4]   2> 332949 INFO  (TEST-CdcrReplicationDistributedZkTest.testOps-seed#[9C544F75B30F79F6]) [n:127.0.0.1:39798__s%2Fo    ] o.a.s.c.ZkController Register node as live in ZooKeeper:/live_nodes/127.0.0.1:39798__s%2Fo
   [junit4]   2> 332954 INFO  (zkCallback-350-thread-1-processing-n:127.0.0.1:41142__s%2Fo) [n:127.0.0.1:41142__s%2Fo    ] o.a.s.c.c.ZkStateReader Updated live nodes from ZooKeeper... (1) -> (2)
   [junit4]   2> 332955 INFO  (zkCallback-356-thread-1-processing-n:127.0.0.1:39798__s%2Fo) [n:127.0.0.1:39798__s%2Fo    ] o.a.s.c.c.ZkStateReader Updated live nodes from ZooKeeper... (1) -> (2)
   [junit4]   2> 332984 INFO  (TEST-CdcrReplicationDistributedZkTest.testOps-seed#[9C544F75B30F79F6]) [n:127.0.0.1:39798__s%2Fo    ] o.a.s.c.CorePropertiesLocator Found 1 core definitions underneath /x1/jenkins/jenkins-slave/workspace/Lucene-Solr-NightlyTests-6.x/checkout/solr/build/solr-core/test/J0/temp/solr.cloud.CdcrReplicationDistributedZkTest_9C544F75B30F79F6-001/jetty-002/cores
   [junit4]   2> 332984 INFO  (TEST-CdcrReplicationDistributedZkTest.testOps-seed#[9C544F75B30F79F6]) [n:127.0.0.1:39798__s%2Fo    ] o.a.s.c.CorePropertiesLocator Cores are: [collection1]
   [junit4]   2> 332986 INFO  (OverseerStateUpdate-97247305969369093-127.0.0.1:41142__s%2Fo-n_0000000000) [n:127.0.0.1:41142__s%2Fo    ] o.a.s.c.o.ReplicaMutator Assigning new node to shard shard=shard1
   [junit4]   2> 334014 INFO  (coreLoadExecutor-1042-thread-1-processing-n:127.0.0.1:39798__s%2Fo) [n:127.0.0.1:39798__s%2Fo c:tmp_collection   x:collection1] o.a.s.c.SolrConfig Using Lucene MatchVersion: 6.4.0
   [junit4]   2> 334023 INFO  (coreLoadExecutor-1042-thread-1-processing-n:127.0.0.1:39798__s%2Fo) [n:127.0.0.1:39798__s%2Fo c:tmp_collection   x:collection1] o.a.s.s.IndexSchema [collection1] Schema name=test
   [junit4]   2> 334088 WARN  (coreLoadExecutor-1042-thread-1-processing-n:127.0.0.1:39798__s%2Fo) [n:127.0.0.1:39798__s%2Fo c:tmp_collection   x:collection1] o.a.s.s.IndexSchema [collection1] default search field in schema is text. WARNING: Deprecated, please use 'df' on request instead.
   [junit4]   2> 334089 INFO  (coreLoadExecutor-1042-thread-1-processing-n:127.0.0.1:39798__s%2Fo) [n:127.0.0.1:39798__s%2Fo c:tmp_collection   x:collection1] o.a.s.s.IndexSchema Loaded schema test/1.6 with uniqueid field id
   [junit4]   2> 334098 INFO  (coreLoadExecutor-1042-thread-1-processing-n:127.0.0.1:39798__s%2Fo) [n:127.0.0.1:39798__s%2Fo c:tmp_collection   x:collection1] o.a.s.c.CoreContainer Creating SolrCore 'collection1' using configuration from collection tmp_collection
   [junit4]   2> 334099 INFO  (coreLoadExecutor-1042-thread-1-processing-n:127.0.0.1:39798__s%2Fo) [n:127.0.0.1:39798__s%2Fo c:tmp_collection   x:collection1] o.a.s.c.SolrCore [[collection1] ] Opening new SolrCore at [/x1/jenkins/jenkins-slave/workspace/Lucene-Solr-NightlyTests-6.x/checkout/solr/build/solr-core/test/J0/temp/solr.cloud.CdcrReplicationDistributedZkTest_9C544F75B30F79F6-001/jetty-002/cores/collection1], dataDir=[/x1/jenkins/jenkins-slave/workspace/Lucene-Solr-NightlyTests-6.x/checkout/solr/build/solr-core/test/J0/temp/solr.cloud.CdcrReplicationDistributedZkTest_9C544F75B30F79F6-001/jetty-002/cores/collection1/data/]
   [junit4]   2> 334099 INFO  (coreLoadExecutor-1042-thread-1-processing-n:127.0.0.1:39798__s%2Fo) [n:127.0.0.1:39798__s%2Fo c:tmp_collection   x:collection1] o.a.s.c.JmxMonitoredMap JMX monitoring is enabled. Adding Solr mbeans to JMX Server: com.sun.jmx.mbeanserver.JmxMBeanServer@60def400
   [junit4]   2> 334100 INFO  (coreLoadExecutor-1042-thread-1-processing-n:127.0.0.1:39798__s%2Fo) [n:127.0.0.1:39798__s%2Fo c:tmp_collection   x:collection1] o.a.s.u.RandomMergePolicy RandomMergePolicy wrapping class org.apache.lucene.index.TieredMergePolicy: [TieredMergePolicy: maxMergeAtOnce=35, maxMergeAtOnceExplicit=45, maxMergedSegmentMB=90.5546875, floorSegmentMB=0.796875, forceMergeDeletesPctAllowed=21.103255837142616, segmentsPerTier=2.0, maxCFSSegmentSizeMB=8.796093022207999E12, noCFSRatio=0.5880345511071456
   [junit4]   2> 334115 INFO  (coreLoadExecutor-1042-thread-1-processing-n:127.0.0.1:39798__s%2Fo) [n:127.0.0.1:39798__s%2Fo c:tmp_collection   x:collection1] o.a.s.u.UpdateHandler Using UpdateLog implementation: org.apache.solr.update.CdcrUpdateLog
   [junit4]   2> 334115 INFO  (coreLoadExecutor-1042-thread-1-processing-n:127.0.0.1:39798__s%2Fo) [n:127.0.0.1:39798__s%2Fo c:tmp_collection   x:collection1] o.a.s.u.UpdateLog Initializing UpdateLog: dataDir= defaultSyncLevel=FLUSH numRecordsToKeep=100 maxNumLogsToKeep=10 numVersionBuckets=65536
   [junit4]   2> 334115 INFO  (coreLoadExecutor-1042-thread-1-processing-n:127.0.0.1:39798__s%2Fo) [n:127.0.0.1:39798__s%2Fo c:tmp_collection   x:collection1] o.a.s.u.CommitTracker Hard AutoCommit: disabled
   [junit4]   2> 334115 INFO  (coreLoadExecutor-1042-thread-1-processing-n:127.0.0.1:39798__s%2Fo) [n:127.0.0.1:39798__s%2Fo c:tmp_collection   x:collection1] o.a.s.u.CommitTracker Soft AutoCommit: disabled
   [junit4]   2> 334119 INFO  (coreLoadExecutor-1042-thread-1-processing-n:127.0.0.1:39798__s%2Fo) [n:127.0.0.1:39798__s%2Fo c:tmp_collection   x:collection1] o.a.s.u.RandomMergePolicy RandomMergePolicy wrapping class org.apache.lucene.index.TieredMergePolicy: [TieredMergePolicy: maxMergeAtOnce=34, maxMergeAtOnceExplicit=10, maxMergedSegmentMB=69.6923828125, floorSegmentMB=1.2529296875, forceMergeDeletesPctAllowed=29.220472234281342, segmentsPerTier=5.0, maxCFSSegmentSizeMB=2.125, noCFSRatio=0.0
   [junit4]   2> 334119 INFO  (coreLoadExecutor-1042-thread-1-processing-n:127.0.0.1:39798__s%2Fo) [n:127.0.0.1:39798__s%2Fo c:tmp_collection   x:collection1] o.a.s.s.SolrIndexSearcher Opening [Searcher@61d46c09[collection1] main]
   [junit4]   2> 334120 INFO  (coreLoadExecutor-1042-thread-1-processing-n:127.0.0.1:39798__s%2Fo) [n:127.0.0.1:39798__s%2Fo c:tmp_collection   x:collection1] o.a.s.r.ManagedResourceStorage Configured ZooKeeperStorageIO with znodeBase: /configs/conf1
   [junit4]   2> 334120 INFO  (coreLoadExecutor-1042-thread-1-processing-n:127.0.0.1:39798__s%2Fo) [n:127.0.0.1:39798__s%2Fo c:tmp_collection   x:collection1] o.a.s.r.ManagedResourceStorage Loaded null at path _rest_managed.json using ZooKeeperStorageIO:path=/configs/conf1
   [junit4]   2> 334120 INFO  (coreLoadExecutor-1042-thread-1-processing-n:127.0.0.1:39798__s%2Fo) [n:127.0.0.1:39798__s%2Fo c:tmp_collection   x:collection1] o.a.s.h.ReplicationHandler Commits will be reserved for  10000
   [junit4]   2> 334121 INFO  (coreLoadExecutor-1042-thread-1-processing-n:127.0.0.1:39798__s%2Fo) [n:127.0.0.1:39798__s%2Fo c:tmp_collection   x:collection1] o.a.s.u.UpdateLog Could not find max version in index or recent updates, using new clock 1555956897986641920
   [junit4]   2> 334123 INFO  (searcherExecutor-1043-thread-1-processing-n:127.0.0.1:39798__s%2Fo x:collection1 c:tmp_collection) [n:127.0.0.1:39798__s%2Fo c:tmp_collection   x:collection1] o.a.s.c.SolrCore [collection1] Registered new searcher Searcher@61d46c09[collection1] main{ExitableDirectoryReader(UninvertingDirectoryReader())}
   [junit4]   2> 334127 INFO  (coreZkRegister-1037-thread-1-processing-n:127.0.0.1:39798__s%2Fo x:collection1 c:tmp_collection) [n:127.0.0.1:39798__s%2Fo c:tmp_collection s:shard1 r:core_node2 x:collection1] o.a.s.c.ShardLeaderElectionContext Enough replicas found to continue.
   [junit4]   2> 334127 INFO  (coreZkRegister-1037-thread-1-processing-n:127.0.0.1:39798__s%2Fo x:collection1 c:tmp_collection) [n:127.0.0.1:39798__s%2Fo c:tmp_collection s:shard1 r:core_node2 x:collection1] o.a.s.c.ShardLeaderElectionContext I may be the new leader - try and sync
   [junit4]   2> 334127 INFO  (coreZkRegister-1037-thread-1-processing-n:127.0.0.1:39798__s%2Fo x:collection1 c:tmp_collection) [n:127.0.0.1:39798__s%2Fo c:tmp_collection s:shard1 r:core_node2 x:collection1] o.a.s.c.SyncStrategy Sync replicas to https://127.0.0.1:39798/_s/o/collection1/
   [junit4]   2> 334127 INFO  (coreZkRegister-1037-thread-1-processing-n:127.0.0.1:39798__s%2Fo x:collection1 c:tmp_collection) [n:127.0.0.1:39798__s%2Fo c:tmp_collection s:shard1 r:core_node2 x:collection1] o.a.s.c.SyncStrategy Sync Success - now sync replicas to me
   [junit4]   2> 334127 INFO  (coreZkRegister-1037-thread-1-processing-n:127.0.0.1:39798__s%2Fo x:collection1 c:tmp_collection) [n:127.0.0.1:39798__s%2Fo c:tmp_collection s:shard1 r:core_node2 x:collection1] o.a.s.c.SyncStrategy https://127.0.0.1:39798/_s/o/collection1/ has no replicas
   [junit4]   2> 334129 INFO  (zkCallback-356-thread-1-processing-n:127.0.0.1:39798__s%2Fo) [n:127.0.0.1:39798__s%2Fo    ] o.a.s.h.CdcrLeaderStateManager Received new leader state @ tmp_collection:shard1
   [junit4]   2> 334137 INFO  (coreZkRegister-1037-thread-1-processing-n:127.0.0.1:39798__s%2Fo x:collection1 c:tmp_collection) [n:127.0.0.1:39798__s%2Fo c:tmp_collection s:shard1 r:core_node2 x:collection1] o.a.s.c.ShardLeaderElectionContext I am the new leader: https://127.0.0.1:39798/_s/o/collection1/ shard1
   [junit4]   2> 334288 INFO  (coreZkRegister-1037-thread-1-processing-n:127.0.0.1:39798__s%2Fo x:collection1 c:tmp_collection) [n:127.0.0.1:39798__s%2Fo c:tmp_collection s:shard1 r:core_node2 x:collection1] o.a.s.c.ZkController I am the leader, no recovery necessary
   [junit4]   2> 334641 INFO  (TEST-CdcrReplicationDistributedZkTest.testOps-seed#[9C544F75B30F79F6]) [    ] o.a.s.SolrTestCaseJ4 Writing core.properties file to /x1/jenkins/jenkins-slave/workspace/Lucene-Solr-NightlyTests-6.x/checkout/solr/build/solr-core/test/J0/temp/solr.cloud.CdcrReplicationDistributedZkTest_9C544F75B30F79F6-001/jetty-003/cores/collection1
   [junit4]   2> 334643 INFO  (TEST-CdcrReplicationDistributedZkTest.testOps-seed#[9C544F75B30F79F6]) [    ] o.e.j.s.Server jetty-9.3.14.v20161028
   [junit4]   2> 334647 INFO  (TEST-CdcrReplicationDistributedZkTest.testOps-seed#[9C544F75B30F79F6]) [    ] o.e.j.s.h.ContextHandler Started o.e.j.s.ServletContextHandler@bb30577{/_s/o,null,AVAILABLE}
   [junit4]   2> 334649 INFO  (TEST-CdcrReplicationDistributedZkTest.testOps-seed#[9C544F75B30F79F6]) [    ] o.e.j.s.AbstractConnector Started ServerConnector@1a33ba9e{SSL,[ssl, http/1.1]}{127.0.0.1:35821}
   [junit4]   2> 334649 INFO  (TEST-CdcrReplicationDistributedZkTest.testOps-seed#[9C544F75B30F79F6]) [    ] o.e.j.s.Server Started @337868ms
   [junit4]   2> 334649 INFO  (TEST-CdcrReplicationDistributedZkTest.testOps-seed#[9C544F75B30F79F6]) [    ] o.a.s.c.s.e.JettySolrRunner Jetty properties: {shards=shard3, hostContext=/_s/o, hostPort=35821, coreRootDirectory=/x1/jenkins/jenkins-slave/workspace/Lucene-Solr-NightlyTests-6.x/checkout/solr/build/solr-core/test/J0/temp/solr.cloud.CdcrReplicationDistributedZkTest_9C544F75B30F79F6-001/jetty-003/cores}
   [junit4]   2> 334649 ERROR (TEST-CdcrReplicationDistributedZkTest.testOps-seed#[9C544F75B30F79F6]) [    ] o.a.s.s.StartupLoggingUtils Missing Java Option solr.log.dir. Logging may be missing or incomplete.
   [junit4]   2> 334651 INFO  (TEST-CdcrReplicationDistributedZkTest.testOps-seed#[9C544F75B30F79F6]) [    ] o.a.s.s.SolrDispatchFilter  ___      _       Welcome to Apache Solr™ version 6.4.0
   [junit4]   2> 334651 INFO  (TEST-CdcrReplicationDistributedZkTest.testOps-seed#[9C544F75B30F79F6]) [    ] o.a.s.s.SolrDispatchFilter / __| ___| |_ _   Starting in cloud mode on port null
   [junit4]   2> 334651 INFO  (TEST-CdcrReplicationDistributedZkTest.testOps-seed#[9C544F75B30F79F6]) [    ] o.a.s.s.SolrDispatchFilter \__ \/ _ \ | '_|  Install dir: null
   [junit4]   2> 334651 INFO  (TEST-CdcrReplicationDistributedZkTest.testOps-seed#[9C544F75B30F79F6]) [    ] o.a.s.s.SolrDispatchFilter |___/\___/_|_|    Start time: 2017-01-08T11:48:51.575Z
   [junit4]   2> 334657 INFO  (TEST-CdcrReplicationDistributedZkTest.testOps-seed#[9C544F75B30F79F6]) [    ] o.a.s.s.SolrDispatchFilter Loading solr.xml from SolrHome (not found in ZooKeeper)
   [junit4]   2> 334657 INFO  (TEST-CdcrReplicationDistributedZkTest.testOps-seed#[9C544F75B30F79F6]) [    ] o.a.s.c.SolrXmlConfig Loading container configuration from /x1/jenkins/jenkins-slave/workspace/Lucene-Solr-NightlyTests-6.x/checkout/solr/build/solr-core/test/J0/temp/solr.cloud.CdcrReplicationDistributedZkTest_9C544F75B30F79F6-001/jetty-003/solr.xml
   [junit4]   2> 334666 INFO  (TEST-CdcrReplicationDistributedZkTest.testOps-seed#[9C544F75B30F79F6]) [    ] o.a.s.u.UpdateShardHandler Creating UpdateShardHandler HTTP client with params: socketTimeout=340000&connTimeout=45000&retry=true
   [junit4]   2> 334667 INFO  (TEST-CdcrReplicationDistributedZkTest.testOps-seed#[9C544F75B30F79F6]) [    ] o.a.s.c.ZkContainer Zookeeper client=127.0.0.1:44878/solr
   [junit4]   2> 334675 INFO  (TEST-CdcrReplicationDistributedZkTest.testOps-seed#[9C544F75B30F79F6]) [n:127.0.0.1:35821__s%2Fo    ] o.a.s.c.c.ZkStateReader Updated live nodes from ZooKeeper... (0) -> (2)
   [junit4]   2> 334678 INFO  (TEST-CdcrReplicationDistributedZkTest.testOps-seed#[9C544F75B30F79F6]) [n:127.0.0.1:35821__s%2Fo    ] o.a.s.c.ZkController Register node as live in ZooKeeper:/live_nodes/127.0.0.1:35821__s%2Fo
   [junit4]   2> 334679 INFO  (zkCallback-350-thread-2-processing-n:127.0.0.1:41142__s%2Fo) [n:127.0.0.1:41142__s%2Fo    ] o.a.s.c.c.ZkStateReader Updated live nodes from ZooKeeper... (2) -> (3)
   [junit4]   2> 334679 INFO  (zkCallback-356-thread-1-processing-n:127.0.0.1:39798__s%2Fo) [n:127.0.0.1:39798__s%2Fo    ] o.a.s.c.c.ZkStateReader Updated live nodes from ZooKeeper... (2) -> (3)
   [junit4]   2> 334691 INFO  (zkCallback-362-thread-1-processing-n:127.0.0.1:35821__s%2Fo) [n:127.0.0.1:35821__s%2Fo    ] o.a.s.c.c.ZkStateReader Updated live nodes from ZooKeeper... (2) -> (3)
   [junit4]   2> 334730 INFO  (TEST-CdcrReplicationDistributedZkTest.testOps-seed#[9C544F75B30F79F6]) [n:127.0.0.1:35821__s%2Fo    ] o.a.s.c.CorePropertiesLocator Found 1 core definitions underneath /x1/jenkins/jenkins-slave/workspace/Lucene-Solr-NightlyTests-6.x/checkout/solr/build/solr-core/test/J0/temp/solr.cloud.CdcrReplicationDistributedZkTest_9C544F75B30F79F6-001/jetty-003/cores
   [junit4]   2> 334730 INFO  (TEST-CdcrReplicationDistributedZkTest.testOps-seed#[9C544F75B30F79F6]) [n:127.0.0.1:35821__s%2Fo   

[...truncated too long message...]

.m.log Stopped HttpServer2$SelectChannelConnectorWithSafeStartup@localhost:0
   [junit4]   2> 4324700 ERROR (SUITE-HdfsCollectionsAPIDistributedZkTest-seed#[9C544F75B30F79F6]-worker) [    ] o.a.h.m.l.MethodMetric Error invoking method getBlocksTotal
   [junit4]   2> java.lang.reflect.InvocationTargetException
   [junit4]   2> 	at sun.reflect.NativeMethodAccessorImpl.invoke0(Native Method)
   [junit4]   2> 	at sun.reflect.NativeMethodAccessorImpl.invoke(NativeMethodAccessorImpl.java:62)
   [junit4]   2> 	at sun.reflect.DelegatingMethodAccessorImpl.invoke(DelegatingMethodAccessorImpl.java:43)
   [junit4]   2> 	at java.lang.reflect.Method.invoke(Method.java:498)
   [junit4]   2> 	at org.apache.hadoop.metrics2.lib.MethodMetric$2.snapshot(MethodMetric.java:111)
   [junit4]   2> 	at org.apache.hadoop.metrics2.lib.MethodMetric.snapshot(MethodMetric.java:144)
   [junit4]   2> 	at org.apache.hadoop.metrics2.lib.MetricsRegistry.snapshot(MetricsRegistry.java:401)
   [junit4]   2> 	at org.apache.hadoop.metrics2.lib.MetricsSourceBuilder$1.getMetrics(MetricsSourceBuilder.java:79)
   [junit4]   2> 	at org.apache.hadoop.metrics2.impl.MetricsSourceAdapter.getMetrics(MetricsSourceAdapter.java:194)
   [junit4]   2> 	at org.apache.hadoop.metrics2.impl.MetricsSourceAdapter.updateJmxCache(MetricsSourceAdapter.java:172)
   [junit4]   2> 	at org.apache.hadoop.metrics2.impl.MetricsSourceAdapter.getMBeanInfo(MetricsSourceAdapter.java:151)
   [junit4]   2> 	at com.sun.jmx.interceptor.DefaultMBeanServerInterceptor.getClassName(DefaultMBeanServerInterceptor.java:1804)
   [junit4]   2> 	at com.sun.jmx.interceptor.DefaultMBeanServerInterceptor.safeGetClassName(DefaultMBeanServerInterceptor.java:1595)
   [junit4]   2> 	at com.sun.jmx.interceptor.DefaultMBeanServerInterceptor.checkMBeanPermission(DefaultMBeanServerInterceptor.java:1813)
   [junit4]   2> 	at com.sun.jmx.interceptor.DefaultMBeanServerInterceptor.exclusiveUnregisterMBean(DefaultMBeanServerInterceptor.java:430)
   [junit4]   2> 	at com.sun.jmx.interceptor.DefaultMBeanServerInterceptor.unregisterMBean(DefaultMBeanServerInterceptor.java:415)
   [junit4]   2> 	at com.sun.jmx.mbeanserver.JmxMBeanServer.unregisterMBean(JmxMBeanServer.java:546)
   [junit4]   2> 	at org.apache.hadoop.metrics2.util.MBeans.unregister(MBeans.java:81)
   [junit4]   2> 	at org.apache.hadoop.metrics2.impl.MetricsSourceAdapter.stopMBeans(MetricsSourceAdapter.java:226)
   [junit4]   2> 	at org.apache.hadoop.metrics2.impl.MetricsSourceAdapter.stop(MetricsSourceAdapter.java:211)
   [junit4]   2> 	at org.apache.hadoop.metrics2.impl.MetricsSystemImpl.stopSources(MetricsSystemImpl.java:463)
   [junit4]   2> 	at org.apache.hadoop.metrics2.impl.MetricsSystemImpl.stop(MetricsSystemImpl.java:213)
   [junit4]   2> 	at org.apache.hadoop.metrics2.impl.MetricsSystemImpl.shutdown(MetricsSystemImpl.java:594)
   [junit4]   2> 	at org.apache.hadoop.metrics2.lib.DefaultMetricsSystem.shutdownInstance(DefaultMetricsSystem.java:72)
   [junit4]   2> 	at org.apache.hadoop.metrics2.lib.DefaultMetricsSystem.shutdown(DefaultMetricsSystem.java:68)
   [junit4]   2> 	at org.apache.hadoop.hdfs.server.namenode.metrics.NameNodeMetrics.shutdown(NameNodeMetrics.java:171)
   [junit4]   2> 	at org.apache.hadoop.hdfs.server.namenode.NameNode.stop(NameNode.java:872)
   [junit4]   2> 	at org.apache.hadoop.hdfs.MiniDFSCluster.shutdown(MiniDFSCluster.java:1726)
   [junit4]   2> 	at org.apache.hadoop.hdfs.MiniDFSCluster.shutdown(MiniDFSCluster.java:1705)
   [junit4]   2> 	at org.apache.solr.cloud.hdfs.HdfsTestUtil.teardownClass(HdfsTestUtil.java:198)
   [junit4]   2> 	at org.apache.solr.cloud.hdfs.HdfsCollectionsAPIDistributedZkTest.teardownClass(HdfsCollectionsAPIDistributedZkTest.java:52)
   [junit4]   2> 	at sun.reflect.NativeMethodAccessorImpl.invoke0(Native Method)
   [junit4]   2> 	at sun.reflect.NativeMethodAccessorImpl.invoke(NativeMethodAccessorImpl.java:62)
   [junit4]   2> 	at sun.reflect.DelegatingMethodAccessorImpl.invoke(DelegatingMethodAccessorImpl.java:43)
   [junit4]   2> 	at java.lang.reflect.Method.invoke(Method.java:498)
   [junit4]   2> 	at com.carrotsearch.randomizedtesting.RandomizedRunner.invoke(RandomizedRunner.java:1713)
   [junit4]   2> 	at com.carrotsearch.randomizedtesting.RandomizedRunner$7.evaluate(RandomizedRunner.java:870)
   [junit4]   2> 	at com.carrotsearch.randomizedtesting.rules.StatementAdapter.evaluate(StatementAdapter.java:36)
   [junit4]   2> 	at com.carrotsearch.randomizedtesting.rules.SystemPropertiesRestoreRule$1.evaluate(SystemPropertiesRestoreRule.java:57)
   [junit4]   2> 	at org.apache.lucene.util.AbstractBeforeAfterRule$1.evaluate(AbstractBeforeAfterRule.java:45)
   [junit4]   2> 	at com.carrotsearch.randomizedtesting.rules.StatementAdapter.evaluate(StatementAdapter.java:36)
   [junit4]   2> 	at org.apache.lucene.util.TestRuleStoreClassName$1.evaluate(TestRuleStoreClassName.java:41)
   [junit4]   2> 	at com.carrotsearch.randomizedtesting.rules.NoShadowingOrOverridesOnMethodsRule$1.evaluate(NoShadowingOrOverridesOnMethodsRule.java:40)
   [junit4]   2> 	at com.carrotsearch.randomizedtesting.rules.NoShadowingOrOverridesOnMethodsRule$1.evaluate(NoShadowingOrOverridesOnMethodsRule.java:40)
   [junit4]   2> 	at com.carrotsearch.randomizedtesting.rules.StatementAdapter.evaluate(StatementAdapter.java:36)
   [junit4]   2> 	at com.carrotsearch.randomizedtesting.rules.StatementAdapter.evaluate(StatementAdapter.java:36)
   [junit4]   2> 	at com.carrotsearch.randomizedtesting.rules.StatementAdapter.evaluate(StatementAdapter.java:36)
   [junit4]   2> 	at org.apache.lucene.util.TestRuleAssertionsRequired$1.evaluate(TestRuleAssertionsRequired.java:53)
   [junit4]   2> 	at org.apache.lucene.util.TestRuleMarkFailure$1.evaluate(TestRuleMarkFailure.java:47)
   [junit4]   2> 	at org.apache.lucene.util.TestRuleIgnoreAfterMaxFailures$1.evaluate(TestRuleIgnoreAfterMaxFailures.java:64)
   [junit4]   2> 	at org.apache.lucene.util.TestRuleIgnoreTestSuites$1.evaluate(TestRuleIgnoreTestSuites.java:54)
   [junit4]   2> 	at com.carrotsearch.randomizedtesting.rules.StatementAdapter.evaluate(StatementAdapter.java:36)
   [junit4]   2> 	at com.carrotsearch.randomizedtesting.ThreadLeakControl$StatementRunner.run(ThreadLeakControl.java:367)
   [junit4]   2> 	at java.lang.Thread.run(Thread.java:745)
   [junit4]   2> Caused by: java.lang.NullPointerException
   [junit4]   2> 	at org.apache.hadoop.hdfs.server.blockmanagement.BlocksMap.size(BlocksMap.java:203)
   [junit4]   2> 	at org.apache.hadoop.hdfs.server.blockmanagement.BlockManager.getTotalBlocks(BlockManager.java:3370)
   [junit4]   2> 	at org.apache.hadoop.hdfs.server.namenode.FSNamesystem.getBlocksTotal(FSNamesystem.java:5729)
   [junit4]   2> 	... 54 more
   [junit4]   2> 4324705 INFO  (SUITE-HdfsCollectionsAPIDistributedZkTest-seed#[9C544F75B30F79F6]-worker) [    ] o.a.s.c.ZkTestServer connecting to 127.0.0.1:52094 52094
   [junit4]   2> 4324705 INFO  (SUITE-HdfsCollectionsAPIDistributedZkTest-seed#[9C544F75B30F79F6]-worker) [    ] o.a.s.SolrTestCaseJ4 ###deleteCore
   [junit4]   2> NOTE: leaving temporary files on disk at: /x1/jenkins/jenkins-slave/workspace/Lucene-Solr-NightlyTests-6.x/checkout/solr/build/solr-core/test/J0/temp/solr.cloud.hdfs.HdfsCollectionsAPIDistributedZkTest_9C544F75B30F79F6-001
   [junit4]   2> Jan 08, 2017 12:55:21 PM com.carrotsearch.randomizedtesting.ThreadLeakControl checkThreadLeaks
   [junit4]   2> WARNING: Will linger awaiting termination of 34 leaked thread(s).
   [junit4]   2> NOTE: test params are: codec=Lucene62, sim=RandomSimilarity(queryNorm=true,coord=crazy): {}, locale=zh-HK, timezone=Australia/Darwin
   [junit4]   2> NOTE: Linux 3.13.0-85-generic amd64/Oracle Corporation 1.8.0_102 (64-bit)/cpus=4,threads=1,free=400279280,total=514326528
   [junit4]   2> NOTE: All tests run in this JVM: [BlockDirectoryTest, TestBulkSchemaConcurrent, ZkNodePropsTest, NumericFieldsTest, TestManagedSchemaAPI, DirectoryFactoryTest, TestSolrCloudWithSecureImpersonation, TestDynamicFieldResource, TestJmxIntegration, SyncSliceTest, SolrMetricManagerTest, TestMinMaxOnMultiValuedField, DistributedVersionInfoTest, TestReRankQParserPlugin, TestPerFieldSimilarity, TestNRTOpen, CoreMergeIndexesAdminHandlerTest, BasicAuthIntegrationTest, CursorPagingTest, TestPKIAuthenticationPlugin, UUIDUpdateProcessorFallbackTest, RegexBoostProcessorTest, TestReplicaProperties, ReturnFieldsTest, TestSearcherReuse, TestCustomDocTransformer, FastVectorHighlighterTest, ReplaceNodeTest, MetricUtilsTest, TestScoreJoinQPScore, ActionThrottleTest, SuggestComponentContextFilterQueryTest, TestFastWriter, HdfsLockFactoryTest, JavabinLoaderTest, CdcrReplicationDistributedZkTest, TestStressRecovery, DateRangeFieldTest, TestAtomicUpdateErrorCases, TestRestManager, TestPseudoReturnFields, BadCopyFieldTest, DisMaxRequestHandlerTest, HdfsBasicDistributedZkTest, TestGraphMLResponseWriter, RollingRestartTest, TestCloudRecovery, TestIntervalFaceting, CreateCollectionCleanupTest, TestPHPSerializedResponseWriter, TestSolr4Spatial2, RequiredFieldsTest, ConcurrentDeleteAndCreateCollectionTest, TestBinaryResponseWriter, ZkStateReaderTest, HttpSolrCallGetCoreTest, TestQuerySenderNoQuery, TestReplicationHandler, OverriddenZkACLAndCredentialsProvidersTest, TestRTimerTree, TestImplicitCoreProperties, CurrencyFieldOpenExchangeTest, FileBasedSpellCheckerTest, DistributedQueryComponentOptimizationTest, HdfsThreadLeakTest, TestLazyCores, DistributedFacetPivotSmallTest, QueryEqualityTest, AsyncCallRequestStatusResponseTest, TestHdfsUpdateLog, SignatureUpdateProcessorFactoryTest, TestDownShardTolerantSearch, ExternalFileFieldSortTest, TestEmbeddedSolrServerConstructors, TestAddFieldRealTimeGet, TestRemoteStreaming, TestMissingGroups, TestSubQueryTransformerDistrib, DateFieldTest, ReplicaListTransformerTest, DistributedSpellCheckComponentTest, TestDocSet, HdfsCollectionsAPIDistributedZkTest]
   [junit4] Completed [653/678 (4!)] on J0 in 256.33s, 20 tests, 3 failures, 5 errors <<< FAILURES!

[...truncated 62536 lines...]



Mime
View raw message