lucene-dev mailing list archives

Site index · List index
Message view « Date » · « Thread »
Top « Date » · « Thread »
From Policeman Jenkins Server <jenk...@thetaphi.de>
Subject [JENKINS] Lucene-Solr-master-Linux (32bit/jdk1.8.0_112) - Build # 18697 - Unstable!
Date Wed, 04 Jan 2017 18:38:26 GMT
Build: https://jenkins.thetaphi.de/job/Lucene-Solr-master-Linux/18697/
Java: 32bit/jdk1.8.0_112 -server -XX:+UseSerialGC

1 tests failed.
FAILED:  org.apache.solr.cloud.PeerSyncReplicationTest.test

Error Message:
timeout waiting to see all nodes active

Stack Trace:
java.lang.AssertionError: timeout waiting to see all nodes active
	at __randomizedtesting.SeedInfo.seed([8376DD186AA9128B:B22E2C2C4557F73]:0)
	at org.junit.Assert.fail(Assert.java:93)
	at org.apache.solr.cloud.PeerSyncReplicationTest.waitTillNodesActive(PeerSyncReplicationTest.java:311)
	at org.apache.solr.cloud.PeerSyncReplicationTest.bringUpDeadNodeAndEnsureNoReplication(PeerSyncReplicationTest.java:262)
	at org.apache.solr.cloud.PeerSyncReplicationTest.forceNodeFailureAndDoPeerSync(PeerSyncReplicationTest.java:244)
	at org.apache.solr.cloud.PeerSyncReplicationTest.test(PeerSyncReplicationTest.java:133)
	at sun.reflect.NativeMethodAccessorImpl.invoke0(Native Method)
	at sun.reflect.NativeMethodAccessorImpl.invoke(NativeMethodAccessorImpl.java:62)
	at sun.reflect.DelegatingMethodAccessorImpl.invoke(DelegatingMethodAccessorImpl.java:43)
	at java.lang.reflect.Method.invoke(Method.java:498)
	at com.carrotsearch.randomizedtesting.RandomizedRunner.invoke(RandomizedRunner.java:1713)
	at com.carrotsearch.randomizedtesting.RandomizedRunner$8.evaluate(RandomizedRunner.java:907)
	at com.carrotsearch.randomizedtesting.RandomizedRunner$9.evaluate(RandomizedRunner.java:943)
	at com.carrotsearch.randomizedtesting.RandomizedRunner$10.evaluate(RandomizedRunner.java:957)
	at org.apache.solr.BaseDistributedSearchTestCase$ShardsRepeatRule$ShardsFixedStatement.callStatement(BaseDistributedSearchTestCase.java:985)
	at org.apache.solr.BaseDistributedSearchTestCase$ShardsRepeatRule$ShardsStatement.evaluate(BaseDistributedSearchTestCase.java:960)
	at com.carrotsearch.randomizedtesting.rules.SystemPropertiesRestoreRule$1.evaluate(SystemPropertiesRestoreRule.java:57)
	at org.apache.lucene.util.TestRuleSetupTeardownChained$1.evaluate(TestRuleSetupTeardownChained.java:49)
	at org.apache.lucene.util.AbstractBeforeAfterRule$1.evaluate(AbstractBeforeAfterRule.java:45)
	at org.apache.lucene.util.TestRuleThreadAndTestName$1.evaluate(TestRuleThreadAndTestName.java:48)
	at org.apache.lucene.util.TestRuleIgnoreAfterMaxFailures$1.evaluate(TestRuleIgnoreAfterMaxFailures.java:64)
	at org.apache.lucene.util.TestRuleMarkFailure$1.evaluate(TestRuleMarkFailure.java:47)
	at com.carrotsearch.randomizedtesting.rules.StatementAdapter.evaluate(StatementAdapter.java:36)
	at com.carrotsearch.randomizedtesting.ThreadLeakControl$StatementRunner.run(ThreadLeakControl.java:367)
	at com.carrotsearch.randomizedtesting.ThreadLeakControl.forkTimeoutingTask(ThreadLeakControl.java:811)
	at com.carrotsearch.randomizedtesting.ThreadLeakControl$3.evaluate(ThreadLeakControl.java:462)
	at com.carrotsearch.randomizedtesting.RandomizedRunner.runSingleTest(RandomizedRunner.java:916)
	at com.carrotsearch.randomizedtesting.RandomizedRunner$5.evaluate(RandomizedRunner.java:802)
	at com.carrotsearch.randomizedtesting.RandomizedRunner$6.evaluate(RandomizedRunner.java:852)
	at com.carrotsearch.randomizedtesting.RandomizedRunner$7.evaluate(RandomizedRunner.java:863)
	at com.carrotsearch.randomizedtesting.rules.StatementAdapter.evaluate(StatementAdapter.java:36)
	at com.carrotsearch.randomizedtesting.rules.SystemPropertiesRestoreRule$1.evaluate(SystemPropertiesRestoreRule.java:57)
	at org.apache.lucene.util.AbstractBeforeAfterRule$1.evaluate(AbstractBeforeAfterRule.java:45)
	at com.carrotsearch.randomizedtesting.rules.StatementAdapter.evaluate(StatementAdapter.java:36)
	at org.apache.lucene.util.TestRuleStoreClassName$1.evaluate(TestRuleStoreClassName.java:41)
	at com.carrotsearch.randomizedtesting.rules.NoShadowingOrOverridesOnMethodsRule$1.evaluate(NoShadowingOrOverridesOnMethodsRule.java:40)
	at com.carrotsearch.randomizedtesting.rules.NoShadowingOrOverridesOnMethodsRule$1.evaluate(NoShadowingOrOverridesOnMethodsRule.java:40)
	at com.carrotsearch.randomizedtesting.rules.StatementAdapter.evaluate(StatementAdapter.java:36)
	at com.carrotsearch.randomizedtesting.rules.StatementAdapter.evaluate(StatementAdapter.java:36)
	at com.carrotsearch.randomizedtesting.rules.StatementAdapter.evaluate(StatementAdapter.java:36)
	at org.apache.lucene.util.TestRuleAssertionsRequired$1.evaluate(TestRuleAssertionsRequired.java:53)
	at org.apache.lucene.util.TestRuleMarkFailure$1.evaluate(TestRuleMarkFailure.java:47)
	at org.apache.lucene.util.TestRuleIgnoreAfterMaxFailures$1.evaluate(TestRuleIgnoreAfterMaxFailures.java:64)
	at org.apache.lucene.util.TestRuleIgnoreTestSuites$1.evaluate(TestRuleIgnoreTestSuites.java:54)
	at com.carrotsearch.randomizedtesting.rules.StatementAdapter.evaluate(StatementAdapter.java:36)
	at com.carrotsearch.randomizedtesting.ThreadLeakControl$StatementRunner.run(ThreadLeakControl.java:367)
	at java.lang.Thread.run(Thread.java:745)




Build Log:
[...truncated 11117 lines...]
   [junit4] Suite: org.apache.solr.cloud.PeerSyncReplicationTest
   [junit4]   2> Creating dataDir: /home/jenkins/workspace/Lucene-Solr-master-Linux/solr/build/solr-core/test/J0/temp/solr.cloud.PeerSyncReplicationTest_8376DD186AA9128B-001/init-core-data-001
   [junit4]   2> 232554 INFO  (SUITE-PeerSyncReplicationTest-seed#[8376DD186AA9128B]-worker) [    ] o.a.s.SolrTestCaseJ4 Randomized ssl (true) and clientAuth (true) via: @org.apache.solr.util.RandomizeSSL(reason=, ssl=NaN, value=NaN, clientAuth=NaN)
   [junit4]   2> 232555 INFO  (SUITE-PeerSyncReplicationTest-seed#[8376DD186AA9128B]-worker) [    ] o.a.s.BaseDistributedSearchTestCase Setting hostContext system property: /aqd/uf
   [junit4]   2> 232557 INFO  (TEST-PeerSyncReplicationTest.test-seed#[8376DD186AA9128B]) [    ] o.a.s.c.ZkTestServer STARTING ZK TEST SERVER
   [junit4]   2> 232557 INFO  (Thread-287) [    ] o.a.s.c.ZkTestServer client port:0.0.0.0/0.0.0.0:0
   [junit4]   2> 232557 INFO  (Thread-287) [    ] o.a.s.c.ZkTestServer Starting server
   [junit4]   2> 232657 INFO  (TEST-PeerSyncReplicationTest.test-seed#[8376DD186AA9128B]) [    ] o.a.s.c.ZkTestServer start zk server on port:41790
   [junit4]   2> 232665 INFO  (TEST-PeerSyncReplicationTest.test-seed#[8376DD186AA9128B]) [    ] o.a.s.c.AbstractZkTestCase put /home/jenkins/workspace/Lucene-Solr-master-Linux/solr/core/src/test-files/solr/collection1/conf/solrconfig-tlog.xml to /configs/conf1/solrconfig.xml
   [junit4]   2> 232666 INFO  (TEST-PeerSyncReplicationTest.test-seed#[8376DD186AA9128B]) [    ] o.a.s.c.AbstractZkTestCase put /home/jenkins/workspace/Lucene-Solr-master-Linux/solr/core/src/test-files/solr/collection1/conf/schema.xml to /configs/conf1/schema.xml
   [junit4]   2> 232667 INFO  (TEST-PeerSyncReplicationTest.test-seed#[8376DD186AA9128B]) [    ] o.a.s.c.AbstractZkTestCase put /home/jenkins/workspace/Lucene-Solr-master-Linux/solr/core/src/test-files/solr/collection1/conf/solrconfig.snippet.randomindexconfig.xml to /configs/conf1/solrconfig.snippet.randomindexconfig.xml
   [junit4]   2> 232668 INFO  (TEST-PeerSyncReplicationTest.test-seed#[8376DD186AA9128B]) [    ] o.a.s.c.AbstractZkTestCase put /home/jenkins/workspace/Lucene-Solr-master-Linux/solr/core/src/test-files/solr/collection1/conf/stopwords.txt to /configs/conf1/stopwords.txt
   [junit4]   2> 232668 INFO  (TEST-PeerSyncReplicationTest.test-seed#[8376DD186AA9128B]) [    ] o.a.s.c.AbstractZkTestCase put /home/jenkins/workspace/Lucene-Solr-master-Linux/solr/core/src/test-files/solr/collection1/conf/protwords.txt to /configs/conf1/protwords.txt
   [junit4]   2> 232669 INFO  (TEST-PeerSyncReplicationTest.test-seed#[8376DD186AA9128B]) [    ] o.a.s.c.AbstractZkTestCase put /home/jenkins/workspace/Lucene-Solr-master-Linux/solr/core/src/test-files/solr/collection1/conf/currency.xml to /configs/conf1/currency.xml
   [junit4]   2> 232669 INFO  (TEST-PeerSyncReplicationTest.test-seed#[8376DD186AA9128B]) [    ] o.a.s.c.AbstractZkTestCase put /home/jenkins/workspace/Lucene-Solr-master-Linux/solr/core/src/test-files/solr/collection1/conf/enumsConfig.xml to /configs/conf1/enumsConfig.xml
   [junit4]   2> 232670 INFO  (TEST-PeerSyncReplicationTest.test-seed#[8376DD186AA9128B]) [    ] o.a.s.c.AbstractZkTestCase put /home/jenkins/workspace/Lucene-Solr-master-Linux/solr/core/src/test-files/solr/collection1/conf/open-exchange-rates.json to /configs/conf1/open-exchange-rates.json
   [junit4]   2> 232670 INFO  (TEST-PeerSyncReplicationTest.test-seed#[8376DD186AA9128B]) [    ] o.a.s.c.AbstractZkTestCase put /home/jenkins/workspace/Lucene-Solr-master-Linux/solr/core/src/test-files/solr/collection1/conf/mapping-ISOLatin1Accent.txt to /configs/conf1/mapping-ISOLatin1Accent.txt
   [junit4]   2> 232671 INFO  (TEST-PeerSyncReplicationTest.test-seed#[8376DD186AA9128B]) [    ] o.a.s.c.AbstractZkTestCase put /home/jenkins/workspace/Lucene-Solr-master-Linux/solr/core/src/test-files/solr/collection1/conf/old_synonyms.txt to /configs/conf1/old_synonyms.txt
   [junit4]   2> 232672 INFO  (TEST-PeerSyncReplicationTest.test-seed#[8376DD186AA9128B]) [    ] o.a.s.c.AbstractZkTestCase put /home/jenkins/workspace/Lucene-Solr-master-Linux/solr/core/src/test-files/solr/collection1/conf/synonyms.txt to /configs/conf1/synonyms.txt
   [junit4]   2> 232741 INFO  (TEST-PeerSyncReplicationTest.test-seed#[8376DD186AA9128B]) [    ] o.a.s.SolrTestCaseJ4 Writing core.properties file to /home/jenkins/workspace/Lucene-Solr-master-Linux/solr/build/solr-core/test/J0/temp/solr.cloud.PeerSyncReplicationTest_8376DD186AA9128B-001/control-001/cores/collection1
   [junit4]   2> 232743 INFO  (TEST-PeerSyncReplicationTest.test-seed#[8376DD186AA9128B]) [    ] o.e.j.s.Server jetty-9.3.14.v20161028
   [junit4]   2> 232744 INFO  (TEST-PeerSyncReplicationTest.test-seed#[8376DD186AA9128B]) [    ] o.e.j.s.h.ContextHandler Started o.e.j.s.ServletContextHandler@fe1efe{/aqd/uf,null,AVAILABLE}
   [junit4]   2> 232746 INFO  (TEST-PeerSyncReplicationTest.test-seed#[8376DD186AA9128B]) [    ] o.e.j.s.AbstractConnector Started ServerConnector@123856e{SSL,[ssl, http/1.1]}{127.0.0.1:43788}
   [junit4]   2> 232746 INFO  (TEST-PeerSyncReplicationTest.test-seed#[8376DD186AA9128B]) [    ] o.e.j.s.Server Started @234575ms
   [junit4]   2> 232746 INFO  (TEST-PeerSyncReplicationTest.test-seed#[8376DD186AA9128B]) [    ] o.a.s.c.s.e.JettySolrRunner Jetty properties: {solr.data.dir=/home/jenkins/workspace/Lucene-Solr-master-Linux/solr/build/solr-core/test/J0/temp/solr.cloud.PeerSyncReplicationTest_8376DD186AA9128B-001/tempDir-001/control/data, hostContext=/aqd/uf, hostPort=43788, coreRootDirectory=/home/jenkins/workspace/Lucene-Solr-master-Linux/solr/build/solr-core/test/J0/temp/solr.cloud.PeerSyncReplicationTest_8376DD186AA9128B-001/control-001/cores}
   [junit4]   2> 232746 ERROR (TEST-PeerSyncReplicationTest.test-seed#[8376DD186AA9128B]) [    ] o.a.s.s.StartupLoggingUtils Missing Java Option solr.log.dir. Logging may be missing or incomplete.
   [junit4]   2> 232746 INFO  (TEST-PeerSyncReplicationTest.test-seed#[8376DD186AA9128B]) [    ] o.a.s.s.SolrDispatchFilter  ___      _       Welcome to Apache Solr? version 7.0.0
   [junit4]   2> 232746 INFO  (TEST-PeerSyncReplicationTest.test-seed#[8376DD186AA9128B]) [    ] o.a.s.s.SolrDispatchFilter / __| ___| |_ _   Starting in cloud mode on port null
   [junit4]   2> 232747 INFO  (TEST-PeerSyncReplicationTest.test-seed#[8376DD186AA9128B]) [    ] o.a.s.s.SolrDispatchFilter \__ \/ _ \ | '_|  Install dir: null
   [junit4]   2> 232747 INFO  (TEST-PeerSyncReplicationTest.test-seed#[8376DD186AA9128B]) [    ] o.a.s.s.SolrDispatchFilter |___/\___/_|_|    Start time: 2017-01-04T18:02:20.119Z
   [junit4]   2> 232749 INFO  (TEST-PeerSyncReplicationTest.test-seed#[8376DD186AA9128B]) [    ] o.a.s.s.SolrDispatchFilter Loading solr.xml from SolrHome (not found in ZooKeeper)
   [junit4]   2> 232749 INFO  (TEST-PeerSyncReplicationTest.test-seed#[8376DD186AA9128B]) [    ] o.a.s.c.SolrXmlConfig Loading container configuration from /home/jenkins/workspace/Lucene-Solr-master-Linux/solr/build/solr-core/test/J0/temp/solr.cloud.PeerSyncReplicationTest_8376DD186AA9128B-001/control-001/solr.xml
   [junit4]   2> 232758 INFO  (TEST-PeerSyncReplicationTest.test-seed#[8376DD186AA9128B]) [    ] o.a.s.c.ZkContainer Zookeeper client=127.0.0.1:41790/solr
   [junit4]   2> 232771 INFO  (TEST-PeerSyncReplicationTest.test-seed#[8376DD186AA9128B]) [n:127.0.0.1:43788_aqd%2Fuf    ] o.a.s.c.OverseerElectionContext I am going to be the leader 127.0.0.1:43788_aqd%2Fuf
   [junit4]   2> 232771 INFO  (TEST-PeerSyncReplicationTest.test-seed#[8376DD186AA9128B]) [n:127.0.0.1:43788_aqd%2Fuf    ] o.a.s.c.Overseer Overseer (id=97226125471252485-127.0.0.1:43788_aqd%2Fuf-n_0000000000) starting
   [junit4]   2> 232774 INFO  (TEST-PeerSyncReplicationTest.test-seed#[8376DD186AA9128B]) [n:127.0.0.1:43788_aqd%2Fuf    ] o.a.s.c.ZkController Register node as live in ZooKeeper:/live_nodes/127.0.0.1:43788_aqd%2Fuf
   [junit4]   2> 232775 INFO  (zkCallback-138-thread-1-processing-n:127.0.0.1:43788_aqd%2Fuf) [n:127.0.0.1:43788_aqd%2Fuf    ] o.a.s.c.c.ZkStateReader Updated live nodes from ZooKeeper... (0) -> (1)
   [junit4]   2> 232920 INFO  (TEST-PeerSyncReplicationTest.test-seed#[8376DD186AA9128B]) [n:127.0.0.1:43788_aqd%2Fuf    ] o.a.s.c.CorePropertiesLocator Found 1 core definitions underneath /home/jenkins/workspace/Lucene-Solr-master-Linux/solr/build/solr-core/test/J0/temp/solr.cloud.PeerSyncReplicationTest_8376DD186AA9128B-001/control-001/cores
   [junit4]   2> 232920 INFO  (TEST-PeerSyncReplicationTest.test-seed#[8376DD186AA9128B]) [n:127.0.0.1:43788_aqd%2Fuf    ] o.a.s.c.CorePropertiesLocator Cores are: [collection1]
   [junit4]   2> 232922 INFO  (OverseerStateUpdate-97226125471252485-127.0.0.1:43788_aqd%2Fuf-n_0000000000) [n:127.0.0.1:43788_aqd%2Fuf    ] o.a.s.c.o.ReplicaMutator Assigning new node to shard shard=shard1
   [junit4]   2> 233930 INFO  (coreLoadExecutor-529-thread-1-processing-n:127.0.0.1:43788_aqd%2Fuf) [n:127.0.0.1:43788_aqd%2Fuf c:control_collection   x:collection1] o.a.s.c.SolrConfig Using Lucene MatchVersion: 7.0.0
   [junit4]   2> 233941 INFO  (coreLoadExecutor-529-thread-1-processing-n:127.0.0.1:43788_aqd%2Fuf) [n:127.0.0.1:43788_aqd%2Fuf c:control_collection   x:collection1] o.a.s.s.IndexSchema [collection1] Schema name=test
   [junit4]   2> 234024 WARN  (coreLoadExecutor-529-thread-1-processing-n:127.0.0.1:43788_aqd%2Fuf) [n:127.0.0.1:43788_aqd%2Fuf c:control_collection   x:collection1] o.a.s.s.IndexSchema [collection1] default search field in schema is text. WARNING: Deprecated, please use 'df' on request instead.
   [junit4]   2> 234027 INFO  (coreLoadExecutor-529-thread-1-processing-n:127.0.0.1:43788_aqd%2Fuf) [n:127.0.0.1:43788_aqd%2Fuf c:control_collection   x:collection1] o.a.s.s.IndexSchema Loaded schema test/1.0 with uniqueid field id
   [junit4]   2> 234036 INFO  (coreLoadExecutor-529-thread-1-processing-n:127.0.0.1:43788_aqd%2Fuf) [n:127.0.0.1:43788_aqd%2Fuf c:control_collection   x:collection1] o.a.s.c.CoreContainer Creating SolrCore 'collection1' using configuration from collection control_collection
   [junit4]   2> 234043 INFO  (coreLoadExecutor-529-thread-1-processing-n:127.0.0.1:43788_aqd%2Fuf) [n:127.0.0.1:43788_aqd%2Fuf c:control_collection   x:collection1] o.a.s.c.SolrCore [[collection1] ] Opening new SolrCore at [/home/jenkins/workspace/Lucene-Solr-master-Linux/solr/build/solr-core/test/J0/temp/solr.cloud.PeerSyncReplicationTest_8376DD186AA9128B-001/control-001/cores/collection1], dataDir=[/home/jenkins/workspace/Lucene-Solr-master-Linux/solr/build/solr-core/test/J0/temp/solr.cloud.PeerSyncReplicationTest_8376DD186AA9128B-001/control-001/cores/collection1/data/]
   [junit4]   2> 234044 INFO  (coreLoadExecutor-529-thread-1-processing-n:127.0.0.1:43788_aqd%2Fuf) [n:127.0.0.1:43788_aqd%2Fuf c:control_collection   x:collection1] o.a.s.c.JmxMonitoredMap JMX monitoring is enabled. Adding Solr mbeans to JMX Server: com.sun.jmx.mbeanserver.JmxMBeanServer@654620
   [junit4]   2> 234046 INFO  (coreLoadExecutor-529-thread-1-processing-n:127.0.0.1:43788_aqd%2Fuf) [n:127.0.0.1:43788_aqd%2Fuf c:control_collection   x:collection1] o.a.s.u.RandomMergePolicy RandomMergePolicy wrapping class org.apache.lucene.index.AlcoholicMergePolicy: [AlcoholicMergePolicy: minMergeSize=0, mergeFactor=10, maxMergeSize=1614228595, maxMergeSizeForForcedMerge=9223372036854775807, calibrateSizeByDeletes=true, maxMergeDocs=2147483647, maxCFSSegmentSizeMB=8.796093022207999E12, noCFSRatio=0.1]
   [junit4]   2> 234087 WARN  (coreLoadExecutor-529-thread-1-processing-n:127.0.0.1:43788_aqd%2Fuf) [n:127.0.0.1:43788_aqd%2Fuf c:control_collection   x:collection1] o.a.s.c.RequestHandlers INVALID paramSet a in requestHandler {type = requestHandler,name = /dump,class = DumpRequestHandler,attributes = {initParams=a, name=/dump, class=DumpRequestHandler},args = {defaults={a=A,b=B}}}
   [junit4]   2> 234098 INFO  (coreLoadExecutor-529-thread-1-processing-n:127.0.0.1:43788_aqd%2Fuf) [n:127.0.0.1:43788_aqd%2Fuf c:control_collection   x:collection1] o.a.s.u.UpdateHandler Using UpdateLog implementation: org.apache.solr.update.UpdateLog
   [junit4]   2> 234098 INFO  (coreLoadExecutor-529-thread-1-processing-n:127.0.0.1:43788_aqd%2Fuf) [n:127.0.0.1:43788_aqd%2Fuf c:control_collection   x:collection1] o.a.s.u.UpdateLog Initializing UpdateLog: dataDir= defaultSyncLevel=FLUSH numRecordsToKeep=1000 maxNumLogsToKeep=10 numVersionBuckets=65536
   [junit4]   2> 234099 INFO  (coreLoadExecutor-529-thread-1-processing-n:127.0.0.1:43788_aqd%2Fuf) [n:127.0.0.1:43788_aqd%2Fuf c:control_collection   x:collection1] o.a.s.u.CommitTracker Hard AutoCommit: disabled
   [junit4]   2> 234099 INFO  (coreLoadExecutor-529-thread-1-processing-n:127.0.0.1:43788_aqd%2Fuf) [n:127.0.0.1:43788_aqd%2Fuf c:control_collection   x:collection1] o.a.s.u.CommitTracker Soft AutoCommit: disabled
   [junit4]   2> 234100 INFO  (coreLoadExecutor-529-thread-1-processing-n:127.0.0.1:43788_aqd%2Fuf) [n:127.0.0.1:43788_aqd%2Fuf c:control_collection   x:collection1] o.a.s.u.RandomMergePolicy RandomMergePolicy wrapping class org.apache.lucene.index.AlcoholicMergePolicy: [AlcoholicMergePolicy: minMergeSize=0, mergeFactor=10, maxMergeSize=275115888, maxMergeSizeForForcedMerge=9223372036854775807, calibrateSizeByDeletes=true, maxMergeDocs=2147483647, maxCFSSegmentSizeMB=8.796093022207999E12, noCFSRatio=0.1]
   [junit4]   2> 234101 INFO  (coreLoadExecutor-529-thread-1-processing-n:127.0.0.1:43788_aqd%2Fuf) [n:127.0.0.1:43788_aqd%2Fuf c:control_collection   x:collection1] o.a.s.s.SolrIndexSearcher Opening [Searcher@1fe85d3[collection1] main]
   [junit4]   2> 234102 INFO  (coreLoadExecutor-529-thread-1-processing-n:127.0.0.1:43788_aqd%2Fuf) [n:127.0.0.1:43788_aqd%2Fuf c:control_collection   x:collection1] o.a.s.r.ManagedResourceStorage Configured ZooKeeperStorageIO with znodeBase: /configs/conf1
   [junit4]   2> 234102 INFO  (coreLoadExecutor-529-thread-1-processing-n:127.0.0.1:43788_aqd%2Fuf) [n:127.0.0.1:43788_aqd%2Fuf c:control_collection   x:collection1] o.a.s.r.ManagedResourceStorage Loaded null at path _rest_managed.json using ZooKeeperStorageIO:path=/configs/conf1
   [junit4]   2> 234102 INFO  (coreLoadExecutor-529-thread-1-processing-n:127.0.0.1:43788_aqd%2Fuf) [n:127.0.0.1:43788_aqd%2Fuf c:control_collection   x:collection1] o.a.s.h.ReplicationHandler Commits will be reserved for  10000
   [junit4]   2> 234103 INFO  (searcherExecutor-530-thread-1-processing-n:127.0.0.1:43788_aqd%2Fuf x:collection1 c:control_collection) [n:127.0.0.1:43788_aqd%2Fuf c:control_collection   x:collection1] o.a.s.c.SolrCore [collection1] Registered new searcher Searcher@1fe85d3[collection1] main{ExitableDirectoryReader(UninvertingDirectoryReader())}
   [junit4]   2> 234103 INFO  (coreLoadExecutor-529-thread-1-processing-n:127.0.0.1:43788_aqd%2Fuf) [n:127.0.0.1:43788_aqd%2Fuf c:control_collection   x:collection1] o.a.s.u.UpdateLog Could not find max version in index or recent updates, using new clock 1555618009160089600
   [junit4]   2> 234108 INFO  (coreZkRegister-522-thread-1-processing-n:127.0.0.1:43788_aqd%2Fuf x:collection1 c:control_collection) [n:127.0.0.1:43788_aqd%2Fuf c:control_collection s:shard1 r:core_node1 x:collection1] o.a.s.c.ShardLeaderElectionContext Enough replicas found to continue.
   [junit4]   2> 234108 INFO  (coreZkRegister-522-thread-1-processing-n:127.0.0.1:43788_aqd%2Fuf x:collection1 c:control_collection) [n:127.0.0.1:43788_aqd%2Fuf c:control_collection s:shard1 r:core_node1 x:collection1] o.a.s.c.ShardLeaderElectionContext I may be the new leader - try and sync
   [junit4]   2> 234108 INFO  (coreZkRegister-522-thread-1-processing-n:127.0.0.1:43788_aqd%2Fuf x:collection1 c:control_collection) [n:127.0.0.1:43788_aqd%2Fuf c:control_collection s:shard1 r:core_node1 x:collection1] o.a.s.c.SyncStrategy Sync replicas to https://127.0.0.1:43788/aqd/uf/collection1/
   [junit4]   2> 234108 INFO  (coreZkRegister-522-thread-1-processing-n:127.0.0.1:43788_aqd%2Fuf x:collection1 c:control_collection) [n:127.0.0.1:43788_aqd%2Fuf c:control_collection s:shard1 r:core_node1 x:collection1] o.a.s.c.SyncStrategy Sync Success - now sync replicas to me
   [junit4]   2> 234108 INFO  (coreZkRegister-522-thread-1-processing-n:127.0.0.1:43788_aqd%2Fuf x:collection1 c:control_collection) [n:127.0.0.1:43788_aqd%2Fuf c:control_collection s:shard1 r:core_node1 x:collection1] o.a.s.c.SyncStrategy https://127.0.0.1:43788/aqd/uf/collection1/ has no replicas
   [junit4]   2> 234111 INFO  (coreZkRegister-522-thread-1-processing-n:127.0.0.1:43788_aqd%2Fuf x:collection1 c:control_collection) [n:127.0.0.1:43788_aqd%2Fuf c:control_collection s:shard1 r:core_node1 x:collection1] o.a.s.c.ShardLeaderElectionContext I am the new leader: https://127.0.0.1:43788/aqd/uf/collection1/ shard1
   [junit4]   2> 234261 INFO  (coreZkRegister-522-thread-1-processing-n:127.0.0.1:43788_aqd%2Fuf x:collection1 c:control_collection) [n:127.0.0.1:43788_aqd%2Fuf c:control_collection s:shard1 r:core_node1 x:collection1] o.a.s.c.ZkController I am the leader, no recovery necessary
   [junit4]   2> 234484 INFO  (TEST-PeerSyncReplicationTest.test-seed#[8376DD186AA9128B]) [    ] o.a.s.c.c.ZkStateReader Updated live nodes from ZooKeeper... (0) -> (1)
   [junit4]   2> 234485 INFO  (TEST-PeerSyncReplicationTest.test-seed#[8376DD186AA9128B]) [    ] o.a.s.c.s.i.ZkClientClusterStateProvider Cluster at 127.0.0.1:41790/solr ready
   [junit4]   2> 234485 INFO  (TEST-PeerSyncReplicationTest.test-seed#[8376DD186AA9128B]) [    ] o.a.s.c.ChaosMonkey monkey: init - expire sessions:false cause connection loss:false
   [junit4]   2> 234586 INFO  (TEST-PeerSyncReplicationTest.test-seed#[8376DD186AA9128B]) [    ] o.a.s.SolrTestCaseJ4 Writing core.properties file to /home/jenkins/workspace/Lucene-Solr-master-Linux/solr/build/solr-core/test/J0/temp/solr.cloud.PeerSyncReplicationTest_8376DD186AA9128B-001/shard-1-001/cores/collection1
   [junit4]   2> 234587 INFO  (TEST-PeerSyncReplicationTest.test-seed#[8376DD186AA9128B]) [    ] o.a.s.c.AbstractFullDistribZkTestBase create jetty 1 in directory /home/jenkins/workspace/Lucene-Solr-master-Linux/solr/build/solr-core/test/J0/temp/solr.cloud.PeerSyncReplicationTest_8376DD186AA9128B-001/shard-1-001
   [junit4]   2> 234589 INFO  (TEST-PeerSyncReplicationTest.test-seed#[8376DD186AA9128B]) [    ] o.e.j.s.Server jetty-9.3.14.v20161028
   [junit4]   2> 234590 INFO  (TEST-PeerSyncReplicationTest.test-seed#[8376DD186AA9128B]) [    ] o.e.j.s.h.ContextHandler Started o.e.j.s.ServletContextHandler@1838f5f{/aqd/uf,null,AVAILABLE}
   [junit4]   2> 234591 INFO  (TEST-PeerSyncReplicationTest.test-seed#[8376DD186AA9128B]) [    ] o.e.j.s.AbstractConnector Started ServerConnector@1aa5584{SSL,[ssl, http/1.1]}{127.0.0.1:40238}
   [junit4]   2> 234591 INFO  (TEST-PeerSyncReplicationTest.test-seed#[8376DD186AA9128B]) [    ] o.e.j.s.Server Started @236420ms
   [junit4]   2> 234591 INFO  (TEST-PeerSyncReplicationTest.test-seed#[8376DD186AA9128B]) [    ] o.a.s.c.s.e.JettySolrRunner Jetty properties: {solr.data.dir=/home/jenkins/workspace/Lucene-Solr-master-Linux/solr/build/solr-core/test/J0/temp/solr.cloud.PeerSyncReplicationTest_8376DD186AA9128B-001/tempDir-001/jetty1, solrconfig=solrconfig.xml, hostContext=/aqd/uf, hostPort=40238, coreRootDirectory=/home/jenkins/workspace/Lucene-Solr-master-Linux/solr/build/solr-core/test/J0/../../../../../../../../../home/jenkins/workspace/Lucene-Solr-master-Linux/solr/build/solr-core/test/J0/temp/solr.cloud.PeerSyncReplicationTest_8376DD186AA9128B-001/shard-1-001/cores}
   [junit4]   2> 234591 ERROR (TEST-PeerSyncReplicationTest.test-seed#[8376DD186AA9128B]) [    ] o.a.s.s.StartupLoggingUtils Missing Java Option solr.log.dir. Logging may be missing or incomplete.
   [junit4]   2> 234591 INFO  (TEST-PeerSyncReplicationTest.test-seed#[8376DD186AA9128B]) [    ] o.a.s.s.SolrDispatchFilter  ___      _       Welcome to Apache Solr? version 7.0.0
   [junit4]   2> 234591 INFO  (TEST-PeerSyncReplicationTest.test-seed#[8376DD186AA9128B]) [    ] o.a.s.s.SolrDispatchFilter / __| ___| |_ _   Starting in cloud mode on port null
   [junit4]   2> 234591 INFO  (TEST-PeerSyncReplicationTest.test-seed#[8376DD186AA9128B]) [    ] o.a.s.s.SolrDispatchFilter \__ \/ _ \ | '_|  Install dir: null
   [junit4]   2> 234592 INFO  (TEST-PeerSyncReplicationTest.test-seed#[8376DD186AA9128B]) [    ] o.a.s.s.SolrDispatchFilter |___/\___/_|_|    Start time: 2017-01-04T18:02:21.964Z
   [junit4]   2> 234594 INFO  (TEST-PeerSyncReplicationTest.test-seed#[8376DD186AA9128B]) [    ] o.a.s.s.SolrDispatchFilter Loading solr.xml from SolrHome (not found in ZooKeeper)
   [junit4]   2> 234594 INFO  (TEST-PeerSyncReplicationTest.test-seed#[8376DD186AA9128B]) [    ] o.a.s.c.SolrXmlConfig Loading container configuration from /home/jenkins/workspace/Lucene-Solr-master-Linux/solr/build/solr-core/test/J0/temp/solr.cloud.PeerSyncReplicationTest_8376DD186AA9128B-001/shard-1-001/solr.xml
   [junit4]   2> 234614 INFO  (TEST-PeerSyncReplicationTest.test-seed#[8376DD186AA9128B]) [    ] o.a.s.c.ZkContainer Zookeeper client=127.0.0.1:41790/solr
   [junit4]   2> 234620 INFO  (TEST-PeerSyncReplicationTest.test-seed#[8376DD186AA9128B]) [n:127.0.0.1:40238_aqd%2Fuf    ] o.a.s.c.c.ZkStateReader Updated live nodes from ZooKeeper... (0) -> (1)
   [junit4]   2> 234622 INFO  (TEST-PeerSyncReplicationTest.test-seed#[8376DD186AA9128B]) [n:127.0.0.1:40238_aqd%2Fuf    ] o.a.s.c.ZkController Register node as live in ZooKeeper:/live_nodes/127.0.0.1:40238_aqd%2Fuf
   [junit4]   2> 234623 INFO  (zkCallback-147-thread-1-processing-n:127.0.0.1:40238_aqd%2Fuf) [n:127.0.0.1:40238_aqd%2Fuf    ] o.a.s.c.c.ZkStateReader Updated live nodes from ZooKeeper... (1) -> (2)
   [junit4]   2> 234623 INFO  (zkCallback-138-thread-1-processing-n:127.0.0.1:43788_aqd%2Fuf) [n:127.0.0.1:43788_aqd%2Fuf    ] o.a.s.c.c.ZkStateReader Updated live nodes from ZooKeeper... (1) -> (2)
   [junit4]   2> 234623 INFO  (zkCallback-142-thread-1) [    ] o.a.s.c.c.ZkStateReader Updated live nodes from ZooKeeper... (1) -> (2)
   [junit4]   2> 234782 INFO  (TEST-PeerSyncReplicationTest.test-seed#[8376DD186AA9128B]) [n:127.0.0.1:40238_aqd%2Fuf    ] o.a.s.c.CorePropertiesLocator Found 1 core definitions underneath /home/jenkins/workspace/Lucene-Solr-master-Linux/solr/build/solr-core/test/J0/../../../../../../../../../home/jenkins/workspace/Lucene-Solr-master-Linux/solr/build/solr-core/test/J0/temp/solr.cloud.PeerSyncReplicationTest_8376DD186AA9128B-001/shard-1-001/cores
   [junit4]   2> 234782 INFO  (TEST-PeerSyncReplicationTest.test-seed#[8376DD186AA9128B]) [n:127.0.0.1:40238_aqd%2Fuf    ] o.a.s.c.CorePropertiesLocator Cores are: [collection1]
   [junit4]   2> 234784 INFO  (OverseerStateUpdate-97226125471252485-127.0.0.1:43788_aqd%2Fuf-n_0000000000) [n:127.0.0.1:43788_aqd%2Fuf    ] o.a.s.c.o.ReplicaMutator Assigning new node to shard shard=shard1
   [junit4]   2> 235800 INFO  (coreLoadExecutor-540-thread-1-processing-n:127.0.0.1:40238_aqd%2Fuf) [n:127.0.0.1:40238_aqd%2Fuf c:collection1   x:collection1] o.a.s.c.SolrConfig Using Lucene MatchVersion: 7.0.0
   [junit4]   2> 235828 INFO  (coreLoadExecutor-540-thread-1-processing-n:127.0.0.1:40238_aqd%2Fuf) [n:127.0.0.1:40238_aqd%2Fuf c:collection1   x:collection1] o.a.s.s.IndexSchema [collection1] Schema name=test
   [junit4]   2> 235924 WARN  (coreLoadExecutor-540-thread-1-processing-n:127.0.0.1:40238_aqd%2Fuf) [n:127.0.0.1:40238_aqd%2Fuf c:collection1   x:collection1] o.a.s.s.IndexSchema [collection1] default search field in schema is text. WARNING: Deprecated, please use 'df' on request instead.
   [junit4]   2> 235926 INFO  (coreLoadExecutor-540-thread-1-processing-n:127.0.0.1:40238_aqd%2Fuf) [n:127.0.0.1:40238_aqd%2Fuf c:collection1   x:collection1] o.a.s.s.IndexSchema Loaded schema test/1.0 with uniqueid field id
   [junit4]   2> 235938 INFO  (coreLoadExecutor-540-thread-1-processing-n:127.0.0.1:40238_aqd%2Fuf) [n:127.0.0.1:40238_aqd%2Fuf c:collection1   x:collection1] o.a.s.c.CoreContainer Creating SolrCore 'collection1' using configuration from collection collection1
   [junit4]   2> 235938 INFO  (coreLoadExecutor-540-thread-1-processing-n:127.0.0.1:40238_aqd%2Fuf) [n:127.0.0.1:40238_aqd%2Fuf c:collection1   x:collection1] o.a.s.c.SolrCore [[collection1] ] Opening new SolrCore at [/home/jenkins/workspace/Lucene-Solr-master-Linux/solr/build/solr-core/test/J0/temp/solr.cloud.PeerSyncReplicationTest_8376DD186AA9128B-001/shard-1-001/cores/collection1], dataDir=[/home/jenkins/workspace/Lucene-Solr-master-Linux/solr/build/solr-core/test/J0/../../../../../../../../../home/jenkins/workspace/Lucene-Solr-master-Linux/solr/build/solr-core/test/J0/temp/solr.cloud.PeerSyncReplicationTest_8376DD186AA9128B-001/shard-1-001/cores/collection1/data/]
   [junit4]   2> 235938 INFO  (coreLoadExecutor-540-thread-1-processing-n:127.0.0.1:40238_aqd%2Fuf) [n:127.0.0.1:40238_aqd%2Fuf c:collection1   x:collection1] o.a.s.c.JmxMonitoredMap JMX monitoring is enabled. Adding Solr mbeans to JMX Server: com.sun.jmx.mbeanserver.JmxMBeanServer@654620
   [junit4]   2> 235944 INFO  (coreLoadExecutor-540-thread-1-processing-n:127.0.0.1:40238_aqd%2Fuf) [n:127.0.0.1:40238_aqd%2Fuf c:collection1   x:collection1] o.a.s.u.RandomMergePolicy RandomMergePolicy wrapping class org.apache.lucene.index.AlcoholicMergePolicy: [AlcoholicMergePolicy: minMergeSize=0, mergeFactor=10, maxMergeSize=1614228595, maxMergeSizeForForcedMerge=9223372036854775807, calibrateSizeByDeletes=true, maxMergeDocs=2147483647, maxCFSSegmentSizeMB=8.796093022207999E12, noCFSRatio=0.1]
   [junit4]   2> 236042 WARN  (coreLoadExecutor-540-thread-1-processing-n:127.0.0.1:40238_aqd%2Fuf) [n:127.0.0.1:40238_aqd%2Fuf c:collection1   x:collection1] o.a.s.c.RequestHandlers INVALID paramSet a in requestHandler {type = requestHandler,name = /dump,class = DumpRequestHandler,attributes = {initParams=a, name=/dump, class=DumpRequestHandler},args = {defaults={a=A,b=B}}}
   [junit4]   2> 236052 INFO  (coreLoadExecutor-540-thread-1-processing-n:127.0.0.1:40238_aqd%2Fuf) [n:127.0.0.1:40238_aqd%2Fuf c:collection1   x:collection1] o.a.s.u.UpdateHandler Using UpdateLog implementation: org.apache.solr.update.UpdateLog
   [junit4]   2> 236052 INFO  (coreLoadExecutor-540-thread-1-processing-n:127.0.0.1:40238_aqd%2Fuf) [n:127.0.0.1:40238_aqd%2Fuf c:collection1   x:collection1] o.a.s.u.UpdateLog Initializing UpdateLog: dataDir= defaultSyncLevel=FLUSH numRecordsToKeep=1000 maxNumLogsToKeep=10 numVersionBuckets=65536
   [junit4]   2> 236052 INFO  (coreLoadExecutor-540-thread-1-processing-n:127.0.0.1:40238_aqd%2Fuf) [n:127.0.0.1:40238_aqd%2Fuf c:collection1   x:collection1] o.a.s.u.CommitTracker Hard AutoCommit: disabled
   [junit4]   2> 236052 INFO  (coreLoadExecutor-540-thread-1-processing-n:127.0.0.1:40238_aqd%2Fuf) [n:127.0.0.1:40238_aqd%2Fuf c:collection1   x:collection1] o.a.s.u.CommitTracker Soft AutoCommit: disabled
   [junit4]   2> 236053 INFO  (coreLoadExecutor-540-thread-1-processing-n:127.0.0.1:40238_aqd%2Fuf) [n:127.0.0.1:40238_aqd%2Fuf c:collection1   x:collection1] o.a.s.u.RandomMergePolicy RandomMergePolicy wrapping class org.apache.lucene.index.AlcoholicMergePolicy: [AlcoholicMergePolicy: minMergeSize=0, mergeFactor=10, maxMergeSize=275115888, maxMergeSizeForForcedMerge=9223372036854775807, calibrateSizeByDeletes=true, maxMergeDocs=2147483647, maxCFSSegmentSizeMB=8.796093022207999E12, noCFSRatio=0.1]
   [junit4]   2> 236053 INFO  (coreLoadExecutor-540-thread-1-processing-n:127.0.0.1:40238_aqd%2Fuf) [n:127.0.0.1:40238_aqd%2Fuf c:collection1   x:collection1] o.a.s.s.SolrIndexSearcher Opening [Searcher@20786[collection1] main]
   [junit4]   2> 236054 INFO  (coreLoadExecutor-540-thread-1-processing-n:127.0.0.1:40238_aqd%2Fuf) [n:127.0.0.1:40238_aqd%2Fuf c:collection1   x:collection1] o.a.s.r.ManagedResourceStorage Configured ZooKeeperStorageIO with znodeBase: /configs/conf1
   [junit4]   2> 236054 INFO  (coreLoadExecutor-540-thread-1-processing-n:127.0.0.1:40238_aqd%2Fuf) [n:127.0.0.1:40238_aqd%2Fuf c:collection1   x:collection1] o.a.s.r.ManagedResourceStorage Loaded null at path _rest_managed.json using ZooKeeperStorageIO:path=/configs/conf1
   [junit4]   2> 236054 INFO  (coreLoadExecutor-540-thread-1-processing-n:127.0.0.1:40238_aqd%2Fuf) [n:127.0.0.1:40238_aqd%2Fuf c:collection1   x:collection1] o.a.s.h.ReplicationHandler Commits will be reserved for  10000
   [junit4]   2> 236055 INFO  (searcherExecutor-541-thread-1-processing-n:127.0.0.1:40238_aqd%2Fuf x:collection1 c:collection1) [n:127.0.0.1:40238_aqd%2Fuf c:collection1   x:collection1] o.a.s.c.SolrCore [collection1] Registered new searcher Searcher@20786[collection1] main{ExitableDirectoryReader(UninvertingDirectoryReader())}
   [junit4]   2> 236055 INFO  (coreLoadExecutor-540-thread-1-processing-n:127.0.0.1:40238_aqd%2Fuf) [n:127.0.0.1:40238_aqd%2Fuf c:collection1   x:collection1] o.a.s.u.UpdateLog Could not find max version in index or recent updates, using new clock 1555618011206909952
   [junit4]   2> 236061 INFO  (coreZkRegister-535-thread-1-processing-n:127.0.0.1:40238_aqd%2Fuf x:collection1 c:collection1) [n:127.0.0.1:40238_aqd%2Fuf c:collection1 s:shard1 r:core_node1 x:collection1] o.a.s.c.ShardLeaderElectionContext Enough replicas found to continue.
   [junit4]   2> 236061 INFO  (coreZkRegister-535-thread-1-processing-n:127.0.0.1:40238_aqd%2Fuf x:collection1 c:collection1) [n:127.0.0.1:40238_aqd%2Fuf c:collection1 s:shard1 r:core_node1 x:collection1] o.a.s.c.ShardLeaderElectionContext I may be the new leader - try and sync
   [junit4]   2> 236061 INFO  (coreZkRegister-535-thread-1-processing-n:127.0.0.1:40238_aqd%2Fuf x:collection1 c:collection1) [n:127.0.0.1:40238_aqd%2Fuf c:collection1 s:shard1 r:core_node1 x:collection1] o.a.s.c.SyncStrategy Sync replicas to https://127.0.0.1:40238/aqd/uf/collection1/
   [junit4]   2> 236061 INFO  (coreZkRegister-535-thread-1-processing-n:127.0.0.1:40238_aqd%2Fuf x:collection1 c:collection1) [n:127.0.0.1:40238_aqd%2Fuf c:collection1 s:shard1 r:core_node1 x:collection1] o.a.s.c.SyncStrategy Sync Success - now sync replicas to me
   [junit4]   2> 236061 INFO  (coreZkRegister-535-thread-1-processing-n:127.0.0.1:40238_aqd%2Fuf x:collection1 c:collection1) [n:127.0.0.1:40238_aqd%2Fuf c:collection1 s:shard1 r:core_node1 x:collection1] o.a.s.c.SyncStrategy https://127.0.0.1:40238/aqd/uf/collection1/ has no replicas
   [junit4]   2> 236063 INFO  (coreZkRegister-535-thread-1-processing-n:127.0.0.1:40238_aqd%2Fuf x:collection1 c:collection1) [n:127.0.0.1:40238_aqd%2Fuf c:collection1 s:shard1 r:core_node1 x:collection1] o.a.s.c.ShardLeaderElectionContext I am the new leader: https://127.0.0.1:40238/aqd/uf/collection1/ shard1
   [junit4]   2> 236214 INFO  (coreZkRegister-535-thread-1-processing-n:127.0.0.1:40238_aqd%2Fuf x:collection1 c:collection1) [n:127.0.0.1:40238_aqd%2Fuf c:collection1 s:shard1 r:core_node1 x:collection1] o.a.s.c.ZkController I am the leader, no recovery necessary
   [junit4]   2> 236465 INFO  (TEST-PeerSyncReplicationTest.test-seed#[8376DD186AA9128B]) [    ] o.a.s.SolrTestCaseJ4 Writing core.properties file to /home/jenkins/workspace/Lucene-Solr-master-Linux/solr/build/solr-core/test/J0/temp/solr.cloud.PeerSyncReplicationTest_8376DD186AA9128B-001/shard-2-001/cores/collection1
   [junit4]   2> 236465 INFO  (TEST-PeerSyncReplicationTest.test-seed#[8376DD186AA9128B]) [    ] o.a.s.c.AbstractFullDistribZkTestBase create jetty 2 in directory /home/jenkins/workspace/Lucene-Solr-master-Linux/solr/build/solr-core/test/J0/temp/solr.cloud.PeerSyncReplicationTest_8376DD186AA9128B-001/shard-2-001
   [junit4]   2> 236466 INFO  (TEST-PeerSyncReplicationTest.test-seed#[8376DD186AA9128B]) [    ] o.e.j.s.Server jetty-9.3.14.v20161028
   [junit4]   2> 236467 INFO  (TEST-PeerSyncReplicationTest.test-seed#[8376DD186AA9128B]) [    ] o.e.j.s.h.ContextHandler Started o.e.j.s.ServletContextHandler@de4f85{/aqd/uf,null,AVAILABLE}
   [junit4]   2> 236468 INFO  (TEST-PeerSyncReplicationTest.test-seed#[8376DD186AA9128B]) [    ] o.e.j.s.AbstractConnector Started ServerConnector@1d3cf07{SSL,[ssl, http/1.1]}{127.0.0.1:45746}
   [junit4]   2> 236468 INFO  (TEST-PeerSyncReplicationTest.test-seed#[8376DD186AA9128B]) [    ] o.e.j.s.Server Started @238297ms
   [junit4]   2> 236468 INFO  (TEST-PeerSyncReplicationTest.test-seed#[8376DD186AA9128B]) [    ] o.a.s.c.s.e.JettySolrRunner Jetty properties: {solr.data.dir=/home/jenkins/workspace/Lucene-Solr-master-Linux/solr/build/solr-core/test/J0/temp/solr.cloud.PeerSyncReplicationTest_8376DD186AA9128B-001/tempDir-001/jetty2, solrconfig=solrconfig.xml, hostContext=/aqd/uf, hostPort=45746, coreRootDirectory=/home/jenkins/workspace/Lucene-Solr-master-Linux/solr/build/solr-core/test/J0/temp/solr.cloud.PeerSyncReplicationTest_8376DD186AA9128B-001/shard-2-001/cores}
   [junit4]   2> 236468 ERROR (TEST-PeerSyncReplicationTest.test-seed#[8376DD186AA9128B]) [    ] o.a.s.s.StartupLoggingUtils Missing Java Option solr.log.dir. Logging may be missing or incomplete.
   [junit4]   2> 236468 INFO  (TEST-PeerSyncReplicationTest.test-seed#[8376DD186AA9128B]) [    ] o.a.s.s.SolrDispatchFilter  ___      _       Welcome to Apache Solr? version 7.0.0
   [junit4]   2> 236468 INFO  (TEST-PeerSyncReplicationTest.test-seed#[8376DD186AA9128B]) [    ] o.a.s.s.SolrDispatchFilter / __| ___| |_ _   Starting in cloud mode on port null
   [junit4]   2> 236468 INFO  (TEST-PeerSyncReplicationTest.test-seed#[8376DD186AA9128B]) [    ] o.a.s.s.SolrDispatchFilter \__ \/ _ \ | '_|  Install dir: null
   [junit4]   2> 236468 INFO  (TEST-PeerSyncReplicationTest.test-seed#[8376DD186AA9128B]) [    ] o.a.s.s.SolrDispatchFilter |___/\___/_|_|    Start time: 2017-01-04T18:02:23.840Z
   [junit4]   2> 236471 INFO  (TEST-PeerSyncReplicationTest.test-seed#[8376DD186AA9128B]) [    ] o.a.s.s.SolrDispatchFilter Loading solr.xml from SolrHome (not found in ZooKeeper)
   [junit4]   2> 236471 INFO  (TEST-PeerSyncReplicationTest.test-seed#[8376DD186AA9128B]) [    ] o.a.s.c.SolrXmlConfig Loading container configuration from /home/jenkins/workspace/Lucene-Solr-master-Linux/solr/build/solr-core/test/J0/temp/solr.cloud.PeerSyncReplicationTest_8376DD186AA9128B-001/shard-2-001/solr.xml
   [junit4]   2> 236477 INFO  (TEST-PeerSyncReplicationTest.test-seed#[8376DD186AA9128B]) [    ] o.a.s.c.ZkContainer Zookeeper client=127.0.0.1:41790/solr
   [junit4]   2> 236483 INFO  (TEST-PeerSyncReplicationTest.test-seed#[8376DD186AA9128B]) [n:127.0.0.1:45746_aqd%2Fuf    ] o.a.s.c.c.ZkStateReader Updated live nodes from ZooKeeper... (0) -> (2)
   [junit4]   2> 236485 INFO  (TEST-PeerSyncReplicationTest.test-seed#[8376DD186AA9128B]) [n:127.0.0.1:45746_aqd%2Fuf    ] o.a.s.c.ZkController Register node as live in ZooKeeper:/live_nodes/127.0.0.1:45746_aqd%2Fuf
   [junit4]   2> 236486 INFO  (zkCallback-138-thread-1-processing-n:127.0.0.1:43788_aqd%2Fuf) [n:127.0.0.1:43788_aqd%2Fuf    ] o.a.s.c.c.ZkStateReader Updated live nodes from ZooKeeper... (2) -> (3)
   [junit4]   2> 236486 INFO  (zkCallback-153-thread-1-processing-n:127.0.0.1:45746_aqd%2Fuf) [n:127.0.0.1:45746_aqd%2Fuf    ] o.a.s.c.c.ZkStateReader Updated live nodes from ZooKeeper... (2) -> (3)
   [junit4]   2> 236486 INFO  (zkCallback-147-thread-1-processing-n:127.0.0.1:40238_aqd%2Fuf) [n:127.0.0.1:40238_aqd%2Fuf    ] o.a.s.c.c.ZkStateReader Updated live nodes from ZooKeeper... (2) -> (3)
   [junit4]   2> 236486 INFO  (zkCallback-142-thread-1) [    ] o.a.s.c.c.ZkStateReader Updated live nodes from ZooKeeper... (2) -> (3)
   [junit4]   2> 236609 INFO  (TEST-PeerSyncReplicationTest.test-seed#[8376DD186AA9128B]) [n:127.0.0.1:45746_aqd%2Fuf    ] o.a.s.c.CorePropertiesLocator Found 1 core definitions underneath /home/jenkins/workspace/Lucene-Solr-master-Linux/solr/build/solr-core/test/J0/temp/solr.cloud.PeerSyncReplicationTest_8376DD186AA9128B-001/shard-2-001/cores
   [junit4]   2> 236609 INFO  (TEST-PeerSyncReplicationTest.test-seed#[8376DD186AA9128B]) [n:127.0.0.1:45746_aqd%2Fuf    ] o.a.s.c.CorePropertiesLocator Cores are: [collection1]
   [junit4]   2> 236610 INFO  (OverseerStateUpdate-97226125471252485-127.0.0.1:43788_aqd%2Fuf-n_0000000000) [n:127.0.0.1:43788_aqd%2Fuf    ] o.a.s.c.o.ReplicaMutator Assigning new node to shard shard=shard1
   [junit4]   2> 237621 INFO  (coreLoadExecutor-551-thread-1-processing-n:127.0.0.1:45746_aqd%2Fuf) [n:127.0.0.1:45746_aqd%2Fuf c:collection1   x:collection1] o.a.s.c.SolrConfig Using Lucene MatchVersion: 7.0.0
   [junit4]   2> 237647 INFO  (coreLoadExecutor-551-thread-1-processing-n:127.0.0.1:45746_aqd%2Fuf) [n:127.0.0.1:45746_aqd%2Fuf c:collection1   x:collection1] o.a.s.s.IndexSchema [collection1] Schema name=test
   [junit4]   2> 237763 WARN  (coreLoadExecutor-551-thread-1-processing-n:127.0.0.1:45746_aqd%2Fuf) [n:127.0.0.1:45746_aqd%2Fuf c:collection1   x:collection1] o.a.s.s.IndexSchema [collection1] default search field in schema is text. WARNING: Deprecated, please use 'df' on request instead.
   [junit4]   2> 237766 INFO  (coreLoadExecutor-551-thread-1-processing-n:127.0.0.1:45746_aqd%2Fuf) [n:127.0.0.1:45746_aqd%2Fuf c:collection1   x:collection1] o.a.s.s.IndexSchema Loaded schema test/1.0 with uniqueid field id
   [junit4]   2> 237774 INFO  (coreLoadExecutor-551-thread-1-processing-n:127.0.0.1:45746_aqd%2Fuf) [n:127.0.0.1:45746_aqd%2Fuf c:collection1   x:collection1] o.a.s.c.CoreContainer Creating SolrCore 'collection1' using configuration from collection collection1
   [junit4]   2> 237774 INFO  (coreLoadExecutor-551-thread-1-processing-n:127.0.0.1:45746_aqd%2Fuf) [n:127.0.0.1:45746_aqd%2Fuf c:collection1   x:collection1] o.a.s.c.SolrCore [[collection1] ] Opening new SolrCore at [/home/jenkins/workspace/Lucene-Solr-master-Linux/solr/build/solr-core/test/J0/temp/solr.cloud.PeerSyncReplicationTest_8376DD186AA9128B-001/shard-2-001/cores/collection1], dataDir=[/home/jenkins/workspace/Lucene-Solr-master-Linux/solr/build/solr-core/test/J0/temp/solr.cloud.PeerSyncReplicationTest_8376DD186AA9128B-001/shard-2-001/cores/collection1/data/]
   [junit4]   2> 237774 INFO  (coreLoadExecutor-551-thread-1-processing-n:127.0.0.1:45746_aqd%2Fuf) [n:127.0.0.1:45746_aqd%2Fuf c:collection1   x:collection1] o.a.s.c.JmxMonitoredMap JMX monitoring is enabled. Adding Solr mbeans to JMX Server: com.sun.jmx.mbeanserver.JmxMBeanServer@654620
   [junit4]   2> 237792 INFO  (coreLoadExecutor-551-thread-1-processing-n:127.0.0.1:45746_aqd%2Fuf) [n:127.0.0.1:45746_aqd%2Fuf c:collection1   x:collection1] o.a.s.u.RandomMergePolicy RandomMergePolicy wrapping class org.apache.lucene.index.AlcoholicMergePolicy: [AlcoholicMergePolicy: minMergeSize=0, mergeFactor=10, maxMergeSize=1614228595, maxMergeSizeForForcedMerge=9223372036854775807, calibrateSizeByDeletes=true, maxMergeDocs=2147483647, maxCFSSegmentSizeMB=8.796093022207999E12, noCFSRatio=0.1]
   [junit4]   2> 237814 WARN  (coreLoadExecutor-551-thread-1-processing-n:127.0.0.1:45746_aqd%2Fuf) [n:127.0.0.1:45746_aqd%2Fuf c:collection1   x:collection1] o.a.s.c.RequestHandlers INVALID paramSet a in requestHandler {type = requestHandler,name = /dump,class = DumpRequestHandler,attributes = {initParams=a, name=/dump, class=DumpRequestHandler},args = {defaults={a=A,b=B}}}
   [junit4]   2> 237824 INFO  (coreLoadExecutor-551-thread-1-processing-n:127.0.0.1:45746_aqd%2Fuf) [n:127.0.0.1:45746_aqd%2Fuf c:collection1   x:collection1] o.a.s.u.UpdateHandler Using UpdateLog implementation: org.apache.solr.update.UpdateLog
   [junit4]   2> 237824 INFO  (coreLoadExecutor-551-thread-1-processing-n:127.0.0.1:45746_aqd%2Fuf) [n:127.0.0.1:45746_aqd%2Fuf c:collection1   x:collection1] o.a.s.u.UpdateLog Initializing UpdateLog: dataDir= defaultSyncLevel=FLUSH numRecordsToKeep=1000 maxNumLogsToKeep=10 numVersionBuckets=65536
   [junit4]   2> 237834 INFO  (coreLoadExecutor-551-thread-1-processing-n:127.0.0.1:45746_aqd%2Fuf) [n:127.0.0.1:45746_aqd%2Fuf c:collection1   x:collection1] o.a.s.u.CommitTracker Hard AutoCommit: disabled
   [junit4]   2> 237834 INFO  (coreLoadExecutor-551-thread-1-processing-n:127.0.0.1:45746_aqd%2Fuf) [n:127.0.0.1:45746_aqd%2Fuf c:collection1   x:collection1] o.a.s.u.CommitTracker Soft AutoCommit: disabled
   [junit4]   2> 237835 INFO  (coreLoadExecutor-551-thread-1-processing-n:127.0.0.1:45746_aqd%2Fuf) [n:127.0.0.1:45746_aqd%2Fuf c:collection1   x:collection1] o.a.s.u.RandomMergePolicy RandomMergePolicy wrapping class org.apache.lucene.index.AlcoholicMergePolicy: [AlcoholicMergePolicy: minMergeSize=0, mergeFactor=10, maxMergeSize=275115888, maxMergeSizeForForcedMerge=9223372036854775807, calibrateSizeByDeletes=true, maxMergeDocs=2147483647, maxCFSSegmentSizeMB=8.796093022207999E12, noCFSRatio=0.1]
   [junit4]   2> 237843 INFO  (coreLoadExecutor-551-thread-1-processing-n:127.0.0.1:45746_aqd%2Fuf) [n:127.0.0.1:45746_aqd%2Fuf c:collection1   x:collection1] o.a.s.s.SolrIndexSearcher Opening [Searcher@6754c3[collection1] main]
   [junit4]   2> 237844 INFO  (coreLoadExecutor-551-thread-1-processing-n:127.0.0.1:45746_aqd%2Fuf) [n:127.0.0.1:45746_aqd%2Fuf c:collection1   x:collection1] o.a.s.r.ManagedResourceStorage Configured ZooKeeperStorageIO with znodeBase: /configs/conf1
   [junit4]   2> 237844 INFO  (coreLoadExecutor-551-thread-1-processing-n:127.0.0.1:45746_aqd%2Fuf) [n:127.0.0.1:45746_aqd%2Fuf c:collection1   x:collection1] o.a.s.r.ManagedResourceStorage Loaded null at path _rest_managed.json using ZooKeeperStorageIO:path=/configs/conf1
   [junit4]   2> 237845 INFO  (coreLoadExecutor-551-thread-1-processing-n:127.0.0.1:45746_aqd%2Fuf) [n:127.0.0.1:45746_aqd%2Fuf c:collection1   x:collection1] o.a.s.h.ReplicationHandler Commits will be reserved for  10000
   [junit4]   2> 237845 INFO  (searcherExecutor-552-thread-1-processing-n:127.0.0.1:45746_aqd%2Fuf x:collection1 c:collection1) [n:127.0.0.1:45746_aqd%2Fuf c:collection1   x:collection1] o.a.s.c.SolrCore [collection1] Registered new searcher Searcher@6754c3[collection1] main{ExitableDirectoryReader(UninvertingDirectoryReader())}
   [junit4]   2> 237845 INFO  (coreLoadExecutor-551-thread-1-processing-n:127.0.0.1:45746_aqd%2Fuf) [n:127.0.0.1:45746_aqd%2Fuf c:collection1   x:collection1] o.a.s.u.UpdateLog Could not find max version in index or recent updates, using new clock 1555618013083860992
   [junit4]   2> 237849 INFO  (coreZkRegister-546-thread-1-processing-n:127.0.0.1:45746_aqd%2Fuf x:collection1 c:collection1) [n:127.0.0.1:45746_aqd%2Fuf c:collection1 s:shard1 r:core_node2 x:collection1] o.a.s.c.ZkController Core needs to recover:collection1
   [junit4]   2> 237849 INFO  (updateExecutor-150-thread-1-processing-n:127.0.0.1:45746_aqd%2Fuf x:collection1 s:shard1 c:collection1 r:core_node2) [n:127.0.0.1:45746_aqd%2Fuf c:collection1 s:shard1 r:core_node2 x:collection1] o.a.s.u.DefaultSolrCoreState Running recovery
   [junit4]   2> 237849 INFO  (recoveryExecutor-151-thread-1-processing-n:127.0.0.1:45746_aqd%2Fuf x:collection1 s:shard1 c:collection1 r:core_node2) [n:127.0.0.1:45746_aqd%2Fuf c:collection1 s:shard1 r:core_node2 x:collection1] o.a.s.c.RecoveryStrategy Starting recovery process. recoveringAfterStartup=true
   [junit4]   2> 237849 INFO  (recoveryExecutor-151-thread-1-processing-n:127.0.0.1:45746_aqd%2Fuf x:collection1 s:shard1 c:collection1 r:core_node2) [n:127.0.0.1:45746_aqd%2Fuf c:collection1 s:shard1 r:core_node2 x:collection1] o.a.s.c.RecoveryStrategy ###### startupVersions=[[]]
   [junit4]   2> 237849 INFO  (recoveryExecutor-151-thread-1-processing-n:127.0.0.1:45746_aqd%2Fuf x:collection1 s:shard1 c:collection1 r:core_node2) [n:127.0.0.1:45746_aqd%2Fuf c:collection1 s:shard1 r:core_node2 x:collection1] o.a.s.c.RecoveryStrategy Begin buffering updates. core=[collection1]
   [junit4]   2> 237849 INFO  (recoveryExecutor-151-thread-1-processing-n:127.0.0.1:45746_aqd%2Fuf x:collection1 s:shard1 c:collection1 r:core_node2) [n:127.0.0.1:45746_aqd%2Fuf c:collection1 s:shard1 r:core_node2 x:collection1] o.a.s.u.UpdateLog Starting to buffer updates. FSUpdateLog{state=ACTIVE, tlog=null}
   [junit4]   2> 237849 INFO  (recoveryExecutor-151-thread-1-processing-n:127.0.0.1:45746_aqd%2Fuf x:collection1 s:shard1 c:collection1 r:core_node2) [n:127.0.0.1:45746_aqd%2Fuf c:collection1 s:shard1 r:core_node2 x:collection1] o.a.s.c.RecoveryStrategy Publishing state of core [collection1] as recovering, leader is [https://127.0.0.1:40238/aqd/uf/collection1/] and I am [https://127.0.0.1:45746/aqd/uf/collection1/]
   [junit4]   2> 237851 INFO  (recoveryExecutor-151-thread-1-processing-n:127.0.0.1:45746_aqd%2Fuf x:collection1 s:shard1 c:collection1 r:core_node2) [n:127.0.0.1:45746_aqd%2Fuf c:collection1 s:shard1 r:core_node2 x:collection1] o.a.s.c.RecoveryStrategy Sending prep recovery command to [https://127.0.0.1:40238/aqd/uf]; [WaitForState: action=PREPRECOVERY&core=collection1&nodeName=127.0.0.1:45746_aqd%252Fuf&coreNodeName=core_node2&state=recovering&checkLive=true&onlyIfLeader=true&onlyIfLeaderActive=true]
   [junit4]   2> 237909 INFO  (qtp10427241-1273) [n:127.0.0.1:40238_aqd%2Fuf    ] o.a.s.h.a.PrepRecoveryOp Going to wait for coreNodeName: core_node2, state: recovering, checkLive: true, onlyIfLeader: true, onlyIfLeaderActive: true
   [junit4]   2> 237909 INFO  (qtp10427241-1273) [n:127.0.0.1:40238_aqd%2Fuf    ] o.a.s.h.a.PrepRecoveryOp Will wait a max of 183 seconds to see collection1 (shard1 of collection1) have state: recovering
   [junit4]   2> 237909 INFO  (qtp10427241-1273) [n:127.0.0.1:40238_aqd%2Fuf    ] o.a.s.h.a.PrepRecoveryOp In WaitForState(recovering): collection=collection1, shard=shard1, thisCore=collection1, leaderDoesNotNeedRecovery=false, isLeader? true, live=true, checkLive=true, currentState=down, localState=active, nodeName=127.0.0.1:45746_aqd%2Fuf, coreNodeName=core_node2, onlyIfActiveCheckResult=false, nodeProps: core_node2:{"core":"collection1","base_url":"https://127.0.0.1:45746/aqd/uf","node_name":"127.0.0.1:45746_aqd%2Fuf","state":"down"}
   [junit4]   2> 238270 INFO  (TEST-PeerSyncReplicationTest.test-seed#[8376DD186AA9128B]) [    ] o.a.s.SolrTestCaseJ4 Writing core.properties file to /home/jenkins/workspace/Lucene-Solr-master-Linux/solr/build/solr-core/test/J0/temp/solr.cloud.PeerSyncReplicationTest_8376DD186AA9128B-001/shard-3-001/cores/collection1
   [junit4]   2> 238271 INFO  (TEST-PeerSyncReplicationTest.test-seed#[8376DD186AA9128B]) [    ] o.a.s.c.AbstractFullDistribZkTestBase create jetty 3 in directory /home/jenkins/workspace/Lucene-Solr-master-Linux/solr/build/solr-core/test/J0/temp/solr.cloud.PeerSyncReplicationTest_8376DD186AA9128B-001/shard-3-001
   [junit4]   2> 238272 INFO  (TEST-PeerSyncReplicationTest.test-seed#[8376DD186AA9128B]) [    ] o.e.j.s.Server jetty-9.3.14.v20161028
   [junit4]   2> 238273 INFO  (TEST-PeerSyncReplicationTest.test-seed#[8376DD186AA9128B]) [    ] o.e.j.s.h.ContextHandler Started o.e.j.s.ServletContextHandler@166919f{/aqd/uf,null,AVAILABLE}
   [junit4]   2> 238274 INFO  (TEST-PeerSyncReplicationTest.test-seed#[8376DD186AA9128B]) [    ] o.e.j.s.AbstractConnector Started ServerConnector@1137974{SSL,[ssl, http/1.1]}{127.0.0.1:43537}
   [junit4]   2> 238275 INFO  (TEST-PeerSyncReplicationTest.test-seed#[8376DD186AA9128B]) [    ] o.e.j.s.Server Started @240104ms
   [junit4]   2> 238275 INFO  (TEST-PeerSyncReplicationTest.test-seed#[8376DD186AA9128B]) [    ] o.a.s.c.s.e.JettySolrRunner Jetty properties: {solr.data.dir=/home/jenkins/workspace/Lucene-Solr-master-Linux/solr/build/solr-core/test/J0/temp/solr.cloud.PeerSyncReplicationTest_8376DD186AA9128B-001/tempDir-001/jetty3, solrconfig=solrconfig.xml, hostContext=/aqd/uf, hostPort=43537, coreRootDirectory=/home/jenkins/workspace/Lucene-Solr-master-Linux/solr/build/solr-core/test/J0/temp/solr.cloud.PeerSyncReplicationTest_8376DD186AA9128B-001/shard-3-001/cores}
   [junit4]   2> 238275 ERROR (TEST-PeerSyncReplicationTest.test-seed#[8376DD186AA9128B]) [    ] o.a.s.s.StartupLoggingUtils Missing Java Option solr.log.dir. Logging may be missing or incomplete.
   [junit4]   2> 238275 INFO  (TEST-PeerSyncReplicationTest.test-seed#[8376DD186AA9128B]) [    ] o.a.s.s.SolrDispatchFilter  ___      _       Welcome to Apache Solr? version 7.0.0
   [junit4]   2> 238276 INFO  (TEST-PeerSyncReplicationTest.test-seed#[8376DD186AA9128B]) [    ] o.a.s.s.SolrDispatchFilter / __| ___| |_ _   Starting in cloud mode on port null
   [junit4]   2> 238276 INFO  (TEST-PeerSyncReplicationTest.test-seed#[8376DD186AA9128B]) [    ] o.a.s.s.SolrDispatchFilter \__ \/ _ \ | '_|  Install dir: null
   [junit4]   2> 238276 INFO  (TEST-PeerSyncReplicationTest.test-seed#[8376DD186AA9128B]) [    ] o.a.s.s.SolrDispatchFilter |___/\___/_|_|    Start time: 2017-01-04T18:02:25.648Z
   [junit4]   2> 238279 INFO  (TEST-PeerSyncReplicationTest.test-seed#[8376DD186AA9128B]) [    ] o.a.s.s.SolrDispatchFilter Loading solr.xml from SolrHome (not found in ZooKeeper)
   [junit4]   2> 238279 INFO  (TEST-PeerSyncReplicationTest.test-seed#[8376DD186AA9128B]) [    ] o.a.s.c.SolrXmlConfig Loading container configuration from /home/jenkins/workspace/Lucene-Solr-master-Linux/solr/build/solr-core/test/J0/temp/solr.cloud.PeerSyncReplicationTest_8376DD186AA9128B-001/shard-3-001/solr.xml
   [junit4]   2> 238288 INFO  (TEST-PeerSyncReplicationTest.test-seed#[8376DD186AA9128B]) [    ] o.a.s.c.ZkContainer Zookeeper client=127.0.0.1:41790/solr
   [junit4]   2> 238296 INFO  (TEST-PeerSyncReplicationTest.test-seed#[8376DD186AA9128B]) [n:127.0.0.1:43537_aqd%2Fuf    ] o.a.s.c.c.ZkStateReader Updated live nodes from ZooKeeper... (0) -> (3)
   [junit4]   2> 238298 INFO  (TEST-PeerSyncReplicationTest.test-seed#[8376DD186AA9128B]) [n:127.0.0.1:43537_aqd%2Fuf    ] o.a.s.c.ZkController Register node as live in ZooKeeper:/live_nodes/127.0.0.1:43537_aqd%2Fuf
   [junit4]   2> 238299 INFO  (zkCallback-142-thread-1) [    ] o.a.s.c.c.ZkStateReader Updated live nodes from ZooKeeper... (3) -> (4)
   [junit4]   2> 238300 INFO  (zkCallback-147-thread-1-processing-n:127.0.0.1:40238_aqd%2Fuf) [n:127.0.0.1:40238_aqd%2Fuf    ] o.a.s.c.c.ZkStateReader Updated live nodes from ZooKeeper... (3) -> (4)
   [junit4]   2> 238300 INFO  (zkCallback-153-thread-1-processing-n:127.0.0.1:45746_aqd%2Fuf) [n:127.0.0.1:45746_aqd%2Fuf    ] o.a.s.c.c.ZkStateReader Updated live nodes from ZooKeeper... (3) -> (4)
   [junit4]   2> 238301 INFO  (zkCallback-138-thread-3-processing-n:127.0.0.1:43788_aqd%2Fuf) [n:127.0.0.1:43788_aqd%2Fuf    ] o.a.s.c.c.ZkStateReader Updated live nodes from ZooKeeper... (3) -> (4)
   [junit4]   2> 238302 INFO  (zkCallback-160-thread-1-processing-n:127.0.0.1:43537_aqd%2Fuf) [n:127.0.0.1:43537_aqd%2Fuf    ] o.a.s.c.c.ZkStateReader Updated live nodes from ZooKeeper... (3) -> (4)
   [junit4]   2> 238419 INFO  (TEST-PeerSyncReplicationTest.test-seed#[8376DD186AA9128B]) [n:127.0.0.1:43537_aqd%2Fuf    ] o.a.s.c.CorePropertiesLocator Found 1 core definitions underneath /home/jenkins/workspace/Lucene-Solr-master-Linux/solr/build/solr-core/test/J0/temp/solr.cloud.PeerSyncReplicationTest_8376DD186AA9128B-001/shard-3-001/cores
   [junit4]   2> 238419 INFO  (TEST-PeerSyncReplicationTest.test-seed#[8376DD186AA9128B]) [n:127.0.0.1:43537_aqd%2Fuf    ] o.a.s.c.CorePropertiesLocator Cores are: [collection1]
   [junit4]   2> 238440 INFO  (OverseerStateUpdate-97226125471252485-127.0.0.1:43788_aqd%2Fuf-n_0000000000) [n:127.0.0.1:43788_aqd%2Fuf    ] o.a.s.c.o.ReplicaMutator Assigning new node to shard shard=shard1
   [junit4]   2> 238909 INFO  (qtp10427241-1273) [n:127.0.0.1:40238_aqd%2Fuf    ] o.a.s.h.a.PrepRecoveryOp In WaitForState(recovering): collection=collection1, shard=shard1, thisCore=collection1, leaderDoesNotNeedRecovery=false, isLeader? true, live=true, checkLive=true, currentState=recovering, localState=active, nodeName=127.0.0.1:45746_aqd%2Fuf, coreNodeName=core_node2, onlyIfActiveCheckResult=false, nodeProps: core_node2:{"core":"collection1","base_url":"https://127.0.0.1:45746/aqd/uf","node_name":"127.0.0.1:45746_aqd%2Fuf","state":"recovering"}
   [junit4]   2> 238909 INFO  (qtp10427241-1273) [n:127.0.0.1:40238_aqd%2Fuf    ] o.a.s.h.a.PrepRecoveryOp Waited coreNodeName: core_node2, state: recovering, checkLive: true, onlyIfLeader: true for: 1 seconds.
   [junit4]   2> 238910 INFO  (qtp10427241-1273) [n:127.0.0.1:40238_aqd%2Fuf    ] o.a.s.s.HttpSolrCall [admin] webapp=null path=/admin/cores params={nodeName=127.0.0.1:45746_aqd%252Fuf&onlyIfLeaderActive=true&core=collection1&coreNodeName=core_node2&action=PREPRECOVERY&checkLive=true&state=recovering&onlyIfLeader=true&wt=javabin&version=2} status=0 QTime=1000
   [junit4]   2> 239462 INFO  (coreLoadExecutor-562-thread-1-processing-n:127.0.0.1:43537_aqd%2Fuf) [n:127.0.0.1:43537_aqd%2Fuf c:collection1   x:collection1] o.a.s.c.SolrConfig Using Lucene MatchVersion: 7.0.0
   [junit4]   2> 239480 INFO  (coreLoadExecutor-562-thread-1-processing-n:127.0.0.1:43537_aqd%2Fuf) [n:127.0.0.1:43537_aqd%2Fuf c:collection1   x:collection1] o.a.s.s.IndexSchema [collection1] Schema name=test
   [junit4]   2> 239597 WARN  (coreLoadExecutor-562-thread-1-processing-n:127.0.0.1:43537_aqd%2Fuf) [n:127.0.0.1:43537_aqd%2Fuf c:collection1   x:collection1] o.a.s.s.IndexSchema [collection1] default search field in schema is text. WARNING: Deprecated, please use 'df' on request instead.
   [junit4]   2> 239600 INFO  (coreLoadExecutor-562-thread-1-processing-n:127.0.0.1:43537_aqd%2Fuf) [n:127.0.0.1:43537_aqd%2Fuf c:collection1   x:collection1] o.a.s.s.IndexSchema Loaded schema test/1.0 with uniqueid field id
   [junit4]   2> 239617 INFO  (coreLoadExecutor-562-thread-1-processing-n:127.0.0.1:43537_aqd%2Fuf) [n:127.0.0.1:43537_aqd%2Fuf c:collection1   x:collection1] o.a.s.c.CoreContainer Creating SolrCore 'collection1' using configuration from collection collection1
   [junit4]   2> 239618 INFO  (coreLoadExecutor-562-thread-1-processing-n:127.0.0.1:43537_aqd%2Fuf) [n:127.0.0.1:43537_aqd%2Fuf c:collection1   x:collection1] o.a.s.c.SolrCore [[collection1] ] Opening new SolrCore at [/home/jenkins/workspace/Lucene-Solr-master-Linux/solr/build/solr-core/test/J0/temp/solr.cloud.PeerSyncReplicationTest_8376DD186AA9128B-001/shard-3-001/cores/collection1], dataDir=[/home/jenkins/workspace/Lucene-Solr-master-Linux/solr/build/solr-core/test/J0/temp/solr.cloud.PeerSyncReplicationTest_8376DD186AA9128B-001/shard-3-001/cores/collection1/data/]
   [junit4]   2> 239618 INFO  (coreLoadExecutor-562-thread-1-processing-n:127.0.0.1:43537_aqd%2Fuf) [n:127.0.0.1:43537_aqd%2Fuf c:collection1   x:collection1] o.a.s.c.JmxMonitoredMap JMX monitoring is enabled. Adding Solr mbeans to JMX Server: com.sun.jmx.mbeanserver.JmxMBeanServer@654620
   [junit4]   2> 239620 INFO  (coreLoadExecutor-562-thread-1-processing-n:127.0.0.1:43537_aqd%2Fuf) [n:127.0.0.1:43537_aqd%2Fuf c:collection1   x:collection1] o.a.s.u.RandomMergePolicy RandomMergePolicy wrapping class org.apache.lucene.index.AlcoholicMergePolicy: [AlcoholicMergePolicy: minMergeSize=0, mergeFactor=10, maxMergeSize=1614228595, maxMergeSizeForForcedMerge=9223372036854775807, calibrateSizeByDeletes=true, maxMergeDocs=2147483647, maxCFSSegmentSizeMB=8.796093022207999E12, noCFSRatio=0.1]
   [junit4]   2> 239669 WARN  (coreLoadExecutor-562-thread-1-processing-n:127.0.0.1:43537_aqd%2Fuf) [n:127.0.0.1:43537_aqd%2Fuf c:collection1   x:collection1] o.a.s.c.RequestHandlers INVALID paramSet a in requestHandler {type = requestHandler,name = /dump,class = DumpRequestHandler,attributes = {initParams=a, name=/dump, class=DumpRequestHandler},args = {defaults={a=A,b=B}}}
   [junit4]   2> 239677 INFO  (coreLoadExecutor-562-thread-1-processing-n:127.0.0.1:43537_aqd%2Fuf) [n:127.0.0.1:43537_aqd%2Fuf c:collection1   x:collection1] o.a.s.u.UpdateHandler Using UpdateLog implementation: org.apache.solr.update.UpdateLog
   [junit4]   2> 239677 INFO  (coreLoadExecutor-562-thread-1-processing-n:127.0.0.1:43537_aqd%2Fuf) [n:127.0.0.1:43537_aqd%2Fuf c:collection1   x:collection1] o.a.s.u.UpdateLog Initializing UpdateLog: dataDir= defaultSyncLevel=FLUSH numRecordsToKeep=1000 maxNumLogsToKeep=10 numVersionBuckets=65536
   [junit4]   2> 239679 INFO  (coreLoadExecutor-562-thread-1-processing-n:127.0.0.1:43537_aqd%2Fuf) [n:127.0.0.1:43537_aqd%2Fuf c:collection1   x:collection1] o.a.s.u.CommitTracker Hard AutoCommit: disabled
   [junit4]   2> 239679 INFO  (coreLoadExecutor-562-thread-1-processing-n:127.0.0.1:43537_aqd%2Fuf) [n:127.0.0.1:43537_aqd%2Fuf c:collection1   x:collection1] o.a.s.u.CommitTracker Soft AutoCommit: disabled
   [junit4]   2> 239680 INFO  (coreLoadExecutor-562-thread-1-processing-n:127.0.0.1:43537_aqd%2Fuf) [n:127.0.0.1:43537_aqd%2Fuf c:collection1   x:collection1] o.a.s.u.RandomMergePolicy RandomMergePolicy wrapping class org.apache.lucene.index.AlcoholicMergePolicy: [AlcoholicMergePolicy: minMergeSize=0, mergeFactor=10, maxMergeSize=275115888, maxMergeSizeForForcedMerge=9223372036854775807, calibrateSizeByDeletes=true, maxMergeDocs=2147483647, maxCFSSegmentSizeMB=8.796093022207999E12, noCFSRatio=0.1]
   [junit4]   2> 239681 INFO  (coreLoadExecutor-562-thread-1-processing-n:127.0.0.1:43537_aqd%2Fuf) [n:127.0.0.1:43537_aqd%2Fuf c:collection1   x:collection1] o.a.s.s.SolrIndexSearcher Opening [Searcher@1b21c97[collection1] main]
   [junit4]   2> 239682 INFO  (coreLoadExecutor-562-thread-1-processing-n:127.0.0.1:43537_aqd%2Fuf) [n:127.0.0.1:43537_aqd%2Fuf c:collection1   x:collection1] o.a.s.r.ManagedResourceStorage Configured ZooKeeperStorageIO with znodeBase: /configs/conf1
   [junit4]   2> 239682 INFO  (coreLoadExecutor-562-thread-1-processing-n:127.0.0.1:43537_aqd%2Fuf) [n:127.0.0.1:43537_aqd%2Fuf c:collection1   x:collection1] o.a.s.r.ManagedResourceStorage Loaded null at path _rest_managed.json using ZooKeeperStorageIO:path=/configs/conf1
   [junit4]   2> 239682 INFO  (coreLoadExecutor-562-thread-1-processing-n:127.0.0.1:43537_aqd%2Fuf) [n:127.0.0.1:43537_aqd%2Fuf c:collection1   x:collection1] o.a.s.h.ReplicationHandler Commits will be reserved for  10000
   [junit4]   2> 239683 INFO  (searcherExecutor-563-thread-1-processing-n:127.0.0.1:43537_aqd%2Fuf x:collection1 c:collection1) [n:127.0.0.1:43537_aqd%2Fuf c:collection1   x:collection1] o.a.s.c.SolrCore [collection1] Registered new searcher Searcher@1b21c97[collection1] main{ExitableDirectoryReader(UninvertingDirectoryReader())}
   [junit4]   2> 239683 INFO  (coreLoadExecutor-562-thread-1-processing-n:127.0.0.1:43537_aqd%2Fuf) [n:127.0.0.1:43537_aqd%2Fuf c:collection1   x:collection1] o.a.s.u.UpdateLog Could not find max version in index or recent updates, using new clock 1555618015011143680
   [junit4]   2> 239687 INFO  (coreZkRegister-557-thread-1-processing-n:127.0.0.1:43537_aqd%2Fuf x:collection1 c:collection1) [n:127.0.0.1:43537_aqd%2Fuf c:collection1 s:shard1 r:core_node3 x:collection1] o.a.s.c.ZkController Core needs to recover:collection1
   [junit4]   2> 239687 INFO  (updateExecutor-157-thread-1-processing-n:127.0.0.1:43537_aqd%2Fuf x:collection1 s:shard1 c:collection1 r:core_node3) [n:127.0.0.1:43537_aqd%2Fuf c:collection1 s:shard1 r:core_node3 x:collection1] o.a.s.u.DefaultSolrCoreState Running recovery
   [junit4]   2> 239687 INFO  (recoveryExecutor-158-thread-1-processing-n:127.0.0.1:43537_aqd%2Fuf x:collection1 s:shard1 c:collection1 r:core_node3) [n:127.0.0.1:43537_aqd%2Fuf c:collection1 s:shard1 r:core_node3 x:collection1] o.a.s.c.RecoveryStrategy Starting recovery process. recoveringAfterStartup=true
   [junit4]   2> 239687 INFO  (recoveryExecutor-158-thread-1-processing-n:127.0.0.1:43537_aqd%2Fuf x:collection1 s:shard1 c:collection1 r:core_node3) [n:127.0.0.1:43537_aqd%2Fuf c:collection1 s:shard1 r:core_node3 x:collection1] o.a.s.c.RecoveryStrategy ###### startupVersions=[[]]
   [junit4]   2> 239687 INFO  (recoveryExecutor-158-thread-1-processing-n:127.0.0.1:43537_aqd%2Fuf x:collection1 s:shard1 c:collection1 r:core_node3) [n:127.0.0.1:43537_aqd%2Fuf c:collection1 s:shard1 r:core_node3 x:collection1] o.a.s.c.RecoveryStrategy Begin buffering updates. core=[collection1]
   [junit4]   2> 239687 INFO  (recoveryExecutor-158-thread-1-processing-n:127.0.0.1:43537_aqd%2Fuf x:collection1 s:shard1 c:collection1 r:core_node3) [n:127.0.0.1:43537_aqd%2Fuf c:collection1 s:shard1 r:core_node3 x:collection1] o.a.s.u.UpdateLog Starting to buffer updates. FSUpdateLog{state=ACTIVE, tlog=null}
   [junit4]   2> 239687 INFO  (recoveryExecutor-158-thread-1-processing-n:127.0.0.1:43537_aqd%2Fuf x:collection1 s:shard1 c:collection1 r:core_node3) [n:127.0.0.1:43537_aqd%2Fuf c:collection1 s:shard1 r:core_node3 x:collection1] o.a.s.c.RecoveryStrategy Publishing state of core [collection1] as recovering, leader is [https://127.0.0.1:40238/aqd/uf/collection1/] and I am [https://127.0.0.1:43537/aqd/uf/collection1/]
   [junit4]   2> 239689 INFO  (recoveryExecutor-158-thread-1-processing-n:127.0.0.1:43537_aqd%2Fuf x:collection1 s:shard1 c:collection1 r:core_node3) [n:127.0.0.1:43537_aqd%2Fuf c:collection1 s:shard1 r:core_node3 x:collection1] o.a.s.c.RecoveryStrategy Sending prep recovery command to [https://127.0.0.1:40238/aqd/uf]; [WaitForState: action=PREPRECOVERY&core=collection1&nodeName=127.0.0.1:43537_aqd%252Fuf&coreNodeName=core_node3&state=recovering&checkLive=true&onlyIfLeader=true&onlyIfLeaderActive=true]
   [junit4]   2> 239694 INFO  (qtp10427241-1279) [n:127.0.0.1:40238_aqd%2Fuf    ] o.a.s.h.a.PrepRecoveryOp Going to wait for coreNodeName: core_node3, state: recovering, checkLive: true, onlyIfLeader: true, onlyIfLeaderActive: true
   [junit4]   2> 239694 INFO  (qtp10427241-1279) [n:127.0.0.1:40238_aqd%2Fuf    ] o.a.s.h.a.PrepRecoveryOp Will wait a max of 183 seconds to see collection1 (shard1 of collection1) have state: recovering
   [junit4]   2> 239694 INFO  (qtp10427241-1279) [n:127.0.0.1:40238_aqd%2Fuf    ] o.a.s.h.a.PrepRecoveryOp In WaitForState(recovering): collection=collection1, shard=shard1, thisCore=collection1, leaderDoesNotNeedRecovery=false, isLeader? true, live=true, checkLive=true, currentState=down, localState=active, nodeName=127.0.0.1:43537_aqd%2Fuf, coreNodeName=core_node3, onlyIfActiveCheckResult=false, nodeProps: core_node3:{"core":"collection1","base_url":"https://127.0.0.1:43537/aqd/uf","node_name":"127.0.0.1:43537_aqd%2Fuf","state":"down"}
   [junit4]   2> 239981 INFO  (TEST-PeerSyncReplicationTest.test-seed#[8376DD186AA9128B]) [    ] o.a.s.SolrTestCaseJ4 ###Starting test
   [junit4]   2> 239981 INFO  (TEST-PeerSyncReplicationTest.test-seed#[8376DD186AA9128B]) [    ] o.a.s.c.AbstractFullDistribZkTestBase Wait for recoveries to finish - wait 30 for each attempt
   [junit4]   2> 239981 INFO  (TEST-PeerSyncReplicationTest.test-seed#[8376DD186AA9128B]) [    ] o.a.s.c.AbstractDistribZkTestBase Wait for recoveries to finish - collection: collection1 failOnTimeout:true timeout (sec):30
   [junit4]   2> 240694 INFO  (qtp10427241-1279) [n:127.0.0.1:40238_aqd%2Fuf    ] o.a.s.h.a.PrepRecoveryOp In WaitForState(recovering): collection=collection1, shard=shard1, thisCore=collection1, leaderDoesNotNeedRecovery=false, isLeader? true, live=true, checkLive=true, currentState=recovering, localState=active, nodeName=127.0.0.1:43537_aqd%2Fuf, coreNodeName=core_node3, onlyIfActiveCheckResult=false, nodeProps: core_node3:{"core":"collection1","base_url":"https://127.0.0.1:43537/aqd/uf","node_name":"127.0.0.1:43537_aqd%2Fuf","state":"recovering"}
   [junit4]   2> 240694 INFO  (qtp10427241-1279) [n:127.0.0.1:40238_aqd%2Fuf    ] o.a.s.h.a.PrepRecoveryOp Waited coreNodeName: core_node3, state: recovering, checkLive: true, onlyIfLeader: true for: 1 seconds.
   [junit4]   2> 240694 INFO  (qtp10427241-1279) [n:127.0.0.1:40238_aqd%2Fuf    ] o.a.s.s.HttpSolrCall [admin] webapp=null path=/admin/cores params={nodeName=127.0.0.1:43537_aqd%252Fuf&onlyIfLeaderActive=true&core=collection1&coreNodeName=core_node3&action=PREPRECOVERY&checkLive=true&state=recovering&onlyIfLeader=true&wt=javabin&version=2} status=0 QTime=1000
   [junit4]   2> 245910 INFO  (recoveryExecutor-151-thread-1-processing-n:127.0.0.1:45746_aqd%2Fuf x:collection1 s:shard1 c:collection1 r:core_node2) [n:127.0.0.1:45746_aqd%2Fuf c:collection1 s:shard1 r:core_node2 x:collection1] o.a.s.c.RecoveryStrategy Attempting to PeerSync from [https://127.0.0.1:40238/aqd/uf/collection1/] - recoveringAfterStartup=[true]
   [junit4]   2> 245910 INFO  (recoveryExecutor-151-thread-1-processing-n:127.0.0.1:45746_aqd%2Fuf x:collection1 s:shard1 c:collection1 r:core_node2) [n:127.0.0.1:45746_aqd%2Fuf c:collection1 s:shard1 r:core_node2 x:collection1] o.a.s.u.PeerSync PeerSync: core=collection1 url=https://127.0.0.1:45746/aqd/uf START replicas=[https://127.0.0.1:40238/aqd/uf/collection1/] nUpdates=1000
   [junit4]   2> 245915 INFO  (qtp10427241-1274) [n:127.0.0.1:40238_aqd%2Fuf c:collection1 s:shard1 r:core_node1 x:collection1] o.a.s.u.IndexFingerprint IndexFingerprint millis:0.0 result:{maxVersionSpecified=9223372036854775807, maxVersionEncountered=0, maxInHash=0, versionsHash=0, numVersions=0, numDocs=0, maxDoc=0}
   [junit4]   2> 245915 INFO  (qtp10427241-1274) [n:127.0.0.1:40238_aqd%2Fuf c:collection1 s:shard1 r:core_node1 x:collection1] o.a.s.c.S.Request [collection1]  webapp=/aqd/uf path=/get params={distrib=false&qt=/get&getFingerprint=9223372036854775807&wt=javabin&version=2} status=0 QTime=0
   [junit4]   2> 245916 INFO  (recoveryExecutor-151-thread-1-processing-n:127.0.0.1:45746_aqd%2Fuf x:collection1 s:shard1 c:collection1 r:core_node2) [n:127.0.0.1:45746_aqd%2Fuf c:collection1 s:shard1 r:core_node2 x:collection1] o.a.s.u.IndexFingerprint IndexFingerprint millis:0.0 result:{maxVersionSpecified=9223372036854775807, maxVersionEncountered=0, maxInHash=0, versionsHash=0, numVersions=0, numDocs=0, maxDoc=0}
   [junit4]   2> 245916 INFO  (recoveryExecutor-151-thread-1-processing-n:127.0.0.1:45746_aqd%2Fuf x:collection1 s:shard1 c:collection1 r:core_node2) [n:127.0.0.1:45746_aqd%2Fuf c:collection1 s:shard1 r:core_node2 x:collection1] o.a.s.u.PeerSync We are already in sync. No need to do a PeerSync 
   [junit4]   2> 245916 INFO  (recoveryExecutor-151-thread-1-processing-n:127.0.0.1:45746_aqd%2Fuf x:collection1 s:shard1 c:collection1 r:core_node2) [n:127.0.0.1:45746_aqd%2Fuf c:collection1 s:shard1 r:core_node2 x:collection1] o.a.s.u.DirectUpdateHandler2 start commit{,optimize=false,openSearcher=true,waitSearcher=true,expungeDeletes=false,softCommit=false,prepareCommit=false}
   [junit4]   2> 245916 INFO  (recoveryExecutor-151-thread-1-processing-n:127.0.0.1:45746_aqd%2Fuf x:collection1 s:shard1 c:collection1 r:core_node2) [n:127.0.0.1:45746_aqd%2Fuf c:collection1 s:shard1 r:core_node2 x:collection1] o.a.s.u.DirectUpdateHandler2 No uncommitted changes. Skipping IW.commit.
   [junit4]   2> 245916 INFO  (recoveryExecutor-151-thread-1-processing-n:127.0.0.1:45746_aqd%2Fuf x:collection1 s:shard1 c:collection1 r:core_node2) [n:127.0.0.1:45746_aqd%2Fuf c:collection1 s:shard1 r:core_node2 x:collection1] o.a.s.u.DirectUpdateHandler2 end_commit_flush
   [junit4]   2> 245916 INFO  (recoveryExecutor-151-thread-1-processing-n:127.0.0.1:45746_aqd%2Fuf x:collection1 s:shard1 c:collection1 r:core_node2) [n:127.0.0.1:45746_aqd%2Fuf c:collection1 s:shard1 r:core_node2 x:collection1] o.a.s.c.RecoveryStrategy PeerSync stage of recovery was successful.
   [junit4]   2> 245916 INFO  (recoveryExecutor-151-thread-1-processing-n:127.0.0.1:45746_aqd%2Fuf x:collection1 s:shard1 c:collection1 r:core_node2) [n:127.0.0.1:45746_aqd%2Fuf c:collection1 s:shard1 r:core_node2 x:collection1] o.a.s.c.RecoveryStrategy Replaying updates buffered during PeerSync.
   [junit4]   2> 245916 INFO  (recoveryExecutor-151-thread-1-processing-n:127.0.0.1:45746_aqd%2Fuf x:collection1 s:shard1 c:collection1 r:core_node2) [n:127.0.0.1:45746_aqd%2Fuf c:collection1 s:shard1 r:core_node2 x:collection1] o.a.s.c.RecoveryStrategy No replay needed.
   [junit4]   2> 245916 INFO  (recoveryExecutor-151-thread-1-processing-n:127.0.0.1:45746_aqd%2Fuf x:collection1 s:shard1 c:collection1 r:core_node2) [n:127.0.0.1:45746_aqd%2Fuf c:collection1 s:shard1 r:core_node2 x:collection1] o.a.s.c.RecoveryStrategy Registering as Active after recovery.
   [junit4]   2> 247695 INFO  (recoveryExecutor-158-thread-1-processing-n:127.0.0.1:43537_aqd%2Fuf x:collection1 s:shard1 c:collection1 r:core_node3) [n:127.0.0.1:43537_aqd%2Fuf c:collection1 s:shard1 r:core_node3 x:collection1] o.a.s.c.RecoveryStrategy Attempting to PeerSync from [https://127.0.0.1:40238/aqd/uf/collection1/] - recoveringAfterStartup=[true]
   [junit4]   2> 247695 INFO  (recoveryExecutor-158-thread-1-processing-n:127.0.0.1:43537_aqd%2Fuf x:collection1 s:shard1 c:collection1 r:core_node3) [n:127.0.0.1:43537_aqd%2Fuf c:collection1 s:shard1 r:core_node3 x:collection1] o.a.s.u.PeerSync PeerSync: core=collection1 url=https://127.0.0.1:43537/aqd/uf START replicas=[https://127.0.0.1:40238/aqd/uf/collection1/] nUpdates=1000
   [junit4]   2> 247710 INFO  (qtp10427241-1275) [n:127.0.0.1:40238_aqd%2Fuf c:collection1 s:shard1 r:core_node1 x:collection1] o.a.s.u.IndexFingerprint IndexFingerprint millis:0.0 result:{maxVersionSpecified=9223372036854775807, maxVersionEncountered=0, maxInHash=0, versionsHash=0, numVersions=0, numDocs=0, maxDoc=0}
   [junit4]   2> 247710 INFO  (qtp10427241-1275) [n:127.0.0.1:40238_aqd%2Fuf c:collection1 s:shard1 r:core_node1 x:collection1] o.a.s.c.S.Request [collection1]  webapp=/aqd/uf path=/get params={distrib=false&qt=/get&getFingerprint=9223372036854775807&wt=javabin&version=2} status=0 QTime=0
   [junit4]   2> 247711 INFO  (recoveryExecutor-158-thread-1-processing-n:127.0.0.1:43537_aqd%2Fuf x:collection1 s:shard1 c:collection1 r:core_node3) [n:127.0.0.1:43537_aqd%2Fuf c:collection1 s:shard1 r:core_node3 x:collection1] o.a.s.u.IndexFingerprint IndexFingerprint millis:0.0 result:{maxVersionSpecified=9223372036854775807, maxVersionEncountered=0, maxInHash=0, versionsHash=0, numVersions=0, numDocs=0, maxDoc=0}
   [junit4]   2> 247711 INFO  (recoveryExecutor-158-thread-1-processing-n:127.0.0.1:43537_aqd%2Fuf x:collection1 s:shard1 c:collection1 r:core_node3) [n:127.0.0.1:43537_aqd%2Fuf c:collection1 s:shard1 r:core_node3 x:collection1] o.a.s.u.PeerSync We are already in sync. No need to do a PeerSync 
   [junit4]   2> 247711 INFO  (recoveryExecutor-158-thread-1-processing-n:127.0.0.1:43537_aqd%2Fuf x:collection1 s:shard1 c:collection1 r:core_node3) [n:127.0.0.1:43537_aqd%2Fuf c:collection1 s:shard1 r:core_node3 x:collection1] o.a.s.u.DirectUpdateHandler2 start commit{,optimize=false,openSearcher=true,waitSearcher=true,expungeDeletes=false,softCommit=false,prepareCommit=false}
   [junit4]   2> 247711 INFO  (recoveryExecutor-158-thread-1-processing-n:127.0.0.1:43537_aqd%2Fuf x:collection1 s:shard1 c:collection1 r:core_node3) [n:127.0.0.1:43537_aqd%2Fuf c:collection1 s:shard1 r:core_node3 x:collection1] o.a.s.u.DirectUpdateHandler2 No uncommitted changes. Skipping IW.commit.
   [junit4]   2> 247712 INFO  (recoveryExecutor-158-thread-1-processing-n:127.0.0.1:43537_aqd%2Fuf x:collection1 s:shard1 c:collection1 r:core_node3) [n:127.0.0.1:43537_aqd%2Fuf c:collection1 s:shard1 r:core_node3 x:collection1] o.a.s.u.DirectUpdateHandler2 end_commit_flush
   [junit4]   2> 247712 INFO  (recoveryExecutor-158-thread-1-processing-n:127.0.0.1:43537_aqd%2Fuf x:collection1 s:shard1 c:collection1 r:core_node3) [n:127.0.0.1:43537_aqd%2Fuf c:collection1 s:shard1 r:core_node3 x:collection1] o.a.s.c.RecoveryStrategy PeerSync stage of recovery was successful.
   [junit4]   2> 247712 INFO  (recoveryExecutor-158-thread-1-processing-n:127.0.0.1:43537_aqd%2Fuf x:collection1 s:shard1 c:collection1 r:core_node3) [n:127.0.0.1:43537_aqd%2Fuf c:collection1 s:shard1 r:core_node3 x:collection1] o.a.s.c.RecoveryStrategy Replaying updates buffered during PeerSync.
   [junit4]   2> 247712 INFO  (recoveryExecutor-158-thread-1-processing-n:127.0.0.1:43537_aqd%2Fuf x:collection1 s:shard1 c:collection1 r:core_node3) [n:127.0.0.1:43537_aqd%2Fuf c:collection1 s:shard1 r:core_node3 x:collection1] o.a.s.c.RecoveryStrategy No replay needed.
   [junit4]   2> 247712 INFO  (recoveryExecutor-158-thread-1-processing-n:127.0.0.1:43537_aqd%2Fuf x:collection1 s:shard1 c:collection1 r:core_node3) [n:127.0.0.1:43537_aqd%2Fuf c:collection1 s:shard1 r:core_node3 x:collection1] o.a.s.c.RecoveryStrategy Registering as Active after recovery.
   [junit4]   2> 247982 INFO  (TEST-PeerSyncReplicationTest.test-seed#[8376DD186AA9128B]) [    ] o.a.s.c.AbstractDistribZkTestBase Recoveries finished - collection: collection1
   [junit4]   2> 248077 INFO  (qtp19872558-1236) [n:127.0.0.1:43788_aqd%2Fuf c:control_collection s:shard1 r:core_node1 x:collection1] o.a.s.u.DirectUpdateHandler2 start commit{,optimize=false,openSearcher=true,waitSearcher=true,expungeDeletes=false,softCommit=false,prepareCommit=false}
   [junit4]   2> 248078 INFO  (qtp19872558-1236) [n:127.0.0.1:43788_aqd%2Fuf c:control_collection s:shard1 r:core_node1 x:collection1] o.a.s.u.DirectUpdateHandler2 No uncommitted changes. Skipping IW.commit.
   [junit4]   2> 248079 INFO  (qtp19872558-1236) [n:127.0.0.1:43788_aqd%2Fuf c:control_collection s:shard1 r:core_node1 x:collection1] o.a.s.u.DirectUpdateHandler2 end_commit_flush
   [junit4]   2> 248079 INFO  (qtp19872558-1236) [n:127.0.0.1:43788_aqd%2Fuf c:control_collection s:shard1 r:core_node1 x:collection1] o.a.s.u.p.LogUpdateProcessorFactory [collection1]  webapp=/aqd/uf path=/update params={waitSearcher=true&commit=true&softCommit=false&wt=javabin&version=2}{commit=} 0 2
   [junit4]   2> 248103 INFO  (qtp10427241-1276) [n:127.0.0.1:40238_aqd%2Fuf c:collection1 s:shard1 r:core_node1 x:collection1] o.a.s.u.DirectUpdateHandler2 start commit{,optimize=false,openSearcher=true,waitSearcher=true,expungeDeletes=false,softCommit=false,prepareCommit=false}
   [junit4]   2> 248104 INFO  (qtp10427241-1276) [n:127.0.0.1:40238_aqd%2Fuf c:collection1 s:shard1 r:core_node1 x:collection1] o.a.s.u.DirectUpdateHandler2 No uncommitted changes. Skipping IW.commit.
   [junit4]   2> 248108 INFO  (qtp10427241-1276) [n:127.0.0.1:40238_aqd%2Fuf c:collection1 s:shard1 r:core_node1 x:collection1] o.a.s.u.DirectUpdateHandler2 end_commit_flush
   [junit4]   2> 248108 INFO  (qtp10427241-1276) [n:127.0.0.1:40238_aqd%2Fuf c:collection1 s:shard1 r:core_node1 x:collection1] o.a.s.u.p.LogUpdateProcessorFactory [collection1]  webapp=/aqd/uf path=/update params={update.distrib=FROMLEADER&waitSearcher=true&openSearcher=true&commit=true&softCommit=false&distrib.from=https://127.0.0.1:40238/aqd/uf/collection1/&commit_end_point=true&wt=javabin&version=2&expungeDeletes=false}{commit=} 0 4
   [junit4]   2> 248175 INFO  (qtp14308353-1301) [n:127.0.0.1:45746_aqd%2Fuf c:collection1 s:shard1 r:core_node2 x:collection1] o.a.s.u.DirectUpdateHandler2 start commit{,optimize=false,openSearcher=true,waitSearcher=true,expungeDeletes=false,softCommit=false,prepareCommit=false}
   [junit4]   2> 248175 INFO  (qtp14308353-1301) [n:127.0.0.1:45746_aqd%2Fuf c:collection1 s:shard1 r:core_node2 x:collection1] o.a.s.u.DirectUpdateHandler2 No uncommitted changes. Skipping IW.commit.
   [junit4]   2> 248176 INFO  (qtp14308353-1301) [n:127.0.0.1:45746_aqd%2Fuf c:collection1 s:shard1 r:core_node2 x:collection1] o.a.s.u.DirectUpdateHandler2 end_commit_flush
   [junit4]   2> 248176 INFO  (qtp14308353-1301) [n:127.0.0.1:45746_aqd%2Fuf c:collection1 s:shard1 r:core_node2 x:collection1] o.a.s.u.p.LogUpdateProcessorFactory [collection1]  webapp=/aqd/uf path=/update params={update.distrib=FROMLEADER&waitSearcher=true&openSearcher=true&commit=true&softCommit=false&distrib.from=https://127.0.0.1:40238/aqd/uf/collection1/&commit_end_point=true&wt=javabin&version=2&expungeDeletes=false}{commit=} 0 1
   [junit4]   2> 248201 INFO  (qtp26297503-1343) [n:127.0.0.1:43537_aqd%2Fuf c:collection1 s:shard1 r:core_node3 x:collection1] o.a.s.u.DirectUpdateHandler2 start commit{,optimize=false,openSearcher=true,waitSearcher=true,expungeDeletes=false,softCommit=false,prepareCommit=false}
   [junit4]   2> 248202 INFO  (qtp26297503-1343) [n:127.0.0.1:43537_aqd%2Fuf c:collection1 s:shard1 r:core_node3 x:collection1] o.a.s.u.DirectUpdateHandler2 No uncommitted changes. Skipping IW.commit.
   [junit4]   2> 248202 INFO  (qtp26297503-1343) [n:127.0.0.1:43537_aqd%2Fuf c:collection1 s:shard1 r:core_node3 x:collection1] o.a.s.u.DirectUpdateHandler2 end_commit_flush
   [junit4]   2> 248202 INFO  (qtp26297503-1343) [n:127.0.0.1:43537_aqd%2Fuf c:collection1 s:shard1 r:core_node3 x:collection1] o.a.s.u.p.LogUpdateProcessorFactory [collection1]  webapp=/aqd/uf path=/update params={update.distrib=FROMLEADER&waitSearcher=true&openSearcher=true&commit=true&softCommit=false&distrib.from=https://127.0.0.1:40238/aqd/uf/collection1/&commit_end_point=true&wt=javabin&version=2&expungeDeletes=false}{commit=} 0 2
   [junit4]   2> 248203 INFO  (qtp10427241-1274) [n:127.0.0.1:40238_aqd%2Fuf c:collection1 s:shard1 r:core_node1 x:collection1] o.a.s.u.p.LogUpdateProcessorFactory [collection1]  webapp=/aqd/uf path=/update params={waitSearcher=true&commit=true&softCommit=false&wt=javabin&version=2}{commit=} 0 120
   [junit4]   2> 248207 INFO  (qtp10427241-1276) [n:127.0.0.1:40238_aqd%2Fuf c:collection1 s:shard1 r:core_node1 x:collection1] o.a.s.c.S.Request [collection1]  webapp=/aqd/uf path=/select params={q=*:*&distrib=false&tests=checkShardConsistency&rows=0&wt=javabin&version=2} hits=0 status=0 QTime=0
   [junit4]   2> 248211 INFO  (qtp14308353-1302) [n:127.0.0.1:45746_aqd%2Fuf c:collection1 s:shard1 r:core_node2 x:collection1] o.a.s.c.S.Request [collection1]  webapp=/aqd/uf path=/select params={q=*:*&distrib=false&tests=checkShardConsistency&rows=0&wt=javabin&version=2} hits=0 status=0 QTime=0
   [junit4]   2> 248219 INFO  (qtp26297503-1343) [n:127.0.0.1:43537_aqd%2Fuf c:collection1 s:shard1 r:core_node3 x:collection1] o.a.s.c.S.Request [collection1]  webapp=/aqd/uf path=/select params={q=*:*&distrib=false&tests=checkShardConsistency&rows=0&wt=javabin&version=2} hits=0 status=0 QTime=0
   [junit4]   2> 250223 INFO  (qtp19872558-1241) [n:127.0.0.1:43788_aqd%2Fuf c:control_collection s:shard1 r:core_node1 x:collection1] o.a.s.u.p.LogUpdateProcessorFactory [collection1]  webapp=/aqd/uf path=/update params={wt=javabin&version=2}{deleteByQuery=*:* (-1555618026059988992)} 0 2
   [junit4]   2> 250232 INFO  (qtp14308353-1306) [n:127.0.0.1:45746_aqd%2Fuf c:collection1 s:shard1 r:core_node2 x:collection1] o.a.s.u.p.LogUpdateProcessorFactory [collection1]  webapp=/aqd/uf path=/update params={update.distrib=FROMLEADER&_version_=-1555618026063134720&distrib.from=https://127.0.0.1:40238/aqd/uf/collection1/&wt=javabin&version=2}{deleteByQuery=*:* (-1555618026063134720)} 0 4
   [junit4]   2> 250232 INFO  (qtp26297503-1336) [n:127.0.0.1:43537_aqd%2Fuf c:collection1 s:shard1 r:core_node3 x:collection1] o.a.s.u.p.LogUpdateProcessorFactory [collection1]  webapp=/aqd/uf path=/update params={update.distrib=FROMLEADER&_version_=-1555618026063134720&distrib.from=https://127.0.0.1:40238/aqd/uf/collection1/&wt=javabin&version=2}{deleteByQuery=*:* (-1555618026063134720)} 0 4
   [junit4]   2> 250232 INFO  (qtp10427241-1280) [n:127.0.0.1:40238_aqd%2Fuf c:collection1 s:shard1 r:core_node1 x:collection1] o.a.s.u.p.LogUpdateProcessorFactory [collection1]  webapp=/aqd/uf path=/update params={wt=javabin&version=2}{deleteByQuery=*:* (-1555618026063134720)} 0 9
   [junit4]   2> 250241 INFO  (qtp26297503-1337) [n:127.0.0.1:43537_aqd%2Fuf c:collection1 s:shard1 r:core_node3 x:collection1] o.a.s.u.p.LogUpdateProcessorFactory [collection1]  webapp=/aqd/uf path=/update params={update.distrib=FROMLEADER&distrib.from=https://127.0.0.1:40238/aqd/uf/collection1/&wt=javabin&version=2}{add=[0 (1555618026076766208)]} 0 3
   [junit4]   2> 250241 INFO  (qtp14308353-1308) [n:127.0.0.1:45746_aqd%2Fuf c:collection1 s:shard1 r:core_node2 x:collection1] o.a.s.u.p.LogUpdateProcessorFactory [collection1]  webapp=/aqd/uf path=/update params={update.distrib=FROMLEADER&distrib.from=https://127.0.0.1:40238/aqd/uf/collection1/&wt=javabin&version=2}{add=[0 (1555618026076766208)]} 0 3
   [junit4]   2> 250241 INFO  (qtp10427241-1273) [n:127.0.0.1:40238_aqd%2Fuf c:collection1 s:shard1 r:core_node1 x:collection1] o.a.s.u.p.LogUpdateProcessorFactory [collection1]  webapp=/aqd/uf path=/update params={wt=javabin&version=2}{add=[0 (1555618026076766208)]} 0 5
   [junit4]   2> 250244 INFO  (qtp26297503-1342) [n:127.0.0.1:43537_aqd%2Fuf c:collection1 s:shard1 r:core_node3 x:collection1] o.a.s.u.p.LogUpdateProcessorFactory [collection1]  webapp=/aqd/uf path=/update params={update.distrib=FROMLEADER&distrib.from=https://127.0.0.1:40238/aqd/uf/collection1/&wt=javabin&version=2}{add=[1 (1555618026083057664)]} 0 0
   [junit4]   2> 250244 INFO  (qtp14308353-1301) [n:127.0.0.1:45746_aqd%2Fuf c:collection1 s:shard1 r:core_node2 x:collection1] o.a.s.u.p.LogUpdateProcessorFactory [collection1]  webapp=/aqd/uf path=/update params={update.distrib=FROMLEADER&distrib.from=https://127.0.0.1:40238/aqd/uf/collection1/&wt=javabin&version=2}{add=[1 (1555618026083057664)]} 0 0
   [junit4]   2> 250244 INFO  (qtp10427241-1279) [n:127.0.0.1:40238_aqd%2Fuf c:collection1 s:shard1 r:core_node1 x:collection1] o.a.s.u.p.LogUpdateProcessorFactory [collection1]  webapp=/aqd/uf path=/update params={wt=javabin&version=2}{add=[1 (1555618026083057664)]} 0 2
   [junit4]   2> 250246 INFO  (qtp26297503-1343) [n:127.0.0.1:43537_aqd%2Fuf c:collection1 s:shard1 r:core_node3 x:collection1] o.a.s.u.p.LogUpdateProcessorFactory [collection1]  webapp=/aqd/uf path=/update params={update.distrib=FROMLEADER&distrib.from=https://127.0.0.1:40238/aqd/uf/collection1/&wt=javabin&version=2}{add=[2 (1555618026086203392)]} 0 0
   [junit4]   2> 250246 INFO  (qtp14308353-1307) [n:127.0.0.1:45746_aqd%2Fuf c:collection1 s:shard1 r:core_node2 x:collection1] o.a.s.u.p.LogUpdateProcessorFactory [collection1]  webapp=/aqd/uf path=/update params={update.distrib=FROMLEADER&distrib.from=https://127.0.0.1:40238/aqd/uf/collection1/&wt=javabin&version=2}{add=[2 (1555618026086203392)]} 0 0
   [junit4]   2> 250246 INFO  (qtp10427241-1276) [n:127.0.0.1:40238_aqd%2Fuf c:collection1 s:shard1 r:core_node1 x:collection1] o.a.s.u.p.LogUpdateProcessorFactory [collection1]  webapp=/aqd/uf path=/update params={wt=javabin&version=2}{add=[2 (1555618026086203392)]} 0 1
   [junit4]   2> 250248 INFO  (qtp26297503-1343) [n:127.0.0.1:43537_aqd%2Fuf c:collection1 s:shard1 r:core_node3 x:collection1] o.a.s.u.p.LogUpdateProcessorFactory [collection1]  webapp=/aqd/uf path=/update params={update.distrib=FROMLEADER&distrib.from=https://127.0.0.1:40238/aqd/uf/collection1/&wt=javabin&version=2}{add=[3 (1555618026088300544)]} 0 0
   [junit4]   2> 250248 INFO  (qtp14308353-1307) [n:127.0.0.1:45746_aqd%2Fuf c:collection1 s:shard1 r:core_node2 x:collection1] o.a.s.u.p.LogUpdateProcessorFactory [collection1]  webapp=/aqd/uf path=/update params={update.distrib=FROMLEADER&distrib.from=https://127.0.0.1:40238/aqd/uf/collection1/&wt=javabin&version=2}{add=[3 (1555618026088300544)]} 0 0
   [junit4]   2> 250248 INFO  (qtp10427241-1280) [n:127.0.0.1:40238_aqd%2Fuf c:collection1 s:shard1 r:core_node1 x:collection1] o.a.s.u.p.LogUpdateProcessorFactory [collection1]  webapp=/aqd/uf path=/update params={wt=javabin&version=2}{add=[3 (1555618026088300544)]} 0 1
   [junit4]   2> 250250 INFO  (qtp26297503-1337) [n:127.0.0.1:43537_aqd%2Fuf c:collection1 s:shard1 r:core_node3 x:collection1] o.a.s.u.p.LogUpdateProcessorFactory [collection1]  webapp=/aqd/uf path=/update params={update.distrib=FROMLEADER&distrib.from=https://127.0.0.1:40238/aqd/uf/collection1/&wt=javabin&version=2}{add=[4 (1555618026090397696)]} 0 0
   [junit4]   2> 250250 INFO  (qtp14308353-1307) [n:127.0.0.1:45746_aqd%2Fuf c:collection1 s:shard1 r:core_node2 x:collection1] o.a.s.u.p.LogUpdateProcessorFactory [collection1]  webapp=/aqd/uf path=/update params={update.distrib=FROMLEADER&distrib.from=https://127.0.0.1:40238/aqd/uf/collection1/&wt=javabin&version=2}{add=[4 (1555618026090397696)]} 0 0
   [junit4]   2> 250250 INFO  (qtp10427241-1273) [n:127.0.0.1:40238_aqd%2Fuf c:collection1 s:shard1 r:core_node1 x:collection1] o.a.s.u.p.LogUpdateProcessorFactory [collection1]  webapp=/aqd/uf path=/update params={wt=javabin&version=2}{add=[4 (1555618026090397696)]} 0 1
   [junit4]   2> 250252 INFO  (qtp26297503-1337) [n:127.0.0.1:43537_aqd%2Fuf c:collection1 s:shard1 r:core_node3 x:collection1] o.a.s.u.p.LogUpdateProcessorFactory [collection1]  webapp=/aqd/uf path=/update params={update.distrib=FROMLEADER&distrib.from=https://127.0.0.1:40238/aqd/uf/collection1/&wt=javabin&version=2}{add=[5 (1555618026092494848)]} 0 1
   [junit4]   2> 250252 INFO  (qtp14308353-1307) [n:127.0.0.1:45746_aqd%2Fuf c:collection1 s:shard1 r:core_node2 x:collection1] o.a.s.u.p.LogUpdateProcessorFactory [collection1]  webapp=/aqd/uf path=/update params={update.distrib=FROMLEADER&distrib.from=https://127.0.0.1:40238/aqd/uf/collection1/&wt=javabin&version=2}{add=[5 (1555618026092494848)]} 0 1
   [junit4]   2> 250253 INFO  (qtp10427241-1279) [n:127.0.0.1:40238_aqd%2Fuf c:collection1 s:shard1 r:core_node1 x:collection1] o.a.s.u.p.LogUpdateProcessorFactory [collection1]  webapp=/aqd/uf path=/update params={wt=javabin&version=2}{add=[5 (1555618026092494848)]} 0 2
   [junit4]   2> 250254 INFO  (qtp14308353-1306) [n:127.0.0.1:45

[...truncated too long message...]

pse.jetty.io.SelectChannelEndPoint$2.run(SelectChannelEndPoint.java:93)
   [junit4]   2> 	at org.eclipse.jetty.util.thread.strategy.ExecuteProduceConsume.executeProduceConsume(ExecuteProduceConsume.java:303)
   [junit4]   2> 	at org.eclipse.jetty.util.thread.strategy.ExecuteProduceConsume.produceConsume(ExecuteProduceConsume.java:148)
   [junit4]   2> 	at org.eclipse.jetty.util.thread.strategy.ExecuteProduceConsume.run(ExecuteProduceConsume.java:136)
   [junit4]   2> 	at org.eclipse.jetty.util.thread.QueuedThreadPool.runJob(QueuedThreadPool.java:671)
   [junit4]   2> 	at org.eclipse.jetty.util.thread.QueuedThreadPool$2.run(QueuedThreadPool.java:589)
   [junit4]   2> 	at java.lang.Thread.run(Thread.java:745)
   [junit4]   2> 
   [junit4]   2> 435339 INFO  (qtp10427241-1462) [n:127.0.0.1:40238_aqd%2Fuf    ] o.a.s.s.HttpSolrCall [admin] webapp=null path=/admin/cores params={nodeName=127.0.0.1:45746_aqd%252Fuf&onlyIfLeaderActive=true&core=collection1&coreNodeName=core_node2&action=PREPRECOVERY&checkLive=true&state=recovering&onlyIfLeader=true&wt=javabin&version=2} status=400 QTime=2004
   [junit4]   2> 435339 INFO  (TEST-PeerSyncReplicationTest.test-seed#[8376DD186AA9128B]) [    ] o.a.s.c.ChaosMonkey monkey: stop shard! 45746
   [junit4]   2> 435339 INFO  (TEST-PeerSyncReplicationTest.test-seed#[8376DD186AA9128B]) [    ] o.a.s.c.CoreContainer Shutting down CoreContainer instance=11049869
   [junit4]   2> 435340 WARN  (TEST-PeerSyncReplicationTest.test-seed#[8376DD186AA9128B]) [    ] o.a.s.c.RecoveryStrategy Stopping recovery for core=[collection1] coreNodeName=[core_node2]
   [junit4]   2> 435341 WARN  (updateExecutor-164-thread-2-processing-n:127.0.0.1:45746_aqd%2Fuf) [n:127.0.0.1:45746_aqd%2Fuf c:collection1 s:shard1 r:core_node2 x:collection1] o.a.s.u.DefaultSolrCoreState Skipping recovery because Solr is shutdown
   [junit4]   2> 440176 INFO  (recoveryExecutor-165-thread-1-processing-n:127.0.0.1:45746_aqd%2Fuf x:collection1 s:shard1 c:collection1 r:core_node2) [n:127.0.0.1:45746_aqd%2Fuf c:collection1 s:shard1 r:core_node2 x:collection1] o.a.s.c.RecoveryStrategy RecoveryStrategy has been closed
   [junit4]   2> 440176 INFO  (recoveryExecutor-165-thread-1-processing-n:127.0.0.1:45746_aqd%2Fuf x:collection1 s:shard1 c:collection1 r:core_node2) [n:127.0.0.1:45746_aqd%2Fuf c:collection1 s:shard1 r:core_node2 x:collection1] o.a.s.c.RecoveryStrategy Finished recovery process, successful=[false]
   [junit4]   2> 440176 INFO  (recoveryExecutor-165-thread-1-processing-n:127.0.0.1:45746_aqd%2Fuf x:collection1 s:shard1 c:collection1 r:core_node2) [n:127.0.0.1:45746_aqd%2Fuf c:collection1 s:shard1 r:core_node2 x:collection1] o.a.s.c.SolrCore [collection1]  CLOSING SolrCore org.apache.solr.core.SolrCore@ab3a92
   [junit4]   2> 440177 WARN  (recoveryExecutor-165-thread-1-processing-n:127.0.0.1:45746_aqd%2Fuf x:collection1 s:shard1 c:collection1 r:core_node2) [n:127.0.0.1:45746_aqd%2Fuf c:collection1 s:shard1 r:core_node2 x:collection1] o.a.s.c.RecoveryStrategy Stopping recovery for core=[collection1] coreNodeName=[core_node2]
   [junit4]   2> 440184 INFO  (recoveryExecutor-165-thread-1-processing-n:127.0.0.1:45746_aqd%2Fuf x:collection1 s:shard1 c:collection1 r:core_node2) [n:127.0.0.1:45746_aqd%2Fuf c:collection1 s:shard1 r:core_node2 x:collection1] o.a.s.m.SolrMetricManager Closing metric reporters for: solr.core.collection1
   [junit4]   2> 440185 INFO  (TEST-PeerSyncReplicationTest.test-seed#[8376DD186AA9128B]) [    ] o.a.s.c.Overseer Overseer (id=97226125471252498-127.0.0.1:45746_aqd%2Fuf-n_0000000004) closing
   [junit4]   2> 440185 INFO  (OverseerStateUpdate-97226125471252498-127.0.0.1:45746_aqd%2Fuf-n_0000000004) [n:127.0.0.1:45746_aqd%2Fuf    ] o.a.s.c.Overseer Overseer Loop exiting : 127.0.0.1:45746_aqd%2Fuf
   [junit4]   2> 440186 WARN  (zkCallback-167-thread-4-processing-n:127.0.0.1:45746_aqd%2Fuf) [n:127.0.0.1:45746_aqd%2Fuf    ] o.a.s.c.c.ZkStateReader ZooKeeper watch triggered, but Solr cannot talk to ZK: [KeeperErrorCode = Session expired for /live_nodes]
   [junit4]   2> 440186 INFO  (TEST-PeerSyncReplicationTest.test-seed#[8376DD186AA9128B]) [    ] o.a.s.m.SolrMetricManager Closing metric reporters for: solr.node
   [junit4]   2> 440186 INFO  (TEST-PeerSyncReplicationTest.test-seed#[8376DD186AA9128B]) [    ] o.e.j.s.AbstractConnector Stopped ServerConnector@1547850{SSL,[ssl, http/1.1]}{127.0.0.1:45746}
   [junit4]   2> 440186 INFO  (TEST-PeerSyncReplicationTest.test-seed#[8376DD186AA9128B]) [    ] o.e.j.s.h.ContextHandler Stopped o.e.j.s.ServletContextHandler@13ac80c{/aqd/uf,null,UNAVAILABLE}
   [junit4]   2> 440187 INFO  (TEST-PeerSyncReplicationTest.test-seed#[8376DD186AA9128B]) [    ] o.a.s.c.ChaosMonkey monkey: stop shard! 43537
   [junit4]   2> 440187 INFO  (TEST-PeerSyncReplicationTest.test-seed#[8376DD186AA9128B]) [    ] o.a.s.c.ZkTestServer connecting to 127.0.0.1:41790 41790
   [junit4]   2> 440193 INFO  (Thread-287) [    ] o.a.s.c.ZkTestServer connecting to 127.0.0.1:41790 41790
   [junit4]   2> 440194 WARN  (Thread-287) [    ] o.a.s.c.ZkTestServer Watch limit violations: 
   [junit4]   2> Maximum concurrent create/delete watches above limit:
   [junit4]   2> 
   [junit4]   2> 	6	/solr/aliases.json
   [junit4]   2> 	5	/solr/security.json
   [junit4]   2> 	5	/solr/configs/conf1
   [junit4]   2> 	4	/solr/collections/collection1/state.json
   [junit4]   2> 
   [junit4]   2> Maximum concurrent data watches above limit:
   [junit4]   2> 
   [junit4]   2> 	6	/solr/clusterstate.json
   [junit4]   2> 	6	/solr/clusterprops.json
   [junit4]   2> 	2	/solr/overseer_elect/election/97226125471252489-127.0.0.1:40238_aqd%2Fuf-n_0000000001
   [junit4]   2> 	2	/solr/collections/collection1/leader_elect/shard1/election/97226125471252489-core_node1-n_0000000000
   [junit4]   2> 
   [junit4]   2> Maximum concurrent children watches above limit:
   [junit4]   2> 
   [junit4]   2> 	207	/solr/overseer/collection-queue-work
   [junit4]   2> 	27	/solr/overseer/queue
   [junit4]   2> 	6	/solr/collections
   [junit4]   2> 	5	/solr/live_nodes
   [junit4]   2> 	4	/solr/overseer/queue-work
   [junit4]   2> 
   [junit4]   2> NOTE: reproduce with: ant test  -Dtestcase=PeerSyncReplicationTest -Dtests.method=test -Dtests.seed=8376DD186AA9128B -Dtests.multiplier=3 -Dtests.slow=true -Dtests.locale=nl -Dtests.timezone=America/Bogota -Dtests.asserts=true -Dtests.file.encoding=US-ASCII
   [junit4] FAILURE  208s J0 | PeerSyncReplicationTest.test <<<
   [junit4]    > Throwable #1: java.lang.AssertionError: timeout waiting to see all nodes active
   [junit4]    > 	at __randomizedtesting.SeedInfo.seed([8376DD186AA9128B:B22E2C2C4557F73]:0)
   [junit4]    > 	at org.apache.solr.cloud.PeerSyncReplicationTest.waitTillNodesActive(PeerSyncReplicationTest.java:311)
   [junit4]    > 	at org.apache.solr.cloud.PeerSyncReplicationTest.bringUpDeadNodeAndEnsureNoReplication(PeerSyncReplicationTest.java:262)
   [junit4]    > 	at org.apache.solr.cloud.PeerSyncReplicationTest.forceNodeFailureAndDoPeerSync(PeerSyncReplicationTest.java:244)
   [junit4]    > 	at org.apache.solr.cloud.PeerSyncReplicationTest.test(PeerSyncReplicationTest.java:133)
   [junit4]    > 	at org.apache.solr.BaseDistributedSearchTestCase$ShardsRepeatRule$ShardsFixedStatement.callStatement(BaseDistributedSearchTestCase.java:985)
   [junit4]    > 	at org.apache.solr.BaseDistributedSearchTestCase$ShardsRepeatRule$ShardsStatement.evaluate(BaseDistributedSearchTestCase.java:960)
   [junit4]    > 	at java.lang.Thread.run(Thread.java:745)
   [junit4]   2> 440196 INFO  (SUITE-PeerSyncReplicationTest-seed#[8376DD186AA9128B]-worker) [    ] o.a.s.SolrTestCaseJ4 ###deleteCore
   [junit4]   2> NOTE: leaving temporary files on disk at: /home/jenkins/workspace/Lucene-Solr-master-Linux/solr/build/solr-core/test/J0/temp/solr.cloud.PeerSyncReplicationTest_8376DD186AA9128B-001
   [junit4]   2> Jan 04, 2017 6:05:47 PM com.carrotsearch.randomizedtesting.ThreadLeakControl checkThreadLeaks
   [junit4]   2> WARNING: Will linger awaiting termination of 2 leaked thread(s).
   [junit4]   2> NOTE: test params are: codec=Asserting(Lucene70): {other_tl1=PostingsFormat(name=LuceneVarGapFixedInterval), range_facet_l_dv=PostingsFormat(name=Memory), rnd_s=TestBloomFilteredLucenePostings(BloomFilteringPostingsFormat(Lucene50(blocksize=128))), multiDefault=TestBloomFilteredLucenePostings(BloomFilteringPostingsFormat(Lucene50(blocksize=128))), intDefault=PostingsFormat(name=LuceneVarGapFixedInterval), a_i1=PostingsFormat(name=LuceneVarGapFixedInterval), range_facet_l=PostingsFormat(name=LuceneVarGapFixedInterval), _version_=PostingsFormat(name=LuceneVarGapFixedInterval), a_t=PostingsFormat(name=LuceneVarGapFixedInterval), id=PostingsFormat(name=Memory), range_facet_i_dv=PostingsFormat(name=LuceneVarGapFixedInterval), text=BlockTreeOrds(blocksize=128), timestamp=PostingsFormat(name=LuceneVarGapFixedInterval)}, docValues:{range_facet_l_dv=DocValuesFormat(name=Memory), range_facet_i_dv=DocValuesFormat(name=Lucene70), timestamp=DocValuesFormat(name=Lucene70)}, maxPointsInLeafNode=1297, maxMBSortInHeap=5.371503815464217, sim=RandomSimilarity(queryNorm=true): {}, locale=nl, timezone=America/Bogota
   [junit4]   2> NOTE: Linux 4.4.0-53-generic i386/Oracle Corporation 1.8.0_112 (32-bit)/cpus=12,threads=1,free=56831832,total=192974848
   [junit4]   2> NOTE: All tests run in this JVM: [HttpPartitionTest, JavabinLoaderTest, ClusterStateTest, DistributedQueryComponentOptimizationTest, SmileWriterTest, TestFieldTypeResource, HLLUtilTest, TestClassicSimilarityFactory, TestCSVLoader, ConcurrentDeleteAndCreateCollectionTest, BooleanFieldTest, TestValueSourceCache, TestGraphTermsQParserPlugin, TestAtomicUpdateErrorCases, SolrRequestParserTest, TestRandomFlRTGCloud, XsltUpdateRequestHandlerTest, TestFastWriter, TestTrieFacet, DistributedFacetPivotSmallTest, TestRandomDVFaceting, TestBulkSchemaAPI, PeerSyncReplicationTest]
   [junit4] Completed [145/675 (1!)] on J0 in 208.17s, 1 test, 1 failure <<< FAILURES!

[...truncated 56359 lines...]


Mime
View raw message