lucene-dev mailing list archives

Site index · List index
Message view « Date » · « Thread »
Top « Date » · « Thread »
From Policeman Jenkins Server <jenk...@thetaphi.de>
Subject [JENKINS] Lucene-Solr-master-MacOSX (64bit/jdk1.8.0) - Build # 3759 - Still Unstable!
Date Fri, 06 Jan 2017 08:11:09 GMT
Build: https://jenkins.thetaphi.de/job/Lucene-Solr-master-MacOSX/3759/
Java: 64bit/jdk1.8.0 -XX:-UseCompressedOops -XX:+UseSerialGC

1 tests failed.
FAILED:  org.apache.solr.cloud.PeerSyncReplicationTest.test

Error Message:
timeout waiting to see all nodes active

Stack Trace:
java.lang.AssertionError: timeout waiting to see all nodes active
	at __randomizedtesting.SeedInfo.seed([FF2A861BB8B2200B:777EB9C1164E4DF3]:0)
	at org.junit.Assert.fail(Assert.java:93)
	at org.apache.solr.cloud.PeerSyncReplicationTest.waitTillNodesActive(PeerSyncReplicationTest.java:311)
	at org.apache.solr.cloud.PeerSyncReplicationTest.bringUpDeadNodeAndEnsureNoReplication(PeerSyncReplicationTest.java:262)
	at org.apache.solr.cloud.PeerSyncReplicationTest.forceNodeFailureAndDoPeerSync(PeerSyncReplicationTest.java:244)
	at org.apache.solr.cloud.PeerSyncReplicationTest.test(PeerSyncReplicationTest.java:133)
	at sun.reflect.NativeMethodAccessorImpl.invoke0(Native Method)
	at sun.reflect.NativeMethodAccessorImpl.invoke(NativeMethodAccessorImpl.java:62)
	at sun.reflect.DelegatingMethodAccessorImpl.invoke(DelegatingMethodAccessorImpl.java:43)
	at java.lang.reflect.Method.invoke(Method.java:498)
	at com.carrotsearch.randomizedtesting.RandomizedRunner.invoke(RandomizedRunner.java:1713)
	at com.carrotsearch.randomizedtesting.RandomizedRunner$8.evaluate(RandomizedRunner.java:907)
	at com.carrotsearch.randomizedtesting.RandomizedRunner$9.evaluate(RandomizedRunner.java:943)
	at com.carrotsearch.randomizedtesting.RandomizedRunner$10.evaluate(RandomizedRunner.java:957)
	at org.apache.solr.BaseDistributedSearchTestCase$ShardsRepeatRule$ShardsFixedStatement.callStatement(BaseDistributedSearchTestCase.java:985)
	at org.apache.solr.BaseDistributedSearchTestCase$ShardsRepeatRule$ShardsStatement.evaluate(BaseDistributedSearchTestCase.java:960)
	at com.carrotsearch.randomizedtesting.rules.SystemPropertiesRestoreRule$1.evaluate(SystemPropertiesRestoreRule.java:57)
	at org.apache.lucene.util.TestRuleSetupTeardownChained$1.evaluate(TestRuleSetupTeardownChained.java:49)
	at org.apache.lucene.util.AbstractBeforeAfterRule$1.evaluate(AbstractBeforeAfterRule.java:45)
	at org.apache.lucene.util.TestRuleThreadAndTestName$1.evaluate(TestRuleThreadAndTestName.java:48)
	at org.apache.lucene.util.TestRuleIgnoreAfterMaxFailures$1.evaluate(TestRuleIgnoreAfterMaxFailures.java:64)
	at org.apache.lucene.util.TestRuleMarkFailure$1.evaluate(TestRuleMarkFailure.java:47)
	at com.carrotsearch.randomizedtesting.rules.StatementAdapter.evaluate(StatementAdapter.java:36)
	at com.carrotsearch.randomizedtesting.ThreadLeakControl$StatementRunner.run(ThreadLeakControl.java:367)
	at com.carrotsearch.randomizedtesting.ThreadLeakControl.forkTimeoutingTask(ThreadLeakControl.java:811)
	at com.carrotsearch.randomizedtesting.ThreadLeakControl$3.evaluate(ThreadLeakControl.java:462)
	at com.carrotsearch.randomizedtesting.RandomizedRunner.runSingleTest(RandomizedRunner.java:916)
	at com.carrotsearch.randomizedtesting.RandomizedRunner$5.evaluate(RandomizedRunner.java:802)
	at com.carrotsearch.randomizedtesting.RandomizedRunner$6.evaluate(RandomizedRunner.java:852)
	at com.carrotsearch.randomizedtesting.RandomizedRunner$7.evaluate(RandomizedRunner.java:863)
	at com.carrotsearch.randomizedtesting.rules.StatementAdapter.evaluate(StatementAdapter.java:36)
	at com.carrotsearch.randomizedtesting.rules.SystemPropertiesRestoreRule$1.evaluate(SystemPropertiesRestoreRule.java:57)
	at org.apache.lucene.util.AbstractBeforeAfterRule$1.evaluate(AbstractBeforeAfterRule.java:45)
	at com.carrotsearch.randomizedtesting.rules.StatementAdapter.evaluate(StatementAdapter.java:36)
	at org.apache.lucene.util.TestRuleStoreClassName$1.evaluate(TestRuleStoreClassName.java:41)
	at com.carrotsearch.randomizedtesting.rules.NoShadowingOrOverridesOnMethodsRule$1.evaluate(NoShadowingOrOverridesOnMethodsRule.java:40)
	at com.carrotsearch.randomizedtesting.rules.NoShadowingOrOverridesOnMethodsRule$1.evaluate(NoShadowingOrOverridesOnMethodsRule.java:40)
	at com.carrotsearch.randomizedtesting.rules.StatementAdapter.evaluate(StatementAdapter.java:36)
	at com.carrotsearch.randomizedtesting.rules.StatementAdapter.evaluate(StatementAdapter.java:36)
	at com.carrotsearch.randomizedtesting.rules.StatementAdapter.evaluate(StatementAdapter.java:36)
	at org.apache.lucene.util.TestRuleAssertionsRequired$1.evaluate(TestRuleAssertionsRequired.java:53)
	at org.apache.lucene.util.TestRuleMarkFailure$1.evaluate(TestRuleMarkFailure.java:47)
	at org.apache.lucene.util.TestRuleIgnoreAfterMaxFailures$1.evaluate(TestRuleIgnoreAfterMaxFailures.java:64)
	at org.apache.lucene.util.TestRuleIgnoreTestSuites$1.evaluate(TestRuleIgnoreTestSuites.java:54)
	at com.carrotsearch.randomizedtesting.rules.StatementAdapter.evaluate(StatementAdapter.java:36)
	at com.carrotsearch.randomizedtesting.ThreadLeakControl$StatementRunner.run(ThreadLeakControl.java:367)
	at java.lang.Thread.run(Thread.java:745)




Build Log:
[...truncated 12245 lines...]
   [junit4] Suite: org.apache.solr.cloud.PeerSyncReplicationTest
   [junit4]   2> Creating dataDir: /Users/jenkins/workspace/Lucene-Solr-master-MacOSX/solr/build/solr-core/test/J0/temp/solr.cloud.PeerSyncReplicationTest_FF2A861BB8B2200B-001/init-core-data-001
   [junit4]   2> 2422631 INFO  (SUITE-PeerSyncReplicationTest-seed#[FF2A861BB8B2200B]-worker) [    ] o.a.s.SolrTestCaseJ4 Randomized ssl (true) and clientAuth (false) via: @org.apache.solr.util.RandomizeSSL(reason=, value=NaN, ssl=NaN, clientAuth=NaN) w/ MAC_OS_X supressed clientAuth
   [junit4]   2> 2422636 INFO  (SUITE-PeerSyncReplicationTest-seed#[FF2A861BB8B2200B]-worker) [    ] o.a.s.BaseDistributedSearchTestCase Setting hostContext system property: /b/m
   [junit4]   2> 2422638 INFO  (TEST-PeerSyncReplicationTest.test-seed#[FF2A861BB8B2200B]) [    ] o.a.s.c.ZkTestServer STARTING ZK TEST SERVER
   [junit4]   2> 2422638 INFO  (Thread-3846) [    ] o.a.s.c.ZkTestServer client port:0.0.0.0/0.0.0.0:0
   [junit4]   2> 2422638 INFO  (Thread-3846) [    ] o.a.s.c.ZkTestServer Starting server
   [junit4]   2> 2422744 INFO  (TEST-PeerSyncReplicationTest.test-seed#[FF2A861BB8B2200B]) [    ] o.a.s.c.ZkTestServer start zk server on port:63374
   [junit4]   2> 2422771 INFO  (TEST-PeerSyncReplicationTest.test-seed#[FF2A861BB8B2200B]) [    ] o.a.s.c.AbstractZkTestCase put /Users/jenkins/workspace/Lucene-Solr-master-MacOSX/solr/core/src/test-files/solr/collection1/conf/solrconfig-tlog.xml to /configs/conf1/solrconfig.xml
   [junit4]   2> 2422783 INFO  (TEST-PeerSyncReplicationTest.test-seed#[FF2A861BB8B2200B]) [    ] o.a.s.c.AbstractZkTestCase put /Users/jenkins/workspace/Lucene-Solr-master-MacOSX/solr/core/src/test-files/solr/collection1/conf/schema.xml to /configs/conf1/schema.xml
   [junit4]   2> 2422792 INFO  (TEST-PeerSyncReplicationTest.test-seed#[FF2A861BB8B2200B]) [    ] o.a.s.c.AbstractZkTestCase put /Users/jenkins/workspace/Lucene-Solr-master-MacOSX/solr/core/src/test-files/solr/collection1/conf/solrconfig.snippet.randomindexconfig.xml to /configs/conf1/solrconfig.snippet.randomindexconfig.xml
   [junit4]   2> 2422796 INFO  (TEST-PeerSyncReplicationTest.test-seed#[FF2A861BB8B2200B]) [    ] o.a.s.c.AbstractZkTestCase put /Users/jenkins/workspace/Lucene-Solr-master-MacOSX/solr/core/src/test-files/solr/collection1/conf/stopwords.txt to /configs/conf1/stopwords.txt
   [junit4]   2> 2422799 INFO  (TEST-PeerSyncReplicationTest.test-seed#[FF2A861BB8B2200B]) [    ] o.a.s.c.AbstractZkTestCase put /Users/jenkins/workspace/Lucene-Solr-master-MacOSX/solr/core/src/test-files/solr/collection1/conf/protwords.txt to /configs/conf1/protwords.txt
   [junit4]   2> 2422803 INFO  (TEST-PeerSyncReplicationTest.test-seed#[FF2A861BB8B2200B]) [    ] o.a.s.c.AbstractZkTestCase put /Users/jenkins/workspace/Lucene-Solr-master-MacOSX/solr/core/src/test-files/solr/collection1/conf/currency.xml to /configs/conf1/currency.xml
   [junit4]   2> 2422806 INFO  (TEST-PeerSyncReplicationTest.test-seed#[FF2A861BB8B2200B]) [    ] o.a.s.c.AbstractZkTestCase put /Users/jenkins/workspace/Lucene-Solr-master-MacOSX/solr/core/src/test-files/solr/collection1/conf/enumsConfig.xml to /configs/conf1/enumsConfig.xml
   [junit4]   2> 2422816 INFO  (TEST-PeerSyncReplicationTest.test-seed#[FF2A861BB8B2200B]) [    ] o.a.s.c.AbstractZkTestCase put /Users/jenkins/workspace/Lucene-Solr-master-MacOSX/solr/core/src/test-files/solr/collection1/conf/open-exchange-rates.json to /configs/conf1/open-exchange-rates.json
   [junit4]   2> 2422819 INFO  (TEST-PeerSyncReplicationTest.test-seed#[FF2A861BB8B2200B]) [    ] o.a.s.c.AbstractZkTestCase put /Users/jenkins/workspace/Lucene-Solr-master-MacOSX/solr/core/src/test-files/solr/collection1/conf/mapping-ISOLatin1Accent.txt to /configs/conf1/mapping-ISOLatin1Accent.txt
   [junit4]   2> 2422823 INFO  (TEST-PeerSyncReplicationTest.test-seed#[FF2A861BB8B2200B]) [    ] o.a.s.c.AbstractZkTestCase put /Users/jenkins/workspace/Lucene-Solr-master-MacOSX/solr/core/src/test-files/solr/collection1/conf/old_synonyms.txt to /configs/conf1/old_synonyms.txt
   [junit4]   2> 2422826 INFO  (TEST-PeerSyncReplicationTest.test-seed#[FF2A861BB8B2200B]) [    ] o.a.s.c.AbstractZkTestCase put /Users/jenkins/workspace/Lucene-Solr-master-MacOSX/solr/core/src/test-files/solr/collection1/conf/synonyms.txt to /configs/conf1/synonyms.txt
   [junit4]   2> 2426266 INFO  (TEST-PeerSyncReplicationTest.test-seed#[FF2A861BB8B2200B]) [    ] o.a.s.SolrTestCaseJ4 Writing core.properties file to /Users/jenkins/workspace/Lucene-Solr-master-MacOSX/solr/build/solr-core/test/J0/temp/solr.cloud.PeerSyncReplicationTest_FF2A861BB8B2200B-001/control-001/cores/collection1
   [junit4]   2> 2426301 INFO  (TEST-PeerSyncReplicationTest.test-seed#[FF2A861BB8B2200B]) [    ] o.e.j.s.Server jetty-9.3.14.v20161028
   [junit4]   2> 2426302 INFO  (TEST-PeerSyncReplicationTest.test-seed#[FF2A861BB8B2200B]) [    ] o.e.j.s.h.ContextHandler Started o.e.j.s.ServletContextHandler@546bdea{/b/m,null,AVAILABLE}
   [junit4]   2> 2426305 INFO  (TEST-PeerSyncReplicationTest.test-seed#[FF2A861BB8B2200B]) [    ] o.e.j.s.AbstractConnector Started ServerConnector@24598c1a{SSL,[ssl, http/1.1]}{127.0.0.1:63380}
   [junit4]   2> 2426305 INFO  (TEST-PeerSyncReplicationTest.test-seed#[FF2A861BB8B2200B]) [    ] o.e.j.s.Server Started @2431988ms
   [junit4]   2> 2426305 INFO  (TEST-PeerSyncReplicationTest.test-seed#[FF2A861BB8B2200B]) [    ] o.a.s.c.s.e.JettySolrRunner Jetty properties: {solr.data.dir=/Users/jenkins/workspace/Lucene-Solr-master-MacOSX/solr/build/solr-core/test/J0/temp/solr.cloud.PeerSyncReplicationTest_FF2A861BB8B2200B-001/tempDir-001/control/data, hostContext=/b/m, hostPort=63380, coreRootDirectory=/Users/jenkins/workspace/Lucene-Solr-master-MacOSX/solr/build/solr-core/test/J0/temp/solr.cloud.PeerSyncReplicationTest_FF2A861BB8B2200B-001/control-001/cores}
   [junit4]   2> 2426306 ERROR (TEST-PeerSyncReplicationTest.test-seed#[FF2A861BB8B2200B]) [    ] o.a.s.s.StartupLoggingUtils Missing Java Option solr.log.dir. Logging may be missing or incomplete.
   [junit4]   2> 2426306 INFO  (TEST-PeerSyncReplicationTest.test-seed#[FF2A861BB8B2200B]) [    ] o.a.s.s.SolrDispatchFilter  ___      _       Welcome to Apache Solr? version 7.0.0
   [junit4]   2> 2426306 INFO  (TEST-PeerSyncReplicationTest.test-seed#[FF2A861BB8B2200B]) [    ] o.a.s.s.SolrDispatchFilter / __| ___| |_ _   Starting in cloud mode on port null
   [junit4]   2> 2426306 INFO  (TEST-PeerSyncReplicationTest.test-seed#[FF2A861BB8B2200B]) [    ] o.a.s.s.SolrDispatchFilter \__ \/ _ \ | '_|  Install dir: null
   [junit4]   2> 2426307 INFO  (TEST-PeerSyncReplicationTest.test-seed#[FF2A861BB8B2200B]) [    ] o.a.s.s.SolrDispatchFilter |___/\___/_|_|    Start time: 2017-01-06T07:32:14.494Z
   [junit4]   2> 2426310 INFO  (TEST-PeerSyncReplicationTest.test-seed#[FF2A861BB8B2200B]) [    ] o.a.s.s.SolrDispatchFilter Loading solr.xml from SolrHome (not found in ZooKeeper)
   [junit4]   2> 2426310 INFO  (TEST-PeerSyncReplicationTest.test-seed#[FF2A861BB8B2200B]) [    ] o.a.s.c.SolrXmlConfig Loading container configuration from /Users/jenkins/workspace/Lucene-Solr-master-MacOSX/solr/build/solr-core/test/J0/temp/solr.cloud.PeerSyncReplicationTest_FF2A861BB8B2200B-001/control-001/solr.xml
   [junit4]   2> 2426321 INFO  (TEST-PeerSyncReplicationTest.test-seed#[FF2A861BB8B2200B]) [    ] o.a.s.c.ZkContainer Zookeeper client=127.0.0.1:63374/solr
   [junit4]   2> 2426364 INFO  (TEST-PeerSyncReplicationTest.test-seed#[FF2A861BB8B2200B]) [n:127.0.0.1:63380_b%2Fm    ] o.a.s.c.OverseerElectionContext I am going to be the leader 127.0.0.1:63380_b%2Fm
   [junit4]   2> 2426366 INFO  (TEST-PeerSyncReplicationTest.test-seed#[FF2A861BB8B2200B]) [n:127.0.0.1:63380_b%2Fm    ] o.a.s.c.Overseer Overseer (id=97234972234743813-127.0.0.1:63380_b%2Fm-n_0000000000) starting
   [junit4]   2> 2426380 INFO  (TEST-PeerSyncReplicationTest.test-seed#[FF2A861BB8B2200B]) [n:127.0.0.1:63380_b%2Fm    ] o.a.s.c.ZkController Register node as live in ZooKeeper:/live_nodes/127.0.0.1:63380_b%2Fm
   [junit4]   2> 2426384 INFO  (zkCallback-2919-thread-1-processing-n:127.0.0.1:63380_b%2Fm) [n:127.0.0.1:63380_b%2Fm    ] o.a.s.c.c.ZkStateReader Updated live nodes from ZooKeeper... (0) -> (1)
   [junit4]   2> 2426431 INFO  (TEST-PeerSyncReplicationTest.test-seed#[FF2A861BB8B2200B]) [n:127.0.0.1:63380_b%2Fm    ] o.a.s.c.CorePropertiesLocator Found 1 core definitions underneath /Users/jenkins/workspace/Lucene-Solr-master-MacOSX/solr/build/solr-core/test/J0/temp/solr.cloud.PeerSyncReplicationTest_FF2A861BB8B2200B-001/control-001/cores
   [junit4]   2> 2426431 INFO  (TEST-PeerSyncReplicationTest.test-seed#[FF2A861BB8B2200B]) [n:127.0.0.1:63380_b%2Fm    ] o.a.s.c.CorePropertiesLocator Cores are: [collection1]
   [junit4]   2> 2426437 INFO  (OverseerStateUpdate-97234972234743813-127.0.0.1:63380_b%2Fm-n_0000000000) [n:127.0.0.1:63380_b%2Fm    ] o.a.s.c.o.ReplicaMutator Assigning new node to shard shard=shard1
   [junit4]   2> 2427463 WARN  (coreLoadExecutor-9264-thread-1-processing-n:127.0.0.1:63380_b%2Fm) [n:127.0.0.1:63380_b%2Fm c:control_collection   x:collection1] o.a.s.c.Config Beginning with Solr 5.5, <mergePolicy> is deprecated, use <mergePolicyFactory> instead.
   [junit4]   2> 2427464 INFO  (coreLoadExecutor-9264-thread-1-processing-n:127.0.0.1:63380_b%2Fm) [n:127.0.0.1:63380_b%2Fm c:control_collection   x:collection1] o.a.s.c.SolrConfig Using Lucene MatchVersion: 7.0.0
   [junit4]   2> 2427478 INFO  (coreLoadExecutor-9264-thread-1-processing-n:127.0.0.1:63380_b%2Fm) [n:127.0.0.1:63380_b%2Fm c:control_collection   x:collection1] o.a.s.s.IndexSchema [collection1] Schema name=test
   [junit4]   2> 2427581 WARN  (coreLoadExecutor-9264-thread-1-processing-n:127.0.0.1:63380_b%2Fm) [n:127.0.0.1:63380_b%2Fm c:control_collection   x:collection1] o.a.s.s.IndexSchema [collection1] default search field in schema is text. WARNING: Deprecated, please use 'df' on request instead.
   [junit4]   2> 2427584 INFO  (coreLoadExecutor-9264-thread-1-processing-n:127.0.0.1:63380_b%2Fm) [n:127.0.0.1:63380_b%2Fm c:control_collection   x:collection1] o.a.s.s.IndexSchema Loaded schema test/1.0 with uniqueid field id
   [junit4]   2> 2427605 INFO  (coreLoadExecutor-9264-thread-1-processing-n:127.0.0.1:63380_b%2Fm) [n:127.0.0.1:63380_b%2Fm c:control_collection   x:collection1] o.a.s.c.CoreContainer Creating SolrCore 'collection1' using configuration from collection control_collection
   [junit4]   2> 2427605 INFO  (coreLoadExecutor-9264-thread-1-processing-n:127.0.0.1:63380_b%2Fm) [n:127.0.0.1:63380_b%2Fm c:control_collection   x:collection1] o.a.s.c.SolrCore [[collection1] ] Opening new SolrCore at [/Users/jenkins/workspace/Lucene-Solr-master-MacOSX/solr/build/solr-core/test/J0/temp/solr.cloud.PeerSyncReplicationTest_FF2A861BB8B2200B-001/control-001/cores/collection1], dataDir=[/Users/jenkins/workspace/Lucene-Solr-master-MacOSX/solr/build/solr-core/test/J0/temp/solr.cloud.PeerSyncReplicationTest_FF2A861BB8B2200B-001/control-001/cores/collection1/data/]
   [junit4]   2> 2427605 INFO  (coreLoadExecutor-9264-thread-1-processing-n:127.0.0.1:63380_b%2Fm) [n:127.0.0.1:63380_b%2Fm c:control_collection   x:collection1] o.a.s.c.JmxMonitoredMap JMX monitoring is enabled. Adding Solr mbeans to JMX Server: com.sun.jmx.mbeanserver.JmxMBeanServer@51076071
   [junit4]   2> 2427608 INFO  (coreLoadExecutor-9264-thread-1-processing-n:127.0.0.1:63380_b%2Fm) [n:127.0.0.1:63380_b%2Fm c:control_collection   x:collection1] o.a.s.u.RandomMergePolicy RandomMergePolicy wrapping class org.apache.lucene.index.AlcoholicMergePolicy: [AlcoholicMergePolicy: minMergeSize=0, mergeFactor=10, maxMergeSize=1703256056, maxMergeSizeForForcedMerge=9223372036854775807, calibrateSizeByDeletes=true, maxMergeDocs=2147483647, maxCFSSegmentSizeMB=8.796093022207999E12, noCFSRatio=0.1]
   [junit4]   2> 2427616 WARN  (coreLoadExecutor-9264-thread-1-processing-n:127.0.0.1:63380_b%2Fm) [n:127.0.0.1:63380_b%2Fm c:control_collection   x:collection1] o.a.s.c.RequestHandlers INVALID paramSet a in requestHandler {type = requestHandler,name = /dump,class = DumpRequestHandler,attributes = {initParams=a, name=/dump, class=DumpRequestHandler},args = {defaults={a=A,b=B}}}
   [junit4]   2> 2427628 INFO  (coreLoadExecutor-9264-thread-1-processing-n:127.0.0.1:63380_b%2Fm) [n:127.0.0.1:63380_b%2Fm c:control_collection   x:collection1] o.a.s.u.UpdateHandler Using UpdateLog implementation: org.apache.solr.update.UpdateLog
   [junit4]   2> 2427628 INFO  (coreLoadExecutor-9264-thread-1-processing-n:127.0.0.1:63380_b%2Fm) [n:127.0.0.1:63380_b%2Fm c:control_collection   x:collection1] o.a.s.u.UpdateLog Initializing UpdateLog: dataDir= defaultSyncLevel=FLUSH numRecordsToKeep=1000 maxNumLogsToKeep=10 numVersionBuckets=65536
   [junit4]   2> 2427629 INFO  (coreLoadExecutor-9264-thread-1-processing-n:127.0.0.1:63380_b%2Fm) [n:127.0.0.1:63380_b%2Fm c:control_collection   x:collection1] o.a.s.u.CommitTracker Hard AutoCommit: disabled
   [junit4]   2> 2427629 INFO  (coreLoadExecutor-9264-thread-1-processing-n:127.0.0.1:63380_b%2Fm) [n:127.0.0.1:63380_b%2Fm c:control_collection   x:collection1] o.a.s.u.CommitTracker Soft AutoCommit: disabled
   [junit4]   2> 2427630 INFO  (coreLoadExecutor-9264-thread-1-processing-n:127.0.0.1:63380_b%2Fm) [n:127.0.0.1:63380_b%2Fm c:control_collection   x:collection1] o.a.s.u.RandomMergePolicy RandomMergePolicy wrapping class org.apache.lucene.index.TieredMergePolicy: [TieredMergePolicy: maxMergeAtOnce=39, maxMergeAtOnceExplicit=37, maxMergedSegmentMB=92.0517578125, floorSegmentMB=0.9404296875, forceMergeDeletesPctAllowed=23.368907617038282, segmentsPerTier=27.0, maxCFSSegmentSizeMB=8.796093022207999E12, noCFSRatio=1.0
   [junit4]   2> 2427630 INFO  (coreLoadExecutor-9264-thread-1-processing-n:127.0.0.1:63380_b%2Fm) [n:127.0.0.1:63380_b%2Fm c:control_collection   x:collection1] o.a.s.s.SolrIndexSearcher Opening [Searcher@2898442[collection1] main]
   [junit4]   2> 2427632 INFO  (coreLoadExecutor-9264-thread-1-processing-n:127.0.0.1:63380_b%2Fm) [n:127.0.0.1:63380_b%2Fm c:control_collection   x:collection1] o.a.s.r.ManagedResourceStorage Configured ZooKeeperStorageIO with znodeBase: /configs/conf1
   [junit4]   2> 2427633 INFO  (coreLoadExecutor-9264-thread-1-processing-n:127.0.0.1:63380_b%2Fm) [n:127.0.0.1:63380_b%2Fm c:control_collection   x:collection1] o.a.s.r.ManagedResourceStorage Loaded null at path _rest_managed.json using ZooKeeperStorageIO:path=/configs/conf1
   [junit4]   2> 2427633 INFO  (coreLoadExecutor-9264-thread-1-processing-n:127.0.0.1:63380_b%2Fm) [n:127.0.0.1:63380_b%2Fm c:control_collection   x:collection1] o.a.s.h.ReplicationHandler Commits will be reserved for  10000
   [junit4]   2> 2427634 INFO  (searcherExecutor-9265-thread-1-processing-n:127.0.0.1:63380_b%2Fm x:collection1 c:control_collection) [n:127.0.0.1:63380_b%2Fm c:control_collection   x:collection1] o.a.s.c.SolrCore [collection1] Registered new searcher Searcher@2898442[collection1] main{ExitableDirectoryReader(UninvertingDirectoryReader())}
   [junit4]   2> 2427634 INFO  (coreLoadExecutor-9264-thread-1-processing-n:127.0.0.1:63380_b%2Fm) [n:127.0.0.1:63380_b%2Fm c:control_collection   x:collection1] o.a.s.u.UpdateLog Could not find max version in index or recent updates, using new clock 1555759560991440896
   [junit4]   2> 2427645 INFO  (coreZkRegister-9257-thread-1-processing-n:127.0.0.1:63380_b%2Fm x:collection1 c:control_collection) [n:127.0.0.1:63380_b%2Fm c:control_collection s:shard1 r:core_node1 x:collection1] o.a.s.c.ShardLeaderElectionContext Enough replicas found to continue.
   [junit4]   2> 2427645 INFO  (coreZkRegister-9257-thread-1-processing-n:127.0.0.1:63380_b%2Fm x:collection1 c:control_collection) [n:127.0.0.1:63380_b%2Fm c:control_collection s:shard1 r:core_node1 x:collection1] o.a.s.c.ShardLeaderElectionContext I may be the new leader - try and sync
   [junit4]   2> 2427645 INFO  (coreZkRegister-9257-thread-1-processing-n:127.0.0.1:63380_b%2Fm x:collection1 c:control_collection) [n:127.0.0.1:63380_b%2Fm c:control_collection s:shard1 r:core_node1 x:collection1] o.a.s.c.SyncStrategy Sync replicas to https://127.0.0.1:63380/b/m/collection1/
   [junit4]   2> 2427645 INFO  (coreZkRegister-9257-thread-1-processing-n:127.0.0.1:63380_b%2Fm x:collection1 c:control_collection) [n:127.0.0.1:63380_b%2Fm c:control_collection s:shard1 r:core_node1 x:collection1] o.a.s.c.SyncStrategy Sync Success - now sync replicas to me
   [junit4]   2> 2427645 INFO  (coreZkRegister-9257-thread-1-processing-n:127.0.0.1:63380_b%2Fm x:collection1 c:control_collection) [n:127.0.0.1:63380_b%2Fm c:control_collection s:shard1 r:core_node1 x:collection1] o.a.s.c.SyncStrategy https://127.0.0.1:63380/b/m/collection1/ has no replicas
   [junit4]   2> 2427652 INFO  (coreZkRegister-9257-thread-1-processing-n:127.0.0.1:63380_b%2Fm x:collection1 c:control_collection) [n:127.0.0.1:63380_b%2Fm c:control_collection s:shard1 r:core_node1 x:collection1] o.a.s.c.ShardLeaderElectionContext I am the new leader: https://127.0.0.1:63380/b/m/collection1/ shard1
   [junit4]   2> 2427812 INFO  (coreZkRegister-9257-thread-1-processing-n:127.0.0.1:63380_b%2Fm x:collection1 c:control_collection) [n:127.0.0.1:63380_b%2Fm c:control_collection s:shard1 r:core_node1 x:collection1] o.a.s.c.ZkController I am the leader, no recovery necessary
   [junit4]   2> 2427844 INFO  (TEST-PeerSyncReplicationTest.test-seed#[FF2A861BB8B2200B]) [    ] o.a.s.c.c.ZkStateReader Updated live nodes from ZooKeeper... (0) -> (1)
   [junit4]   2> 2427847 INFO  (TEST-PeerSyncReplicationTest.test-seed#[FF2A861BB8B2200B]) [    ] o.a.s.c.s.i.ZkClientClusterStateProvider Cluster at 127.0.0.1:63374/solr ready
   [junit4]   2> 2427847 INFO  (TEST-PeerSyncReplicationTest.test-seed#[FF2A861BB8B2200B]) [    ] o.a.s.c.ChaosMonkey monkey: init - expire sessions:false cause connection loss:false
   [junit4]   2> 2427847 INFO  (TEST-PeerSyncReplicationTest.test-seed#[FF2A861BB8B2200B]) [    ] o.a.s.c.AbstractFullDistribZkTestBase Creating collection1 with stateFormat=2
   [junit4]   2> 2428162 INFO  (TEST-PeerSyncReplicationTest.test-seed#[FF2A861BB8B2200B]) [    ] o.a.s.SolrTestCaseJ4 Writing core.properties file to /Users/jenkins/workspace/Lucene-Solr-master-MacOSX/solr/build/solr-core/test/J0/temp/solr.cloud.PeerSyncReplicationTest_FF2A861BB8B2200B-001/shard-1-001/cores/collection1
   [junit4]   2> 2428164 INFO  (TEST-PeerSyncReplicationTest.test-seed#[FF2A861BB8B2200B]) [    ] o.a.s.c.AbstractFullDistribZkTestBase create jetty 1 in directory /Users/jenkins/workspace/Lucene-Solr-master-MacOSX/solr/build/solr-core/test/J0/temp/solr.cloud.PeerSyncReplicationTest_FF2A861BB8B2200B-001/shard-1-001
   [junit4]   2> 2428175 INFO  (TEST-PeerSyncReplicationTest.test-seed#[FF2A861BB8B2200B]) [    ] o.e.j.s.Server jetty-9.3.14.v20161028
   [junit4]   2> 2428177 INFO  (TEST-PeerSyncReplicationTest.test-seed#[FF2A861BB8B2200B]) [    ] o.e.j.s.h.ContextHandler Started o.e.j.s.ServletContextHandler@2933f99e{/b/m,null,AVAILABLE}
   [junit4]   2> 2428179 INFO  (TEST-PeerSyncReplicationTest.test-seed#[FF2A861BB8B2200B]) [    ] o.e.j.s.AbstractConnector Started ServerConnector@57e7f5ac{SSL,[ssl, http/1.1]}{127.0.0.1:63386}
   [junit4]   2> 2428180 INFO  (TEST-PeerSyncReplicationTest.test-seed#[FF2A861BB8B2200B]) [    ] o.e.j.s.Server Started @2433862ms
   [junit4]   2> 2428180 INFO  (TEST-PeerSyncReplicationTest.test-seed#[FF2A861BB8B2200B]) [    ] o.a.s.c.s.e.JettySolrRunner Jetty properties: {solr.data.dir=/Users/jenkins/workspace/Lucene-Solr-master-MacOSX/solr/build/solr-core/test/J0/temp/solr.cloud.PeerSyncReplicationTest_FF2A861BB8B2200B-001/tempDir-001/jetty1, solrconfig=solrconfig.xml, hostContext=/b/m, hostPort=63386, coreRootDirectory=/Users/jenkins/workspace/Lucene-Solr-master-MacOSX/solr/build/solr-core/test/J0/../../../../../../../../../Users/jenkins/workspace/Lucene-Solr-master-MacOSX/solr/build/solr-core/test/J0/temp/solr.cloud.PeerSyncReplicationTest_FF2A861BB8B2200B-001/shard-1-001/cores}
   [junit4]   2> 2428180 ERROR (TEST-PeerSyncReplicationTest.test-seed#[FF2A861BB8B2200B]) [    ] o.a.s.s.StartupLoggingUtils Missing Java Option solr.log.dir. Logging may be missing or incomplete.
   [junit4]   2> 2428180 INFO  (TEST-PeerSyncReplicationTest.test-seed#[FF2A861BB8B2200B]) [    ] o.a.s.s.SolrDispatchFilter  ___      _       Welcome to Apache Solr? version 7.0.0
   [junit4]   2> 2428181 INFO  (TEST-PeerSyncReplicationTest.test-seed#[FF2A861BB8B2200B]) [    ] o.a.s.s.SolrDispatchFilter / __| ___| |_ _   Starting in cloud mode on port null
   [junit4]   2> 2428181 INFO  (TEST-PeerSyncReplicationTest.test-seed#[FF2A861BB8B2200B]) [    ] o.a.s.s.SolrDispatchFilter \__ \/ _ \ | '_|  Install dir: null
   [junit4]   2> 2428181 INFO  (TEST-PeerSyncReplicationTest.test-seed#[FF2A861BB8B2200B]) [    ] o.a.s.s.SolrDispatchFilter |___/\___/_|_|    Start time: 2017-01-06T07:32:16.368Z
   [junit4]   2> 2428186 INFO  (TEST-PeerSyncReplicationTest.test-seed#[FF2A861BB8B2200B]) [    ] o.a.s.s.SolrDispatchFilter Loading solr.xml from SolrHome (not found in ZooKeeper)
   [junit4]   2> 2428186 INFO  (TEST-PeerSyncReplicationTest.test-seed#[FF2A861BB8B2200B]) [    ] o.a.s.c.SolrXmlConfig Loading container configuration from /Users/jenkins/workspace/Lucene-Solr-master-MacOSX/solr/build/solr-core/test/J0/temp/solr.cloud.PeerSyncReplicationTest_FF2A861BB8B2200B-001/shard-1-001/solr.xml
   [junit4]   2> 2428199 INFO  (TEST-PeerSyncReplicationTest.test-seed#[FF2A861BB8B2200B]) [    ] o.a.s.c.ZkContainer Zookeeper client=127.0.0.1:63374/solr
   [junit4]   2> 2428217 INFO  (TEST-PeerSyncReplicationTest.test-seed#[FF2A861BB8B2200B]) [n:127.0.0.1:63386_b%2Fm    ] o.a.s.c.c.ZkStateReader Updated live nodes from ZooKeeper... (0) -> (1)
   [junit4]   2> 2428229 INFO  (TEST-PeerSyncReplicationTest.test-seed#[FF2A861BB8B2200B]) [n:127.0.0.1:63386_b%2Fm    ] o.a.s.c.ZkController Register node as live in ZooKeeper:/live_nodes/127.0.0.1:63386_b%2Fm
   [junit4]   2> 2428232 INFO  (zkCallback-2923-thread-1) [    ] o.a.s.c.c.ZkStateReader Updated live nodes from ZooKeeper... (1) -> (2)
   [junit4]   2> 2428232 INFO  (zkCallback-2919-thread-1-processing-n:127.0.0.1:63380_b%2Fm) [n:127.0.0.1:63380_b%2Fm    ] o.a.s.c.c.ZkStateReader Updated live nodes from ZooKeeper... (1) -> (2)
   [junit4]   2> 2428232 INFO  (zkCallback-2929-thread-1-processing-n:127.0.0.1:63386_b%2Fm) [n:127.0.0.1:63386_b%2Fm    ] o.a.s.c.c.ZkStateReader Updated live nodes from ZooKeeper... (1) -> (2)
   [junit4]   2> 2428293 INFO  (TEST-PeerSyncReplicationTest.test-seed#[FF2A861BB8B2200B]) [n:127.0.0.1:63386_b%2Fm    ] o.a.s.c.CorePropertiesLocator Found 1 core definitions underneath /Users/jenkins/workspace/Lucene-Solr-master-MacOSX/solr/build/solr-core/test/J0/../../../../../../../../../Users/jenkins/workspace/Lucene-Solr-master-MacOSX/solr/build/solr-core/test/J0/temp/solr.cloud.PeerSyncReplicationTest_FF2A861BB8B2200B-001/shard-1-001/cores
   [junit4]   2> 2428293 INFO  (TEST-PeerSyncReplicationTest.test-seed#[FF2A861BB8B2200B]) [n:127.0.0.1:63386_b%2Fm    ] o.a.s.c.CorePropertiesLocator Cores are: [collection1]
   [junit4]   2> 2428297 INFO  (OverseerStateUpdate-97234972234743813-127.0.0.1:63380_b%2Fm-n_0000000000) [n:127.0.0.1:63380_b%2Fm    ] o.a.s.c.o.ReplicaMutator Assigning new node to shard shard=shard1
   [junit4]   2> 2428402 INFO  (zkCallback-2929-thread-1-processing-n:127.0.0.1:63386_b%2Fm) [n:127.0.0.1:63386_b%2Fm    ] o.a.s.c.c.ZkStateReader A cluster state change: [WatchedEvent state:SyncConnected type:NodeDataChanged path:/collections/collection1/state.json] for collection [collection1] has occurred - updating... (live nodes size: [2])
   [junit4]   2> 2429311 WARN  (coreLoadExecutor-9275-thread-1-processing-n:127.0.0.1:63386_b%2Fm) [n:127.0.0.1:63386_b%2Fm c:collection1   x:collection1] o.a.s.c.Config Beginning with Solr 5.5, <mergePolicy> is deprecated, use <mergePolicyFactory> instead.
   [junit4]   2> 2429311 INFO  (coreLoadExecutor-9275-thread-1-processing-n:127.0.0.1:63386_b%2Fm) [n:127.0.0.1:63386_b%2Fm c:collection1   x:collection1] o.a.s.c.SolrConfig Using Lucene MatchVersion: 7.0.0
   [junit4]   2> 2429323 INFO  (coreLoadExecutor-9275-thread-1-processing-n:127.0.0.1:63386_b%2Fm) [n:127.0.0.1:63386_b%2Fm c:collection1   x:collection1] o.a.s.s.IndexSchema [collection1] Schema name=test
   [junit4]   2> 2429426 WARN  (coreLoadExecutor-9275-thread-1-processing-n:127.0.0.1:63386_b%2Fm) [n:127.0.0.1:63386_b%2Fm c:collection1   x:collection1] o.a.s.s.IndexSchema [collection1] default search field in schema is text. WARNING: Deprecated, please use 'df' on request instead.
   [junit4]   2> 2429428 INFO  (coreLoadExecutor-9275-thread-1-processing-n:127.0.0.1:63386_b%2Fm) [n:127.0.0.1:63386_b%2Fm c:collection1   x:collection1] o.a.s.s.IndexSchema Loaded schema test/1.0 with uniqueid field id
   [junit4]   2> 2429453 INFO  (coreLoadExecutor-9275-thread-1-processing-n:127.0.0.1:63386_b%2Fm) [n:127.0.0.1:63386_b%2Fm c:collection1   x:collection1] o.a.s.c.CoreContainer Creating SolrCore 'collection1' using configuration from collection collection1
   [junit4]   2> 2429453 INFO  (coreLoadExecutor-9275-thread-1-processing-n:127.0.0.1:63386_b%2Fm) [n:127.0.0.1:63386_b%2Fm c:collection1   x:collection1] o.a.s.c.SolrCore [[collection1] ] Opening new SolrCore at [/Users/jenkins/workspace/Lucene-Solr-master-MacOSX/solr/build/solr-core/test/J0/temp/solr.cloud.PeerSyncReplicationTest_FF2A861BB8B2200B-001/shard-1-001/cores/collection1], dataDir=[/Users/jenkins/workspace/Lucene-Solr-master-MacOSX/solr/build/solr-core/test/J0/../../../../../../../../../Users/jenkins/workspace/Lucene-Solr-master-MacOSX/solr/build/solr-core/test/J0/temp/solr.cloud.PeerSyncReplicationTest_FF2A861BB8B2200B-001/shard-1-001/cores/collection1/data/]
   [junit4]   2> 2429453 INFO  (coreLoadExecutor-9275-thread-1-processing-n:127.0.0.1:63386_b%2Fm) [n:127.0.0.1:63386_b%2Fm c:collection1   x:collection1] o.a.s.c.JmxMonitoredMap JMX monitoring is enabled. Adding Solr mbeans to JMX Server: com.sun.jmx.mbeanserver.JmxMBeanServer@51076071
   [junit4]   2> 2429458 INFO  (coreLoadExecutor-9275-thread-1-processing-n:127.0.0.1:63386_b%2Fm) [n:127.0.0.1:63386_b%2Fm c:collection1   x:collection1] o.a.s.u.RandomMergePolicy RandomMergePolicy wrapping class org.apache.lucene.index.AlcoholicMergePolicy: [AlcoholicMergePolicy: minMergeSize=0, mergeFactor=10, maxMergeSize=1703256056, maxMergeSizeForForcedMerge=9223372036854775807, calibrateSizeByDeletes=true, maxMergeDocs=2147483647, maxCFSSegmentSizeMB=8.796093022207999E12, noCFSRatio=0.1]
   [junit4]   2> 2429469 WARN  (coreLoadExecutor-9275-thread-1-processing-n:127.0.0.1:63386_b%2Fm) [n:127.0.0.1:63386_b%2Fm c:collection1   x:collection1] o.a.s.c.RequestHandlers INVALID paramSet a in requestHandler {type = requestHandler,name = /dump,class = DumpRequestHandler,attributes = {initParams=a, name=/dump, class=DumpRequestHandler},args = {defaults={a=A,b=B}}}
   [junit4]   2> 2429484 INFO  (coreLoadExecutor-9275-thread-1-processing-n:127.0.0.1:63386_b%2Fm) [n:127.0.0.1:63386_b%2Fm c:collection1   x:collection1] o.a.s.u.UpdateHandler Using UpdateLog implementation: org.apache.solr.update.UpdateLog
   [junit4]   2> 2429484 INFO  (coreLoadExecutor-9275-thread-1-processing-n:127.0.0.1:63386_b%2Fm) [n:127.0.0.1:63386_b%2Fm c:collection1   x:collection1] o.a.s.u.UpdateLog Initializing UpdateLog: dataDir= defaultSyncLevel=FLUSH numRecordsToKeep=1000 maxNumLogsToKeep=10 numVersionBuckets=65536
   [junit4]   2> 2429485 INFO  (coreLoadExecutor-9275-thread-1-processing-n:127.0.0.1:63386_b%2Fm) [n:127.0.0.1:63386_b%2Fm c:collection1   x:collection1] o.a.s.u.CommitTracker Hard AutoCommit: disabled
   [junit4]   2> 2429485 INFO  (coreLoadExecutor-9275-thread-1-processing-n:127.0.0.1:63386_b%2Fm) [n:127.0.0.1:63386_b%2Fm c:collection1   x:collection1] o.a.s.u.CommitTracker Soft AutoCommit: disabled
   [junit4]   2> 2429486 INFO  (coreLoadExecutor-9275-thread-1-processing-n:127.0.0.1:63386_b%2Fm) [n:127.0.0.1:63386_b%2Fm c:collection1   x:collection1] o.a.s.u.RandomMergePolicy RandomMergePolicy wrapping class org.apache.lucene.index.TieredMergePolicy: [TieredMergePolicy: maxMergeAtOnce=39, maxMergeAtOnceExplicit=37, maxMergedSegmentMB=92.0517578125, floorSegmentMB=0.9404296875, forceMergeDeletesPctAllowed=23.368907617038282, segmentsPerTier=27.0, maxCFSSegmentSizeMB=8.796093022207999E12, noCFSRatio=1.0
   [junit4]   2> 2429486 INFO  (coreLoadExecutor-9275-thread-1-processing-n:127.0.0.1:63386_b%2Fm) [n:127.0.0.1:63386_b%2Fm c:collection1   x:collection1] o.a.s.s.SolrIndexSearcher Opening [Searcher@3c366721[collection1] main]
   [junit4]   2> 2429488 INFO  (coreLoadExecutor-9275-thread-1-processing-n:127.0.0.1:63386_b%2Fm) [n:127.0.0.1:63386_b%2Fm c:collection1   x:collection1] o.a.s.r.ManagedResourceStorage Configured ZooKeeperStorageIO with znodeBase: /configs/conf1
   [junit4]   2> 2429489 INFO  (coreLoadExecutor-9275-thread-1-processing-n:127.0.0.1:63386_b%2Fm) [n:127.0.0.1:63386_b%2Fm c:collection1   x:collection1] o.a.s.r.ManagedResourceStorage Loaded null at path _rest_managed.json using ZooKeeperStorageIO:path=/configs/conf1
   [junit4]   2> 2429489 INFO  (coreLoadExecutor-9275-thread-1-processing-n:127.0.0.1:63386_b%2Fm) [n:127.0.0.1:63386_b%2Fm c:collection1   x:collection1] o.a.s.h.ReplicationHandler Commits will be reserved for  10000
   [junit4]   2> 2429490 INFO  (searcherExecutor-9276-thread-1-processing-n:127.0.0.1:63386_b%2Fm x:collection1 c:collection1) [n:127.0.0.1:63386_b%2Fm c:collection1   x:collection1] o.a.s.c.SolrCore [collection1] Registered new searcher Searcher@3c366721[collection1] main{ExitableDirectoryReader(UninvertingDirectoryReader())}
   [junit4]   2> 2429490 INFO  (coreLoadExecutor-9275-thread-1-processing-n:127.0.0.1:63386_b%2Fm) [n:127.0.0.1:63386_b%2Fm c:collection1   x:collection1] o.a.s.u.UpdateLog Could not find max version in index or recent updates, using new clock 1555759562937597952
   [junit4]   2> 2429502 INFO  (coreZkRegister-9270-thread-1-processing-n:127.0.0.1:63386_b%2Fm x:collection1 c:collection1) [n:127.0.0.1:63386_b%2Fm c:collection1 s:shard1 r:core_node1 x:collection1] o.a.s.c.ShardLeaderElectionContext Enough replicas found to continue.
   [junit4]   2> 2429502 INFO  (coreZkRegister-9270-thread-1-processing-n:127.0.0.1:63386_b%2Fm x:collection1 c:collection1) [n:127.0.0.1:63386_b%2Fm c:collection1 s:shard1 r:core_node1 x:collection1] o.a.s.c.ShardLeaderElectionContext I may be the new leader - try and sync
   [junit4]   2> 2429502 INFO  (coreZkRegister-9270-thread-1-processing-n:127.0.0.1:63386_b%2Fm x:collection1 c:collection1) [n:127.0.0.1:63386_b%2Fm c:collection1 s:shard1 r:core_node1 x:collection1] o.a.s.c.SyncStrategy Sync replicas to https://127.0.0.1:63386/b/m/collection1/
   [junit4]   2> 2429502 INFO  (coreZkRegister-9270-thread-1-processing-n:127.0.0.1:63386_b%2Fm x:collection1 c:collection1) [n:127.0.0.1:63386_b%2Fm c:collection1 s:shard1 r:core_node1 x:collection1] o.a.s.c.SyncStrategy Sync Success - now sync replicas to me
   [junit4]   2> 2429502 INFO  (coreZkRegister-9270-thread-1-processing-n:127.0.0.1:63386_b%2Fm x:collection1 c:collection1) [n:127.0.0.1:63386_b%2Fm c:collection1 s:shard1 r:core_node1 x:collection1] o.a.s.c.SyncStrategy https://127.0.0.1:63386/b/m/collection1/ has no replicas
   [junit4]   2> 2429509 INFO  (coreZkRegister-9270-thread-1-processing-n:127.0.0.1:63386_b%2Fm x:collection1 c:collection1) [n:127.0.0.1:63386_b%2Fm c:collection1 s:shard1 r:core_node1 x:collection1] o.a.s.c.ShardLeaderElectionContext I am the new leader: https://127.0.0.1:63386/b/m/collection1/ shard1
   [junit4]   2> 2429615 INFO  (zkCallback-2929-thread-1-processing-n:127.0.0.1:63386_b%2Fm) [n:127.0.0.1:63386_b%2Fm    ] o.a.s.c.c.ZkStateReader A cluster state change: [WatchedEvent state:SyncConnected type:NodeDataChanged path:/collections/collection1/state.json] for collection [collection1] has occurred - updating... (live nodes size: [2])
   [junit4]   2> 2429619 INFO  (coreZkRegister-9270-thread-1-processing-n:127.0.0.1:63386_b%2Fm x:collection1 c:collection1) [n:127.0.0.1:63386_b%2Fm c:collection1 s:shard1 r:core_node1 x:collection1] o.a.s.c.ZkController I am the leader, no recovery necessary
   [junit4]   2> 2429727 INFO  (zkCallback-2929-thread-1-processing-n:127.0.0.1:63386_b%2Fm) [n:127.0.0.1:63386_b%2Fm    ] o.a.s.c.c.ZkStateReader A cluster state change: [WatchedEvent state:SyncConnected type:NodeDataChanged path:/collections/collection1/state.json] for collection [collection1] has occurred - updating... (live nodes size: [2])
   [junit4]   2> 2430075 INFO  (TEST-PeerSyncReplicationTest.test-seed#[FF2A861BB8B2200B]) [    ] o.a.s.SolrTestCaseJ4 Writing core.properties file to /Users/jenkins/workspace/Lucene-Solr-master-MacOSX/solr/build/solr-core/test/J0/temp/solr.cloud.PeerSyncReplicationTest_FF2A861BB8B2200B-001/shard-2-001/cores/collection1
   [junit4]   2> 2430076 INFO  (TEST-PeerSyncReplicationTest.test-seed#[FF2A861BB8B2200B]) [    ] o.a.s.c.AbstractFullDistribZkTestBase create jetty 2 in directory /Users/jenkins/workspace/Lucene-Solr-master-MacOSX/solr/build/solr-core/test/J0/temp/solr.cloud.PeerSyncReplicationTest_FF2A861BB8B2200B-001/shard-2-001
   [junit4]   2> 2430081 INFO  (TEST-PeerSyncReplicationTest.test-seed#[FF2A861BB8B2200B]) [    ] o.e.j.s.Server jetty-9.3.14.v20161028
   [junit4]   2> 2430083 INFO  (TEST-PeerSyncReplicationTest.test-seed#[FF2A861BB8B2200B]) [    ] o.e.j.s.h.ContextHandler Started o.e.j.s.ServletContextHandler@74d8c9fc{/b/m,null,AVAILABLE}
   [junit4]   2> 2430085 INFO  (TEST-PeerSyncReplicationTest.test-seed#[FF2A861BB8B2200B]) [    ] o.e.j.s.AbstractConnector Started ServerConnector@6d481047{SSL,[ssl, http/1.1]}{127.0.0.1:63390}
   [junit4]   2> 2430086 INFO  (TEST-PeerSyncReplicationTest.test-seed#[FF2A861BB8B2200B]) [    ] o.e.j.s.Server Started @2435768ms
   [junit4]   2> 2430086 INFO  (TEST-PeerSyncReplicationTest.test-seed#[FF2A861BB8B2200B]) [    ] o.a.s.c.s.e.JettySolrRunner Jetty properties: {solr.data.dir=/Users/jenkins/workspace/Lucene-Solr-master-MacOSX/solr/build/solr-core/test/J0/temp/solr.cloud.PeerSyncReplicationTest_FF2A861BB8B2200B-001/tempDir-001/jetty2, solrconfig=solrconfig.xml, hostContext=/b/m, hostPort=63390, coreRootDirectory=/Users/jenkins/workspace/Lucene-Solr-master-MacOSX/solr/build/solr-core/test/J0/temp/solr.cloud.PeerSyncReplicationTest_FF2A861BB8B2200B-001/shard-2-001/cores}
   [junit4]   2> 2430087 ERROR (TEST-PeerSyncReplicationTest.test-seed#[FF2A861BB8B2200B]) [    ] o.a.s.s.StartupLoggingUtils Missing Java Option solr.log.dir. Logging may be missing or incomplete.
   [junit4]   2> 2430087 INFO  (TEST-PeerSyncReplicationTest.test-seed#[FF2A861BB8B2200B]) [    ] o.a.s.s.SolrDispatchFilter  ___      _       Welcome to Apache Solr? version 7.0.0
   [junit4]   2> 2430087 INFO  (TEST-PeerSyncReplicationTest.test-seed#[FF2A861BB8B2200B]) [    ] o.a.s.s.SolrDispatchFilter / __| ___| |_ _   Starting in cloud mode on port null
   [junit4]   2> 2430087 INFO  (TEST-PeerSyncReplicationTest.test-seed#[FF2A861BB8B2200B]) [    ] o.a.s.s.SolrDispatchFilter \__ \/ _ \ | '_|  Install dir: null
   [junit4]   2> 2430087 INFO  (TEST-PeerSyncReplicationTest.test-seed#[FF2A861BB8B2200B]) [    ] o.a.s.s.SolrDispatchFilter |___/\___/_|_|    Start time: 2017-01-06T07:32:18.274Z
   [junit4]   2> 2430093 INFO  (TEST-PeerSyncReplicationTest.test-seed#[FF2A861BB8B2200B]) [    ] o.a.s.s.SolrDispatchFilter Loading solr.xml from SolrHome (not found in ZooKeeper)
   [junit4]   2> 2430094 INFO  (TEST-PeerSyncReplicationTest.test-seed#[FF2A861BB8B2200B]) [    ] o.a.s.c.SolrXmlConfig Loading container configuration from /Users/jenkins/workspace/Lucene-Solr-master-MacOSX/solr/build/solr-core/test/J0/temp/solr.cloud.PeerSyncReplicationTest_FF2A861BB8B2200B-001/shard-2-001/solr.xml
   [junit4]   2> 2430107 INFO  (TEST-PeerSyncReplicationTest.test-seed#[FF2A861BB8B2200B]) [    ] o.a.s.c.ZkContainer Zookeeper client=127.0.0.1:63374/solr
   [junit4]   2> 2430129 INFO  (TEST-PeerSyncReplicationTest.test-seed#[FF2A861BB8B2200B]) [n:127.0.0.1:63390_b%2Fm    ] o.a.s.c.c.ZkStateReader Updated live nodes from ZooKeeper... (0) -> (2)
   [junit4]   2> 2430143 INFO  (TEST-PeerSyncReplicationTest.test-seed#[FF2A861BB8B2200B]) [n:127.0.0.1:63390_b%2Fm    ] o.a.s.c.ZkController Register node as live in ZooKeeper:/live_nodes/127.0.0.1:63390_b%2Fm
   [junit4]   2> 2430147 INFO  (zkCallback-2923-thread-1) [    ] o.a.s.c.c.ZkStateReader Updated live nodes from ZooKeeper... (2) -> (3)
   [junit4]   2> 2430148 INFO  (zkCallback-2935-thread-1-processing-n:127.0.0.1:63390_b%2Fm) [n:127.0.0.1:63390_b%2Fm    ] o.a.s.c.c.ZkStateReader Updated live nodes from ZooKeeper... (2) -> (3)
   [junit4]   2> 2430148 INFO  (zkCallback-2929-thread-1-processing-n:127.0.0.1:63386_b%2Fm) [n:127.0.0.1:63386_b%2Fm    ] o.a.s.c.c.ZkStateReader Updated live nodes from ZooKeeper... (2) -> (3)
   [junit4]   2> 2430148 INFO  (zkCallback-2919-thread-1-processing-n:127.0.0.1:63380_b%2Fm) [n:127.0.0.1:63380_b%2Fm    ] o.a.s.c.c.ZkStateReader Updated live nodes from ZooKeeper... (2) -> (3)
   [junit4]   2> 2430262 INFO  (zkCallback-2929-thread-1-processing-n:127.0.0.1:63386_b%2Fm) [n:127.0.0.1:63386_b%2Fm    ] o.a.s.c.c.ZkStateReader A cluster state change: [WatchedEvent state:SyncConnected type:NodeDataChanged path:/collections/collection1/state.json] for collection [collection1] has occurred - updating... (live nodes size: [3])
   [junit4]   2> 2430288 INFO  (TEST-PeerSyncReplicationTest.test-seed#[FF2A861BB8B2200B]) [n:127.0.0.1:63390_b%2Fm    ] o.a.s.c.CorePropertiesLocator Found 1 core definitions underneath /Users/jenkins/workspace/Lucene-Solr-master-MacOSX/solr/build/solr-core/test/J0/temp/solr.cloud.PeerSyncReplicationTest_FF2A861BB8B2200B-001/shard-2-001/cores
   [junit4]   2> 2430288 INFO  (TEST-PeerSyncReplicationTest.test-seed#[FF2A861BB8B2200B]) [n:127.0.0.1:63390_b%2Fm    ] o.a.s.c.CorePropertiesLocator Cores are: [collection1]
   [junit4]   2> 2430292 INFO  (OverseerStateUpdate-97234972234743813-127.0.0.1:63380_b%2Fm-n_0000000000) [n:127.0.0.1:63380_b%2Fm    ] o.a.s.c.o.ReplicaMutator Assigning new node to shard shard=shard1
   [junit4]   2> 2430401 INFO  (zkCallback-2929-thread-1-processing-n:127.0.0.1:63386_b%2Fm) [n:127.0.0.1:63386_b%2Fm    ] o.a.s.c.c.ZkStateReader A cluster state change: [WatchedEvent state:SyncConnected type:NodeDataChanged path:/collections/collection1/state.json] for collection [collection1] has occurred - updating... (live nodes size: [3])
   [junit4]   2> 2430401 INFO  (zkCallback-2935-thread-1-processing-n:127.0.0.1:63390_b%2Fm) [n:127.0.0.1:63390_b%2Fm    ] o.a.s.c.c.ZkStateReader A cluster state change: [WatchedEvent state:SyncConnected type:NodeDataChanged path:/collections/collection1/state.json] for collection [collection1] has occurred - updating... (live nodes size: [3])
   [junit4]   2> 2431310 WARN  (coreLoadExecutor-9286-thread-1-processing-n:127.0.0.1:63390_b%2Fm) [n:127.0.0.1:63390_b%2Fm c:collection1   x:collection1] o.a.s.c.Config Beginning with Solr 5.5, <mergePolicy> is deprecated, use <mergePolicyFactory> instead.
   [junit4]   2> 2431311 INFO  (coreLoadExecutor-9286-thread-1-processing-n:127.0.0.1:63390_b%2Fm) [n:127.0.0.1:63390_b%2Fm c:collection1   x:collection1] o.a.s.c.SolrConfig Using Lucene MatchVersion: 7.0.0
   [junit4]   2> 2431352 INFO  (coreLoadExecutor-9286-thread-1-processing-n:127.0.0.1:63390_b%2Fm) [n:127.0.0.1:63390_b%2Fm c:collection1   x:collection1] o.a.s.s.IndexSchema [collection1] Schema name=test
   [junit4]   2> 2431469 WARN  (coreLoadExecutor-9286-thread-1-processing-n:127.0.0.1:63390_b%2Fm) [n:127.0.0.1:63390_b%2Fm c:collection1   x:collection1] o.a.s.s.IndexSchema [collection1] default search field in schema is text. WARNING: Deprecated, please use 'df' on request instead.
   [junit4]   2> 2431471 INFO  (coreLoadExecutor-9286-thread-1-processing-n:127.0.0.1:63390_b%2Fm) [n:127.0.0.1:63390_b%2Fm c:collection1   x:collection1] o.a.s.s.IndexSchema Loaded schema test/1.0 with uniqueid field id
   [junit4]   2> 2431516 INFO  (coreLoadExecutor-9286-thread-1-processing-n:127.0.0.1:63390_b%2Fm) [n:127.0.0.1:63390_b%2Fm c:collection1   x:collection1] o.a.s.c.CoreContainer Creating SolrCore 'collection1' using configuration from collection collection1
   [junit4]   2> 2431516 INFO  (coreLoadExecutor-9286-thread-1-processing-n:127.0.0.1:63390_b%2Fm) [n:127.0.0.1:63390_b%2Fm c:collection1   x:collection1] o.a.s.c.SolrCore [[collection1] ] Opening new SolrCore at [/Users/jenkins/workspace/Lucene-Solr-master-MacOSX/solr/build/solr-core/test/J0/temp/solr.cloud.PeerSyncReplicationTest_FF2A861BB8B2200B-001/shard-2-001/cores/collection1], dataDir=[/Users/jenkins/workspace/Lucene-Solr-master-MacOSX/solr/build/solr-core/test/J0/temp/solr.cloud.PeerSyncReplicationTest_FF2A861BB8B2200B-001/shard-2-001/cores/collection1/data/]
   [junit4]   2> 2431517 INFO  (coreLoadExecutor-9286-thread-1-processing-n:127.0.0.1:63390_b%2Fm) [n:127.0.0.1:63390_b%2Fm c:collection1   x:collection1] o.a.s.c.JmxMonitoredMap JMX monitoring is enabled. Adding Solr mbeans to JMX Server: com.sun.jmx.mbeanserver.JmxMBeanServer@51076071
   [junit4]   2> 2431522 INFO  (coreLoadExecutor-9286-thread-1-processing-n:127.0.0.1:63390_b%2Fm) [n:127.0.0.1:63390_b%2Fm c:collection1   x:collection1] o.a.s.u.RandomMergePolicy RandomMergePolicy wrapping class org.apache.lucene.index.AlcoholicMergePolicy: [AlcoholicMergePolicy: minMergeSize=0, mergeFactor=10, maxMergeSize=1703256056, maxMergeSizeForForcedMerge=9223372036854775807, calibrateSizeByDeletes=true, maxMergeDocs=2147483647, maxCFSSegmentSizeMB=8.796093022207999E12, noCFSRatio=0.1]
   [junit4]   2> 2431547 WARN  (coreLoadExecutor-9286-thread-1-processing-n:127.0.0.1:63390_b%2Fm) [n:127.0.0.1:63390_b%2Fm c:collection1   x:collection1] o.a.s.c.RequestHandlers INVALID paramSet a in requestHandler {type = requestHandler,name = /dump,class = DumpRequestHandler,attributes = {initParams=a, name=/dump, class=DumpRequestHandler},args = {defaults={a=A,b=B}}}
   [junit4]   2> 2432051 INFO  (coreLoadExecutor-9286-thread-1-processing-n:127.0.0.1:63390_b%2Fm) [n:127.0.0.1:63390_b%2Fm c:collection1   x:collection1] o.a.s.u.UpdateHandler Using UpdateLog implementation: org.apache.solr.update.UpdateLog
   [junit4]   2> 2432051 INFO  (coreLoadExecutor-9286-thread-1-processing-n:127.0.0.1:63390_b%2Fm) [n:127.0.0.1:63390_b%2Fm c:collection1   x:collection1] o.a.s.u.UpdateLog Initializing UpdateLog: dataDir= defaultSyncLevel=FLUSH numRecordsToKeep=1000 maxNumLogsToKeep=10 numVersionBuckets=65536
   [junit4]   2> 2432052 INFO  (coreLoadExecutor-9286-thread-1-processing-n:127.0.0.1:63390_b%2Fm) [n:127.0.0.1:63390_b%2Fm c:collection1   x:collection1] o.a.s.u.CommitTracker Hard AutoCommit: disabled
   [junit4]   2> 2432052 INFO  (coreLoadExecutor-9286-thread-1-processing-n:127.0.0.1:63390_b%2Fm) [n:127.0.0.1:63390_b%2Fm c:collection1   x:collection1] o.a.s.u.CommitTracker Soft AutoCommit: disabled
   [junit4]   2> 2432053 INFO  (coreLoadExecutor-9286-thread-1-processing-n:127.0.0.1:63390_b%2Fm) [n:127.0.0.1:63390_b%2Fm c:collection1   x:collection1] o.a.s.u.RandomMergePolicy RandomMergePolicy wrapping class org.apache.lucene.index.TieredMergePolicy: [TieredMergePolicy: maxMergeAtOnce=39, maxMergeAtOnceExplicit=37, maxMergedSegmentMB=92.0517578125, floorSegmentMB=0.9404296875, forceMergeDeletesPctAllowed=23.368907617038282, segmentsPerTier=27.0, maxCFSSegmentSizeMB=8.796093022207999E12, noCFSRatio=1.0
   [junit4]   2> 2432055 INFO  (coreLoadExecutor-9286-thread-1-processing-n:127.0.0.1:63390_b%2Fm) [n:127.0.0.1:63390_b%2Fm c:collection1   x:collection1] o.a.s.s.SolrIndexSearcher Opening [Searcher@5527e555[collection1] main]
   [junit4]   2> 2432057 INFO  (coreLoadExecutor-9286-thread-1-processing-n:127.0.0.1:63390_b%2Fm) [n:127.0.0.1:63390_b%2Fm c:collection1   x:collection1] o.a.s.r.ManagedResourceStorage Configured ZooKeeperStorageIO with znodeBase: /configs/conf1
   [junit4]   2> 2432058 INFO  (coreLoadExecutor-9286-thread-1-processing-n:127.0.0.1:63390_b%2Fm) [n:127.0.0.1:63390_b%2Fm c:collection1   x:collection1] o.a.s.r.ManagedResourceStorage Loaded null at path _rest_managed.json using ZooKeeperStorageIO:path=/configs/conf1
   [junit4]   2> 2432058 INFO  (coreLoadExecutor-9286-thread-1-processing-n:127.0.0.1:63390_b%2Fm) [n:127.0.0.1:63390_b%2Fm c:collection1   x:collection1] o.a.s.h.ReplicationHandler Commits will be reserved for  10000
   [junit4]   2> 2432059 INFO  (searcherExecutor-9287-thread-1-processing-n:127.0.0.1:63390_b%2Fm x:collection1 c:collection1) [n:127.0.0.1:63390_b%2Fm c:collection1   x:collection1] o.a.s.c.SolrCore [collection1] Registered new searcher Searcher@5527e555[collection1] main{ExitableDirectoryReader(UninvertingDirectoryReader())}
   [junit4]   2> 2432060 INFO  (coreLoadExecutor-9286-thread-1-processing-n:127.0.0.1:63390_b%2Fm) [n:127.0.0.1:63390_b%2Fm c:collection1   x:collection1] o.a.s.u.UpdateLog Could not find max version in index or recent updates, using new clock 1555759565632438272
   [junit4]   2> 2432066 INFO  (coreZkRegister-9281-thread-1-processing-n:127.0.0.1:63390_b%2Fm x:collection1 c:collection1) [n:127.0.0.1:63390_b%2Fm c:collection1 s:shard1 r:core_node2 x:collection1] o.a.s.c.ZkController Core needs to recover:collection1
   [junit4]   2> 2432067 INFO  (updateExecutor-2932-thread-1-processing-n:127.0.0.1:63390_b%2Fm x:collection1 s:shard1 c:collection1 r:core_node2) [n:127.0.0.1:63390_b%2Fm c:collection1 s:shard1 r:core_node2 x:collection1] o.a.s.u.DefaultSolrCoreState Running recovery
   [junit4]   2> 2432067 INFO  (recoveryExecutor-2933-thread-1-processing-n:127.0.0.1:63390_b%2Fm x:collection1 s:shard1 c:collection1 r:core_node2) [n:127.0.0.1:63390_b%2Fm c:collection1 s:shard1 r:core_node2 x:collection1] o.a.s.c.RecoveryStrategy Starting recovery process. recoveringAfterStartup=true
   [junit4]   2> 2432067 INFO  (recoveryExecutor-2933-thread-1-processing-n:127.0.0.1:63390_b%2Fm x:collection1 s:shard1 c:collection1 r:core_node2) [n:127.0.0.1:63390_b%2Fm c:collection1 s:shard1 r:core_node2 x:collection1] o.a.s.c.RecoveryStrategy ###### startupVersions=[[]]
   [junit4]   2> 2432068 INFO  (recoveryExecutor-2933-thread-1-processing-n:127.0.0.1:63390_b%2Fm x:collection1 s:shard1 c:collection1 r:core_node2) [n:127.0.0.1:63390_b%2Fm c:collection1 s:shard1 r:core_node2 x:collection1] o.a.s.c.RecoveryStrategy Begin buffering updates. core=[collection1]
   [junit4]   2> 2432068 INFO  (recoveryExecutor-2933-thread-1-processing-n:127.0.0.1:63390_b%2Fm x:collection1 s:shard1 c:collection1 r:core_node2) [n:127.0.0.1:63390_b%2Fm c:collection1 s:shard1 r:core_node2 x:collection1] o.a.s.u.UpdateLog Starting to buffer updates. FSUpdateLog{state=ACTIVE, tlog=null}
   [junit4]   2> 2432068 INFO  (recoveryExecutor-2933-thread-1-processing-n:127.0.0.1:63390_b%2Fm x:collection1 s:shard1 c:collection1 r:core_node2) [n:127.0.0.1:63390_b%2Fm c:collection1 s:shard1 r:core_node2 x:collection1] o.a.s.c.RecoveryStrategy Publishing state of core [collection1] as recovering, leader is [https://127.0.0.1:63386/b/m/collection1/] and I am [https://127.0.0.1:63390/b/m/collection1/]
   [junit4]   2> 2432071 INFO  (recoveryExecutor-2933-thread-1-processing-n:127.0.0.1:63390_b%2Fm x:collection1 s:shard1 c:collection1 r:core_node2) [n:127.0.0.1:63390_b%2Fm c:collection1 s:shard1 r:core_node2 x:collection1] o.a.s.c.RecoveryStrategy Sending prep recovery command to [https://127.0.0.1:63386/b/m]; [WaitForState: action=PREPRECOVERY&core=collection1&nodeName=127.0.0.1:63390_b%252Fm&coreNodeName=core_node2&state=recovering&checkLive=true&onlyIfLeader=true&onlyIfLeaderActive=true]
   [junit4]   2> 2432077 INFO  (zkCallback-2935-thread-1-processing-n:127.0.0.1:63390_b%2Fm) [n:127.0.0.1:63390_b%2Fm    ] o.a.s.c.c.ZkStateReader A cluster state change: [WatchedEvent state:SyncConnected type:NodeDataChanged path:/collections/collection1/state.json] for collection [collection1] has occurred - updating... (live nodes size: [3])
   [junit4]   2> 2432077 INFO  (zkCallback-2929-thread-1-processing-n:127.0.0.1:63386_b%2Fm) [n:127.0.0.1:63386_b%2Fm    ] o.a.s.c.c.ZkStateReader A cluster state change: [WatchedEvent state:SyncConnected type:NodeDataChanged path:/collections/collection1/state.json] for collection [collection1] has occurred - updating... (live nodes size: [3])
   [junit4]   2> 2432098 INFO  (qtp257357659-17588) [n:127.0.0.1:63386_b%2Fm    ] o.a.s.h.a.PrepRecoveryOp Going to wait for coreNodeName: core_node2, state: recovering, checkLive: true, onlyIfLeader: true, onlyIfLeaderActive: true
   [junit4]   2> 2432099 INFO  (qtp257357659-17588) [n:127.0.0.1:63386_b%2Fm    ] o.a.s.h.a.PrepRecoveryOp Will wait a max of 183 seconds to see collection1 (shard1 of collection1) have state: recovering
   [junit4]   2> 2432099 INFO  (qtp257357659-17588) [n:127.0.0.1:63386_b%2Fm    ] o.a.s.h.a.PrepRecoveryOp In WaitForState(recovering): collection=collection1, shard=shard1, thisCore=collection1, leaderDoesNotNeedRecovery=false, isLeader? true, live=true, checkLive=true, currentState=recovering, localState=active, nodeName=127.0.0.1:63390_b%2Fm, coreNodeName=core_node2, onlyIfActiveCheckResult=false, nodeProps: core_node2:{"core":"collection1","base_url":"https://127.0.0.1:63390/b/m","node_name":"127.0.0.1:63390_b%2Fm","state":"recovering"}
   [junit4]   2> 2432099 INFO  (qtp257357659-17588) [n:127.0.0.1:63386_b%2Fm    ] o.a.s.h.a.PrepRecoveryOp Waited coreNodeName: core_node2, state: recovering, checkLive: true, onlyIfLeader: true for: 0 seconds.
   [junit4]   2> 2432099 INFO  (qtp257357659-17588) [n:127.0.0.1:63386_b%2Fm    ] o.a.s.s.HttpSolrCall [admin] webapp=null path=/admin/cores params={nodeName=127.0.0.1:63390_b%252Fm&onlyIfLeaderActive=true&core=collection1&coreNodeName=core_node2&action=PREPRECOVERY&checkLive=true&state=recovering&onlyIfLeader=true&wt=javabin&version=2} status=0 QTime=1
   [junit4]   2> 2432408 INFO  (TEST-PeerSyncReplicationTest.test-seed#[FF2A861BB8B2200B]) [    ] o.a.s.SolrTestCaseJ4 Writing core.properties file to /Users/jenkins/workspace/Lucene-Solr-master-MacOSX/solr/build/solr-core/test/J0/temp/solr.cloud.PeerSyncReplicationTest_FF2A861BB8B2200B-001/shard-3-001/cores/collection1
   [junit4]   2> 2432410 INFO  (TEST-PeerSyncReplicationTest.test-seed#[FF2A861BB8B2200B]) [    ] o.a.s.c.AbstractFullDistribZkTestBase create jetty 3 in directory /Users/jenkins/workspace/Lucene-Solr-master-MacOSX/solr/build/solr-core/test/J0/temp/solr.cloud.PeerSyncReplicationTest_FF2A861BB8B2200B-001/shard-3-001
   [junit4]   2> 2432412 INFO  (TEST-PeerSyncReplicationTest.test-seed#[FF2A861BB8B2200B]) [    ] o.e.j.s.Server jetty-9.3.14.v20161028
   [junit4]   2> 2432414 INFO  (TEST-PeerSyncReplicationTest.test-seed#[FF2A861BB8B2200B]) [    ] o.e.j.s.h.ContextHandler Started o.e.j.s.ServletContextHandler@4e0af4ac{/b/m,null,AVAILABLE}
   [junit4]   2> 2432416 INFO  (TEST-PeerSyncReplicationTest.test-seed#[FF2A861BB8B2200B]) [    ] o.e.j.s.AbstractConnector Started ServerConnector@55e61b5e{SSL,[ssl, http/1.1]}{127.0.0.1:63397}
   [junit4]   2> 2432416 INFO  (TEST-PeerSyncReplicationTest.test-seed#[FF2A861BB8B2200B]) [    ] o.e.j.s.Server Started @2438098ms
   [junit4]   2> 2432416 INFO  (TEST-PeerSyncReplicationTest.test-seed#[FF2A861BB8B2200B]) [    ] o.a.s.c.s.e.JettySolrRunner Jetty properties: {solr.data.dir=/Users/jenkins/workspace/Lucene-Solr-master-MacOSX/solr/build/solr-core/test/J0/temp/solr.cloud.PeerSyncReplicationTest_FF2A861BB8B2200B-001/tempDir-001/jetty3, solrconfig=solrconfig.xml, hostContext=/b/m, hostPort=63397, coreRootDirectory=/Users/jenkins/workspace/Lucene-Solr-master-MacOSX/solr/build/solr-core/test/J0/../../../../../../../../../Users/jenkins/workspace/Lucene-Solr-master-MacOSX/solr/build/solr-core/test/J0/temp/solr.cloud.PeerSyncReplicationTest_FF2A861BB8B2200B-001/shard-3-001/cores}
   [junit4]   2> 2432416 ERROR (TEST-PeerSyncReplicationTest.test-seed#[FF2A861BB8B2200B]) [    ] o.a.s.s.StartupLoggingUtils Missing Java Option solr.log.dir. Logging may be missing or incomplete.
   [junit4]   2> 2432417 INFO  (TEST-PeerSyncReplicationTest.test-seed#[FF2A861BB8B2200B]) [    ] o.a.s.s.SolrDispatchFilter  ___      _       Welcome to Apache Solr? version 7.0.0
   [junit4]   2> 2432417 INFO  (TEST-PeerSyncReplicationTest.test-seed#[FF2A861BB8B2200B]) [    ] o.a.s.s.SolrDispatchFilter / __| ___| |_ _   Starting in cloud mode on port null
   [junit4]   2> 2432417 INFO  (TEST-PeerSyncReplicationTest.test-seed#[FF2A861BB8B2200B]) [    ] o.a.s.s.SolrDispatchFilter \__ \/ _ \ | '_|  Install dir: null
   [junit4]   2> 2432417 INFO  (TEST-PeerSyncReplicationTest.test-seed#[FF2A861BB8B2200B]) [    ] o.a.s.s.SolrDispatchFilter |___/\___/_|_|    Start time: 2017-01-06T07:32:20.604Z
   [junit4]   2> 2432422 INFO  (TEST-PeerSyncReplicationTest.test-seed#[FF2A861BB8B2200B]) [    ] o.a.s.s.SolrDispatchFilter Loading solr.xml from SolrHome (not found in ZooKeeper)
   [junit4]   2> 2432422 INFO  (TEST-PeerSyncReplicationTest.test-seed#[FF2A861BB8B2200B]) [    ] o.a.s.c.SolrXmlConfig Loading container configuration from /Users/jenkins/workspace/Lucene-Solr-master-MacOSX/solr/build/solr-core/test/J0/temp/solr.cloud.PeerSyncReplicationTest_FF2A861BB8B2200B-001/shard-3-001/solr.xml
   [junit4]   2> 2432448 INFO  (TEST-PeerSyncReplicationTest.test-seed#[FF2A861BB8B2200B]) [    ] o.a.s.c.ZkContainer Zookeeper client=127.0.0.1:63374/solr
   [junit4]   2> 2432466 INFO  (TEST-PeerSyncReplicationTest.test-seed#[FF2A861BB8B2200B]) [n:127.0.0.1:63397_b%2Fm    ] o.a.s.c.c.ZkStateReader Updated live nodes from ZooKeeper... (0) -> (3)
   [junit4]   2> 2432477 INFO  (TEST-PeerSyncReplicationTest.test-seed#[FF2A861BB8B2200B]) [n:127.0.0.1:63397_b%2Fm    ] o.a.s.c.ZkController Register node as live in ZooKeeper:/live_nodes/127.0.0.1:63397_b%2Fm
   [junit4]   2> 2432480 INFO  (zkCallback-2935-thread-1-processing-n:127.0.0.1:63390_b%2Fm) [n:127.0.0.1:63390_b%2Fm    ] o.a.s.c.c.ZkStateReader Updated live nodes from ZooKeeper... (3) -> (4)
   [junit4]   2> 2432480 INFO  (zkCallback-2923-thread-1) [    ] o.a.s.c.c.ZkStateReader Updated live nodes from ZooKeeper... (3) -> (4)
   [junit4]   2> 2432481 INFO  (zkCallback-2929-thread-1-processing-n:127.0.0.1:63386_b%2Fm) [n:127.0.0.1:63386_b%2Fm    ] o.a.s.c.c.ZkStateReader Updated live nodes from ZooKeeper... (3) -> (4)
   [junit4]   2> 2432481 INFO  (zkCallback-2942-thread-1-processing-n:127.0.0.1:63397_b%2Fm) [n:127.0.0.1:63397_b%2Fm    ] o.a.s.c.c.ZkStateReader Updated live nodes from ZooKeeper... (3) -> (4)
   [junit4]   2> 2432481 INFO  (zkCallback-2919-thread-1-processing-n:127.0.0.1:63380_b%2Fm) [n:127.0.0.1:63380_b%2Fm    ] o.a.s.c.c.ZkStateReader Updated live nodes from ZooKeeper... (3) -> (4)
   [junit4]   2> 2432528 INFO  (TEST-PeerSyncReplicationTest.test-seed#[FF2A861BB8B2200B]) [n:127.0.0.1:63397_b%2Fm    ] o.a.s.c.CorePropertiesLocator Found 1 core definitions underneath /Users/jenkins/workspace/Lucene-Solr-master-MacOSX/solr/build/solr-core/test/J0/../../../../../../../../../Users/jenkins/workspace/Lucene-Solr-master-MacOSX/solr/build/solr-core/test/J0/temp/solr.cloud.PeerSyncReplicationTest_FF2A861BB8B2200B-001/shard-3-001/cores
   [junit4]   2> 2432529 INFO  (TEST-PeerSyncReplicationTest.test-seed#[FF2A861BB8B2200B]) [n:127.0.0.1:63397_b%2Fm    ] o.a.s.c.CorePropertiesLocator Cores are: [collection1]
   [junit4]   2> 2432533 INFO  (OverseerStateUpdate-97234972234743813-127.0.0.1:63380_b%2Fm-n_0000000000) [n:127.0.0.1:63380_b%2Fm    ] o.a.s.c.o.ReplicaMutator Assigning new node to shard shard=shard1
   [junit4]   2> 2432664 INFO  (zkCallback-2935-thread-1-processing-n:127.0.0.1:63390_b%2Fm) [n:127.0.0.1:63390_b%2Fm    ] o.a.s.c.c.ZkStateReader A cluster state change: [WatchedEvent state:SyncConnected type:NodeDataChanged path:/collections/collection1/state.json] for collection [collection1] has occurred - updating... (live nodes size: [4])
   [junit4]   2> 2432664 INFO  (zkCallback-2929-thread-1-processing-n:127.0.0.1:63386_b%2Fm) [n:127.0.0.1:63386_b%2Fm    ] o.a.s.c.c.ZkStateReader A cluster state change: [WatchedEvent state:SyncConnected type:NodeDataChanged path:/collections/collection1/state.json] for collection [collection1] has occurred - updating... (live nodes size: [4])
   [junit4]   2> 2432664 INFO  (zkCallback-2942-thread-1-processing-n:127.0.0.1:63397_b%2Fm) [n:127.0.0.1:63397_b%2Fm    ] o.a.s.c.c.ZkStateReader A cluster state change: [WatchedEvent state:SyncConnected type:NodeDataChanged path:/collections/collection1/state.json] for collection [collection1] has occurred - updating... (live nodes size: [4])
   [junit4]   2> 2433546 WARN  (coreLoadExecutor-9297-thread-1-processing-n:127.0.0.1:63397_b%2Fm) [n:127.0.0.1:63397_b%2Fm c:collection1   x:collection1] o.a.s.c.Config Beginning with Solr 5.5, <mergePolicy> is deprecated, use <mergePolicyFactory> instead.
   [junit4]   2> 2433547 INFO  (coreLoadExecutor-9297-thread-1-processing-n:127.0.0.1:63397_b%2Fm) [n:127.0.0.1:63397_b%2Fm c:collection1   x:collection1] o.a.s.c.SolrConfig Using Lucene MatchVersion: 7.0.0
   [junit4]   2> 2433561 INFO  (coreLoadExecutor-9297-thread-1-processing-n:127.0.0.1:63397_b%2Fm) [n:127.0.0.1:63397_b%2Fm c:collection1   x:collection1] o.a.s.s.IndexSchema [collection1] Schema name=test
   [junit4]   2> 2433684 WARN  (coreLoadExecutor-9297-thread-1-processing-n:127.0.0.1:63397_b%2Fm) [n:127.0.0.1:63397_b%2Fm c:collection1   x:collection1] o.a.s.s.IndexSchema [collection1] default search field in schema is text. WARNING: Deprecated, please use 'df' on request instead.
   [junit4]   2> 2433686 INFO  (coreLoadExecutor-9297-thread-1-processing-n:127.0.0.1:63397_b%2Fm) [n:127.0.0.1:63397_b%2Fm c:collection1   x:collection1] o.a.s.s.IndexSchema Loaded schema test/1.0 with uniqueid field id
   [junit4]   2> 2433710 INFO  (coreLoadExecutor-9297-thread-1-processing-n:127.0.0.1:63397_b%2Fm) [n:127.0.0.1:63397_b%2Fm c:collection1   x:collection1] o.a.s.c.CoreContainer Creating SolrCore 'collection1' using configuration from collection collection1
   [junit4]   2> 2433710 INFO  (coreLoadExecutor-9297-thread-1-processing-n:127.0.0.1:63397_b%2Fm) [n:127.0.0.1:63397_b%2Fm c:collection1   x:collection1] o.a.s.c.SolrCore [[collection1] ] Opening new SolrCore at [/Users/jenkins/workspace/Lucene-Solr-master-MacOSX/solr/build/solr-core/test/J0/temp/solr.cloud.PeerSyncReplicationTest_FF2A861BB8B2200B-001/shard-3-001/cores/collection1], dataDir=[/Users/jenkins/workspace/Lucene-Solr-master-MacOSX/solr/build/solr-core/test/J0/../../../../../../../../../Users/jenkins/workspace/Lucene-Solr-master-MacOSX/solr/build/solr-core/test/J0/temp/solr.cloud.PeerSyncReplicationTest_FF2A861BB8B2200B-001/shard-3-001/cores/collection1/data/]
   [junit4]   2> 2433710 INFO  (coreLoadExecutor-9297-thread-1-processing-n:127.0.0.1:63397_b%2Fm) [n:127.0.0.1:63397_b%2Fm c:collection1   x:collection1] o.a.s.c.JmxMonitoredMap JMX monitoring is enabled. Adding Solr mbeans to JMX Server: com.sun.jmx.mbeanserver.JmxMBeanServer@51076071
   [junit4]   2> 2433714 INFO  (coreLoadExecutor-9297-thread-1-processing-n:127.0.0.1:63397_b%2Fm) [n:127.0.0.1:63397_b%2Fm c:collection1   x:collection1] o.a.s.u.RandomMergePolicy RandomMergePolicy wrapping class org.apache.lucene.index.AlcoholicMergePolicy: [AlcoholicMergePolicy: minMergeSize=0, mergeFactor=10, maxMergeSize=1703256056, maxMergeSizeForForcedMerge=9223372036854775807, calibrateSizeByDeletes=true, maxMergeDocs=2147483647, maxCFSSegmentSizeMB=8.796093022207999E12, noCFSRatio=0.1]
   [junit4]   2> 2433732 WARN  (coreLoadExecutor-9297-thread-1-processing-n:127.0.0.1:63397_b%2Fm) [n:127.0.0.1:63397_b%2Fm c:collection1   x:collection1] o.a.s.c.RequestHandlers INVALID paramSet a in requestHandler {type = requestHandler,name = /dump,class = DumpRequestHandler,attributes = {initParams=a, name=/dump, class=DumpRequestHandler},args = {defaults={a=A,b=B}}}
   [junit4]   2> 2433748 INFO  (coreLoadExecutor-9297-thread-1-processing-n:127.0.0.1:63397_b%2Fm) [n:127.0.0.1:63397_b%2Fm c:collection1   x:collection1] o.a.s.u.UpdateHandler Using UpdateLog implementation: org.apache.solr.update.UpdateLog
   [junit4]   2> 2433748 INFO  (coreLoadExecutor-9297-thread-1-processing-n:127.0.0.1:63397_b%2Fm) [n:127.0.0.1:63397_b%2Fm c:collection1   x:collection1] o.a.s.u.UpdateLog Initializing UpdateLog: dataDir= defaultSyncLevel=FLUSH numRecordsToKeep=1000 maxNumLogsToKeep=10 numVersionBuckets=65536
   [junit4]   2> 2433750 INFO  (coreLoadExecutor-9297-thread-1-processing-n:127.0.0.1:63397_b%2Fm) [n:127.0.0.1:63397_b%2Fm c:collection1   x:collection1] o.a.s.u.CommitTracker Hard AutoCommit: disabled
   [junit4]   2> 2433750 INFO  (coreLoadExecutor-9297-thread-1-processing-n:127.0.0.1:63397_b%2Fm) [n:127.0.0.1:63397_b%2Fm c:collection1   x:collection1] o.a.s.u.CommitTracker Soft AutoCommit: disabled
   [junit4]   2> 2433750 INFO  (coreLoadExecutor-9297-thread-1-processing-n:127.0.0.1:63397_b%2Fm) [n:127.0.0.1:63397_b%2Fm c:collection1   x:collection1] o.a.s.u.RandomMergePolicy RandomMergePolicy wrapping class org.apache.lucene.index.TieredMergePolicy: [TieredMergePolicy: maxMergeAtOnce=39, maxMergeAtOnceExplicit=37, maxMergedSegmentMB=92.0517578125, floorSegmentMB=0.9404296875, forceMergeDeletesPctAllowed=23.368907617038282, segmentsPerTier=27.0, maxCFSSegmentSizeMB=8.796093022207999E12, noCFSRatio=1.0
   [junit4]   2> 2433751 INFO  (coreLoadExecutor-9297-thread-1-processing-n:127.0.0.1:63397_b%2Fm) [n:127.0.0.1:63397_b%2Fm c:collection1   x:collection1] o.a.s.s.SolrIndexSearcher Opening [Searcher@70656d6a[collection1] main]
   [junit4]   2> 2433753 INFO  (coreLoadExecutor-9297-thread-1-processing-n:127.0.0.1:63397_b%2Fm) [n:127.0.0.1:63397_b%2Fm c:collection1   x:collection1] o.a.s.r.ManagedResourceStorage Configured ZooKeeperStorageIO with znodeBase: /configs/conf1
   [junit4]   2> 2433754 INFO  (coreLoadExecutor-9297-thread-1-processing-n:127.0.0.1:63397_b%2Fm) [n:127.0.0.1:63397_b%2Fm c:collection1   x:collection1] o.a.s.r.ManagedResourceStorage Loaded null at path _rest_managed.json using ZooKeeperStorageIO:path=/configs/conf1
   [junit4]   2> 2433754 INFO  (coreLoadExecutor-9297-thread-1-processing-n:127.0.0.1:63397_b%2Fm) [n:127.0.0.1:63397_b%2Fm c:collection1   x:collection1] o.a.s.h.ReplicationHandler Commits will be reserved for  10000
   [junit4]   2> 2433755 INFO  (searcherExecutor-9298-thread-1-processing-n:127.0.0.1:63397_b%2Fm x:collection1 c:collection1) [n:127.0.0.1:63397_b%2Fm c:collection1   x:collection1] o.a.s.c.SolrCore [collection1] Registered new searcher Searcher@70656d6a[collection1] main{ExitableDirectoryReader(UninvertingDirectoryReader())}
   [junit4]   2> 2433755 INFO  (coreLoadExecutor-9297-thread-1-processing-n:127.0.0.1:63397_b%2Fm) [n:127.0.0.1:63397_b%2Fm c:collection1   x:collection1] o.a.s.u.UpdateLog Could not find max version in index or recent updates, using new clock 1555759567409774592
   [junit4]   2> 2433761 INFO  (coreZkRegister-9292-thread-1-processing-n:127.0.0.1:63397_b%2Fm x:collection1 c:collection1) [n:127.0.0.1:63397_b%2Fm c:collection1 s:shard1 r:core_node3 x:collection1] o.a.s.c.ZkController Core needs to recover:collection1
   [junit4]   2> 2433762 INFO  (updateExecutor-2939-thread-1-processing-n:127.0.0.1:63397_b%2Fm x:collection1 s:shard1 c:collection1 r:core_node3) [n:127.0.0.1:63397_b%2Fm c:collection1 s:shard1 r:core_node3 x:collection1] o.a.s.u.DefaultSolrCoreState Running recovery
   [junit4]   2> 2433762 INFO  (recoveryExecutor-2940-thread-1-processing-n:127.0.0.1:63397_b%2Fm x:collection1 s:shard1 c:collection1 r:core_node3) [n:127.0.0.1:63397_b%2Fm c:collection1 s:shard1 r:core_node3 x:collection1] o.a.s.c.RecoveryStrategy Starting recovery process. recoveringAfterStartup=true
   [junit4]   2> 2433762 INFO  (recoveryExecutor-2940-thread-1-processing-n:127.0.0.1:63397_b%2Fm x:collection1 s:shard1 c:collection1 r:core_node3) [n:127.0.0.1:63397_b%2Fm c:collection1 s:shard1 r:core_node3 x:collection1] o.a.s.c.RecoveryStrategy ###### startupVersions=[[]]
   [junit4]   2> 2433762 INFO  (recoveryExecutor-2940-thread-1-processing-n:127.0.0.1:63397_b%2Fm x:collection1 s:shard1 c:collection1 r:core_node3) [n:127.0.0.1:63397_b%2Fm c:collection1 s:shard1 r:core_node3 x:collection1] o.a.s.c.RecoveryStrategy Begin buffering updates. core=[collection1]
   [junit4]   2> 2433762 INFO  (recoveryExecutor-2940-thread-1-processing-n:127.0.0.1:63397_b%2Fm x:collection1 s:shard1 c:collection1 r:core_node3) [n:127.0.0.1:63397_b%2Fm c:collection1 s:shard1 r:core_node3 x:collection1] o.a.s.u.UpdateLog Starting to buffer updates. FSUpdateLog{state=ACTIVE, tlog=null}
   [junit4]   2> 2433762 INFO  (recoveryExecutor-2940-thread-1-processing-n:127.0.0.1:63397_b%2Fm x:collection1 s:shard1 c:collection1 r:core_node3) [n:127.0.0.1:63397_b%2Fm c:collection1 s:shard1 r:core_node3 x:collection1] o.a.s.c.RecoveryStrategy Publishing state of core [collection1] as recovering, leader is [https://127.0.0.1:63386/b/m/collection1/] and I am [https://127.0.0.1:63397/b/m/collection1/]
   [junit4]   2> 2433765 INFO  (recoveryExecutor-2940-thread-1-processing-n:127.0.0.1:63397_b%2Fm x:collection1 s:shard1 c:collection1 r:core_node3) [n:127.0.0.1:63397_b%2Fm c:collection1 s:shard1 r:core_node3 x:collection1] o.a.s.c.RecoveryStrategy Sending prep recovery command to [https://127.0.0.1:63386/b/m]; [WaitForState: action=PREPRECOVERY&core=collection1&nodeName=127.0.0.1:63397_b%252Fm&coreNodeName=core_node3&state=recovering&checkLive=true&onlyIfLeader=true&onlyIfLeaderActive=true]
   [junit4]   2> 2433772 INFO  (qtp257357659-17586) [n:127.0.0.1:63386_b%2Fm    ] o.a.s.h.a.PrepRecoveryOp Going to wait for coreNodeName: core_node3, state: recovering, checkLive: true, onlyIfLeader: true, onlyIfLeaderActive: true
   [junit4]   2> 2433772 INFO  (qtp257357659-17586) [n:127.0.0.1:63386_b%2Fm    ] o.a.s.h.a.PrepRecoveryOp Will wait a max of 183 seconds to see collection1 (shard1 of collection1) have state: recovering
   [junit4]   2> 2433773 INFO  (qtp257357659-17586) [n:127.0.0.1:63386_b%2Fm    ] o.a.s.h.a.PrepRecoveryOp In WaitForState(recovering): collection=collection1, shard=shard1, thisCore=collection1, leaderDoesNotNeedRecovery=false, isLeader? true, live=true, checkLive=true, currentState=down, localState=active, nodeName=127.0.0.1:63397_b%2Fm, coreNodeName=core_node3, onlyIfActiveCheckResult=false, nodeProps: core_node3:{"core":"collection1","base_url":"https://127.0.0.1:63397/b/m","node_name":"127.0.0.1:63397_b%2Fm","state":"down"}
   [junit4]   2> 2433872 INFO  (zkCallback-2935-thread-1-processing-n:127.0.0.1:63390_b%2Fm) [n:127.0.0.1:63390_b%2Fm    ] o.a.s.c.c.ZkStateReader A cluster state change: [WatchedEvent state:SyncConnected type:NodeDataChanged path:/collections/collection1/state.json] for collection [collection1] has occurred - updating... (live nodes size: [4])
   [junit4]   2> 2433872 INFO  (zkCallback-2929-thread-1-processing-n:127.0.0.1:63386_b%2Fm) [n:127.0.0.1:63386_b%2Fm    ] o.a.s.c.c.ZkStateReader A cluster state change: [WatchedEvent state:SyncConnected type:NodeDataChanged path:/collections/collection1/state.json] for collection [collection1] has occurred - updating... (live nodes size: [4])
   [junit4]   2> 2433872 INFO  (zkCallback-2942-thread-1-processing-n:127.0.0.1:63397_b%2Fm) [n:127.0.0.1:63397_b%2Fm    ] o.a.s.c.c.ZkStateReader A cluster state change: [WatchedEvent state:SyncConnected type:NodeDataChanged path:/collections/collection1/state.json] for collection [collection1] has occurred - updating... (live nodes size: [4])
   [junit4]   2> 2433963 INFO  (TEST-PeerSyncReplicationTest.test-seed#[FF2A861BB8B2200B]) [    ] o.a.s.SolrTestCaseJ4 ###Starting test
   [junit4]   2> 2433964 INFO  (TEST-PeerSyncReplicationTest.test-seed#[FF2A861BB8B2200B]) [    ] o.a.s.c.AbstractFullDistribZkTestBase Wait for recoveries to finish - wait 30 for each attempt
   [junit4]   2> 2433964 INFO  (TEST-PeerSyncReplicationTest.test-seed#[FF2A861BB8B2200B]) [    ] o.a.s.c.AbstractDistribZkTestBase Wait for recoveries to finish - collection: collection1 failOnTimeout:true timeout (sec):30
   [junit4]   2> 2434773 INFO  (qtp257357659-17586) [n:127.0.0.1:63386_b%2Fm    ] o.a.s.h.a.PrepRecoveryOp In WaitForState(recovering): collection=collection1, shard=shard1, thisCore=collection1, leaderDoesNotNeedRecovery=false, isLeader? true, live=true, checkLive=true, currentState=recovering, localState=active, nodeName=127.0.0.1:63397_b%2Fm, coreNodeName=core_node3, onlyIfActiveCheckResult=false, nodeProps: core_node3:{"core":"collection1","base_url":"https://127.0.0.1:63397/b/m","node_name":"127.0.0.1:63397_b%2Fm","state":"recovering"}
   [junit4]   2> 2434773 INFO  (qtp257357659-17586) [n:127.0.0.1:63386_b%2Fm    ] o.a.s.h.a.PrepRecoveryOp Waited coreNodeName: core_node3, state: recovering, checkLive: true, onlyIfLeader: true for: 1 seconds.
   [junit4]   2> 2434773 INFO  (qtp257357659-17586) [n:127.0.0.1:63386_b%2Fm    ] o.a.s.s.HttpSolrCall [admin] webapp=null path=/admin/cores params={nodeName=127.0.0.1:63397_b%252Fm&onlyIfLeaderActive=true&core=collection1&coreNodeName=core_node3&action=PREPRECOVERY&checkLive=true&state=recovering&onlyIfLeader=true&wt=javabin&version=2} status=0 QTime=1001
   [junit4]   2> 2439107 INFO  (recoveryExecutor-2933-thread-1-processing-n:127.0.0.1:63390_b%2Fm x:collection1 s:shard1 c:collection1 r:core_node2) [n:127.0.0.1:63390_b%2Fm c:collection1 s:shard1 r:core_node2 x:collection1] o.a.s.c.RecoveryStrategy Attempting to PeerSync from [https://127.0.0.1:63386/b/m/collection1/] - recoveringAfterStartup=[true]
   [junit4]   2> 2439107 INFO  (recoveryExecutor-2933-thread-1-processing-n:127.0.0.1:63390_b%2Fm x:collection1 s:shard1 c:collection1 r:core_node2) [n:127.0.0.1:63390_b%2Fm c:collection1 s:shard1 r:core_node2 x:collection1] o.a.s.u.PeerSync PeerSync: core=collection1 url=https://127.0.0.1:63390/b/m START replicas=[https://127.0.0.1:63386/b/m/collection1/] nUpdates=1000
   [junit4]   2> 2439112 INFO  (qtp257357659-17583) [n:127.0.0.1:63386_b%2Fm c:collection1 s:shard1 r:core_node1 x:collection1] o.a.s.u.IndexFingerprint IndexFingerprint millis:0.0 result:{maxVersionSpecified=9223372036854775807, maxVersionEncountered=0, maxInHash=0, versionsHash=0, numVersions=0, numDocs=0, maxDoc=0}
   [junit4]   2> 2439112 INFO  (qtp257357659-17583) [n:127.0.0.1:63386_b%2Fm c:collection1 s:shard1 r:core_node1 x:collection1] o.a.s.c.S.Request [collection1]  webapp=/b/m path=/get params={distrib=false&qt=/get&getFingerprint=9223372036854775807&wt=javabin&version=2} status=0 QTime=1
   [junit4]   2> 2439113 INFO  (recoveryExecutor-2933-thread-1-processing-n:127.0.0.1:63390_b%2Fm x:collection1 s:shard1 c:collection1 r:core_node2) [n:127.0.0.1:63390_b%2Fm c:collection1 s:shard1 r:core_node2 x:collection1] o.a.s.u.IndexFingerprint IndexFingerprint millis:0.0 result:{maxVersionSpecified=9223372036854775807, maxVersionEncountered=0, maxInHash=0, versionsHash=0, numVersions=0, numDocs=0, maxDoc=0}
   [junit4]   2> 2439113 INFO  (recoveryExecutor-2933-thread-1-processing-n:127.0.0.1:63390_b%2Fm x:collection1 s:shard1 c:collection1 r:core_node2) [n:127.0.0.1:63390_b%2Fm c:collection1 s:shard1 r:core_node2 x:collection1] o.a.s.u.PeerSync We are already in sync. No need to do a PeerSync 
   [junit4]   2> 2439113 INFO  (recoveryExecutor-2933-thread-1-processing-n:127.0.0.1:63390_b%2Fm x:collection1 s:shard1 c:collection1 r:core_node2) [n:127.0.0.1:63390_b%2Fm c:collection1 s:shard1 r:core_node2 x:collection1] o.a.s.u.DirectUpdateHandler2 start commit{,optimize=false,openSearcher=true,waitSearcher=true,expungeDeletes=false,softCommit=false,prepareCommit=false}
   [junit4]   2> 2439113 INFO  (recoveryExecutor-2933-thread-1-processing-n:127.0.0.1:63390_b%2Fm x:collection1 s:shard1 c:collection1 r:core_node2) [n:127.0.0.1:63390_b%2Fm c:collection1 s:shard1 r:core_node2 x:collection1] o.a.s.u.DirectUpdateHandler2 No uncommitted changes. Skipping IW.commit.
   [junit4]   2> 2439113 INFO  (recoveryExecutor-2933-thread-1-processing-n:127.0.0.1:63390_b%2Fm x:collection1 s:shard1 c:collection1 r:core_node2) [n:127.0.0.1:63390_b%2Fm c:collection1 s:shard1 r:core_node2 x:collection1] o.a.s.u.DirectUpdateHandler2 end_commit_flush
   [junit4]   2> 2439114 INFO  (recoveryExecutor-2933-thread-1-processing-n:127.0.0.1:63390_b%2Fm x:collection1 s:shard1 c:collection1 r:core_node2) [n:127.0.0.1:63390_b%2Fm c:collection1 s:shard1 r:core_node2 x:collection1] o.a.s.c.RecoveryStrategy PeerSync stage of recovery was successful.
   [junit4]   2> 2439114 INFO  (recoveryExecutor-2933-thread-1-processing-n:127.0.0.1:63390_b%2Fm x:collection1 s:shard1 c:collection1 r:core_node2) [n:127.0.0.1:63390_b%2Fm c:collection1 s:shard1 r:core_node2 x:collection1] o.a.s.c.RecoveryStrategy Replaying updates buffered during PeerSync.
   [junit4]   2> 2439114 INFO  (recoveryExecutor-2933-thread-1-processing-n:127.0.0.1:63390_b%2Fm x:collection1 s:shard1 c:collection1 r:core_node2) [n:127.0.0.1:63390_b%2Fm c:collection1 s:shard1 r:core_node2 x:collection1] o.a.s.c.RecoveryStrategy No replay needed.
   [junit4]   2> 2439114 INFO  (recoveryExecutor-2933-thread-1-processing-n:127.0.0.1:63390_b%2Fm x:collection1 s:shard1 c:collection1 r:core_node2) [n:127.0.0.1:63390_b%2Fm c:collection1 s:shard1 r:core_node2 x:collection1] o.a.s.c.RecoveryStrategy Registering as Active after recovery.
   [junit4]   2> 2439127 INFO  (zkCallback-2942-thread-1-processing-n:127.0.0.1:63397_b%2Fm) [n:127.0.0.1:63397_b%2Fm    ] o.a.s.c.c.ZkStateReader A cluster state change: [WatchedEvent state:SyncConnected type:NodeDataChanged path:/collections/collection1/state.json] for collection [collection1] has occurred - updating... (live nodes size: [4])
   [junit4]   2> 2439127 INFO  (zkCallback-2929-thread-1-processing-n:127.0.0.1:63386_b%2Fm) [n:127.0.0.1:63386_b%2Fm    ] o.a.s.c.c.ZkStateReader A cluster state change: [WatchedEvent state:SyncConnected type:NodeDataChanged path:/collections/collection1/state.json] for collection [collection1] has occurred - updating... (live nodes size: [4])
   [junit4]   2> 2439127 INFO  (zkCallback-2935-thread-1-processing-n:127.0.0.1:63390_b%2Fm) [n:127.0.0.1:63390_b%2Fm    ] o.a.s.c.c.ZkStateReader A cluster state change: [WatchedEvent state:SyncConnected type:NodeDataChanged path:/collections/collection1/state.json] for collection [collection1] has occurred - updating... (live nodes size: [4])
   [junit4]   2> 2441779 INFO  (recoveryExecutor-2940-thread-1-processing-n:127.0.0.1:63397_b%2Fm x:collection1 s:shard1 c:collection1 r:core_node3) [n:127.0.0.1:63397_b%2Fm c:collection1 s:shard1 r:core_node3 x:collection1] o.a.s.c.RecoveryStrategy Attempting to PeerSync from [https://127.0.0.1:63386/b/m/collection1/] - recoveringAfterStartup=[true]
   [junit4]   2> 2441779 INFO  (recoveryExecutor-2940-thread-1-processing-n:127.0.0.1:63397_b%2Fm x:collection1 s:shard1 c:collection1 r:core_node3) [n:127.0.0.1:63397_b%2Fm c:collection1 s:shard1 r:core_node3 x:collection1] o.a.s.u.PeerSync PeerSync: core=collection1 url=https://127.0.0.1:63397/b/m START replicas=[https://127.0.0.1:63386/b/m/collection1/] nUpdates=1000
   [junit4]   2> 2441786 INFO  (qtp257357659-17587) [n:127.0.0.1:63386_b%2Fm c:collection1 s:shard1 r:core_node1 x:collection1] o.a.s.u.IndexFingerprint IndexFingerprint millis:0.0 result:{maxVersionSpecified=9223372036854775807, maxVersionEncountered=0, maxInHash=0, versionsHash=0, numVersions=0, numDocs=0, maxDoc=0}
   [junit4]   2> 2441786 INFO  (qtp257357659-17587) [n:127.0.0.1:63386_b%2Fm c:collection1 s:shard1 r:core_node1 x:collection1] o.a.s.c.S.Request [collection1]  webapp=/b/m path=/get params={distrib=false&qt=/get&getFingerprint=9223372036854775807&wt=javabin&version=2} status=0 QTime=0
   [junit4]   2> 2441787 INFO  (recoveryExecutor-2940-thread-1-processing-n:127.0.0.1:63397_b%2Fm x:collection1 s:shard1 c:collection1 r:core_node3) [n:127.0.0.1:63397_b%2Fm c:collection1 s:shard1 r:core_node3 x:collection1] o.a.s.u.IndexFingerprint IndexFingerprint millis:0.0 result:{maxVersionSpecified=9223372036854775807, maxVersionEncountered=0, maxInHash=0, versionsHash=0, numVersions=0, numDocs=0, maxDoc=0}
   [junit4]   2> 2441787 INFO  (recoveryExecutor-2940-thread-1-processing-n:127.0.0.1:63397_b%2Fm x:collection1 s:shard1 c:collection1 r:core_node3) [n:127.0.0.1:63397_b%2Fm c:collection1 s:shard1 r:core_node3 x:collection1] o.a.s.u.PeerSync We are already in sync. No need to do a PeerSync 
   [junit4]   2> 2441787 INFO  (recoveryExecutor-2940-thread-1-processing-n:127.0.0.1:63397_b%2Fm x:collection1 s:shard1 c:collection1 r:core_node3) [n:127.0.0.1:63397_b%2Fm c:collection1 s:shard1 r:core_node3 x:collection1] o.a.s.u.DirectUpdateHandler2 start commit{,optimize=false,openSearcher=true,waitSearcher=true,expungeDeletes=false,softCommit=false,prepareCommit=false}
   [junit4]   2> 2441787 INFO  (recoveryExecutor-2940-thread-1-processing-n:127.0.0.1:63397_b%2Fm x:collection1 s:shard1 c:collection1 r:core_node3) [n:127.0.0.1:63397_b%2Fm c:collection1 s:shard1 r:core_node3 x:collection1] o.a.s.u.DirectUpdateHandler2 No uncommitted changes. Skipping IW.commit.
   [junit4]   2> 2441787 INFO  (recoveryExecutor-2940-thread-1-processing-n:127.0.0.1:63397_b%2Fm x:collection1 s:shard1 c:collection1 r:core_node3) [n:127.0.0.1:63397_b%2Fm c:collection1 s:shard1 r:core_node3 x:collection1] o.a.s.u.DirectUpdateHandler2 end_commit_flush
   [junit4]   2> 2441787 INFO  (recoveryExecutor-2940-thread-1-processing-n:127.0.0.1:63397_b%2Fm x:collection1 s:shard1 c:collection1 r:core_node3) [n:127.0.0.1:63397_b%2Fm c:collection1 s:shard1 r:core_node3 x:collection1] o.a.s.c.RecoveryStrategy PeerSync stage of recovery was successful.
   [junit4]   2> 2441788 INFO  (recoveryExecutor-2940-thread-1-processing-n:127.0.0.1:63397_b%2Fm x:collection1 s:shard1 c:collection1 r:core_node3) [n:127.0.0.1:63397_b%2Fm c:collection1 s:shard1 r:core_node3 x:collection1] o.a.s.c.RecoveryStrategy Replaying updates buffered during PeerSync.
   [junit4]   2> 2441788 INFO  (recoveryExecutor-2940-thread-1-processing-n:127.0.0.1:63397_b%2Fm x:collection1 s:shard1 c:collection1 r:core_node3) [n:127.0.0.1:63397_b%2Fm c:collection1 s:shard1 r:core_node3 x:collection1] o.a.s.c.RecoveryStrategy No replay needed.
   [junit4]   2> 2441788 INFO  (recoveryExecutor-2940-thread-1-processing-n:127.0.0.1:63397_b%2Fm x:collection1 s:shard1 c:collection1 r:core_node3) [n:127.0.0.1:63397_b%2Fm c:collection1 s:shard1 r:core_node3 x:collection1] o.a.s.c.RecoveryStrategy Registering as Active after recovery.
   [junit4]   2> 2441794 INFO  (zkCallback-2942-thread-1-processing-n:127.0.0.1:63397_b%2Fm) [n:127.0.0.1:63397_b%2Fm    ] o.a.s.c.c.ZkStateReader A cluster state change: [WatchedEvent state:SyncConnected type:NodeDataChanged path:/collections/collection1/state.json] for collection [collection1] has occurred - updating... (live nodes size: [4])
   [junit4]   2> 2441794 INFO  (zkCallback-2935-thread-1-processing-n:127.0.0.1:63390_b%2Fm) [n:127.0.0.1:63390_b%2Fm    ] o.a.s.c.c.ZkStateReader A cluster state change: [WatchedEvent state:SyncConnected type:NodeDataChanged path:/collections/collection1/state.json] for collection [collection1] has occurred - updating... (live nodes size: [4])
   [junit4]   2> 2441794 INFO  (zkCallback-2929-thread-1-processing-n:127.0.0.1:63386_b%2Fm) [n:127.0.0.1:63386_b%2Fm    ] o.a.s.c.c.ZkStateReader A cluster state change: [WatchedEvent state:SyncConnected type:NodeDataChanged path:/collections/collection1/state.json] for collection [collection1] has occurred - updating... (live nodes size: [4])
   [junit4]   2> 2442009 INFO  (TEST-PeerSyncReplicationTest.test-seed#[FF2A861BB8B2200B]) [    ] o.a.s.c.AbstractDistribZkTestBase Recoveries finished - collection: collection1
   [junit4]   2> 2442034 INFO  (qtp2089041131-17547) [n:127.0.0.1:63380_b%2Fm c:control_collection s:shard1 r:core_node1 x:collection1] o.a.s.u.DirectUpdateHandler2 start commit{,optimize=false,openSearcher=true,waitSearcher=true,expungeDeletes=false,softCommit=false,prepareCommit=false}
   [junit4]   2> 2442034 INFO  (qtp2089041131-17547) [n:127.0.0.1:63380_b%2Fm c:control_collection s:shard1 r:core_node1 x:collection1] o.a.s.u.DirectUpdateHandler2 No uncommitted changes. Skipping IW.commit.
   [junit4]   2> 2442035 INFO  (qtp2089041131-17547) [n:127.0.0.1:63380_b%2Fm c:control_collection s:shard1 r:core_node1 x:collection1] o.a.s.u.DirectUpdateHandler2 end_commit_flush
   [junit4]   2> 2442036 INFO  (qtp2089041131-17547) [n:127.0.0.1:63380_b%2Fm c:control_collection s:shard1 r:core_node1 x:collection1] o.a.s.u.p.LogUpdateProcessorFactory [collection1]  webapp=/b/m path=/update params={waitSearcher=true&commit=true&softCommit=false&wt=javabin&version=2}{commit=} 0 1
   [junit4]   2> 2442047 INFO  (qtp257357659-17585) [n:127.0.0.1:63386_b%2Fm c:collection1 s:shard1 r:core_node1 x:collection1] o.a.s.u.DirectUpdateHandler2 start commit{,optimize=false,openSearcher=true,waitSearcher=true,expungeDeletes=false,softCommit=false,prepareCommit=false}
   [junit4]   2> 2442047 INFO  (qtp257357659-17585) [n:127.0.0.1:63386_b%2Fm c:collection1 s:shard1 r:core_node1 x:collection1] o.a.s.u.DirectUpdateHandler2 No uncommitted changes. Skipping IW.commit.
   [junit4]   2> 2442048 INFO  (qtp257357659-17585) [n:127.0.0.1:63386_b%2Fm c:collection1 s:shard1 r:core_node1 x:collection1] o.a.s.u.DirectUpdateHandler2 end_commit_flush
   [junit4]   2> 2442049 INFO  (qtp257357659-17585) [n:127.0.0.1:63386_b%2Fm c:collection1 s:shard1 r:core_node1 x:collection1] o.a.s.u.p.LogUpdateProcessorFactory [collection1]  webapp=/b/m path=/update params={update.distrib=FROMLEADER&waitSearcher=true&openSearcher=true&commit=true&softCommit=false&distrib.from=https://127.0.0.1:63386/b/m/collection1/&commit_end_point=true&wt=javabin&version=2&expungeDeletes=false}{commit=} 0 1
   [junit4]   2> 2442073 INFO  (qtp1084782972-17615) [n:127.0.0.1:63390_b%2Fm c:collection1 s:shard1 r:core_node2 x:collection1] o.a.s.u.DirectUpdateHandler2 start commit{,optimize=false,openSearcher=true,waitSearcher=true,expungeDeletes=false,softCommit=false,prepareCommit=false}
   [junit4]   2> 2442073 INFO  (qtp1084782972-17615) [n:127.0.0.1:63390_b%2Fm c:collection1 s:shard1 r:core_node2 x:collection1] o.a.s.u.DirectUpdateHandler2 No uncommitted changes. Skipping IW.commit.
   [junit4]   2> 2442073 INFO  (qtp1084782972-17615) [n:127.0.0.1:63390_b%2Fm c:collection1 s:shard1 r:core_node2 x:collection1] o.a.s.u.DirectUpdateHandler2 end_commit_flush
   [junit4]   2> 2442074 INFO  (qtp1084782972-17615) [n:127.0.0.1:63390_b%2Fm c:collection1 s:shard1 r:core_node2 x:collection1] o.a.s.u.p.LogUpdateProcessorFactory [collection1]  webapp=/b/m path=/update params={update.distrib=FROMLEADER&waitSearcher=true&openSearcher=true&commit=true&softCommit=false&distrib.from=https://127.0.0.1:63386/b/m/collection1/&commit_end_point=true&wt=javabin&version=2&expungeDeletes=false}{commit=} 0 1
   [junit4]   2> 2442076 INFO  (qtp1529651568-17650) [n:127.0.0.1:63397_b%2Fm c:collection1 s:shard1 r:core_node3 x:collection1] o.a.s.u.DirectUpdateHandler2 start commit{,optimize=false,openSearcher=true,waitSearcher=true,expungeDeletes=false,softCommit=false,prepareCommit=false}
   [junit4]   2> 2442076 INFO  (qtp1529651568-17650) [n:127.0.0.1:63397_b%2Fm c:collection1 s:shard1 r:core_node3 x:collection1] o.a.s.u.DirectUpdateHandler2 No uncommitted changes. Skipping IW.commit.
   [junit4]   2> 2442077 INFO  (qtp1529651568-17650) [n:127.0.0.1:63397_b%2Fm c:collection1 s:shard1 r:core_node3 x:collection1] o.a.s.u.DirectUpdateHandler2 end_commit_flush
   [junit4]   2> 2442077 INFO  (qtp1529651568-17650) [n:127.0.0.1:63397_b%2Fm c:collection1 s:shard1 r:core_node3 x:collection1] o.a.s.u.p.LogUpdateProcessorFactory [collection1]  webapp=/b/m path=/update params={update.distrib=FROMLEADER&waitSearcher=true&openSearcher=true&commit=true&softCommit=false&distrib.from=https://127.0.0.1:63386/b/m/collection1/&commit_end_point=true&wt=javabin&version=2&expungeDeletes=false}{commit=} 0 1
   [junit4]   2> 2442077 INFO  (qtp257357659-17590) [n:127.0.0.1:63386_b%2Fm c:collection1 s:shard1 r:core_node1 x:collection1] o.a.s.u.p.LogUpdateProcessorFactory [collection1]  webapp=/b/m path=/update params={_stateVer_=collection1:10&waitSearcher=true&commit=true&softCommit=false&wt=javabin&version=2}{commit=} 0 36
   [junit4]   2> 2442084 INFO  (qtp257357659-17586) [n:127.0.0.1:63386_b%2Fm c:collection1 s:shard1 r:core_node1 x:collection1] o.a.s.c.S.Request [collection1]  webapp=/b/m path=/select params={q=*:*&distrib=false&tests=checkShardConsistency&rows=0&wt=javabin&version=2} hits=0 status=0 QTime=0
   [junit4]   2> 2442090 INFO  (qtp1084782972-17611) [n:127.0.0.1:63390_b%2Fm c:collection1 s:shard1 r:core_node2 x:collection1] o.a.s.c.S.Request [collection1]  webapp=/b/m path=/select params={q=*:*&distrib=false&tests=checkShardConsistency&rows=0&wt=javabin&version=2} hits=0 status=0 QTime=0
   [junit4]   2> 2442095 INFO  (qtp1529651568-17653) [n:127.0.0.1:63397_b%2Fm c:collection1 s:shard1 r:core_node3 x:collection1] o.a.s.

[...truncated too long message...]

1]}{127.0.0.1:63390}
   [junit4]   2> 2635597 INFO  (TEST-PeerSyncReplicationTest.test-seed#[FF2A861BB8B2200B]) [    ] o.e.j.s.h.ContextHandler Stopped o.e.j.s.ServletContextHandler@29736361{/b/m,null,UNAVAILABLE}
   [junit4]   2> 2635599 INFO  (TEST-PeerSyncReplicationTest.test-seed#[FF2A861BB8B2200B]) [    ] o.a.s.c.ChaosMonkey monkey: stop shard! 63397
   [junit4]   2> 2635603 INFO  (TEST-PeerSyncReplicationTest.test-seed#[FF2A861BB8B2200B]) [    ] o.a.s.c.ZkTestServer connecting to 127.0.0.1:63374 63374
   [junit4]   2> 2635619 INFO  (Thread-3846) [    ] o.a.s.c.ZkTestServer connecting to 127.0.0.1:63374 63374
   [junit4]   2> 2639183 WARN  (Thread-3846) [    ] o.a.s.c.ZkTestServer Watch limit violations: 
   [junit4]   2> Maximum concurrent create/delete watches above limit:
   [junit4]   2> 
   [junit4]   2> 	6	/solr/aliases.json
   [junit4]   2> 	5	/solr/security.json
   [junit4]   2> 	5	/solr/configs/conf1
   [junit4]   2> 
   [junit4]   2> Maximum concurrent data watches above limit:
   [junit4]   2> 
   [junit4]   2> 	6	/solr/clusterstate.json
   [junit4]   2> 	6	/solr/clusterprops.json
   [junit4]   2> 	4	/solr/collections/collection1/state.json
   [junit4]   2> 	2	/solr/overseer_elect/election/97234972234743818-127.0.0.1:63386_b%2Fm-n_0000000001
   [junit4]   2> 	2	/solr/collections/collection1/leader_elect/shard1/election/97234972234743818-core_node1-n_0000000000
   [junit4]   2> 
   [junit4]   2> Maximum concurrent children watches above limit:
   [junit4]   2> 
   [junit4]   2> 	207	/solr/overseer/collection-queue-work
   [junit4]   2> 	42	/solr/overseer/queue
   [junit4]   2> 	17	/solr/overseer/queue-work
   [junit4]   2> 	6	/solr/collections
   [junit4]   2> 	5	/solr/live_nodes
   [junit4]   2> 
   [junit4]   2> NOTE: reproduce with: ant test  -Dtestcase=PeerSyncReplicationTest -Dtests.method=test -Dtests.seed=FF2A861BB8B2200B -Dtests.slow=true -Dtests.locale=be -Dtests.timezone=PST -Dtests.asserts=true -Dtests.file.encoding=ISO-8859-1
   [junit4] FAILURE  217s J0 | PeerSyncReplicationTest.test <<<
   [junit4]    > Throwable #1: java.lang.AssertionError: timeout waiting to see all nodes active
   [junit4]    > 	at __randomizedtesting.SeedInfo.seed([FF2A861BB8B2200B:777EB9C1164E4DF3]:0)
   [junit4]    > 	at org.apache.solr.cloud.PeerSyncReplicationTest.waitTillNodesActive(PeerSyncReplicationTest.java:311)
   [junit4]    > 	at org.apache.solr.cloud.PeerSyncReplicationTest.bringUpDeadNodeAndEnsureNoReplication(PeerSyncReplicationTest.java:262)
   [junit4]    > 	at org.apache.solr.cloud.PeerSyncReplicationTest.forceNodeFailureAndDoPeerSync(PeerSyncReplicationTest.java:244)
   [junit4]    > 	at org.apache.solr.cloud.PeerSyncReplicationTest.test(PeerSyncReplicationTest.java:133)
   [junit4]    > 	at org.apache.solr.BaseDistributedSearchTestCase$ShardsRepeatRule$ShardsFixedStatement.callStatement(BaseDistributedSearchTestCase.java:985)
   [junit4]    > 	at org.apache.solr.BaseDistributedSearchTestCase$ShardsRepeatRule$ShardsStatement.evaluate(BaseDistributedSearchTestCase.java:960)
   [junit4]    > 	at java.lang.Thread.run(Thread.java:745)
   [junit4]   2> 2639286 INFO  (SUITE-PeerSyncReplicationTest-seed#[FF2A861BB8B2200B]-worker) [    ] o.a.s.SolrTestCaseJ4 ###deleteCore
   [junit4]   2> NOTE: leaving temporary files on disk at: /Users/jenkins/workspace/Lucene-Solr-master-MacOSX/solr/build/solr-core/test/J0/temp/solr.cloud.PeerSyncReplicationTest_FF2A861BB8B2200B-001
   [junit4]   2> NOTE: test params are: codec=Asserting(Lucene70), sim=RandomSimilarity(queryNorm=false): {}, locale=be, timezone=PST
   [junit4]   2> NOTE: Mac OS X 10.11.6 x86_64/Oracle Corporation 1.8.0_102 (64-bit)/cpus=3,threads=1,free=126749656,total=518979584
   [junit4]   2> NOTE: All tests run in this JVM: [DocValuesTest, TestIntervalFaceting, TestFieldCacheVsDocValues, TestStressLucene, SimpleMLTQParserTest, LeaderElectionTest, AddBlockUpdateTest, SuggesterFSTTest, TestXIncludeConfig, TestSchemaSimilarityResource, HdfsWriteToMultipleCollectionsTest, TestGeoJSONResponseWriter, BlockDirectoryTest, TestSort, TestSolrQueryResponse, TestHighFrequencyDictionaryFactory, SpatialHeatmapFacetsTest, TestLFUCache, TestFieldCacheSort, BlockJoinFacetDistribTest, ActionThrottleTest, TestCoreContainer, TestRawResponseWriter, QueryElevationComponentTest, TestLegacyFieldCache, MigrateRouteKeyTest, TestImplicitCoreProperties, SearchHandlerTest, BitVectorTest, TermsComponentTest, StatelessScriptUpdateProcessorFactoryTest, TestCollectionAPI, BaseCdcrDistributedZkTest, TestConfigSetImmutable, TestPartialUpdateDeduplication, TolerantUpdateProcessorTest, HdfsTlogReplayBufferedWhileIndexingTest, HLLUtilTest, PluginInfoTest, TestSearcherReuse, TestJmxIntegration, SSLMigrationTest, ZkNodePropsTest, RecoveryAfterSoftCommitTest, FullHLLTest, TestInitParams, TestTrackingShardHandlerFactory, TestRTGBase, HdfsBasicDistributedZkTest, TestQueryWrapperFilter, IndexBasedSpellCheckerTest, TestStressVersions, AssignTest, TestLeaderElectionWithEmptyReplica, DocValuesMissingTest, TestLRUCache, TestRandomDVFaceting, TestSlowCompositeReaderWrapper, XmlUpdateRequestHandlerTest, ReplaceNodeTest, ZkStateWriterTest, TestCustomDocTransformer, DOMUtilTest, TestFieldSortValues, TestCopyFieldCollectionResource, TestHashPartitioner, TestNoOpRegenerator, TestDistribDocBasedVersion, HighlighterTest, DistributedQueryElevationComponentTest, TestCloudRecovery, TestSolrJ, TestAnalyzeInfixSuggestions, DeleteLastCustomShardedReplicaTest, StandardRequestHandlerTest, CustomCollectionTest, TestCSVLoader, CdcrUpdateLogTest, DocumentAnalysisRequestHandlerTest, TestLRUStatsCache, SyncSliceTest, TestBackupRepositoryFactory, SolrXmlInZkTest, BasicAuthStandaloneTest, ConcurrentDeleteAndCreateCollectionTest, TestFileDictionaryLookup, CollectionStateFormat2Test, TestCloudDeleteByQuery, BlobRepositoryCloudTest, TestXmlQParser, TestSubQueryTransformerDistrib, CdcrRequestHandlerTest, TestManagedStopFilterFactory, HdfsDirectoryTest, TestTestInjection, SmileWriterTest, SimplePostToolTest, SolrTestCaseJ4Test, SolrMetricsIntegrationTest, LeaderInitiatedRecoveryOnCommitTest, FileUtilsTest, SpatialRPTFieldTypeTest, TestBlobHandler, DistributedFacetExistsSmallTest, OverseerCollectionConfigSetProcessorTest, TestSweetSpotSimilarityFactory, SolrIndexConfigTest, TestCustomStream, TestDocumentBuilder, TestPseudoReturnFields, ShardSplitTest, TestAddFieldRealTimeGet, TestDefaultStatsCache, TestLazyCores, TestRequestStatusCollectionAPI, ResponseHeaderTest, TestFunctionQuery, TestGraphTermsQParserPlugin, TestMacros, TestRTimerTree, TestStressUserVersions, CursorMarkTest, TestClusterStateMutator, HdfsSyncSliceTest, RuleEngineTest, CoreMergeIndexesAdminHandlerTest, PrimUtilsTest, TestDFISimilarityFactory, TestSolrCoreSnapshots, DocValuesNotIndexedTest, SolrPluginUtilsTest, SegmentsInfoRequestHandlerTest, TestJsonFacetRefinement, AddSchemaFieldsUpdateProcessorFactoryTest, TestBinaryField, DistributedFacetPivotLongTailTest, AnalysisAfterCoreReloadTest, TestSmileRequest, UnloadDistributedZkTest, TestManagedSchema, TestJavabinTupleStreamParser, TemplateUpdateProcessorTest, TestSolrCloudWithHadoopAuthPlugin, HdfsRecoveryZkTest, TestFieldCacheReopen, ClassificationUpdateProcessorTest, ManagedSchemaRoundRobinCloudTest, TestTolerantSearch, TestSchemaNameResource, SchemaVersionSpecificBehaviorTest, TestIBSimilarityFactory, TestRemoteStreaming, CurrencyFieldXmlFileTest, TestWordDelimiterFilterFactory, DirectSolrSpellCheckerTest, TestDelegationWithHadoopAuth, TestSerializedLuceneMatchVersion, OpenExchangeRatesOrgProviderTest, CheckHdfsIndexTest, TestFieldCollectionResource, TestManagedResourceStorage, TestSQLHandler, SystemInfoHandlerTest, SolrGraphiteReporterTest, TestReqParamsAPI, TestCursorMarkWithoutUniqueKey, TestUseDocValuesAsStored, BasicDistributedZkTest, OpenCloseCoreStressTest, OverseerTest, LeaderElectionIntegrationTest, TestReplicationHandler, TestZkChroot, ZkCLITest, AutoCommitTest, TestFaceting, DistributedSpellCheckComponentTest, ZkControllerTest, TestReload, SimpleFacetsTest, StatsComponentTest, PeerSyncTest, ConvertedLegacyTest, DirectUpdateHandlerTest, CurrencyFieldOpenExchangeTest, TestExtendedDismaxParser, SolrRequestParserTest, TestFoldingMultitermQuery, SuggesterTSTTest, SpatialFilterTest, SuggesterWFSTTest, PolyFieldTest, SolrCoreCheckLockOnStartupTest, FieldMutatingUpdateProcessorTest, DocValuesMultiTest, DistanceFunctionTest, SolrInfoMBeanTest, DisMaxRequestHandlerTest, TestQueryUtils, TestQueryTypes, DocumentBuilderTest, TermVectorComponentTest, RequiredFieldsTest, FastVectorHighlighterTest, LoggingHandlerTest, IndexSchemaTest, TestCSVResponseWriter, TestAnalyzedSuggestions, BinaryUpdateRequestHandlerTest, TestPHPSerializedResponseWriter, TestComponentsName, HighlighterConfigTest, SOLR749Test, TestQuerySenderListener, UpdateParamsTest, AlternateDirectoryTest, TestQuerySenderNoQuery, CopyFieldTest, ResponseLogComponentTest, BadComponentTest, TestMergePolicyConfig, MultiTermTest, SampleTest, NumericFieldsTest, TestElisionMultitermQuery, OutputWriterTest, ExternalFileFieldSortTest, TestSolrCoreProperties, DirectSolrConnectionTest, NotRequiredUniqueKeyTest, TestCharFilters, SynonymTokenizerTest, TestDFRSimilarityFactory, TestPerFieldSimilarity, TestLMDirichletSimilarityFactory, TestLMJelinekMercerSimilarityFactory, TestBM25SimilarityFactory, TimeZoneUtilsTest, TestFastOutputStream, TestFastLRUCache, ChaosMonkeyNothingIsSafeTest, TestCrossCoreJoin, TestHighlightDedupGrouping, TestEmbeddedSolrServerConstructors, TestJettySolrRunner, ConnectionReuseTest, AliasIntegrationTest, AsyncCallRequestStatusResponseTest, CloudExitableDirectoryReaderTest, CollectionsAPIAsyncDistributedZkTest, DeleteStatusTest, DistribDocExpirationUpdateProcessorTest, LeaderFailoverAfterPartitionTest, MultiThreadedOCPTest, OutOfBoxZkACLAndCredentialsProvidersTest, OverseerModifyCollectionTest, PeerSyncReplicationTest]
   [junit4] Completed [510/675 (1!)] on J0 in 216.68s, 1 test, 1 failure <<< FAILURES!

[...truncated 63018 lines...]


Mime
View raw message