lucene-dev mailing list archives

Site index · List index
Message view « Date » · « Thread »
Top « Date » · « Thread »
From Policeman Jenkins Server <jenk...@thetaphi.de>
Subject [JENKINS] Lucene-Solr-6.x-Windows (64bit/jdk1.8.0_112) - Build # 675 - Unstable!
Date Sat, 07 Jan 2017 23:24:46 GMT
Build: https://jenkins.thetaphi.de/job/Lucene-Solr-6.x-Windows/675/
Java: 64bit/jdk1.8.0_112 -XX:+UseCompressedOops -XX:+UseConcMarkSweepGC

1 tests failed.
FAILED:  junit.framework.TestSuite.org.apache.solr.handler.component.DistributedQueryElevationComponentTest

Error Message:
Could not remove the following files (in the order of attempts):    C:\Users\jenkins\workspace\Lucene-Solr-6.x-Windows\solr\build\solr-core\test\J1\temp\solr.handler.component.DistributedQueryElevationComponentTest_E8C52F3F5249420-001\tempDir-001\control\collection1: java.nio.file.DirectoryNotEmptyException: C:\Users\jenkins\workspace\Lucene-Solr-6.x-Windows\solr\build\solr-core\test\J1\temp\solr.handler.component.DistributedQueryElevationComponentTest_E8C52F3F5249420-001\tempDir-001\control\collection1    C:\Users\jenkins\workspace\Lucene-Solr-6.x-Windows\solr\build\solr-core\test\J1\temp\solr.handler.component.DistributedQueryElevationComponentTest_E8C52F3F5249420-001\tempDir-001\control: java.nio.file.DirectoryNotEmptyException: C:\Users\jenkins\workspace\Lucene-Solr-6.x-Windows\solr\build\solr-core\test\J1\temp\solr.handler.component.DistributedQueryElevationComponentTest_E8C52F3F5249420-001\tempDir-001\control    C:\Users\jenkins\workspace\Lucene-Solr-6.x-Windows\solr\build\solr-core\test\J1\temp\solr.handler.component.DistributedQueryElevationComponentTest_E8C52F3F5249420-001\tempDir-001: java.nio.file.DirectoryNotEmptyException: C:\Users\jenkins\workspace\Lucene-Solr-6.x-Windows\solr\build\solr-core\test\J1\temp\solr.handler.component.DistributedQueryElevationComponentTest_E8C52F3F5249420-001\tempDir-001    C:\Users\jenkins\workspace\Lucene-Solr-6.x-Windows\solr\build\solr-core\test\J1\temp\solr.handler.component.DistributedQueryElevationComponentTest_E8C52F3F5249420-001\tempDir-001\control\collection1\conf: java.nio.file.AccessDeniedException: C:\Users\jenkins\workspace\Lucene-Solr-6.x-Windows\solr\build\solr-core\test\J1\temp\solr.handler.component.DistributedQueryElevationComponentTest_E8C52F3F5249420-001\tempDir-001\control\collection1\conf    C:\Users\jenkins\workspace\Lucene-Solr-6.x-Windows\solr\build\solr-core\test\J1\temp\solr.handler.component.DistributedQueryElevationComponentTest_E8C52F3F5249420-001: java.nio.file.DirectoryNotEmptyException: C:\Users\jenkins\workspace\Lucene-Solr-6.x-Windows\solr\build\solr-core\test\J1\temp\solr.handler.component.DistributedQueryElevationComponentTest_E8C52F3F5249420-001 

Stack Trace:
java.io.IOException: Could not remove the following files (in the order of attempts):
   C:\Users\jenkins\workspace\Lucene-Solr-6.x-Windows\solr\build\solr-core\test\J1\temp\solr.handler.component.DistributedQueryElevationComponentTest_E8C52F3F5249420-001\tempDir-001\control\collection1: java.nio.file.DirectoryNotEmptyException: C:\Users\jenkins\workspace\Lucene-Solr-6.x-Windows\solr\build\solr-core\test\J1\temp\solr.handler.component.DistributedQueryElevationComponentTest_E8C52F3F5249420-001\tempDir-001\control\collection1
   C:\Users\jenkins\workspace\Lucene-Solr-6.x-Windows\solr\build\solr-core\test\J1\temp\solr.handler.component.DistributedQueryElevationComponentTest_E8C52F3F5249420-001\tempDir-001\control: java.nio.file.DirectoryNotEmptyException: C:\Users\jenkins\workspace\Lucene-Solr-6.x-Windows\solr\build\solr-core\test\J1\temp\solr.handler.component.DistributedQueryElevationComponentTest_E8C52F3F5249420-001\tempDir-001\control
   C:\Users\jenkins\workspace\Lucene-Solr-6.x-Windows\solr\build\solr-core\test\J1\temp\solr.handler.component.DistributedQueryElevationComponentTest_E8C52F3F5249420-001\tempDir-001: java.nio.file.DirectoryNotEmptyException: C:\Users\jenkins\workspace\Lucene-Solr-6.x-Windows\solr\build\solr-core\test\J1\temp\solr.handler.component.DistributedQueryElevationComponentTest_E8C52F3F5249420-001\tempDir-001
   C:\Users\jenkins\workspace\Lucene-Solr-6.x-Windows\solr\build\solr-core\test\J1\temp\solr.handler.component.DistributedQueryElevationComponentTest_E8C52F3F5249420-001\tempDir-001\control\collection1\conf: java.nio.file.AccessDeniedException: C:\Users\jenkins\workspace\Lucene-Solr-6.x-Windows\solr\build\solr-core\test\J1\temp\solr.handler.component.DistributedQueryElevationComponentTest_E8C52F3F5249420-001\tempDir-001\control\collection1\conf
   C:\Users\jenkins\workspace\Lucene-Solr-6.x-Windows\solr\build\solr-core\test\J1\temp\solr.handler.component.DistributedQueryElevationComponentTest_E8C52F3F5249420-001: java.nio.file.DirectoryNotEmptyException: C:\Users\jenkins\workspace\Lucene-Solr-6.x-Windows\solr\build\solr-core\test\J1\temp\solr.handler.component.DistributedQueryElevationComponentTest_E8C52F3F5249420-001

	at __randomizedtesting.SeedInfo.seed([E8C52F3F5249420]:0)
	at org.apache.lucene.util.IOUtils.rm(IOUtils.java:323)
	at org.apache.lucene.util.TestRuleTemporaryFilesCleanup.afterAlways(TestRuleTemporaryFilesCleanup.java:216)
	at com.carrotsearch.randomizedtesting.rules.TestRuleAdapter$1.afterAlways(TestRuleAdapter.java:31)
	at com.carrotsearch.randomizedtesting.rules.StatementAdapter.evaluate(StatementAdapter.java:43)
	at com.carrotsearch.randomizedtesting.rules.StatementAdapter.evaluate(StatementAdapter.java:36)
	at org.apache.lucene.util.TestRuleAssertionsRequired$1.evaluate(TestRuleAssertionsRequired.java:53)
	at org.apache.lucene.util.TestRuleMarkFailure$1.evaluate(TestRuleMarkFailure.java:47)
	at org.apache.lucene.util.TestRuleIgnoreAfterMaxFailures$1.evaluate(TestRuleIgnoreAfterMaxFailures.java:64)
	at org.apache.lucene.util.TestRuleIgnoreTestSuites$1.evaluate(TestRuleIgnoreTestSuites.java:54)
	at com.carrotsearch.randomizedtesting.rules.StatementAdapter.evaluate(StatementAdapter.java:36)
	at com.carrotsearch.randomizedtesting.ThreadLeakControl$StatementRunner.run(ThreadLeakControl.java:367)
	at java.lang.Thread.run(Thread.java:745)




Build Log:
[...truncated 11991 lines...]
   [junit4] Suite: org.apache.solr.handler.component.DistributedQueryElevationComponentTest
   [junit4]   2> Creating dataDir: C:\Users\jenkins\workspace\Lucene-Solr-6.x-Windows\solr\build\solr-core\test\J1\temp\solr.handler.component.DistributedQueryElevationComponentTest_E8C52F3F5249420-001\init-core-data-001
   [junit4]   2> 1512801 INFO  (SUITE-DistributedQueryElevationComponentTest-seed#[E8C52F3F5249420]-worker) [    ] o.a.s.SolrTestCaseJ4 Randomized ssl (true) and clientAuth (true) via: @org.apache.solr.util.RandomizeSSL(reason=, value=NaN, ssl=NaN, clientAuth=NaN)
   [junit4]   2> 1512802 INFO  (SUITE-DistributedQueryElevationComponentTest-seed#[E8C52F3F5249420]-worker) [    ] o.a.s.BaseDistributedSearchTestCase Setting hostContext system property: /erbt/bz
   [junit4]   2> 1513502 INFO  (TEST-DistributedQueryElevationComponentTest.test-seed#[E8C52F3F5249420]) [    ] o.a.s.SolrTestCaseJ4 Writing core.properties file to C:\Users\jenkins\workspace\Lucene-Solr-6.x-Windows\solr\build\solr-core\test\J1\temp\solr.handler.component.DistributedQueryElevationComponentTest_E8C52F3F5249420-001\tempDir-001\control\cores\collection1
   [junit4]   2> 1513512 INFO  (TEST-DistributedQueryElevationComponentTest.test-seed#[E8C52F3F5249420]) [    ] o.e.j.s.Server jetty-9.3.14.v20161028
   [junit4]   2> 1513513 INFO  (TEST-DistributedQueryElevationComponentTest.test-seed#[E8C52F3F5249420]) [    ] o.e.j.s.h.ContextHandler Started o.e.j.s.ServletContextHandler@7432a19e{/erbt/bz,null,AVAILABLE}
   [junit4]   2> 1513515 INFO  (TEST-DistributedQueryElevationComponentTest.test-seed#[E8C52F3F5249420]) [    ] o.e.j.s.AbstractConnector Started ServerConnector@6fe4f7af{SSL,[ssl, http/1.1]}{127.0.0.1:60662}
   [junit4]   2> 1513515 INFO  (TEST-DistributedQueryElevationComponentTest.test-seed#[E8C52F3F5249420]) [    ] o.e.j.s.Server Started @1518052ms
   [junit4]   2> 1513515 INFO  (TEST-DistributedQueryElevationComponentTest.test-seed#[E8C52F3F5249420]) [    ] o.a.s.c.s.e.JettySolrRunner Jetty properties: {schema=schema11.xml, solrconfig=solrconfig-elevate.xml, hostContext=/erbt/bz, hostPort=60662, coreRootDirectory=C:\Users\jenkins\workspace\Lucene-Solr-6.x-Windows\solr\build\solr-core\test\J1\temp\solr.handler.component.DistributedQueryElevationComponentTest_E8C52F3F5249420-001\tempDir-001\control\cores}
   [junit4]   2> 1513516 ERROR (TEST-DistributedQueryElevationComponentTest.test-seed#[E8C52F3F5249420]) [    ] o.a.s.s.StartupLoggingUtils Missing Java Option solr.log.dir. Logging may be missing or incomplete.
   [junit4]   2> 1513516 INFO  (TEST-DistributedQueryElevationComponentTest.test-seed#[E8C52F3F5249420]) [    ] o.a.s.s.SolrDispatchFilter  ___      _       Welcome to Apache Solr? version 6.4.0
   [junit4]   2> 1513516 INFO  (TEST-DistributedQueryElevationComponentTest.test-seed#[E8C52F3F5249420]) [    ] o.a.s.s.SolrDispatchFilter / __| ___| |_ _   Starting in standalone mode on port null
   [junit4]   2> 1513516 INFO  (TEST-DistributedQueryElevationComponentTest.test-seed#[E8C52F3F5249420]) [    ] o.a.s.s.SolrDispatchFilter \__ \/ _ \ | '_|  Install dir: null
   [junit4]   2> 1513516 INFO  (TEST-DistributedQueryElevationComponentTest.test-seed#[E8C52F3F5249420]) [    ] o.a.s.s.SolrDispatchFilter |___/\___/_|_|    Start time: 2017-01-07T22:36:49.813Z
   [junit4]   2> 1513517 INFO  (TEST-DistributedQueryElevationComponentTest.test-seed#[E8C52F3F5249420]) [    ] o.a.s.c.SolrXmlConfig Loading container configuration from C:\Users\jenkins\workspace\Lucene-Solr-6.x-Windows\solr\build\solr-core\test\J1\temp\solr.handler.component.DistributedQueryElevationComponentTest_E8C52F3F5249420-001\tempDir-001\control\solr.xml
   [junit4]   2> 1513540 INFO  (TEST-DistributedQueryElevationComponentTest.test-seed#[E8C52F3F5249420]) [    ] o.a.s.u.UpdateShardHandler Creating UpdateShardHandler HTTP client with params: socketTimeout=340000&connTimeout=45000&retry=true
   [junit4]   2> 1513551 INFO  (TEST-DistributedQueryElevationComponentTest.test-seed#[E8C52F3F5249420]) [    ] o.a.s.c.CorePropertiesLocator Found 1 core definitions underneath C:\Users\jenkins\workspace\Lucene-Solr-6.x-Windows\solr\build\solr-core\test\J1\temp\solr.handler.component.DistributedQueryElevationComponentTest_E8C52F3F5249420-001\tempDir-001\control\cores
   [junit4]   2> 1513551 INFO  (TEST-DistributedQueryElevationComponentTest.test-seed#[E8C52F3F5249420]) [    ] o.a.s.c.CorePropertiesLocator Cores are: [collection1]
   [junit4]   2> 1513553 INFO  (coreLoadExecutor-6425-thread-1) [    x:collection1] o.a.s.c.SolrResourceLoader [null] Added 2 libs to classloader, from paths: [/C:/Users/jenkins/workspace/Lucene-Solr-6.x-Windows/solr/core/src/test-files/solr/collection1/lib, /C:/Users/jenkins/workspace/Lucene-Solr-6.x-Windows/solr/core/src/test-files/solr/collection1/lib/classes]
   [junit4]   2> 1513637 INFO  (coreLoadExecutor-6425-thread-1) [    x:collection1] o.a.s.c.SolrConfig Using Lucene MatchVersion: 6.4.0
   [junit4]   2> 1513654 INFO  (coreLoadExecutor-6425-thread-1) [    x:collection1] o.a.s.s.IndexSchema [collection1] Schema name=example
   [junit4]   2> 1513735 WARN  (coreLoadExecutor-6425-thread-1) [    x:collection1] o.a.s.s.IndexSchema [collection1] default search field in schema is text. WARNING: Deprecated, please use 'df' on request instead.
   [junit4]   2> 1513740 INFO  (coreLoadExecutor-6425-thread-1) [    x:collection1] o.a.s.s.IndexSchema Loaded schema example/1.1 with uniqueid field id
   [junit4]   2> 1513752 INFO  (coreLoadExecutor-6425-thread-1) [    x:collection1] o.a.s.c.CoreContainer Creating SolrCore 'collection1' using configuration from configset C:\Users\jenkins\workspace\Lucene-Solr-6.x-Windows\solr\core\src\test-files\solr\collection1
   [junit4]   2> 1513753 INFO  (coreLoadExecutor-6425-thread-1) [    x:collection1] o.a.s.c.SolrCore [[collection1] ] Opening new SolrCore at [C:\Users\jenkins\workspace\Lucene-Solr-6.x-Windows\solr\core\src\test-files\solr\collection1], dataDir=[C:\Users\jenkins\workspace\Lucene-Solr-6.x-Windows\solr\build\solr-core\test\J1\temp\solr.handler.component.DistributedQueryElevationComponentTest_E8C52F3F5249420-001\tempDir-001\control\cores\collection1\data\]
   [junit4]   2> 1513753 INFO  (coreLoadExecutor-6425-thread-1) [    x:collection1] o.a.s.c.JmxMonitoredMap JMX monitoring is enabled. Adding Solr mbeans to JMX Server: com.sun.jmx.mbeanserver.JmxMBeanServer@44867711
   [junit4]   2> 1513754 INFO  (coreLoadExecutor-6425-thread-1) [    x:collection1] o.a.s.u.RandomMergePolicy RandomMergePolicy wrapping class org.apache.lucene.index.TieredMergePolicy: [TieredMergePolicy: maxMergeAtOnce=24, maxMergeAtOnceExplicit=14, maxMergedSegmentMB=60.0283203125, floorSegmentMB=0.6240234375, forceMergeDeletesPctAllowed=24.636546362037137, segmentsPerTier=35.0, maxCFSSegmentSizeMB=8.796093022207999E12, noCFSRatio=1.0
   [junit4]   2> 1513786 WARN  (coreLoadExecutor-6425-thread-1) [    x:collection1] o.a.s.c.RequestHandlers no default request handler is registered (either '/select' or 'standard')
   [junit4]   2> 1513786 INFO  (coreLoadExecutor-6425-thread-1) [    x:collection1] o.a.s.u.CommitTracker Hard AutoCommit: disabled
   [junit4]   2> 1513787 INFO  (coreLoadExecutor-6425-thread-1) [    x:collection1] o.a.s.u.CommitTracker Soft AutoCommit: disabled
   [junit4]   2> 1513791 INFO  (coreLoadExecutor-6425-thread-1) [    x:collection1] o.a.s.u.RandomMergePolicy RandomMergePolicy wrapping class org.apache.lucene.index.TieredMergePolicy: [TieredMergePolicy: maxMergeAtOnce=23, maxMergeAtOnceExplicit=49, maxMergedSegmentMB=6.51171875, floorSegmentMB=0.6162109375, forceMergeDeletesPctAllowed=23.737565860857107, segmentsPerTier=15.0, maxCFSSegmentSizeMB=8.796093022207999E12, noCFSRatio=1.0
   [junit4]   2> 1513793 INFO  (coreLoadExecutor-6425-thread-1) [    x:collection1] o.a.s.s.SolrIndexSearcher Opening [Searcher@489f4cde[collection1] main]
   [junit4]   2> 1513794 WARN  (coreLoadExecutor-6425-thread-1) [    x:collection1] o.a.s.r.ManagedResourceStorage Cannot write to config directory C:\Users\jenkins\workspace\Lucene-Solr-6.x-Windows\solr\core\src\test-files\solr\collection1\conf; switching to use InMemory storage instead.
   [junit4]   2> 1513795 INFO  (coreLoadExecutor-6425-thread-1) [    x:collection1] o.a.s.h.c.QueryElevationComponent Loading QueryElevation from: C:\Users\jenkins\workspace\Lucene-Solr-6.x-Windows\solr\core\src\test-files\solr\collection1\conf\elevate.xml
   [junit4]   2> 1513805 INFO  (coreLoadExecutor-6425-thread-1) [    x:collection1] o.a.s.h.c.QueryElevationComponent Loading QueryElevation from: C:\Users\jenkins\workspace\Lucene-Solr-6.x-Windows\solr\core\src\test-files\solr\collection1\conf\elevate.xml
   [junit4]   2> 1513815 INFO  (coreLoadExecutor-6425-thread-1) [    x:collection1] o.a.s.h.ReplicationHandler Commits will be reserved for  10000
   [junit4]   2> 1513815 INFO  (searcherExecutor-6426-thread-1-processing-x:collection1) [    x:collection1] o.a.s.c.SolrCore [collection1] Registered new searcher Searcher@489f4cde[collection1] main{ExitableDirectoryReader(UninvertingDirectoryReader())}
   [junit4]   2> 1514830 INFO  (TEST-DistributedQueryElevationComponentTest.test-seed#[E8C52F3F5249420]) [    ] o.a.s.SolrTestCaseJ4 Writing core.properties file to C:\Users\jenkins\workspace\Lucene-Solr-6.x-Windows\solr\build\solr-core\test\J1\temp\solr.handler.component.DistributedQueryElevationComponentTest_E8C52F3F5249420-001\tempDir-001\shard0\cores\collection1
   [junit4]   2> 1514835 INFO  (TEST-DistributedQueryElevationComponentTest.test-seed#[E8C52F3F5249420]) [    ] o.e.j.s.Server jetty-9.3.14.v20161028
   [junit4]   2> 1514836 INFO  (TEST-DistributedQueryElevationComponentTest.test-seed#[E8C52F3F5249420]) [    ] o.e.j.s.h.ContextHandler Started o.e.j.s.ServletContextHandler@793ff7d2{/erbt/bz,null,AVAILABLE}
   [junit4]   2> 1514836 INFO  (TEST-DistributedQueryElevationComponentTest.test-seed#[E8C52F3F5249420]) [    ] o.e.j.s.AbstractConnector Started ServerConnector@668b5929{SSL,[ssl, http/1.1]}{127.0.0.1:60665}
   [junit4]   2> 1514837 INFO  (TEST-DistributedQueryElevationComponentTest.test-seed#[E8C52F3F5249420]) [    ] o.e.j.s.Server Started @1519375ms
   [junit4]   2> 1514838 INFO  (TEST-DistributedQueryElevationComponentTest.test-seed#[E8C52F3F5249420]) [    ] o.a.s.c.s.e.JettySolrRunner Jetty properties: {schema=schema11.xml, solrconfig=solrconfig-elevate.xml, hostContext=/erbt/bz, hostPort=60665, coreRootDirectory=C:\Users\jenkins\workspace\Lucene-Solr-6.x-Windows\solr\build\solr-core\test\J1\temp\solr.handler.component.DistributedQueryElevationComponentTest_E8C52F3F5249420-001\tempDir-001\shard0\cores}
   [junit4]   2> 1514838 ERROR (TEST-DistributedQueryElevationComponentTest.test-seed#[E8C52F3F5249420]) [    ] o.a.s.s.StartupLoggingUtils Missing Java Option solr.log.dir. Logging may be missing or incomplete.
   [junit4]   2> 1514838 INFO  (TEST-DistributedQueryElevationComponentTest.test-seed#[E8C52F3F5249420]) [    ] o.a.s.s.SolrDispatchFilter  ___      _       Welcome to Apache Solr? version 6.4.0
   [junit4]   2> 1514839 INFO  (TEST-DistributedQueryElevationComponentTest.test-seed#[E8C52F3F5249420]) [    ] o.a.s.s.SolrDispatchFilter / __| ___| |_ _   Starting in standalone mode on port null
   [junit4]   2> 1514839 INFO  (TEST-DistributedQueryElevationComponentTest.test-seed#[E8C52F3F5249420]) [    ] o.a.s.s.SolrDispatchFilter \__ \/ _ \ | '_|  Install dir: null
   [junit4]   2> 1514839 INFO  (TEST-DistributedQueryElevationComponentTest.test-seed#[E8C52F3F5249420]) [    ] o.a.s.s.SolrDispatchFilter |___/\___/_|_|    Start time: 2017-01-07T22:36:51.136Z
   [junit4]   2> 1514840 INFO  (TEST-DistributedQueryElevationComponentTest.test-seed#[E8C52F3F5249420]) [    ] o.a.s.c.SolrXmlConfig Loading container configuration from C:\Users\jenkins\workspace\Lucene-Solr-6.x-Windows\solr\build\solr-core\test\J1\temp\solr.handler.component.DistributedQueryElevationComponentTest_E8C52F3F5249420-001\tempDir-001\shard0\solr.xml
   [junit4]   2> 1514862 INFO  (TEST-DistributedQueryElevationComponentTest.test-seed#[E8C52F3F5249420]) [    ] o.a.s.u.UpdateShardHandler Creating UpdateShardHandler HTTP client with params: socketTimeout=340000&connTimeout=45000&retry=true
   [junit4]   2> 1514866 INFO  (TEST-DistributedQueryElevationComponentTest.test-seed#[E8C52F3F5249420]) [    ] o.a.s.c.CorePropertiesLocator Found 1 core definitions underneath C:\Users\jenkins\workspace\Lucene-Solr-6.x-Windows\solr\build\solr-core\test\J1\temp\solr.handler.component.DistributedQueryElevationComponentTest_E8C52F3F5249420-001\tempDir-001\shard0\cores
   [junit4]   2> 1514866 INFO  (TEST-DistributedQueryElevationComponentTest.test-seed#[E8C52F3F5249420]) [    ] o.a.s.c.CorePropertiesLocator Cores are: [collection1]
   [junit4]   2> 1514875 INFO  (coreLoadExecutor-6435-thread-1) [    x:collection1] o.a.s.c.SolrResourceLoader [null] Added 2 libs to classloader, from paths: [/C:/Users/jenkins/workspace/Lucene-Solr-6.x-Windows/solr/core/src/test-files/solr/collection1/lib, /C:/Users/jenkins/workspace/Lucene-Solr-6.x-Windows/solr/core/src/test-files/solr/collection1/lib/classes]
   [junit4]   2> 1514962 INFO  (coreLoadExecutor-6435-thread-1) [    x:collection1] o.a.s.c.SolrConfig Using Lucene MatchVersion: 6.4.0
   [junit4]   2> 1514980 INFO  (coreLoadExecutor-6435-thread-1) [    x:collection1] o.a.s.s.IndexSchema [collection1] Schema name=example
   [junit4]   2> 1515032 WARN  (coreLoadExecutor-6435-thread-1) [    x:collection1] o.a.s.s.IndexSchema [collection1] default search field in schema is text. WARNING: Deprecated, please use 'df' on request instead.
   [junit4]   2> 1515034 INFO  (coreLoadExecutor-6435-thread-1) [    x:collection1] o.a.s.s.IndexSchema Loaded schema example/1.1 with uniqueid field id
   [junit4]   2> 1515049 INFO  (coreLoadExecutor-6435-thread-1) [    x:collection1] o.a.s.c.CoreContainer Creating SolrCore 'collection1' using configuration from configset C:\Users\jenkins\workspace\Lucene-Solr-6.x-Windows\solr\core\src\test-files\solr\collection1
   [junit4]   2> 1515050 INFO  (coreLoadExecutor-6435-thread-1) [    x:collection1] o.a.s.c.SolrCore [[collection1] ] Opening new SolrCore at [C:\Users\jenkins\workspace\Lucene-Solr-6.x-Windows\solr\core\src\test-files\solr\collection1], dataDir=[C:\Users\jenkins\workspace\Lucene-Solr-6.x-Windows\solr\build\solr-core\test\J1\temp\solr.handler.component.DistributedQueryElevationComponentTest_E8C52F3F5249420-001\tempDir-001\shard0\cores\collection1\data\]
   [junit4]   2> 1515050 INFO  (coreLoadExecutor-6435-thread-1) [    x:collection1] o.a.s.c.JmxMonitoredMap JMX monitoring is enabled. Adding Solr mbeans to JMX Server: com.sun.jmx.mbeanserver.JmxMBeanServer@44867711
   [junit4]   2> 1515054 INFO  (coreLoadExecutor-6435-thread-1) [    x:collection1] o.a.s.u.RandomMergePolicy RandomMergePolicy wrapping class org.apache.lucene.index.TieredMergePolicy: [TieredMergePolicy: maxMergeAtOnce=24, maxMergeAtOnceExplicit=14, maxMergedSegmentMB=60.0283203125, floorSegmentMB=0.6240234375, forceMergeDeletesPctAllowed=24.636546362037137, segmentsPerTier=35.0, maxCFSSegmentSizeMB=8.796093022207999E12, noCFSRatio=1.0
   [junit4]   2> 1515102 WARN  (coreLoadExecutor-6435-thread-1) [    x:collection1] o.a.s.c.RequestHandlers no default request handler is registered (either '/select' or 'standard')
   [junit4]   2> 1515103 INFO  (coreLoadExecutor-6435-thread-1) [    x:collection1] o.a.s.u.CommitTracker Hard AutoCommit: disabled
   [junit4]   2> 1515103 INFO  (coreLoadExecutor-6435-thread-1) [    x:collection1] o.a.s.u.CommitTracker Soft AutoCommit: disabled
   [junit4]   2> 1515132 INFO  (coreLoadExecutor-6435-thread-1) [    x:collection1] o.a.s.u.RandomMergePolicy RandomMergePolicy wrapping class org.apache.lucene.index.TieredMergePolicy: [TieredMergePolicy: maxMergeAtOnce=23, maxMergeAtOnceExplicit=49, maxMergedSegmentMB=6.51171875, floorSegmentMB=0.6162109375, forceMergeDeletesPctAllowed=23.737565860857107, segmentsPerTier=15.0, maxCFSSegmentSizeMB=8.796093022207999E12, noCFSRatio=1.0
   [junit4]   2> 1515136 INFO  (coreLoadExecutor-6435-thread-1) [    x:collection1] o.a.s.s.SolrIndexSearcher Opening [Searcher@d5dcc9b[collection1] main]
   [junit4]   2> 1515137 WARN  (coreLoadExecutor-6435-thread-1) [    x:collection1] o.a.s.r.ManagedResourceStorage Cannot write to config directory C:\Users\jenkins\workspace\Lucene-Solr-6.x-Windows\solr\core\src\test-files\solr\collection1\conf; switching to use InMemory storage instead.
   [junit4]   2> 1515139 INFO  (coreLoadExecutor-6435-thread-1) [    x:collection1] o.a.s.h.c.QueryElevationComponent Loading QueryElevation from: C:\Users\jenkins\workspace\Lucene-Solr-6.x-Windows\solr\core\src\test-files\solr\collection1\conf\elevate.xml
   [junit4]   2> 1515161 INFO  (coreLoadExecutor-6435-thread-1) [    x:collection1] o.a.s.h.c.QueryElevationComponent Loading QueryElevation from: C:\Users\jenkins\workspace\Lucene-Solr-6.x-Windows\solr\core\src\test-files\solr\collection1\conf\elevate.xml
   [junit4]   2> 1515167 INFO  (coreLoadExecutor-6435-thread-1) [    x:collection1] o.a.s.h.ReplicationHandler Commits will be reserved for  10000
   [junit4]   2> 1515168 INFO  (searcherExecutor-6436-thread-1-processing-x:collection1) [    x:collection1] o.a.s.c.SolrCore [collection1] Registered new searcher Searcher@d5dcc9b[collection1] main{ExitableDirectoryReader(UninvertingDirectoryReader())}
   [junit4]   2> 1516359 INFO  (TEST-DistributedQueryElevationComponentTest.test-seed#[E8C52F3F5249420]) [    ] o.a.s.SolrTestCaseJ4 Writing core.properties file to C:\Users\jenkins\workspace\Lucene-Solr-6.x-Windows\solr\build\solr-core\test\J1\temp\solr.handler.component.DistributedQueryElevationComponentTest_E8C52F3F5249420-001\tempDir-001\shard1\cores\collection1
   [junit4]   2> 1516362 INFO  (TEST-DistributedQueryElevationComponentTest.test-seed#[E8C52F3F5249420]) [    ] o.e.j.s.Server jetty-9.3.14.v20161028
   [junit4]   2> 1516363 INFO  (TEST-DistributedQueryElevationComponentTest.test-seed#[E8C52F3F5249420]) [    ] o.e.j.s.h.ContextHandler Started o.e.j.s.ServletContextHandler@56e2fc9c{/erbt/bz,null,AVAILABLE}
   [junit4]   2> 1516369 INFO  (TEST-DistributedQueryElevationComponentTest.test-seed#[E8C52F3F5249420]) [    ] o.e.j.s.AbstractConnector Started ServerConnector@3bb15c44{SSL,[ssl, http/1.1]}{127.0.0.1:60669}
   [junit4]   2> 1516369 INFO  (TEST-DistributedQueryElevationComponentTest.test-seed#[E8C52F3F5249420]) [    ] o.e.j.s.Server Started @1520906ms
   [junit4]   2> 1516369 INFO  (TEST-DistributedQueryElevationComponentTest.test-seed#[E8C52F3F5249420]) [    ] o.a.s.c.s.e.JettySolrRunner Jetty properties: {schema=schema11.xml, solrconfig=solrconfig-elevate.xml, hostContext=/erbt/bz, hostPort=60669, coreRootDirectory=C:\Users\jenkins\workspace\Lucene-Solr-6.x-Windows\solr\build\solr-core\test\J1\temp\solr.handler.component.DistributedQueryElevationComponentTest_E8C52F3F5249420-001\tempDir-001\shard1\cores}
   [junit4]   2> 1516370 ERROR (TEST-DistributedQueryElevationComponentTest.test-seed#[E8C52F3F5249420]) [    ] o.a.s.s.StartupLoggingUtils Missing Java Option solr.log.dir. Logging may be missing or incomplete.
   [junit4]   2> 1516370 INFO  (TEST-DistributedQueryElevationComponentTest.test-seed#[E8C52F3F5249420]) [    ] o.a.s.s.SolrDispatchFilter  ___      _       Welcome to Apache Solr? version 6.4.0
   [junit4]   2> 1516370 INFO  (TEST-DistributedQueryElevationComponentTest.test-seed#[E8C52F3F5249420]) [    ] o.a.s.s.SolrDispatchFilter / __| ___| |_ _   Starting in standalone mode on port null
   [junit4]   2> 1516370 INFO  (TEST-DistributedQueryElevationComponentTest.test-seed#[E8C52F3F5249420]) [    ] o.a.s.s.SolrDispatchFilter \__ \/ _ \ | '_|  Install dir: null
   [junit4]   2> 1516371 INFO  (TEST-DistributedQueryElevationComponentTest.test-seed#[E8C52F3F5249420]) [    ] o.a.s.s.SolrDispatchFilter |___/\___/_|_|    Start time: 2017-01-07T22:36:52.668Z
   [junit4]   2> 1516371 INFO  (TEST-DistributedQueryElevationComponentTest.test-seed#[E8C52F3F5249420]) [    ] o.a.s.c.SolrXmlConfig Loading container configuration from C:\Users\jenkins\workspace\Lucene-Solr-6.x-Windows\solr\build\solr-core\test\J1\temp\solr.handler.component.DistributedQueryElevationComponentTest_E8C52F3F5249420-001\tempDir-001\shard1\solr.xml
   [junit4]   2> 1516385 INFO  (TEST-DistributedQueryElevationComponentTest.test-seed#[E8C52F3F5249420]) [    ] o.a.s.u.UpdateShardHandler Creating UpdateShardHandler HTTP client with params: socketTimeout=340000&connTimeout=45000&retry=true
   [junit4]   2> 1516389 INFO  (TEST-DistributedQueryElevationComponentTest.test-seed#[E8C52F3F5249420]) [    ] o.a.s.c.CorePropertiesLocator Found 1 core definitions underneath C:\Users\jenkins\workspace\Lucene-Solr-6.x-Windows\solr\build\solr-core\test\J1\temp\solr.handler.component.DistributedQueryElevationComponentTest_E8C52F3F5249420-001\tempDir-001\shard1\cores
   [junit4]   2> 1516389 INFO  (TEST-DistributedQueryElevationComponentTest.test-seed#[E8C52F3F5249420]) [    ] o.a.s.c.CorePropertiesLocator Cores are: [collection1]
   [junit4]   2> 1516396 INFO  (coreLoadExecutor-6445-thread-1) [    x:collection1] o.a.s.c.SolrResourceLoader [null] Added 2 libs to classloader, from paths: [/C:/Users/jenkins/workspace/Lucene-Solr-6.x-Windows/solr/core/src/test-files/solr/collection1/lib, /C:/Users/jenkins/workspace/Lucene-Solr-6.x-Windows/solr/core/src/test-files/solr/collection1/lib/classes]
   [junit4]   2> 1516467 INFO  (coreLoadExecutor-6445-thread-1) [    x:collection1] o.a.s.c.SolrConfig Using Lucene MatchVersion: 6.4.0
   [junit4]   2> 1516484 INFO  (coreLoadExecutor-6445-thread-1) [    x:collection1] o.a.s.s.IndexSchema [collection1] Schema name=example
   [junit4]   2> 1516539 WARN  (coreLoadExecutor-6445-thread-1) [    x:collection1] o.a.s.s.IndexSchema [collection1] default search field in schema is text. WARNING: Deprecated, please use 'df' on request instead.
   [junit4]   2> 1516540 INFO  (coreLoadExecutor-6445-thread-1) [    x:collection1] o.a.s.s.IndexSchema Loaded schema example/1.1 with uniqueid field id
   [junit4]   2> 1516558 INFO  (coreLoadExecutor-6445-thread-1) [    x:collection1] o.a.s.c.CoreContainer Creating SolrCore 'collection1' using configuration from configset C:\Users\jenkins\workspace\Lucene-Solr-6.x-Windows\solr\core\src\test-files\solr\collection1
   [junit4]   2> 1516559 INFO  (coreLoadExecutor-6445-thread-1) [    x:collection1] o.a.s.c.SolrCore [[collection1] ] Opening new SolrCore at [C:\Users\jenkins\workspace\Lucene-Solr-6.x-Windows\solr\core\src\test-files\solr\collection1], dataDir=[C:\Users\jenkins\workspace\Lucene-Solr-6.x-Windows\solr\build\solr-core\test\J1\temp\solr.handler.component.DistributedQueryElevationComponentTest_E8C52F3F5249420-001\tempDir-001\shard1\cores\collection1\data\]
   [junit4]   2> 1516559 INFO  (coreLoadExecutor-6445-thread-1) [    x:collection1] o.a.s.c.JmxMonitoredMap JMX monitoring is enabled. Adding Solr mbeans to JMX Server: com.sun.jmx.mbeanserver.JmxMBeanServer@44867711
   [junit4]   2> 1516560 INFO  (coreLoadExecutor-6445-thread-1) [    x:collection1] o.a.s.u.RandomMergePolicy RandomMergePolicy wrapping class org.apache.lucene.index.TieredMergePolicy: [TieredMergePolicy: maxMergeAtOnce=24, maxMergeAtOnceExplicit=14, maxMergedSegmentMB=60.0283203125, floorSegmentMB=0.6240234375, forceMergeDeletesPctAllowed=24.636546362037137, segmentsPerTier=35.0, maxCFSSegmentSizeMB=8.796093022207999E12, noCFSRatio=1.0
   [junit4]   2> 1516597 WARN  (coreLoadExecutor-6445-thread-1) [    x:collection1] o.a.s.c.RequestHandlers no default request handler is registered (either '/select' or 'standard')
   [junit4]   2> 1516598 INFO  (coreLoadExecutor-6445-thread-1) [    x:collection1] o.a.s.u.CommitTracker Hard AutoCommit: disabled
   [junit4]   2> 1516598 INFO  (coreLoadExecutor-6445-thread-1) [    x:collection1] o.a.s.u.CommitTracker Soft AutoCommit: disabled
   [junit4]   2> 1516598 INFO  (coreLoadExecutor-6445-thread-1) [    x:collection1] o.a.s.u.RandomMergePolicy RandomMergePolicy wrapping class org.apache.lucene.index.TieredMergePolicy: [TieredMergePolicy: maxMergeAtOnce=23, maxMergeAtOnceExplicit=49, maxMergedSegmentMB=6.51171875, floorSegmentMB=0.6162109375, forceMergeDeletesPctAllowed=23.737565860857107, segmentsPerTier=15.0, maxCFSSegmentSizeMB=8.796093022207999E12, noCFSRatio=1.0
   [junit4]   2> 1516600 INFO  (coreLoadExecutor-6445-thread-1) [    x:collection1] o.a.s.s.SolrIndexSearcher Opening [Searcher@76c6bcb8[collection1] main]
   [junit4]   2> 1516601 WARN  (coreLoadExecutor-6445-thread-1) [    x:collection1] o.a.s.r.ManagedResourceStorage Cannot write to config directory C:\Users\jenkins\workspace\Lucene-Solr-6.x-Windows\solr\core\src\test-files\solr\collection1\conf; switching to use InMemory storage instead.
   [junit4]   2> 1516602 INFO  (coreLoadExecutor-6445-thread-1) [    x:collection1] o.a.s.h.c.QueryElevationComponent Loading QueryElevation from: C:\Users\jenkins\workspace\Lucene-Solr-6.x-Windows\solr\core\src\test-files\solr\collection1\conf\elevate.xml
   [junit4]   2> 1516612 INFO  (coreLoadExecutor-6445-thread-1) [    x:collection1] o.a.s.h.c.QueryElevationComponent Loading QueryElevation from: C:\Users\jenkins\workspace\Lucene-Solr-6.x-Windows\solr\core\src\test-files\solr\collection1\conf\elevate.xml
   [junit4]   2> 1516616 INFO  (coreLoadExecutor-6445-thread-1) [    x:collection1] o.a.s.h.ReplicationHandler Commits will be reserved for  10000
   [junit4]   2> 1516620 INFO  (searcherExecutor-6446-thread-1-processing-x:collection1) [    x:collection1] o.a.s.c.SolrCore [collection1] Registered new searcher Searcher@76c6bcb8[collection1] main{ExitableDirectoryReader(UninvertingDirectoryReader())}
   [junit4]   2> 1517752 INFO  (TEST-DistributedQueryElevationComponentTest.test-seed#[E8C52F3F5249420]) [    ] o.a.s.SolrTestCaseJ4 Writing core.properties file to C:\Users\jenkins\workspace\Lucene-Solr-6.x-Windows\solr\build\solr-core\test\J1\temp\solr.handler.component.DistributedQueryElevationComponentTest_E8C52F3F5249420-001\tempDir-001\shard2\cores\collection1
   [junit4]   2> 1517755 INFO  (TEST-DistributedQueryElevationComponentTest.test-seed#[E8C52F3F5249420]) [    ] o.e.j.s.Server jetty-9.3.14.v20161028
   [junit4]   2> 1517757 INFO  (TEST-DistributedQueryElevationComponentTest.test-seed#[E8C52F3F5249420]) [    ] o.e.j.s.h.ContextHandler Started o.e.j.s.ServletContextHandler@5a788df2{/erbt/bz,null,AVAILABLE}
   [junit4]   2> 1517758 INFO  (TEST-DistributedQueryElevationComponentTest.test-seed#[E8C52F3F5249420]) [    ] o.e.j.s.AbstractConnector Started ServerConnector@6d96a02f{SSL,[ssl, http/1.1]}{127.0.0.1:60672}
   [junit4]   2> 1517758 INFO  (TEST-DistributedQueryElevationComponentTest.test-seed#[E8C52F3F5249420]) [    ] o.e.j.s.Server Started @1522295ms
   [junit4]   2> 1517758 INFO  (TEST-DistributedQueryElevationComponentTest.test-seed#[E8C52F3F5249420]) [    ] o.a.s.c.s.e.JettySolrRunner Jetty properties: {schema=schema11.xml, solrconfig=solrconfig-elevate.xml, hostContext=/erbt/bz, hostPort=60672, coreRootDirectory=C:\Users\jenkins\workspace\Lucene-Solr-6.x-Windows\solr\build\solr-core\test\J1\temp\solr.handler.component.DistributedQueryElevationComponentTest_E8C52F3F5249420-001\tempDir-001\shard2\cores}
   [junit4]   2> 1517758 ERROR (TEST-DistributedQueryElevationComponentTest.test-seed#[E8C52F3F5249420]) [    ] o.a.s.s.StartupLoggingUtils Missing Java Option solr.log.dir. Logging may be missing or incomplete.
   [junit4]   2> 1517758 INFO  (TEST-DistributedQueryElevationComponentTest.test-seed#[E8C52F3F5249420]) [    ] o.a.s.s.SolrDispatchFilter  ___      _       Welcome to Apache Solr? version 6.4.0
   [junit4]   2> 1517758 INFO  (TEST-DistributedQueryElevationComponentTest.test-seed#[E8C52F3F5249420]) [    ] o.a.s.s.SolrDispatchFilter / __| ___| |_ _   Starting in standalone mode on port null
   [junit4]   2> 1517758 INFO  (TEST-DistributedQueryElevationComponentTest.test-seed#[E8C52F3F5249420]) [    ] o.a.s.s.SolrDispatchFilter \__ \/ _ \ | '_|  Install dir: null
   [junit4]   2> 1517758 INFO  (TEST-DistributedQueryElevationComponentTest.test-seed#[E8C52F3F5249420]) [    ] o.a.s.s.SolrDispatchFilter |___/\___/_|_|    Start time: 2017-01-07T22:36:54.055Z
   [junit4]   2> 1517760 INFO  (TEST-DistributedQueryElevationComponentTest.test-seed#[E8C52F3F5249420]) [    ] o.a.s.c.SolrXmlConfig Loading container configuration from C:\Users\jenkins\workspace\Lucene-Solr-6.x-Windows\solr\build\solr-core\test\J1\temp\solr.handler.component.DistributedQueryElevationComponentTest_E8C52F3F5249420-001\tempDir-001\shard2\solr.xml
   [junit4]   2> 1517779 INFO  (TEST-DistributedQueryElevationComponentTest.test-seed#[E8C52F3F5249420]) [    ] o.a.s.u.UpdateShardHandler Creating UpdateShardHandler HTTP client with params: socketTimeout=340000&connTimeout=45000&retry=true
   [junit4]   2> 1517784 INFO  (TEST-DistributedQueryElevationComponentTest.test-seed#[E8C52F3F5249420]) [    ] o.a.s.c.CorePropertiesLocator Found 1 core definitions underneath C:\Users\jenkins\workspace\Lucene-Solr-6.x-Windows\solr\build\solr-core\test\J1\temp\solr.handler.component.DistributedQueryElevationComponentTest_E8C52F3F5249420-001\tempDir-001\shard2\cores
   [junit4]   2> 1517785 INFO  (TEST-DistributedQueryElevationComponentTest.test-seed#[E8C52F3F5249420]) [    ] o.a.s.c.CorePropertiesLocator Cores are: [collection1]
   [junit4]   2> 1517787 INFO  (coreLoadExecutor-6455-thread-1) [    x:collection1] o.a.s.c.SolrResourceLoader [null] Added 2 libs to classloader, from paths: [/C:/Users/jenkins/workspace/Lucene-Solr-6.x-Windows/solr/core/src/test-files/solr/collection1/lib, /C:/Users/jenkins/workspace/Lucene-Solr-6.x-Windows/solr/core/src/test-files/solr/collection1/lib/classes]
   [junit4]   2> 1517852 INFO  (coreLoadExecutor-6455-thread-1) [    x:collection1] o.a.s.c.SolrConfig Using Lucene MatchVersion: 6.4.0
   [junit4]   2> 1517872 INFO  (coreLoadExecutor-6455-thread-1) [    x:collection1] o.a.s.s.IndexSchema [collection1] Schema name=example
   [junit4]   2> 1517912 WARN  (coreLoadExecutor-6455-thread-1) [    x:collection1] o.a.s.s.IndexSchema [collection1] default search field in schema is text. WARNING: Deprecated, please use 'df' on request instead.
   [junit4]   2> 1517917 INFO  (coreLoadExecutor-6455-thread-1) [    x:collection1] o.a.s.s.IndexSchema Loaded schema example/1.1 with uniqueid field id
   [junit4]   2> 1517933 INFO  (coreLoadExecutor-6455-thread-1) [    x:collection1] o.a.s.c.CoreContainer Creating SolrCore 'collection1' using configuration from configset C:\Users\jenkins\workspace\Lucene-Solr-6.x-Windows\solr\core\src\test-files\solr\collection1
   [junit4]   2> 1517933 INFO  (coreLoadExecutor-6455-thread-1) [    x:collection1] o.a.s.c.SolrCore [[collection1] ] Opening new SolrCore at [C:\Users\jenkins\workspace\Lucene-Solr-6.x-Windows\solr\core\src\test-files\solr\collection1], dataDir=[C:\Users\jenkins\workspace\Lucene-Solr-6.x-Windows\solr\build\solr-core\test\J1\temp\solr.handler.component.DistributedQueryElevationComponentTest_E8C52F3F5249420-001\tempDir-001\shard2\cores\collection1\data\]
   [junit4]   2> 1517933 INFO  (coreLoadExecutor-6455-thread-1) [    x:collection1] o.a.s.c.JmxMonitoredMap JMX monitoring is enabled. Adding Solr mbeans to JMX Server: com.sun.jmx.mbeanserver.JmxMBeanServer@44867711
   [junit4]   2> 1517934 INFO  (coreLoadExecutor-6455-thread-1) [    x:collection1] o.a.s.u.RandomMergePolicy RandomMergePolicy wrapping class org.apache.lucene.index.TieredMergePolicy: [TieredMergePolicy: maxMergeAtOnce=24, maxMergeAtOnceExplicit=14, maxMergedSegmentMB=60.0283203125, floorSegmentMB=0.6240234375, forceMergeDeletesPctAllowed=24.636546362037137, segmentsPerTier=35.0, maxCFSSegmentSizeMB=8.796093022207999E12, noCFSRatio=1.0
   [junit4]   2> 1517969 WARN  (coreLoadExecutor-6455-thread-1) [    x:collection1] o.a.s.c.RequestHandlers no default request handler is registered (either '/select' or 'standard')
   [junit4]   2> 1517969 INFO  (coreLoadExecutor-6455-thread-1) [    x:collection1] o.a.s.u.CommitTracker Hard AutoCommit: disabled
   [junit4]   2> 1517969 INFO  (coreLoadExecutor-6455-thread-1) [    x:collection1] o.a.s.u.CommitTracker Soft AutoCommit: disabled
   [junit4]   2> 1517970 INFO  (coreLoadExecutor-6455-thread-1) [    x:collection1] o.a.s.u.RandomMergePolicy RandomMergePolicy wrapping class org.apache.lucene.index.TieredMergePolicy: [TieredMergePolicy: maxMergeAtOnce=23, maxMergeAtOnceExplicit=49, maxMergedSegmentMB=6.51171875, floorSegmentMB=0.6162109375, forceMergeDeletesPctAllowed=23.737565860857107, segmentsPerTier=15.0, maxCFSSegmentSizeMB=8.796093022207999E12, noCFSRatio=1.0
   [junit4]   2> 1517972 INFO  (coreLoadExecutor-6455-thread-1) [    x:collection1] o.a.s.s.SolrIndexSearcher Opening [Searcher@3e190582[collection1] main]
   [junit4]   2> 1517974 WARN  (coreLoadExecutor-6455-thread-1) [    x:collection1] o.a.s.r.ManagedResourceStorage Cannot write to config directory C:\Users\jenkins\workspace\Lucene-Solr-6.x-Windows\solr\core\src\test-files\solr\collection1\conf; switching to use InMemory storage instead.
   [junit4]   2> 1517976 INFO  (coreLoadExecutor-6455-thread-1) [    x:collection1] o.a.s.h.c.QueryElevationComponent Loading QueryElevation from: C:\Users\jenkins\workspace\Lucene-Solr-6.x-Windows\solr\core\src\test-files\solr\collection1\conf\elevate.xml
   [junit4]   2> 1517993 INFO  (coreLoadExecutor-6455-thread-1) [    x:collection1] o.a.s.h.c.QueryElevationComponent Loading QueryElevation from: C:\Users\jenkins\workspace\Lucene-Solr-6.x-Windows\solr\core\src\test-files\solr\collection1\conf\elevate.xml
   [junit4]   2> 1517997 INFO  (coreLoadExecutor-6455-thread-1) [    x:collection1] o.a.s.h.ReplicationHandler Commits will be reserved for  10000
   [junit4]   2> 1517998 INFO  (searcherExecutor-6456-thread-1-processing-x:collection1) [    x:collection1] o.a.s.c.SolrCore [collection1] Registered new searcher Searcher@3e190582[collection1] main{ExitableDirectoryReader(UninvertingDirectoryReader())}
   [junit4]   2> 1518513 INFO  (TEST-DistributedQueryElevationComponentTest.test-seed#[E8C52F3F5249420]) [    ] o.a.s.SolrTestCaseJ4 ###Starting test
   [junit4]   2> 1518567 INFO  (qtp1884799745-13532) [    x:collection1] o.a.s.u.DirectUpdateHandler2 [collection1] REMOVING ALL DOCUMENTS FROM INDEX
   [junit4]   2> 1518567 INFO  (qtp1884799745-13532) [    x:collection1] o.a.s.u.p.LogUpdateProcessorFactory [collection1]  webapp=/erbt/bz path=/update params={wt=javabin&version=2}{deleteByQuery=*:*} 0 0
   [junit4]   2> 1518631 INFO  (qtp1977462948-13549) [    x:collection1] o.a.s.u.DirectUpdateHandler2 [collection1] REMOVING ALL DOCUMENTS FROM INDEX
   [junit4]   2> 1518631 INFO  (qtp1977462948-13549) [    x:collection1] o.a.s.u.p.LogUpdateProcessorFactory [collection1]  webapp=/erbt/bz path=/update params={wt=javabin&version=2}{deleteByQuery=*:*} 0 0
   [junit4]   2> 1518683 INFO  (qtp573454026-13571) [    x:collection1] o.a.s.u.DirectUpdateHandler2 [collection1] REMOVING ALL DOCUMENTS FROM INDEX
   [junit4]   2> 1518683 INFO  (qtp573454026-13571) [    x:collection1] o.a.s.u.p.LogUpdateProcessorFactory [collection1]  webapp=/erbt/bz path=/update params={wt=javabin&version=2}{deleteByQuery=*:*} 0 0
   [junit4]   2> 1518718 INFO  (qtp1902439535-13589) [    x:collection1] o.a.s.u.DirectUpdateHandler2 [collection1] REMOVING ALL DOCUMENTS FROM INDEX
   [junit4]   2> 1518719 INFO  (qtp1902439535-13589) [    x:collection1] o.a.s.u.p.LogUpdateProcessorFactory [collection1]  webapp=/erbt/bz path=/update params={wt=javabin&version=2}{deleteByQuery=*:*} 0 0
   [junit4]   2> 1518727 INFO  (qtp1884799745-13539) [    x:collection1] o.a.s.u.p.LogUpdateProcessorFactory [collection1]  webapp=/erbt/bz path=/update params={wt=javabin&version=2}{add=[1]} 0 2
   [junit4]   2> 1518733 INFO  (qtp1977462948-13553) [    x:collection1] o.a.s.u.p.LogUpdateProcessorFactory [collection1]  webapp=/erbt/bz path=/update params={wt=javabin&version=2}{add=[1]} 0 2
   [junit4]   2> 1518736 INFO  (qtp1884799745-13531) [    x:collection1] o.a.s.u.p.LogUpdateProcessorFactory [collection1]  webapp=/erbt/bz path=/update params={wt=javabin&version=2}{add=[2]} 0 0
   [junit4]   2> 1518739 INFO  (qtp573454026-13573) [    x:collection1] o.a.s.u.p.LogUpdateProcessorFactory [collection1]  webapp=/erbt/bz path=/update params={wt=javabin&version=2}{add=[2]} 0 1
   [junit4]   2> 1518742 INFO  (qtp1884799745-13530) [    x:collection1] o.a.s.u.p.LogUpdateProcessorFactory [collection1]  webapp=/erbt/bz path=/update params={wt=javabin&version=2}{add=[3]} 0 0
   [junit4]   2> 1518746 INFO  (qtp1902439535-13588) [    x:collection1] o.a.s.u.p.LogUpdateProcessorFactory [collection1]  webapp=/erbt/bz path=/update params={wt=javabin&version=2}{add=[3]} 0 2
   [junit4]   2> 1518749 INFO  (qtp1884799745-13534) [    x:collection1] o.a.s.u.p.LogUpdateProcessorFactory [collection1]  webapp=/erbt/bz path=/update params={wt=javabin&version=2}{add=[4]} 0 0
   [junit4]   2> 1518753 INFO  (qtp1977462948-13554) [    x:collection1] o.a.s.u.p.LogUpdateProcessorFactory [collection1]  webapp=/erbt/bz path=/update params={wt=javabin&version=2}{add=[4]} 0 0
   [junit4]   2> 1518757 INFO  (qtp1884799745-13540) [    x:collection1] o.a.s.u.p.LogUpdateProcessorFactory [collection1]  webapp=/erbt/bz path=/update params={wt=javabin&version=2}{add=[5]} 0 0
   [junit4]   2> 1518760 INFO  (qtp573454026-13572) [    x:collection1] o.a.s.u.p.LogUpdateProcessorFactory [collection1]  webapp=/erbt/bz path=/update params={wt=javabin&version=2}{add=[5]} 0 0
   [junit4]   2> 1518762 INFO  (qtp1884799745-13529) [    x:collection1] o.a.s.u.p.LogUpdateProcessorFactory [collection1]  webapp=/erbt/bz path=/update params={wt=javabin&version=2}{add=[6]} 0 0
   [junit4]   2> 1518766 INFO  (qtp1902439535-13587) [    x:collection1] o.a.s.u.p.LogUpdateProcessorFactory [collection1]  webapp=/erbt/bz path=/update params={wt=javabin&version=2}{add=[6]} 0 0
   [junit4]   2> 1518769 INFO  (qtp1884799745-13529) [    x:collection1] o.a.s.u.p.LogUpdateProcessorFactory [collection1]  webapp=/erbt/bz path=/update params={wt=javabin&version=2}{add=[7]} 0 0
   [junit4]   2> 1518772 INFO  (qtp1902439535-13586) [    x:collection1] o.a.s.u.p.LogUpdateProcessorFactory [collection1]  webapp=/erbt/bz path=/update params={wt=javabin&version=2}{add=[7]} 0 0
   [junit4]   2> 1518773 INFO  (qtp1884799745-13532) [    x:collection1] o.a.s.u.DirectUpdateHandler2 start commit{,optimize=false,openSearcher=true,waitSearcher=true,expungeDeletes=false,softCommit=false,prepareCommit=false}
   [junit4]   2> 1518774 INFO  (qtp1884799745-13532) [    x:collection1] o.a.s.u.SolrIndexWriter Calling setCommitData with IW:org.apache.solr.update.SolrIndexWriter@d14ea41
   [junit4]   2> 1518786 INFO  (qtp1884799745-13532) [    x:collection1] o.a.s.s.SolrIndexSearcher Opening [Searcher@25b976c1[collection1] main]
   [junit4]   2> 1518786 INFO  (qtp1884799745-13532) [    x:collection1] o.a.s.u.DirectUpdateHandler2 end_commit_flush
   [junit4]   2> 1518787 INFO  (searcherExecutor-6426-thread-1-processing-x:collection1) [    x:collection1] o.a.s.c.SolrCore [collection1] Registered new searcher Searcher@25b976c1[collection1] main{ExitableDirectoryReader(UninvertingDirectoryReader(Uninverting(_0(6.4.0):C7)))}
   [junit4]   2> 1518788 INFO  (qtp1884799745-13532) [    x:collection1] o.a.s.u.p.LogUpdateProcessorFactory [collection1]  webapp=/erbt/bz path=/update params={waitSearcher=true&commit=true&softCommit=false&wt=javabin&version=2}{commit=} 0 14
   [junit4]   2> 1518789 INFO  (qtp1977462948-13555) [    x:collection1] o.a.s.u.DirectUpdateHandler2 start commit{,optimize=false,openSearcher=true,waitSearcher=true,expungeDeletes=false,softCommit=false,prepareCommit=false}
   [junit4]   2> 1518789 INFO  (qtp1977462948-13555) [    x:collection1] o.a.s.u.SolrIndexWriter Calling setCommitData with IW:org.apache.solr.update.SolrIndexWriter@5fb1fb22
   [junit4]   2> 1518795 INFO  (qtp1977462948-13555) [    x:collection1] o.a.s.s.SolrIndexSearcher Opening [Searcher@11aec196[collection1] main]
   [junit4]   2> 1518795 INFO  (qtp1977462948-13555) [    x:collection1] o.a.s.u.DirectUpdateHandler2 end_commit_flush
   [junit4]   2> 1518795 INFO  (searcherExecutor-6436-thread-1-processing-x:collection1) [    x:collection1] o.a.s.c.SolrCore [collection1] Registered new searcher Searcher@11aec196[collection1] main{ExitableDirectoryReader(UninvertingDirectoryReader(Uninverting(_0(6.4.0):C2)))}
   [junit4]   2> 1518796 INFO  (qtp1977462948-13555) [    x:collection1] o.a.s.u.p.LogUpdateProcessorFactory [collection1]  webapp=/erbt/bz path=/update params={waitSearcher=true&commit=true&softCommit=false&wt=javabin&version=2}{commit=} 0 6
   [junit4]   2> 1518797 INFO  (qtp573454026-13566) [    x:collection1] o.a.s.u.DirectUpdateHandler2 start commit{,optimize=false,openSearcher=true,waitSearcher=true,expungeDeletes=false,softCommit=false,prepareCommit=false}
   [junit4]   2> 1518797 INFO  (qtp573454026-13566) [    x:collection1] o.a.s.u.SolrIndexWriter Calling setCommitData with IW:org.apache.solr.update.SolrIndexWriter@15f1dc4f
   [junit4]   2> 1518801 INFO  (qtp573454026-13566) [    x:collection1] o.a.s.s.SolrIndexSearcher Opening [Searcher@4b6e2fc0[collection1] main]
   [junit4]   2> 1518801 INFO  (qtp573454026-13566) [    x:collection1] o.a.s.u.DirectUpdateHandler2 end_commit_flush
   [junit4]   2> 1518802 INFO  (searcherExecutor-6446-thread-1-processing-x:collection1) [    x:collection1] o.a.s.c.SolrCore [collection1] Registered new searcher Searcher@4b6e2fc0[collection1] main{ExitableDirectoryReader(UninvertingDirectoryReader(Uninverting(_0(6.4.0):C2)))}
   [junit4]   2> 1518802 INFO  (qtp573454026-13566) [    x:collection1] o.a.s.u.p.LogUpdateProcessorFactory [collection1]  webapp=/erbt/bz path=/update params={waitSearcher=true&commit=true&softCommit=false&wt=javabin&version=2}{commit=} 0 5
   [junit4]   2> 1518803 INFO  (qtp1902439535-13585) [    x:collection1] o.a.s.u.DirectUpdateHandler2 start commit{,optimize=false,openSearcher=true,waitSearcher=true,expungeDeletes=false,softCommit=false,prepareCommit=false}
   [junit4]   2> 1518803 INFO  (qtp1902439535-13585) [    x:collection1] o.a.s.u.SolrIndexWriter Calling setCommitData with IW:org.apache.solr.update.SolrIndexWriter@73c02a5
   [junit4]   2> 1518824 INFO  (qtp1902439535-13585) [    x:collection1] o.a.s.s.SolrIndexSearcher Opening [Searcher@7f8e26a6[collection1] main]
   [junit4]   2> 1518825 INFO  (qtp1902439535-13585) [    x:collection1] o.a.s.u.DirectUpdateHandler2 end_commit_flush
   [junit4]   2> 1518825 INFO  (searcherExecutor-6456-thread-1-processing-x:collection1) [    x:collection1] o.a.s.c.SolrCore [collection1] Registered new searcher Searcher@7f8e26a6[collection1] main{ExitableDirectoryReader(UninvertingDirectoryReader(Uninverting(_0(6.4.0):C3)))}
   [junit4]   2> 1518826 INFO  (qtp1902439535-13585) [    x:collection1] o.a.s.u.p.LogUpdateProcessorFactory [collection1]  webapp=/erbt/bz path=/update params={waitSearcher=true&commit=true&softCommit=false&wt=javabin&version=2}{commit=} 0 22
   [junit4]   2> 1518830 INFO  (qtp1884799745-13539) [    x:collection1] o.a.s.c.S.Request [collection1]  webapp=/erbt/bz path=/elevate params={q=*:*&distrib=false&qt=/elevate&fl=id,+score,+[elevated]&sort=id+desc&rows=500&wt=javabin&version=2&shards.qt=/elevate} hits=7 status=0 QTime=2
   [junit4]   2> 1518861 INFO  (qtp573454026-13569) [    x:collection1] o.a.s.c.S.Request [collection1]  webapp=/erbt/bz path=/elevate params={distrib=false&qt=/elevate&fl=id&fl=score&shards.purpose=4&start=0&fsv=true&sort=id+desc&shard.url=[ff01::083]:33332/erbt/bz|[ff01::213]:33332/erbt/bz|https://127.0.0.1:60669/erbt/bz/collection1|[ff01::114]:33332/erbt/bz&rows=500&version=2&shards.qt=/elevate&q=*:*&NOW=1483828615129&isShard=true&wt=javabin} hits=2 status=0 QTime=2
   [junit4]   2> 1518865 INFO  (qtp1902439535-13583) [    x:collection1] o.a.s.c.S.Request [collection1]  webapp=/erbt/bz path=/elevate params={distrib=false&qt=/elevate&fl=id&fl=score&shards.purpose=4&start=0&fsv=true&sort=id+desc&shard.url=[ff01::114]:33332/erbt/bz|https://127.0.0.1:60672/erbt/bz/collection1|[ff01::083]:33332/erbt/bz&rows=500&version=2&shards.qt=/elevate&q=*:*&NOW=1483828615129&isShard=true&wt=javabin} hits=3 status=0 QTime=0
   [junit4]   2> 1518870 INFO  (qtp1977462948-13551) [    x:collection1] o.a.s.c.S.Request [collection1]  webapp=/erbt/bz path=/elevate params={distrib=false&qt=/elevate&fl=id&fl=score&shards.purpose=4&start=0&fsv=true&sort=id+desc&shard.url=[ff01::083]:33332/erbt/bz|[ff01::114]:33332/erbt/bz|https://127.0.0.1:60665/erbt/bz/collection1|[ff01::213]:33332/erbt/bz&rows=500&version=2&shards.qt=/elevate&q=*:*&NOW=1483828615129&isShard=true&wt=javabin} hits=2 status=0 QTime=0
   [junit4]   2> 1518877 INFO  (qtp1977462948-13551) [    x:collection1] o.a.s.c.S.Request [collection1]  webapp=/erbt/bz path=/elevate params={distrib=false&qt=/elevate&fl=id,+score,+[elevated]&shards.purpose=64&shard.url=[ff01::083]:33332/erbt/bz|[ff01::114]:33332/erbt/bz|https://127.0.0.1:60665/erbt/bz/collection1|[ff01::213]:33332/erbt/bz&rows=500&version=2&shards.qt=/elevate&q=*:*&NOW=1483828615129&ids=1.0,4.0&isShard=true&wt=javabin} status=0 QTime=0
   [junit4]   2> 1518877 INFO  (qtp1902439535-13593) [    x:collection1] o.a.s.c.S.Request [collection1]  webapp=/erbt/bz path=/elevate params={distrib=false&qt=/elevate&fl=id,+score,+[elevated]&shards.purpose=64&shard.url=[ff01::114]:33332/erbt/bz|https://127.0.0.1:60672/erbt/bz/collection1|[ff01::083]:33332/erbt/bz&rows=500&version=2&shards.qt=/elevate&q=*:*&NOW=1483828615129&ids=3.0,6.0,7.0&isShard=true&wt=javabin} status=0 QTime=2
   [junit4]   2> 1518877 INFO  (qtp573454026-13570) [    x:collection1] o.a.s.c.S.Request [collection1]  webapp=/erbt/bz path=/elevate params={distrib=false&qt=/elevate&fl=id,+score,+[elevated]&shards.purpose=64&shard.url=[ff01::083]:33332/erbt/bz|[ff01::213]:33332/erbt/bz|https://127.0.0.1:60669/erbt/bz/collection1|[ff01::114]:33332/erbt/bz&rows=500&version=2&shards.qt=/elevate&q=*:*&NOW=1483828615129&ids=2.0,5.0&isShard=true&wt=javabin} status=0 QTime=0
   [junit4]   2> 1518878 INFO  (qtp1977462948-13556) [    x:collection1] o.a.s.c.S.Request [collection1]  webapp=/erbt/bz path=/elevate params={q=*:*&shards=[ff01::083]:33332/erbt/bz|[ff01::114]:33332/erbt/bz|https://127.0.0.1:60665/erbt/bz/collection1|[ff01::213]:33332/erbt/bz,[ff01::083]:33332/erbt/bz|[ff01::213]:33332/erbt/bz|https://127.0.0.1:60669/erbt/bz/collection1|[ff01::114]:33332/erbt/bz,[ff01::114]:33332/erbt/bz|https://127.0.0.1:60672/erbt/bz/collection1|[ff01::083]:33332/erbt/bz&qt=/elevate&fl=id,+score,+[elevated]&sort=id+desc&rows=500&wt=javabin&version=2&shards.qt=/elevate} hits=7 status=0 QTime=45
   [junit4]   2> 1518887 INFO  (qtp1884799745-13531) [    x:collection1] o.a.s.c.S.Request [collection1]  webapp=/erbt/bz path=/elevate params={q=ZZZZ&forceElevation=true&distrib=false&qt=/elevate&fl=*,+[elevated]&sort=int_i+desc&rows=500&wt=javabin&version=2&shards.qt=/elevate} hits=5 status=0 QTime=7
   [junit4]   2> 1518895 INFO  (qtp1902439535-13590) [    x:collection1] o.a.s.c.S.Request [collection1]  webapp=/erbt/bz path=/elevate params={distrib=false&qt=/elevate&fl=id&shards.purpose=4&start=0&fsv=true&sort=int_i+desc&shard.url=https://127.0.0.1:60672/erbt/bz/collection1&rows=500&version=2&shards.qt=/elevate&q=ZZZZ&forceElevation=true&NOW=1483828615187&isShard=true&wt=javabin} hits=2 status=0 QTime=1
   [junit4]   2> 1518897 INFO  (qtp1977462948-13553) [    x:collection1] o.a.s.c.S.Request [collection1]  webapp=/erbt/bz path=/elevate params={distrib=false&qt=/elevate&fl=id&shards.purpose=4&start=0&fsv=true&sort=int_i+desc&shard.url=https://127.0.0.1:60665/erbt/bz/collection1|[ff01::114]:33332/erbt/bz|[ff01::213]:33332/erbt/bz|[ff01::083]:33332/erbt/bz&rows=500&version=2&shards.qt=/elevate&q=ZZZZ&forceElevation=true&NOW=1483828615187&isShard=true&wt=javabin} hits=1 status=0 QTime=2
   [junit4]   2> 1518899 INFO  (qtp573454026-13570) [    x:collection1] o.a.s.c.S.Request [collection1]  webapp=/erbt/bz path=/elevate params={distrib=false&qt=/elevate&fl=id&shards.purpose=4&start=0&fsv=true&sort=int_i+desc&shard.url=https://127.0.0.1:60669/erbt/bz/collection1&rows=500&version=2&shards.qt=/elevate&q=ZZZZ&forceElevation=true&NOW=1483828615187&isShard=true&wt=javabin} hits=2 status=0 QTime=5
   [junit4]   2> 1518904 INFO  (qtp1977462948-13554) [    x:collection1] o.a.s.c.S.Request [collection1]  webapp=/erbt/bz path=/elevate params={distrib=false&qt=/elevate&fl=*,+[elevated]&shards.purpose=64&shard.url=https://127.0.0.1:60665/erbt/bz/collection1|[ff01::114]:33332/erbt/bz|[ff01::213]:33332/erbt/bz|[ff01::083]:33332/erbt/bz&rows=500&version=2&shards.qt=/elevate&q=ZZZZ&forceElevation=true&NOW=1483828615187&ids=1.0&isShard=true&wt=javabin} status=0 QTime=0
   [junit4]   2> 1518904 INFO  (qtp1902439535-13589) [    x:collection1] o.a.s.c.S.Request [collection1]  webapp=/erbt/bz path=/elevate params={distrib=false&qt=/elevate&fl=*,+[elevated]&shards.purpose=64&shard.url=https://127.0.0.1:60672/erbt/bz/collection1&rows=500&version=2&shards.qt=/elevate&q=ZZZZ&forceElevation=true&NOW=1483828615187&ids=3.0,6.0&isShard=true&wt=javabin} status=0 QTime=1
   [junit4]   2> 1518904 INFO  (qtp573454026-13573) [    x:collection1] o.a.s.c.S.Request [collection1]  webapp=/erbt/bz path=/elevate params={distrib=false&qt=/elevate&fl=*,+[elevated]&shards.purpose=64&shard.url=https://127.0.0.1:60669/erbt/bz/collection1&rows=500&version=2&shards.qt=/elevate&q=ZZZZ&forceElevation=true&NOW=1483828615187&ids=2.0,5.0&isShard=true&wt=javabin} status=0 QTime=0
   [junit4]   2> 1518905 INFO  (qtp1977462948-13551) [    x:collection1] o.a.s.c.S.Request [collection1]  webapp=/erbt/bz path=/elevate params={q=ZZZZ&forceElevation=true&shards=https://127.0.0.1:60665/erbt/bz/collection1|[ff01::114]:33332/erbt/bz|[ff01::213]:33332/erbt/bz|[ff01::083]:33332/erbt/bz,https://127.0.0.1:60669/erbt/bz/collection1,https://127.0.0.1:60672/erbt/bz/collection1&qt=/elevate&fl=*,+[elevated]&sort=int_i+desc&rows=500&wt=javabin&version=2&shards.qt=/elevate} hits=5 status=0 QTime=14
   [junit4]   2> 1518908 INFO  (qtp1884799745-13530) [    x:collection1] o.a.s.c.S.Request [collection1]  webapp=/erbt/bz path=/elevate params={q=solr&forceElevation=true&distrib=false&qt=/elevate&fl=*,+[elevated]&sort=int_i+asc&rows=500&wt=javabin&version=2&shards.qt=/elevate} hits=1 status=0 QTime=0
   [junit4]   2> 1518920 INFO  (qtp1902439535-13589) [    x:collection1] o.a.s.c.S.Request [collection1]  webapp=/erbt/bz path=/elevate params={distrib=false&qt=/elevate&fl=id&shards.purpose=4&start=0&fsv=true&sort=int_i+asc&shard.url=https://127.0.0.1:60672/erbt/bz/collection1|[ff01::114]:33332/erbt/bz|[ff01::213]:33332/erbt/bz&rows=500&version=2&shards.qt=/elevate&q=solr&forceElevation=true&NOW=1483828615206&isShard=true&wt=javabin} hits=1 status=0 QTime=0
   [junit4]   2> 1518945 INFO  (qtp573454026-13568) [    x:collection1] o.a.s.c.S.Request [collection1]  webapp=/erbt/bz path=/elevate params={distrib=false&qt=/elevate&fl=id&shards.purpose=4&start=0&fsv=true&sort=int_i+asc&shard.url=[ff01::213]:33332/erbt/bz|https://127.0.0.1:60669/erbt/bz/collection1&rows=500&version=2&shards.qt=/elevate&q=solr&forceElevation=true&NOW=1483828615206&isShard=true&wt=javabin} hits=0 status=0 QTime=1
   [junit4]   2> 1518949 INFO  (qtp1977462948-13554) [    x:collection1] o.a.s.c.S.Request [collection1]  webapp=/erbt/bz path=/elevate params={distrib=false&qt=/elevate&fl=id&shards.purpose=4&start=0&fsv=true&sort=int_i+asc&shard.url=[ff01::083]:33332/erbt/bz|https://127.0.0.1:60665/erbt/bz/collection1&rows=500&version=2&shards.qt=/elevate&q=solr&forceElevation=true&NOW=1483828615206&isShard=true&wt=javabin} hits=0 status=0 QTime=0
   [junit4]   2> 1518955 INFO  (qtp1902439535-13589) [    x:collection1] o.a.s.c.S.Request [collection1]  webapp=/erbt/bz path=/elevate params={distrib=false&qt=/elevate&fl=*,+[elevated]&shards.purpose=64&shard.url=https://127.0.0.1:60672/erbt/bz/collection1|[ff01::114]:33332/erbt/bz|[ff01::213]:33332/erbt/bz&rows=500&version=2&shards.qt=/elevate&q=solr&forceElevation=true&NOW=1483828615206&ids=7.0&isShard=true&wt=javabin} status=0 QTime=0
   [junit4]   2> 1518956 INFO  (qtp573454026-13572) [    x:collection1] o.a.s.c.S.Request [collection1]  webapp=/erbt/bz path=/elevate params={q=solr&forceElevation=true&shards=[ff01::083]:33332/erbt/bz|https://127.0.0.1:60665/erbt/bz/collection1,[ff01::213]:33332/erbt/bz|https://127.0.0.1:60669/erbt/bz/collection1,https://127.0.0.1:60672/erbt/bz/collection1|[ff01::114]:33332/erbt/bz|[ff01::213]:33332/erbt/bz&qt=/elevate&fl=*,+[elevated]&sort=int_i+asc&rows=500&wt=javabin&version=2&shards.qt=/elevate} hits=1 status=0 QTime=47
   [junit4]   2> 1518959 INFO  (qtp1884799745-13530) [    x:collection1] o.a.s.c.S.Request [collection1]  webapp=/erbt/bz path=/elevate params={q=ZZZZ&forceElevation=true&distrib=false&qt=/elevate&fl=*,+[elevated]&sort=id+desc&rows=500&wt=javabin&version=2&shards.qt=/elevate} hits=5 status=0 QTime=1
   [junit4]   2> 1518967 INFO  (qtp1902439535-13589) [    x:collection1] o.a.s.c.S.Request [collection1]  webapp=/erbt/bz path=/elevate params={distrib=false&qt=/elevate&fl=id&shards.purpose=4&start=0&fsv=true&sort=id+desc&shard.url=https://127.0.0.1:60672/erbt/bz/collection1|[ff01::083]:33332/erbt/bz|[ff01::114]:33332/erbt/bz&rows=500&version=2&shards.qt=/elevate&q=ZZZZ&forceElevation=true&NOW=1483828615259&isShard=true&wt=javabin} hits=2 status=0 QTime=0
   [junit4]   2> 1518968 INFO  (qtp573454026-13571) [    x:collection1] o.a.s.c.S.Request [collection1]  webapp=/erbt/bz path=/elevate params={distrib=false&qt=/elevate&fl=id&shards.purpose=4&start=0&fsv=true&sort=id+desc&shard.url=[ff01::083]:33332/erbt/bz|https://127.0.0.1:60669/erbt/bz/collection1&rows=500&version=2&shards.qt=/elevate&q=ZZZZ&forceElevation=true&NOW=1483828615259&isShard=true&wt=javabin} hits=2 status=0 QTime=1
   [junit4]   2> 1518968 INFO  (qtp1977462948-13552) [    x:collection1] o.a.s.c.S.Request [collection1]  webapp=/erbt/bz path=/elevate params={distrib=false&qt=/elevate&fl=id&shards.purpose=4&start=0&fsv=true&sort=id+desc&shard.url=https://127.0.0.1:60665/erbt/bz/collection1&rows=500&version=2&shards.qt=/elevate&q=ZZZZ&forceElevation=true&NOW=1483828615259&isShard=true&wt=javabin} hits=1 status=0 QTime=2
   [junit4]   2> 1518982 INFO  (qtp1977462948-13552) [    x:collection1] o.a.s.c.S.Request [collection1]  webapp=/erbt/bz path=/elevate params={distrib=false&qt=/elevate&fl=*,+[elevated]&shards.purpose=64&shard.url=https://127.0.0.1:60665/erbt/bz/collection1&rows=500&version=2&shards.qt=/elevate&q=ZZZZ&forceElevation=true&NOW=1483828615259&ids=1.0&isShard=true&wt=javabin} status=0 QTime=0
   [junit4]   2> 1518983 INFO  (qtp1902439535-13589) [    x:collection1] o.a.s.c.S.Request [collection1]  webapp=/erbt/bz path=/elevate params={distrib=false&qt=/elevate&fl=*,+[elevated]&shards.purpose=64&shard.url=https://127.0.0.1:60672/erbt/bz/collection1|[ff01::083]:33332/erbt/bz|[ff01::114]:33332/erbt/bz&rows=500&version=2&shards.qt=/elevate&q=ZZZZ&forceElevation=true&NOW=1483828615259&ids=3.0,6.0&isShard=true&wt=javabin} status=0 QTime=0
   [junit4]   2> 1518983 INFO  (qtp573454026-13571) [    x:collection1] o.a.s.c.S.Request [collection1]  webapp=/erbt/bz path=/elevate params={distrib=false&qt=/elevate&fl=*,+[elevated]&shards.purpose=64&shard.url=[ff01::083]:33332/erbt/bz|https://127.0.0.1:60669/erbt/bz/collection1&rows=500&version=2&shards.qt=/elevate&q=ZZZZ&forceElevation=true&NOW=1483828615259&ids=2.0,5.0&isShard=true&wt=javabin} status=0 QTime=0
   [junit4]   2> 1518984 INFO  (qtp573454026-13569) [    x:collection1] o.a.s.c.S.Request [collection1]  webapp=/erbt/bz path=/elevate params={q=ZZZZ&forceElevation=true&shards=https://127.0.0.1:60665/erbt/bz/collection1,[ff01::083]:33332/erbt/bz|https://127.0.0.1:60669/erbt/bz/collection1,https://127.0.0.1:60672/erbt/bz/collection1|[ff01::083]:33332/erbt/bz|[ff01::114]:33332/erbt/bz&qt=/elevate&fl=*,+[elevated]&sort=id+desc&rows=500&wt=javabin&version=2&shards.qt=/elevate} hits=5 status=0 QTime=21
   [junit4]   2> 1518988 INFO  (qtp1884799745-13530) [    x:collection1] o.a.s.c.S.Request [collection1]  webapp=/erbt/bz path=/elevate params={q=XXXX&forceElevation=true&enableElevation=true&distrib=false&qt=/elevate&fl=id,+[elevated]&elevateIds=6&sort=id+desc&rows=500&wt=javabin&version=2&shards.qt=/elevate} hits=3 status=0 QTime=0
   [junit4]   2> 1519015 INFO  (qtp1977462948-13552) [    x:collection1] o.a.s.c.S.Request [collection1]  webapp=/erbt/bz path=/elevate params={distrib=false&qt=/elevate&fl=id&shards.purpose=4&start=0&fsv=true&sort=id+desc&shard.url=https://127.0.0.1:60665/erbt/bz/collection1&rows=500&version=2&shards.qt=/elevate&q=XXXX&forceElevation=true&enableElevation=true&NOW=1483828615286&elevateIds=6&isShard=true&wt=javabin} hits=2 status=0 QTime=0
   [junit4]   2> 1519038 INFO  (qtp1902439535-13593) [    x:collection1] o.a.s.c.S.Request [collection1]  webapp=/erbt/bz path=/elevate params={distrib=false&qt=/elevate&fl=id&shards.purpose=4&start=0&fsv=true&sort=id+desc&shard.url=[ff01::213]:33332/erbt/bz|https://127.0.0.1:60672/erbt/bz/collection1&rows=500&version=2&shards.qt=/elevate&q=XXXX&forceElevation=true&enableElevation=true&NOW=1483828615286&elevateIds=6&isShard=true&wt=javabin} hits=1 status=0 QTime=1
   [junit4]   2> 1519047 INFO  (qtp573454026-13568) [    x:collection1] o.a.s.c.S.Request [collection1]  webapp=/erbt/bz path=/elevate params={distrib=false&qt=/elevate&fl=id&shards.purpose=4&start=0&fsv=true&sort=id+desc&shard.url=[ff01::213]:33332/erbt/bz|https://127.0.0.1:60669/erbt/bz/collection1|[ff01::083]:33332/erbt/bz|[ff01::114]:33332/erbt/bz&rows=500&version=2&shards.qt=/elevate&q=XXXX&forceElevation=true&enableElevation=true&NOW=1483828615286&elevateIds=6&isShard=true&wt=javabin} hits=0 status=0 QTime=0
   [junit4]   2> 1519052 INFO  (qtp1902439535-13593) [    x:collection1] o.a.s.c.S.Request [collection1]  webapp=/erbt/bz path=/elevate params={distrib=false&qt=/elevate&fl=id,+[elevated]&shards.purpose=64&shard.url=[ff01::213]:33332/erbt/bz|https://127.0.0.1:60672/erbt/bz/collection1&rows=500&version=2&shards.qt=/elevate&q=XXXX&forceElevation=true&enableElevation=true&NOW=1483828615286&elevateIds=6&ids=6.0&isShard=true&wt=javabin} status=0 QTime=0
   [junit4]   2> 1519053 INFO  (qtp1977462948-13552) [    x:collection1] o.a.s.c.S.Request [collection1]  webapp=/erbt/bz path=/elevate params={distrib=false&qt=/elevate&fl=id,+[elevated]&shards.purpose=64&shard.url=https://127.0.0.1:60665/erbt/bz/collection1&rows=500&version=2&shards.qt=/elevate&q=XXXX&forceElevation=true&enableElevation=true&NOW=1483828615286&elevateIds=6&ids=1.0,4.0&isShard=true&wt=javabin} status=0 QTime=0
   [junit4]   2> 1519053 INFO  (qtp1902439535-13595) [    x:collection1] o.a.s.c.S.Request [collection1]  webapp=/erbt/bz path=/elevate params={q=XXXX&forceElevation=true&shards=https://127.0.0.1:60665/erbt/bz/collection1,[ff01::213]:33332/erbt/bz|https://127.0.0.1:60669/erbt/bz/collection1|[ff01::083]:33332/erbt/bz|[ff01::114]:33332/erbt/bz,[ff01::213]:33332/erbt/bz|https://127.0.0.1:60672/erbt/bz/collection1&enableElevation=true&qt=/elevate&fl=id,+[elevated]&elevateIds=6&sort=id+desc&rows=500&wt=javabin&version=2&shards.qt=/elevate} hits=3 status=0 QTime=64
   [junit4]   2> 1519067 INFO  (qtp1902439535-13593) [    x:collection1] o.a.s.c.S.Request [collection1]  webapp=/erbt/bz path=/elevate params={distrib=false&qt=/elevate&fl=id&shards.purpose=4&start=0&fsv=true&sort=id+desc&shard.url=[ff01::114]:33332/erbt/bz|[ff01::213]:33332/erbt/bz|[ff01::083]:33332/erbt/bz|https://127.0.0.1:60672/erbt/bz/collection1&rows=500&version=2&shards.qt=/elevate&q=XXXX&forceElevation=true&enableElevation=true&NOW=1483828615356&elevateIds=6&elevateIds=wt&elevateIds=javabin&isShard=true&wt=javabin} hits=1 status=0 QTime=0
   [junit4]   2> 1519068 INFO  (qtp1977462948-13554) [    x:collection1] o.a.s.c.S.Request [collection1]  webapp=/erbt/bz path=/elevate params={distrib=false&qt=/elevate&fl=id&shards.purpose=4&start=0&fsv=true&sort=id+desc&shard.url=https://127.0.0.1:60665/erbt/bz/collection1&rows=500&version=2&shards.qt=/elevate&q=XXXX&forceElevation=true&enableElevation=true&NOW=1483828615356&elevateIds=6&elevateIds=wt&elevateIds=javabin&isShard=true&wt=javabin} hits=2 status=0 QTime=0
   [junit4]   2> 1519077 INFO  (qtp573454026-13572) [    x:collection1] o.a.s.c.S.Request [collection1]  webapp=/erbt/bz path=/elevate params={distrib=false&qt=/elevate&fl=id&shards.purpose=4&start=0&fsv=true&sort=id+desc&shard.url=https://127.0.0.1:60669/erbt/bz/collection1|[ff01::114]:33332/erbt/bz&rows=500&version=2&shards.qt=/elevate&q=XXXX&forceElevation=true&enableElevation=true&NOW=1483828615356&elevateIds=6&elevateIds=wt&elevateIds=javabin&isShard=true&wt=javabin} hits=0 status=0 QTime=0
   [junit4]   2> 1519081 INFO  (qtp1977462948-13554) [    x:collection1] o.a.s.c.S.Request [collection1]  webapp=/erbt/bz path=/elevate params={distrib=false&qt=/elevate&fl=id,[elevated]&shards.purpose=64&shard.url=https://127.0.0.1:60665/erbt/bz/collection1&rows=500&version=2&shards.qt=/elevate&q=XXXX&forceElevation=true&enableElevation=true&NOW=1483828615356&elevateIds=6&elevateIds=wt&elevateIds=javabin&ids=1.0,4.0&isShard=true&wt=javabin} status=0 QTime=0
   [junit4]   2> 1519082 INFO  (qtp1902439535-13593) [    x:collection1] o.a.s.c.S.Request [collection1]  webapp=/erbt/bz path=/elevate params={distrib=false&qt=/elevate&fl=id,[elevated]&shards.purpose=64&shard.url=[ff01::114]:33332/erbt/bz|[ff01::213]:33332/erbt/bz|[ff01::083]:33332/erbt/bz|https://127.0.0.1:60672/erbt/bz/collection1&rows=500&version=2&shards.qt=/elevate&q=XXXX&forceElevation=true&enableElevation=true&NOW=1483828615356&elevateIds=6&elevateIds=wt&elevateIds=javabin&ids=6.0&isShard=true&wt=javabin} status=0 QTime=0
   [junit4]   2> 1519084 INFO  (qtp1977462948-13551) [    x:collection1] o.a.s.c.S.Request [collection1]  webapp=/erbt/bz path=/elevate params={q=XXXX&forceElevation=true&shards=https://127.0.0.1:60665/erbt/bz/collection1,https://127.0.0.1:60669/erbt/bz/collection1|[ff01::114]:33332/erbt/bz,[ff01::114]:33332/erbt/bz|[ff01::213]:33332/erbt/bz|[ff01::083]:33332/erbt/bz|https://127.0.0.1:60672/erbt/bz/collection1&enableElevation=true&qt=/elevate&fl=id,[elevated]&elevateIds=6&elevateIds=wt&elevateIds=javabin&sort=id+desc&rows=500&wt=javabin&version=2&shards.qt=/elevate} hits=3 status=0 QTime=24
   [junit4]   2> 1519085 INFO  (TEST-DistributedQueryElevationComponentTest.test-seed#[E8C52F3F5249420]) [    ] o.a.s.SolrTestCaseJ4 ###Ending test
   [junit4]   2> 1519086 INFO  (TEST-DistributedQueryElevationComponentTest.test-seed#[E8C52F3F5249420]) [    ] o.e.j.s.AbstractConnector Stopped ServerConnector@6fe4f7af{SSL,[ssl, http/1.1]}{127.0.0.1:0}
   [junit4]   2> 1519086 INFO  (TEST-DistributedQueryElevationComponentTest.test-seed#[E8C52F3F5249420]) [    ] o.a.s.c.CoreContainer Shutting down CoreContainer instance=1988922007
   [junit4]   2> 1519091 INFO  (coreCloseExecutor-6460-thread-1) [    x:collection1] o.a.s.c.SolrCore [collection1]  CLOSING SolrCore org.apache.solr.core.SolrCore@6bb51d49
   [junit4]   2> 1519098 INFO  (coreCloseExecutor-6460-thread-1) [    x:collection1] o.a.s.m.SolrMetricManager Closing metric reporters for: solr.core.collection1
   [junit4]   2> 1519099 INFO  (TEST-DistributedQueryElevationComponentTest.test-seed#[E8C52F3F5249420]) [    ] o.a.s.m.SolrMetricManager Closing metric reporters for: solr.node
   [junit4]   2> 1519099 INFO  (TEST-DistributedQueryElevationComponentTest.test-seed#[E8C52F3F5249420]) [    ] o.e.j.s.h.ContextHandler Stopped o.e.j.s.ServletContextHandler@7432a19e{/erbt/bz,null,UNAVAILABLE}
   [junit4]   2> 1519103 INFO  (TEST-DistributedQueryElevationComponentTest.test-seed#[E8C52F3F5249420]) [    ] o.e.j.s.AbstractConnector Stopped ServerConnector@668b5929{SSL,[ssl, http/1.1]}{127.0.0.1:0}
   [junit4]   2> 1519103 INFO  (TEST-DistributedQueryElevationComponentTest.test-seed#[E8C52F3F5249420]) [    ] o.a.s.c.CoreContainer Shutting down CoreContainer instance=408759173
   [junit4]   2> 1519104 INFO  (coreCloseExecutor-6462-thread-1) [    x:collection1] o.a.s.c.SolrCore [collection1]  CLOSING SolrCore org.apache.solr.core.SolrCore@23e2732d
   [junit4]   2> 1519144 INFO  (coreCloseExecutor-6462-thread-1) [    x:collection1] o.a.s.m.SolrMetricManager Closing metric reporters for: solr.core.collection1
   [junit4]   2> 1519146 INFO  (TEST-DistributedQueryElevationComponentTest.test-seed#[E8C52F3F5249420]) [    ] o.a.s.m.SolrMetricManager Closing metric reporters for: solr.node
   [junit4]   2> 1519147 INFO  (TEST-DistributedQueryElevationComponentTest.test-seed#[E8C52F3F5249420]) [    ] o.e.j.s.h.ContextHandler Stopped o.e.j.s.ServletContextHandler@793ff7d2{/erbt/bz,null,UNAVAILABLE}
   [junit4]   2> 1519149 INFO  (TEST-DistributedQueryElevationComponentTest.test-seed#[E8C52F3F5249420]) [    ] o.e.j.s.AbstractConnector Stopped ServerConnector@3bb15c44{SSL,[ssl, http/1.1]}{127.0.0.1:0}
   [junit4]   2> 1519149 INFO  (TEST-DistributedQueryElevationComponentTest.test-seed#[E8C52F3F5249420]) [    ] o.a.s.c.CoreContainer Shutting down CoreContainer instance=1995344289
   [junit4]   2> 1519150 INFO  (coreCloseExecutor-6464-thread-1) [    x:collection1] o.a.s.c.SolrCore [collection1]  CLOSING SolrCore org.apache.solr.core.SolrCore@e62a109
   [junit4]   2> 1519157 INFO  (coreCloseExecutor-6464-thread-1) [    x:collection1] o.a.s.m.SolrMetricManager Closing metric reporters for: solr.core.collection1
   [junit4]   2> 1519159 INFO  (TEST-DistributedQueryElevationComponentTest.test-seed#[E8C52F3F5249420]) [    ] o.a.s.m.SolrMetricManager Closing metric reporters for: solr.node
   [junit4]   2> 1519159 INFO  (TEST-DistributedQueryElevationComponentTest.test-seed#[E8C52F3F5249420]) [    ] o.e.j.s.h.ContextHandler Stopped o.e.j.s.ServletContextHandler@56e2fc9c{/erbt/bz,null,UNAVAILABLE}
   [junit4]   2> 1519161 INFO  (TEST-DistributedQueryElevationComponentTest.test-seed#[E8C52F3F5249420]) [    ] o.e.j.s.AbstractConnector Stopped ServerConnector@6d96a02f{SSL,[ssl, http/1.1]}{127.0.0.1:0}
   [junit4]   2> 1519161 INFO  (TEST-DistributedQueryElevationComponentTest.test-seed#[E8C52F3F5249420]) [    ] o.a.s.c.CoreContainer Shutting down CoreContainer instance=1608367430
   [junit4]   2> 1519162 INFO  (coreCloseExecutor-6466-thread-1) [    x:collection1] o.a.s.c.SolrCore [collection1]  CLOSING SolrCore org.apache.solr.core.SolrCore@17b66710
   [junit4]   2> 1519204 INFO  (coreCloseExecutor-6466-thread-1) [    x:collection1] o.a.s.m.SolrMetricManager Closing metric reporters for: solr.core.collection1
   [junit4]   2> 1519208 INFO  (TEST-DistributedQueryElevationComponentTest.test-seed#[E8C52F3F5249420]) [    ] o.a.s.m.SolrMetricManager Closing metric reporters for: solr.node
   [junit4]   2> 1519208 INFO  (TEST-DistributedQueryElevationComponentTest.test-seed#[E8C52F3F5249420]) [    ] o.e.j.s.h.ContextHandler Stopped o.e.j.s.ServletContextHandler@5a788df2{/erbt/bz,null,UNAVAILABLE}
   [junit4]   2> 1519217 INFO  (SUITE-DistributedQueryElevationComponentTest-seed#[E8C52F3F5249420]-worker) [    ] o.a.s.SolrTestCaseJ4 ###deleteCore
   [junit4]   2> NOTE: test params are: codec=Asserting(Lucene62), sim=RandomSimilarity(queryNorm=false,coord=yes): {}, locale=es-GT, timezone=UCT
   [junit4]   2> NOTE: Windows 10 10.0 amd64/Oracle Corporation 1.8.0_112 (64-bit)/cpus=3,threads=1,free=175268680,total=353517568
   [junit4]   2> NOTE: All tests run in this JVM: [DateMathParserTest, TestSolrQueryResponse, TestBulkSchemaAPI, SolrCloudExampleTest, QueryParsingTest, TestFieldCollectionResource, TestSolrConfigHandlerConcurrent, CoreSorterTest, TestSystemIdResolver, FileBasedSpellCheckerTest, AutoCommitTest, LeaderFailureAfterFreshStartTest, SuggestComponentContextFilterQueryTest, TestJoin, TestHashQParserPlugin, TestDistributedStatsComponentCardinality, TestStressUserVersions, CoreAdminHandlerTest, TermVectorComponentDistributedTest, DistribCursorPagingTest, CacheHeaderTest, BasicAuthIntegrationTest, WrapperMergePolicyFactoryTest, ExternalFileFieldSortTest, SimpleMLTQParserTest, SolrGangliaReporterTest, TestUnifiedSolrHighlighter, MinimalSchemaTest, SimpleCollectionCreateDeleteTest, ConfigSetsAPITest, SortSpecParsingTest, TestDownShardTolerantSearch, BitVectorTest, TestPerFieldSimilarityClassic, ConvertedLegacyTest, HdfsDirectoryTest, SolrIndexSplitterTest, TestZkChroot, TestCloudInspectUtil, TestSearchPerf, HdfsChaosMonkeyNothingIsSafeTest, TestShortCircuitedRequests, SolrCmdDistributorTest, TestManagedResourceStorage, NoCacheHeaderTest, CollectionsAPIDistributedZkTest, TestJavabinTupleStreamParser, TestManagedSchema, TolerantUpdateProcessorTest, TestDocBasedVersionConstraints, TestSuggestSpellingConverter, TestDynamicLoading, TestFileDictionaryLookup, ChaosMonkeySafeLeaderTest, CoreAdminRequestStatusTest, TestAuthorizationFramework, AnalyticsQueryTest, TestTrie, TestCoreDiscovery, TestMiniSolrCloudCluster, TestValueSourceCache, PreAnalyzedFieldTest, DistributedFacetPivotWhiteBoxTest, StressHdfsTest, TestDeleteCollectionOnDownNodes, MetricUtilsTest, CreateCollectionCleanupTest, WordBreakSolrSpellCheckerTest, TemplateUpdateProcessorTest, TestNRTOpen, TestCrossCoreJoin, TestSubQueryTransformer, TestExactStatsCache, DeleteInactiveReplicaTest, TestFilteredDocIdSet, HdfsRestartWhileUpdatingTest, TestSolrCloudWithSecureImpersonation, TestLocalFSCloudBackupRestore, DefaultValueUpdateProcessorTest, TestConfig, TestClusterProperties, SliceStateTest, SuggesterTSTTest, TestQueryWrapperFilter, TestReversedWildcardFilterFactory, TestLeaderElectionZkExpiry, TestRawResponseWriter, SolrCoreMetricManagerTest, TermVectorComponentTest, HdfsRecoverLeaseTest, TestDocTermOrds, TestFastWriter, TestReload, TestFieldCacheVsDocValues, TestRandomFaceting, SpellCheckComponentTest, TestRuleBasedAuthorizationPlugin, ReplicationFactorTest, TestConfigReload, LoggingHandlerTest, TestSolrCloudWithDelegationTokens, TestPHPSerializedResponseWriter, EchoParamsTest, BasicDistributedZk2Test, SpellCheckCollatorTest, TestRecoveryHdfs, TestShardHandlerFactory, BadIndexSchemaTest, TestDistributedGrouping, TestCloudSchemaless, HdfsCollectionsAPIDistributedZkTest, TestAuthenticationFramework, SearchHandlerTest, RequestHandlersTest, MBeansHandlerTest, TestFieldTypeCollectionResource, TestDFRSimilarityFactory, UpdateParamsTest, ShardRoutingCustomTest, TestCustomSort, DeleteShardTest, DistribJoinFromCollectionTest, TestFieldCacheReopen, TestJsonFacetRefinement, TestCorePropertiesReload, LeaderElectionIntegrationTest, BasicZkTest, ScriptEngineTest, DistributedExpandComponentTest, TestEmbeddedSolrServerConstructors, TestSearcherReuse, TestQueryTypes, ManagedSchemaRoundRobinCloudTest, CollectionTooManyReplicasTest, URLClassifyProcessorTest, OverseerStatusTest, TestXmlQParser, SolrIndexConfigTest, AddBlockUpdateTest, AliasIntegrationTest, TestDelegationWithHadoopAuth, HdfsBasicDistributedZk2Test, TestUseDocValuesAsStored2, ShufflingReplicaListTransformerTest, TestTestInjection, TestSerializedLuceneMatchVersion, TestGeoJSONResponseWriter, CdcrBootstrapTest, TestSchemaNameResource, TestSolrCoreProperties, TestLMJelinekMercerSimilarityFactory, TestConfigOverlay, TestManagedSchemaThreadSafety, CdcrUpdateLogTest, RollingRestartTest, SharedFSAutoReplicaFailoverTest, SaslZkACLProviderTest, TriLevelCompositeIdRoutingTest, TestRequestForwarding, TestUtils, TestQuerySenderNoQuery, UnloadDistributedZkTest, OpenCloseCoreStressTest, RecoveryZkTest, FullSolrCloudDistribCmdsTest, ZkSolrClientTest, TestRandomDVFaceting, ZkCLITest, TestRecovery, TestHashPartitioner, TestRealTimeGet, DistributedTermsComponentTest, TestRangeQuery, StatsComponentTest, TestIndexSearcher, SoftAutoCommitTest, DistributedQueryElevationComponentTest]
   [junit4]   2> NOTE: reproduce with: ant test  -Dtestcase=DistributedQueryElevationComponentTest -Dtests.seed=E8C52F3F5249420 -Dtests.slow=true -Dtests.locale=es-GT -Dtests.timezone=UCT -Dtests.asserts=true -Dtests.file.encoding=ISO-8859-1
   [junit4] ERROR   0.00s J1 | DistributedQueryElevationComponentTest (suite) <<<
   [junit4]    > Throwable #1: java.io.IOException: Could not remove the following files (in the order of attempts):
   [junit4]    >    C:\Users\jenkins\workspace\Lucene-Solr-6.x-Windows\solr\build\solr-core\test\J1\temp\solr.handler.component.DistributedQueryElevationComponentTest_E8C52F3F5249420-001\tempDir-001\control\collection1: java.nio.file.DirectoryNotEmptyException: C:\Users\jenkins\workspace\Lucene-Solr-6.x-Windows\solr\build\solr-core\test\J1\temp\solr.handler.component.DistributedQueryElevationComponentTest_E8C52F3F5249420-001\tempDir-001\control\collection1
   [junit4]    >    C:\Users\jenkins\workspace\Lucene-Solr-6.x-Windows\solr\build\solr-core\test\J1\temp\solr.handler.component.DistributedQueryElevationComponentTest_E8C52F3F5249420-001\tempDir-001\control: java.nio.file.DirectoryNotEmptyException: C:\Users\jenkins\workspace\Lucene-Solr-6.x-Windows\solr\build\solr-core\test\J1\temp\solr.handler.component.DistributedQueryElevationComponentTest_E8C52F3F5249420-001\tempDir-001\control
   [junit4]    >    C:\Users\jenkins\workspace\Lucene-Solr-6.x-Windows\solr\build\solr-core\test\J1\temp\solr.handler.component.DistributedQueryElevationComponentTest_E8C52F3F5249420-001\tempDir-001: java.nio.file.DirectoryNotEmptyException: C:\Users\jenkins\workspace\Lucene-Solr-6.x-Windows\solr\build\solr-core\test\J1\temp\solr.handler.component.DistributedQueryElevationComponentTest_E8C52F3F5249420-001\tempDir-001
   [junit4]    >    C:\Users\jenkins\workspace\Lucene-Solr-6.x-Windows\solr\build\solr-core\test\J1\temp\solr.handler.component.DistributedQueryElevationComponentTest_E8C52F3F5249420-001\tempDir-001\control\collection1\conf: java.nio.file.AccessDeniedException: C:\Users\jenkins\workspace\Lucene-Solr-6.x-Windows\solr\build\solr-core\test\J1\temp\solr.handler.component.DistributedQueryElevationComponentTest_E8C52F3F5249420-001\tempDir-001\control\collection1\conf
   [junit4]    >    C:\Users\jenkins\workspace\Lucene-Solr-6.x-Windows\solr\build\solr-core\test\J1\temp\solr.handler.component.DistributedQueryElevationComponentTest_E8C52F3F5249420-001: java.nio.file.DirectoryNotEmptyException: C:\Users\jenkins\workspace\Lucene-Solr-6.x-Windows\solr\build\solr-core\test\J1\temp\solr.handler.component.DistributedQueryElevationComponentTest_E8C52F3F5249420-001
   [junit4]    > 	at __randomizedtesting.SeedInfo.seed([E8C52F3F5249420]:0)
   [junit4]    > 	at org.apache.lucene.util.IOUtils.rm(IOUtils.java:323)
   [junit4]    > 	at java.lang.Thread.run(Thread.java:745)
   [junit4] Completed [368/678 (1!)] on J1 in 7.10s, 1 test, 1 error <<< FAILURES!

[...truncated 63489 lines...]


Mime
View raw message