lucene-dev mailing list archives

Site index · List index
Message view « Date » · « Thread »
Top « Date » · « Thread »
From Policeman Jenkins Server <jenk...@thetaphi.de>
Subject [JENKINS] Lucene-Solr-6.x-Solaris (64bit/jdk1.8.0) - Build # 601 - Still Unstable!
Date Fri, 06 Jan 2017 22:58:21 GMT
Build: https://jenkins.thetaphi.de/job/Lucene-Solr-6.x-Solaris/601/
Java: 64bit/jdk1.8.0 -XX:+UseCompressedOops -XX:+UseParallelGC

1 tests failed.
FAILED:  org.apache.solr.update.HardAutoCommitTest.testCommitWithin

Error Message:
Exception during query

Stack Trace:
java.lang.RuntimeException: Exception during query
	at __randomizedtesting.SeedInfo.seed([FFCC61ADF6F6B847:451E0ED575D85652]:0)
	at org.apache.solr.SolrTestCaseJ4.assertQ(SolrTestCaseJ4.java:818)
	at org.apache.solr.update.HardAutoCommitTest.testCommitWithin(HardAutoCommitTest.java:100)
	at sun.reflect.NativeMethodAccessorImpl.invoke0(Native Method)
	at sun.reflect.NativeMethodAccessorImpl.invoke(NativeMethodAccessorImpl.java:62)
	at sun.reflect.DelegatingMethodAccessorImpl.invoke(DelegatingMethodAccessorImpl.java:43)
	at java.lang.reflect.Method.invoke(Method.java:498)
	at com.carrotsearch.randomizedtesting.RandomizedRunner.invoke(RandomizedRunner.java:1713)
	at com.carrotsearch.randomizedtesting.RandomizedRunner$8.evaluate(RandomizedRunner.java:907)
	at com.carrotsearch.randomizedtesting.RandomizedRunner$9.evaluate(RandomizedRunner.java:943)
	at com.carrotsearch.randomizedtesting.RandomizedRunner$10.evaluate(RandomizedRunner.java:957)
	at com.carrotsearch.randomizedtesting.rules.SystemPropertiesRestoreRule$1.evaluate(SystemPropertiesRestoreRule.java:57)
	at org.apache.lucene.util.TestRuleSetupTeardownChained$1.evaluate(TestRuleSetupTeardownChained.java:49)
	at org.apache.lucene.util.AbstractBeforeAfterRule$1.evaluate(AbstractBeforeAfterRule.java:45)
	at org.apache.lucene.util.TestRuleThreadAndTestName$1.evaluate(TestRuleThreadAndTestName.java:48)
	at org.apache.lucene.util.TestRuleIgnoreAfterMaxFailures$1.evaluate(TestRuleIgnoreAfterMaxFailures.java:64)
	at org.apache.lucene.util.TestRuleMarkFailure$1.evaluate(TestRuleMarkFailure.java:47)
	at com.carrotsearch.randomizedtesting.rules.StatementAdapter.evaluate(StatementAdapter.java:36)
	at com.carrotsearch.randomizedtesting.ThreadLeakControl$StatementRunner.run(ThreadLeakControl.java:367)
	at com.carrotsearch.randomizedtesting.ThreadLeakControl.forkTimeoutingTask(ThreadLeakControl.java:811)
	at com.carrotsearch.randomizedtesting.ThreadLeakControl$3.evaluate(ThreadLeakControl.java:462)
	at com.carrotsearch.randomizedtesting.RandomizedRunner.runSingleTest(RandomizedRunner.java:916)
	at com.carrotsearch.randomizedtesting.RandomizedRunner$5.evaluate(RandomizedRunner.java:802)
	at com.carrotsearch.randomizedtesting.RandomizedRunner$6.evaluate(RandomizedRunner.java:852)
	at com.carrotsearch.randomizedtesting.RandomizedRunner$7.evaluate(RandomizedRunner.java:863)
	at com.carrotsearch.randomizedtesting.rules.StatementAdapter.evaluate(StatementAdapter.java:36)
	at com.carrotsearch.randomizedtesting.rules.SystemPropertiesRestoreRule$1.evaluate(SystemPropertiesRestoreRule.java:57)
	at org.apache.lucene.util.AbstractBeforeAfterRule$1.evaluate(AbstractBeforeAfterRule.java:45)
	at com.carrotsearch.randomizedtesting.rules.StatementAdapter.evaluate(StatementAdapter.java:36)
	at org.apache.lucene.util.TestRuleStoreClassName$1.evaluate(TestRuleStoreClassName.java:41)
	at com.carrotsearch.randomizedtesting.rules.NoShadowingOrOverridesOnMethodsRule$1.evaluate(NoShadowingOrOverridesOnMethodsRule.java:40)
	at com.carrotsearch.randomizedtesting.rules.NoShadowingOrOverridesOnMethodsRule$1.evaluate(NoShadowingOrOverridesOnMethodsRule.java:40)
	at com.carrotsearch.randomizedtesting.rules.StatementAdapter.evaluate(StatementAdapter.java:36)
	at com.carrotsearch.randomizedtesting.rules.StatementAdapter.evaluate(StatementAdapter.java:36)
	at com.carrotsearch.randomizedtesting.rules.StatementAdapter.evaluate(StatementAdapter.java:36)
	at org.apache.lucene.util.TestRuleAssertionsRequired$1.evaluate(TestRuleAssertionsRequired.java:53)
	at org.apache.lucene.util.TestRuleMarkFailure$1.evaluate(TestRuleMarkFailure.java:47)
	at org.apache.lucene.util.TestRuleIgnoreAfterMaxFailures$1.evaluate(TestRuleIgnoreAfterMaxFailures.java:64)
	at org.apache.lucene.util.TestRuleIgnoreTestSuites$1.evaluate(TestRuleIgnoreTestSuites.java:54)
	at com.carrotsearch.randomizedtesting.rules.StatementAdapter.evaluate(StatementAdapter.java:36)
	at com.carrotsearch.randomizedtesting.ThreadLeakControl$StatementRunner.run(ThreadLeakControl.java:367)
	at java.lang.Thread.run(Thread.java:745)
Caused by: java.lang.RuntimeException: REQUEST FAILED: xpath=//result[@numFound=1]
	xml response was: <?xml version="1.0" encoding="UTF-8"?>
<response>
<lst name="responseHeader"><int name="status">0</int><int name="QTime">0</int></lst><result
name="response" numFound="0" start="0"></result>
</response>

	request was:q=id:529&qt=standard&start=0&rows=20&version=2.2
	at org.apache.solr.SolrTestCaseJ4.assertQ(SolrTestCaseJ4.java:811)
	... 40 more




Build Log:
[...truncated 11822 lines...]
   [junit4] Suite: org.apache.solr.update.HardAutoCommitTest
   [junit4]   2> Creating dataDir: /export/home/jenkins/workspace/Lucene-Solr-6.x-Solaris/solr/build/solr-core/test/J1/temp/solr.update.HardAutoCommitTest_FFCC61ADF6F6B847-001/init-core-data-001
   [junit4]   2> 1809015 INFO  (SUITE-HardAutoCommitTest-seed#[FFCC61ADF6F6B847]-worker)
[    ] o.a.s.SolrTestCaseJ4 Randomized ssl (false) and clientAuth (false) via: @org.apache.solr.util.RandomizeSSL(reason=,
value=NaN, ssl=NaN, clientAuth=NaN)
   [junit4]   2> 1809015 INFO  (SUITE-HardAutoCommitTest-seed#[FFCC61ADF6F6B847]-worker)
[    ] o.a.s.SolrTestCaseJ4 ####initCore
   [junit4]   2> 1809016 INFO  (SUITE-HardAutoCommitTest-seed#[FFCC61ADF6F6B847]-worker)
[    ] o.a.s.c.SolrResourceLoader [null] Added 2 libs to classloader, from paths: [/export/home/jenkins/workspace/Lucene-Solr-6.x-Solaris/solr/core/src/test-files/solr/collection1/lib,
/export/home/jenkins/workspace/Lucene-Solr-6.x-Solaris/solr/core/src/test-files/solr/collection1/lib/classes]
   [junit4]   2> 1809053 WARN  (SUITE-HardAutoCommitTest-seed#[FFCC61ADF6F6B847]-worker)
[    ] o.a.s.c.Config Beginning with Solr 5.5, <mergePolicy> is deprecated, use <mergePolicyFactory>
instead.
   [junit4]   2> 1809056 INFO  (SUITE-HardAutoCommitTest-seed#[FFCC61ADF6F6B847]-worker)
[    ] o.a.s.c.SolrConfig Using Lucene MatchVersion: 6.4.0
   [junit4]   2> 1809074 INFO  (SUITE-HardAutoCommitTest-seed#[FFCC61ADF6F6B847]-worker)
[    ] o.a.s.s.IndexSchema [null] Schema name=test
   [junit4]   2> 1809159 WARN  (SUITE-HardAutoCommitTest-seed#[FFCC61ADF6F6B847]-worker)
[    ] o.a.s.s.IndexSchema [null] default search field in schema is text. WARNING: Deprecated,
please use 'df' on request instead.
   [junit4]   2> 1809161 INFO  (SUITE-HardAutoCommitTest-seed#[FFCC61ADF6F6B847]-worker)
[    ] o.a.s.s.IndexSchema Loaded schema test/1.0 with uniqueid field id
   [junit4]   2> 1809169 INFO  (SUITE-HardAutoCommitTest-seed#[FFCC61ADF6F6B847]-worker)
[    ] o.a.s.u.UpdateShardHandler Creating UpdateShardHandler HTTP client with params: socketTimeout=30000&connTimeout=30000&retry=true
   [junit4]   2> 1809173 WARN  (SUITE-HardAutoCommitTest-seed#[FFCC61ADF6F6B847]-worker)
[    ] o.a.s.m.r.SolrJmxReporter No serviceUrl or agentId was configured, using first MBeanServer.
   [junit4]   2> 1809175 INFO  (SUITE-HardAutoCommitTest-seed#[FFCC61ADF6F6B847]-worker)
[    ] o.a.s.m.r.SolrJmxReporter JMX monitoring enabled at server: com.sun.jmx.mbeanserver.JmxMBeanServer@10d7e33b
   [junit4]   2> 1809175 WARN  (SUITE-HardAutoCommitTest-seed#[FFCC61ADF6F6B847]-worker)
[    ] o.a.s.m.r.SolrJmxReporter No serviceUrl or agentId was configured, using first MBeanServer.
   [junit4]   2> 1809181 INFO  (SUITE-HardAutoCommitTest-seed#[FFCC61ADF6F6B847]-worker)
[    ] o.a.s.m.r.SolrJmxReporter JMX monitoring enabled at server: com.sun.jmx.mbeanserver.JmxMBeanServer@10d7e33b
   [junit4]   2> 1809181 WARN  (SUITE-HardAutoCommitTest-seed#[FFCC61ADF6F6B847]-worker)
[    ] o.a.s.m.r.SolrJmxReporter No serviceUrl or agentId was configured, using first MBeanServer.
   [junit4]   2> 1809181 INFO  (SUITE-HardAutoCommitTest-seed#[FFCC61ADF6F6B847]-worker)
[    ] o.a.s.m.r.SolrJmxReporter JMX monitoring enabled at server: com.sun.jmx.mbeanserver.JmxMBeanServer@10d7e33b
   [junit4]   2> 1809182 INFO  (coreLoadExecutor-7067-thread-1) [    x:collection1] o.a.s.c.SolrResourceLoader
[null] Added 2 libs to classloader, from paths: [/export/home/jenkins/workspace/Lucene-Solr-6.x-Solaris/solr/core/src/test-files/solr/collection1/lib,
/export/home/jenkins/workspace/Lucene-Solr-6.x-Solaris/solr/core/src/test-files/solr/collection1/lib/classes]
   [junit4]   2> 1809219 WARN  (coreLoadExecutor-7067-thread-1) [    x:collection1] o.a.s.c.Config
Beginning with Solr 5.5, <mergePolicy> is deprecated, use <mergePolicyFactory>
instead.
   [junit4]   2> 1809221 INFO  (coreLoadExecutor-7067-thread-1) [    x:collection1] o.a.s.c.SolrConfig
Using Lucene MatchVersion: 6.4.0
   [junit4]   2> 1809251 INFO  (coreLoadExecutor-7067-thread-1) [    x:collection1] o.a.s.s.IndexSchema
[collection1] Schema name=test
   [junit4]   2> 1809362 WARN  (coreLoadExecutor-7067-thread-1) [    x:collection1] o.a.s.s.IndexSchema
[collection1] default search field in schema is text. WARNING: Deprecated, please use 'df'
on request instead.
   [junit4]   2> 1809364 INFO  (coreLoadExecutor-7067-thread-1) [    x:collection1] o.a.s.s.IndexSchema
Loaded schema test/1.0 with uniqueid field id
   [junit4]   2> 1809371 INFO  (coreLoadExecutor-7067-thread-1) [    x:collection1] o.a.s.c.CoreContainer
Creating SolrCore 'collection1' using configuration from instancedir /export/home/jenkins/workspace/Lucene-Solr-6.x-Solaris/solr/core/src/test-files/solr/collection1
   [junit4]   2> 1809371 WARN  (coreLoadExecutor-7067-thread-1) [    x:collection1] o.a.s.m.r.SolrJmxReporter
No serviceUrl or agentId was configured, using first MBeanServer.
   [junit4]   2> 1809371 INFO  (coreLoadExecutor-7067-thread-1) [    x:collection1] o.a.s.m.r.SolrJmxReporter
JMX monitoring enabled at server: com.sun.jmx.mbeanserver.JmxMBeanServer@10d7e33b
   [junit4]   2> 1809372 INFO  (coreLoadExecutor-7067-thread-1) [    x:collection1] o.a.s.c.SolrCore
[[collection1] ] Opening new SolrCore at [/export/home/jenkins/workspace/Lucene-Solr-6.x-Solaris/solr/core/src/test-files/solr/collection1],
dataDir=[/export/home/jenkins/workspace/Lucene-Solr-6.x-Solaris/solr/build/solr-core/test/J1/temp/solr.update.HardAutoCommitTest_FFCC61ADF6F6B847-001/init-core-data-001/]
   [junit4]   2> 1809372 INFO  (coreLoadExecutor-7067-thread-1) [    x:collection1] o.a.s.c.JmxMonitoredMap
JMX monitoring is enabled. Adding Solr mbeans to JMX Server: com.sun.jmx.mbeanserver.JmxMBeanServer@10d7e33b
   [junit4]   2> 1809373 INFO  (coreLoadExecutor-7067-thread-1) [    x:collection1] o.a.s.u.RandomMergePolicy
RandomMergePolicy wrapping class org.apache.lucene.index.LogDocMergePolicy: [LogDocMergePolicy:
minMergeSize=1000, mergeFactor=14, maxMergeSize=9223372036854775807, maxMergeSizeForForcedMerge=9223372036854775807,
calibrateSizeByDeletes=true, maxMergeDocs=2147483647, maxCFSSegmentSizeMB=8.796093022207999E12,
noCFSRatio=0.5195692805411831]
   [junit4]   2> 1809402 INFO  (coreLoadExecutor-7067-thread-1) [    x:collection1] o.a.s.u.UpdateHandler
Using UpdateLog implementation: org.apache.solr.update.UpdateLog
   [junit4]   2> 1809402 INFO  (coreLoadExecutor-7067-thread-1) [    x:collection1] o.a.s.u.UpdateLog
Initializing UpdateLog: dataDir= defaultSyncLevel=FLUSH numRecordsToKeep=100 maxNumLogsToKeep=10
numVersionBuckets=65536
   [junit4]   2> 1809402 INFO  (coreLoadExecutor-7067-thread-1) [    x:collection1] o.a.s.u.CommitTracker
Hard AutoCommit: disabled
   [junit4]   2> 1809402 INFO  (coreLoadExecutor-7067-thread-1) [    x:collection1] o.a.s.u.CommitTracker
Soft AutoCommit: disabled
   [junit4]   2> 1809403 INFO  (coreLoadExecutor-7067-thread-1) [    x:collection1] o.a.s.u.RandomMergePolicy
RandomMergePolicy wrapping class org.apache.lucene.index.LogDocMergePolicy: [LogDocMergePolicy:
minMergeSize=1000, mergeFactor=27, maxMergeSize=9223372036854775807, maxMergeSizeForForcedMerge=9223372036854775807,
calibrateSizeByDeletes=true, maxMergeDocs=2147483647, maxCFSSegmentSizeMB=8.796093022207999E12,
noCFSRatio=0.23785337537054474]
   [junit4]   2> 1809404 INFO  (coreLoadExecutor-7067-thread-1) [    x:collection1] o.a.s.s.SolrIndexSearcher
Opening [Searcher@3fc58bc3[collection1] main]
   [junit4]   2> 1809404 INFO  (coreLoadExecutor-7067-thread-1) [    x:collection1] o.a.s.h.c.SpellCheckComponent
Initializing spell checkers
   [junit4]   2> 1809416 INFO  (coreLoadExecutor-7067-thread-1) [    x:collection1] o.a.s.s.DirectSolrSpellChecker
init: {name=direct,classname=DirectSolrSpellChecker,field=lowerfilt,minQueryLength=3}
   [junit4]   2> 1809436 INFO  (coreLoadExecutor-7067-thread-1) [    x:collection1] o.a.s.h.ReplicationHandler
Commits will be reserved for  10000
   [junit4]   2> 1809437 INFO  (searcherExecutor-7068-thread-1-processing-x:collection1)
[    x:collection1] o.a.s.h.c.SpellCheckComponent Loading spell index for spellchecker: default
   [junit4]   2> 1809437 INFO  (coreLoadExecutor-7067-thread-1) [    x:collection1] o.a.s.u.UpdateLog
Could not find max version in index or recent updates, using new clock 1555815390883348480
   [junit4]   2> 1809437 INFO  (searcherExecutor-7068-thread-1-processing-x:collection1)
[    x:collection1] o.a.s.h.c.SpellCheckComponent Loading spell index for spellchecker: direct
   [junit4]   2> 1809437 INFO  (searcherExecutor-7068-thread-1-processing-x:collection1)
[    x:collection1] o.a.s.h.c.SpellCheckComponent Loading spell index for spellchecker: wordbreak
   [junit4]   2> 1809437 INFO  (searcherExecutor-7068-thread-1-processing-x:collection1)
[    x:collection1] o.a.s.h.c.SpellCheckComponent Loading spell index for spellchecker: multipleFields
   [junit4]   2> 1809438 INFO  (searcherExecutor-7068-thread-1-processing-x:collection1)
[    x:collection1] o.a.s.h.c.SpellCheckComponent Loading spell index for spellchecker: jarowinkler
   [junit4]   2> 1809439 INFO  (searcherExecutor-7068-thread-1-processing-x:collection1)
[    x:collection1] o.a.s.h.c.SpellCheckComponent Loading spell index for spellchecker: external
   [junit4]   2> 1809439 INFO  (searcherExecutor-7068-thread-1-processing-x:collection1)
[    x:collection1] o.a.s.h.c.SpellCheckComponent Loading spell index for spellchecker: freq
   [junit4]   2> 1809440 INFO  (searcherExecutor-7068-thread-1-processing-x:collection1)
[    x:collection1] o.a.s.h.c.SpellCheckComponent Loading spell index for spellchecker: fqcn
   [junit4]   2> 1809440 INFO  (searcherExecutor-7068-thread-1-processing-x:collection1)
[    x:collection1] o.a.s.h.c.SpellCheckComponent Loading spell index for spellchecker: perDict
   [junit4]   2> 1809441 INFO  (searcherExecutor-7068-thread-1-processing-x:collection1)
[    x:collection1] o.a.s.c.SolrCore [collection1] Registered new searcher Searcher@3fc58bc3[collection1]
main{ExitableDirectoryReader(UninvertingDirectoryReader())}
   [junit4]   2> 1809442 INFO  (SUITE-HardAutoCommitTest-seed#[FFCC61ADF6F6B847]-worker)
[    ] o.a.s.SolrTestCaseJ4 ####initCore end
   [junit4]   2> 1809447 INFO  (TEST-HardAutoCommitTest.testCommitWithin-seed#[FFCC61ADF6F6B847])
[    ] o.a.s.SolrTestCaseJ4 ###Starting testCommitWithin
   [junit4]   2> 1809449 INFO  (TEST-HardAutoCommitTest.testCommitWithin-seed#[FFCC61ADF6F6B847])
[    ] o.a.s.u.p.LogUpdateProcessorFactory [collection1]  webapp=null path=null params={}{deleteByQuery=*:*
(-1555815390893834240)} 0 2
   [junit4]   2> 1809452 INFO  (TEST-HardAutoCommitTest.testCommitWithin-seed#[FFCC61ADF6F6B847])
[    ] o.a.s.c.SolrResourceLoader [null] Added 2 libs to classloader, from paths: [/export/home/jenkins/workspace/Lucene-Solr-6.x-Solaris/solr/core/src/test-files/solr/collection1/lib,
/export/home/jenkins/workspace/Lucene-Solr-6.x-Solaris/solr/core/src/test-files/solr/collection1/lib/classes]
   [junit4]   2> 1809491 WARN  (TEST-HardAutoCommitTest.testCommitWithin-seed#[FFCC61ADF6F6B847])
[    ] o.a.s.c.Config Beginning with Solr 5.5, <mergePolicy> is deprecated, use <mergePolicyFactory>
instead.
   [junit4]   2> 1809492 INFO  (TEST-HardAutoCommitTest.testCommitWithin-seed#[FFCC61ADF6F6B847])
[    ] o.a.s.c.SolrConfig Using Lucene MatchVersion: 6.4.0
   [junit4]   2> 1809511 INFO  (TEST-HardAutoCommitTest.testCommitWithin-seed#[FFCC61ADF6F6B847])
[    ] o.a.s.s.IndexSchema [collection1] Schema name=test
   [junit4]   2> 1809589 WARN  (TEST-HardAutoCommitTest.testCommitWithin-seed#[FFCC61ADF6F6B847])
[    ] o.a.s.s.IndexSchema [collection1] default search field in schema is text. WARNING:
Deprecated, please use 'df' on request instead.
   [junit4]   2> 1809591 INFO  (TEST-HardAutoCommitTest.testCommitWithin-seed#[FFCC61ADF6F6B847])
[    ] o.a.s.s.IndexSchema Loaded schema test/1.0 with uniqueid field id
   [junit4]   2> 1809603 INFO  (TEST-HardAutoCommitTest.testCommitWithin-seed#[FFCC61ADF6F6B847])
[    ] o.a.s.c.CoreContainer Reloading SolrCore 'collection1' using configuration from instancedir
/export/home/jenkins/workspace/Lucene-Solr-6.x-Solaris/solr/core/src/test-files/solr/collection1
   [junit4]   2> 1809603 WARN  (TEST-HardAutoCommitTest.testCommitWithin-seed#[FFCC61ADF6F6B847])
[    x:collection1] o.a.s.m.r.SolrJmxReporter No serviceUrl or agentId was configured, using
first MBeanServer.
   [junit4]   2> 1809613 INFO  (TEST-HardAutoCommitTest.testCommitWithin-seed#[FFCC61ADF6F6B847])
[    x:collection1] o.a.s.m.r.SolrJmxReporter JMX monitoring enabled at server: com.sun.jmx.mbeanserver.JmxMBeanServer@10d7e33b
   [junit4]   2> 1809613 INFO  (TEST-HardAutoCommitTest.testCommitWithin-seed#[FFCC61ADF6F6B847])
[    x:collection1] o.a.s.m.SolrMetricManager Replacing existing reporter 'default' in registry
'solr.core.collection1': [org.apache.solr.metrics.reporters.SolrJmxReporter@6e4dd105: domain
= solr.core.collection1, service url = null, agent id = null]
   [junit4]   2> 1809616 INFO  (TEST-HardAutoCommitTest.testCommitWithin-seed#[FFCC61ADF6F6B847])
[    x:collection1] o.a.s.c.SolrCore [[collection1] ] Opening new SolrCore at [/export/home/jenkins/workspace/Lucene-Solr-6.x-Solaris/solr/core/src/test-files/solr/collection1],
dataDir=[/export/home/jenkins/workspace/Lucene-Solr-6.x-Solaris/solr/build/solr-core/test/J1/temp/solr.update.HardAutoCommitTest_FFCC61ADF6F6B847-001/init-core-data-001/]
   [junit4]   2> 1809616 INFO  (TEST-HardAutoCommitTest.testCommitWithin-seed#[FFCC61ADF6F6B847])
[    x:collection1] o.a.s.c.JmxMonitoredMap JMX monitoring is enabled. Adding Solr mbeans
to JMX Server: com.sun.jmx.mbeanserver.JmxMBeanServer@10d7e33b
   [junit4]   2> 1809643 INFO  (TEST-HardAutoCommitTest.testCommitWithin-seed#[FFCC61ADF6F6B847])
[    x:collection1] o.a.s.u.CommitTracker Hard AutoCommit: disabled
   [junit4]   2> 1809643 INFO  (TEST-HardAutoCommitTest.testCommitWithin-seed#[FFCC61ADF6F6B847])
[    x:collection1] o.a.s.u.CommitTracker Soft AutoCommit: disabled
   [junit4]   2> 1809644 INFO  (TEST-HardAutoCommitTest.testCommitWithin-seed#[FFCC61ADF6F6B847])
[    x:collection1] o.a.s.s.SolrIndexSearcher Opening [Searcher@328e4c4c[collection1] main]
   [junit4]   2> 1809644 INFO  (TEST-HardAutoCommitTest.testCommitWithin-seed#[FFCC61ADF6F6B847])
[    x:collection1] o.a.s.h.c.SpellCheckComponent Initializing spell checkers
   [junit4]   2> 1809645 INFO  (TEST-HardAutoCommitTest.testCommitWithin-seed#[FFCC61ADF6F6B847])
[    x:collection1] o.a.s.s.DirectSolrSpellChecker init: {name=direct,classname=DirectSolrSpellChecker,field=lowerfilt,minQueryLength=3}
   [junit4]   2> 1809649 INFO  (TEST-HardAutoCommitTest.testCommitWithin-seed#[FFCC61ADF6F6B847])
[    x:collection1] o.a.s.h.ReplicationHandler Commits will be reserved for  10000
   [junit4]   2> 1809649 INFO  (searcherExecutor-7073-thread-1-processing-x:collection1)
[    x:collection1] o.a.s.h.c.SpellCheckComponent Loading spell index for spellchecker: default
   [junit4]   2> 1809650 INFO  (searcherExecutor-7073-thread-1-processing-x:collection1)
[    x:collection1] o.a.s.h.c.SpellCheckComponent Loading spell index for spellchecker: direct
   [junit4]   2> 1809650 INFO  (searcherExecutor-7073-thread-1-processing-x:collection1)
[    x:collection1] o.a.s.h.c.SpellCheckComponent Loading spell index for spellchecker: wordbreak
   [junit4]   2> 1809650 INFO  (searcherExecutor-7073-thread-1-processing-x:collection1)
[    x:collection1] o.a.s.h.c.SpellCheckComponent Loading spell index for spellchecker: multipleFields
   [junit4]   2> 1809650 INFO  (searcherExecutor-7073-thread-1-processing-x:collection1)
[    x:collection1] o.a.s.h.c.SpellCheckComponent Loading spell index for spellchecker: jarowinkler
   [junit4]   2> 1809651 INFO  (searcherExecutor-7073-thread-1-processing-x:collection1)
[    x:collection1] o.a.s.h.c.SpellCheckComponent Loading spell index for spellchecker: external
   [junit4]   2> 1809652 INFO  (searcherExecutor-7073-thread-1-processing-x:collection1)
[    x:collection1] o.a.s.h.c.SpellCheckComponent Loading spell index for spellchecker: freq
   [junit4]   2> 1809652 INFO  (searcherExecutor-7073-thread-1-processing-x:collection1)
[    x:collection1] o.a.s.h.c.SpellCheckComponent Loading spell index for spellchecker: fqcn
   [junit4]   2> 1809652 INFO  (searcherExecutor-7073-thread-1-processing-x:collection1)
[    x:collection1] o.a.s.h.c.SpellCheckComponent Loading spell index for spellchecker: perDict
   [junit4]   2> 1809653 INFO  (searcherExecutor-7073-thread-1-processing-x:collection1)
[    x:collection1] o.a.s.c.SolrCore [collection1] Registered new searcher Searcher@328e4c4c[collection1]
main{ExitableDirectoryReader(UninvertingDirectoryReader())}
   [junit4]   2> 1809653 INFO  (TEST-HardAutoCommitTest.testCommitWithin-seed#[FFCC61ADF6F6B847])
[    x:collection1] o.a.s.u.RandomMergePolicy RandomMergePolicy wrapping class org.apache.lucene.index.LogByteSizeMergePolicy:
[LogByteSizeMergePolicy: minMergeSize=1677721, mergeFactor=19, maxMergeSize=2147483648, maxMergeSizeForForcedMerge=9223372036854775807,
calibrateSizeByDeletes=false, maxMergeDocs=2147483647, maxCFSSegmentSizeMB=8.796093022207999E12,
noCFSRatio=0.11801653864735276]
   [junit4]   2> 1809655 INFO  (TEST-HardAutoCommitTest.testCommitWithin-seed#[FFCC61ADF6F6B847])
[    x:collection1] o.a.s.u.DefaultSolrCoreState New IndexWriter is ready to be used.
   [junit4]   2> 1809655 INFO  (TEST-HardAutoCommitTest.testCommitWithin-seed#[FFCC61ADF6F6B847])
[    x:collection1] o.a.s.s.SolrIndexSearcher Opening [Searcher@226273fa[collection1] main]
   [junit4]   2> 1809656 INFO  (TEST-HardAutoCommitTest.testCommitWithin-seed#[FFCC61ADF6F6B847])
[    x:collection1] o.a.s.c.SolrCore [collection1]  CLOSING SolrCore org.apache.solr.core.SolrCore@2870e48b
   [junit4]   2> 1809661 INFO  (TEST-HardAutoCommitTest.testCommitWithin-seed#[FFCC61ADF6F6B847])
[    x:collection1] o.a.s.m.SolrMetricManager Closing metric reporters for: solr.core.collection1
   [junit4]   2> 1809663 INFO  (TEST-HardAutoCommitTest.testCommitWithin-seed#[FFCC61ADF6F6B847])
[    x:collection1] o.a.s.u.p.LogUpdateProcessorFactory [collection1] {add=[529 (1555815391120326656)]}
0 0
   [junit4]   2> 1809664 INFO  (TEST-HardAutoCommitTest.testCommitWithin-seed#[FFCC61ADF6F6B847])
[    x:collection1] o.a.s.c.S.Request [collection1]  webapp=null path=null params={q=id:529&qt=standard&start=0&rows=20&version=2.2}
hits=0 status=0 QTime=0
   [junit4]   2> 1809666 INFO  (searcherExecutor-7073-thread-1-processing-x:collection1)
[    x:collection1] o.a.s.c.SolrCore [collection1] Registered new searcher Searcher@226273fa[collection1]
main{ExitableDirectoryReader(UninvertingDirectoryReader())}
   [junit4]   2> 1809916 INFO  (TEST-HardAutoCommitTest.testCommitWithin-seed#[FFCC61ADF6F6B847])
[    x:collection1] o.a.s.u.p.LogUpdateProcessorFactory [collection1] {add=[530 (1555815391385616384)]}
0 253
   [junit4]   2> 1809917 INFO  (TEST-HardAutoCommitTest.testCommitWithin-seed#[FFCC61ADF6F6B847])
[    x:collection1] o.a.s.c.S.Request [collection1]  webapp=null path=null params={q=id:530&qt=standard&start=0&rows=20&version=2.2}
hits=0 status=0 QTime=0
   [junit4]   2> 1809917 INFO  (TEST-HardAutoCommitTest.testCommitWithin-seed#[FFCC61ADF6F6B847])
[    x:collection1] o.a.s.u.p.LogUpdateProcessorFactory [collection1] {delete=[529 (-1555815391386664960)]}
0 254
   [junit4]   2> 1809917 INFO  (TEST-HardAutoCommitTest.testCommitWithin-seed#[FFCC61ADF6F6B847])
[    x:collection1] o.a.s.c.S.Request [collection1]  webapp=null path=null params={q=id:529&qt=standard&start=0&rows=20&version=2.2}
hits=0 status=0 QTime=0
   [junit4]   2> 1809917 ERROR (TEST-HardAutoCommitTest.testCommitWithin-seed#[FFCC61ADF6F6B847])
[    x:collection1] o.a.s.SolrTestCaseJ4 REQUEST FAILED: xpath=//result[@numFound=1]
   [junit4]   2> 	xml response was: <?xml version="1.0" encoding="UTF-8"?>
   [junit4]   2> <response>
   [junit4]   2> <lst name="responseHeader"><int name="status">0</int><int
name="QTime">0</int></lst><result name="response" numFound="0" start="0"></result>
   [junit4]   2> </response>
   [junit4]   2> 
   [junit4]   2> 	request was:q=id:529&qt=standard&start=0&rows=20&version=2.2
   [junit4]   2> 1809918 ERROR (TEST-HardAutoCommitTest.testCommitWithin-seed#[FFCC61ADF6F6B847])
[    x:collection1] o.a.s.SolrTestCaseJ4 REQUEST FAILED: q=id:529&qt=standard&start=0&rows=20&version=2.2:java.lang.RuntimeException:
REQUEST FAILED: xpath=//result[@numFound=1]
   [junit4]   2> 	xml response was: <?xml version="1.0" encoding="UTF-8"?>
   [junit4]   2> <response>
   [junit4]   2> <lst name="responseHeader"><int name="status">0</int><int
name="QTime">0</int></lst><result name="response" numFound="0" start="0"></result>
   [junit4]   2> </response>
   [junit4]   2> 
   [junit4]   2> 	request was:q=id:529&qt=standard&start=0&rows=20&version=2.2
   [junit4]   2> 	at org.apache.solr.SolrTestCaseJ4.assertQ(SolrTestCaseJ4.java:811)
   [junit4]   2> 	at org.apache.solr.update.HardAutoCommitTest.testCommitWithin(HardAutoCommitTest.java:100)
   [junit4]   2> 	at sun.reflect.NativeMethodAccessorImpl.invoke0(Native Method)
   [junit4]   2> 	at sun.reflect.NativeMethodAccessorImpl.invoke(NativeMethodAccessorImpl.java:62)
   [junit4]   2> 	at sun.reflect.DelegatingMethodAccessorImpl.invoke(DelegatingMethodAccessorImpl.java:43)
   [junit4]   2> 	at java.lang.reflect.Method.invoke(Method.java:498)
   [junit4]   2> 	at com.carrotsearch.randomizedtesting.RandomizedRunner.invoke(RandomizedRunner.java:1713)
   [junit4]   2> 	at com.carrotsearch.randomizedtesting.RandomizedRunner$8.evaluate(RandomizedRunner.java:907)
   [junit4]   2> 	at com.carrotsearch.randomizedtesting.RandomizedRunner$9.evaluate(RandomizedRunner.java:943)
   [junit4]   2> 	at com.carrotsearch.randomizedtesting.RandomizedRunner$10.evaluate(RandomizedRunner.java:957)
   [junit4]   2> 	at com.carrotsearch.randomizedtesting.rules.SystemPropertiesRestoreRule$1.evaluate(SystemPropertiesRestoreRule.java:57)
   [junit4]   2> 	at org.apache.lucene.util.TestRuleSetupTeardownChained$1.evaluate(TestRuleSetupTeardownChained.java:49)
   [junit4]   2> 	at org.apache.lucene.util.AbstractBeforeAfterRule$1.evaluate(AbstractBeforeAfterRule.java:45)
   [junit4]   2> 	at org.apache.lucene.util.TestRuleThreadAndTestName$1.evaluate(TestRuleThreadAndTestName.java:48)
   [junit4]   2> 	at org.apache.lucene.util.TestRuleIgnoreAfterMaxFailures$1.evaluate(TestRuleIgnoreAfterMaxFailures.java:64)
   [junit4]   2> 	at org.apache.lucene.util.TestRuleMarkFailure$1.evaluate(TestRuleMarkFailure.java:47)
   [junit4]   2> 	at com.carrotsearch.randomizedtesting.rules.StatementAdapter.evaluate(StatementAdapter.java:36)
   [junit4]   2> 	at com.carrotsearch.randomizedtesting.ThreadLeakControl$StatementRunner.run(ThreadLeakControl.java:367)
   [junit4]   2> 	at com.carrotsearch.randomizedtesting.ThreadLeakControl.forkTimeoutingTask(ThreadLeakControl.java:811)
   [junit4]   2> 	at com.carrotsearch.randomizedtesting.ThreadLeakControl$3.evaluate(ThreadLeakControl.java:462)
   [junit4]   2> 	at com.carrotsearch.randomizedtesting.RandomizedRunner.runSingleTest(RandomizedRunner.java:916)
   [junit4]   2> 	at com.carrotsearch.randomizedtesting.RandomizedRunner$5.evaluate(RandomizedRunner.java:802)
   [junit4]   2> 	at com.carrotsearch.randomizedtesting.RandomizedRunner$6.evaluate(RandomizedRunner.java:852)
   [junit4]   2> 	at com.carrotsearch.randomizedtesting.RandomizedRunner$7.evaluate(RandomizedRunner.java:863)
   [junit4]   2> 	at com.carrotsearch.randomizedtesting.rules.StatementAdapter.evaluate(StatementAdapter.java:36)
   [junit4]   2> 	at com.carrotsearch.randomizedtesting.rules.SystemPropertiesRestoreRule$1.evaluate(SystemPropertiesRestoreRule.java:57)
   [junit4]   2> 	at org.apache.lucene.util.AbstractBeforeAfterRule$1.evaluate(AbstractBeforeAfterRule.java:45)
   [junit4]   2> 	at com.carrotsearch.randomizedtesting.rules.StatementAdapter.evaluate(StatementAdapter.java:36)
   [junit4]   2> 	at org.apache.lucene.util.TestRuleStoreClassName$1.evaluate(TestRuleStoreClassName.java:41)
   [junit4]   2> 	at com.carrotsearch.randomizedtesting.rules.NoShadowingOrOverridesOnMethodsRule$1.evaluate(NoShadowingOrOverridesOnMethodsRule.java:40)
   [junit4]   2> 	at com.carrotsearch.randomizedtesting.rules.NoShadowingOrOverridesOnMethodsRule$1.evaluate(NoShadowingOrOverridesOnMethodsRule.java:40)
   [junit4]   2> 	at com.carrotsearch.randomizedtesting.rules.StatementAdapter.evaluate(StatementAdapter.java:36)
   [junit4]   2> 	at com.carrotsearch.randomizedtesting.rules.StatementAdapter.evaluate(StatementAdapter.java:36)
   [junit4]   2> 	at com.carrotsearch.randomizedtesting.rules.StatementAdapter.evaluate(StatementAdapter.java:36)
   [junit4]   2> 	at org.apache.lucene.util.TestRuleAssertionsRequired$1.evaluate(TestRuleAssertionsRequired.java:53)
   [junit4]   2> 	at org.apache.lucene.util.TestRuleMarkFailure$1.evaluate(TestRuleMarkFailure.java:47)
   [junit4]   2> 	at org.apache.lucene.util.TestRuleIgnoreAfterMaxFailures$1.evaluate(TestRuleIgnoreAfterMaxFailures.java:64)
   [junit4]   2> 	at org.apache.lucene.util.TestRuleIgnoreTestSuites$1.evaluate(TestRuleIgnoreTestSuites.java:54)
   [junit4]   2> 	at com.carrotsearch.randomizedtesting.rules.StatementAdapter.evaluate(StatementAdapter.java:36)
   [junit4]   2> 	at com.carrotsearch.randomizedtesting.ThreadLeakControl$StatementRunner.run(ThreadLeakControl.java:367)
   [junit4]   2> 	at java.lang.Thread.run(Thread.java:745)
   [junit4]   2> 
   [junit4]   2> 1809919 INFO  (TEST-HardAutoCommitTest.testCommitWithin-seed#[FFCC61ADF6F6B847])
[    x:collection1] o.a.s.SolrTestCaseJ4 ###Ending testCommitWithin
   [junit4]   2> NOTE: reproduce with: ant test  -Dtestcase=HardAutoCommitTest -Dtests.method=testCommitWithin
-Dtests.seed=FFCC61ADF6F6B847 -Dtests.slow=true -Dtests.locale=it-CH -Dtests.timezone=America/Louisville
-Dtests.asserts=true -Dtests.file.encoding=UTF-8
   [junit4] ERROR   0.48s J1 | HardAutoCommitTest.testCommitWithin <<<
   [junit4]    > Throwable #1: java.lang.RuntimeException: Exception during query
   [junit4]    > 	at __randomizedtesting.SeedInfo.seed([FFCC61ADF6F6B847:451E0ED575D85652]:0)
   [junit4]    > 	at org.apache.solr.SolrTestCaseJ4.assertQ(SolrTestCaseJ4.java:818)
   [junit4]    > 	at org.apache.solr.update.HardAutoCommitTest.testCommitWithin(HardAutoCommitTest.java:100)
   [junit4]    > 	at java.lang.Thread.run(Thread.java:745)
   [junit4]    > Caused by: java.lang.RuntimeException: REQUEST FAILED: xpath=//result[@numFound=1]
   [junit4]    > 	xml response was: <?xml version="1.0" encoding="UTF-8"?>
   [junit4]    > <response>
   [junit4]    > <lst name="responseHeader"><int name="status">0</int><int
name="QTime">0</int></lst><result name="response" numFound="0" start="0"></result>
   [junit4]    > </response>
   [junit4]    > 	request was:q=id:529&qt=standard&start=0&rows=20&version=2.2
   [junit4]    > 	at org.apache.solr.SolrTestCaseJ4.assertQ(SolrTestCaseJ4.java:811)
   [junit4]    > 	... 40 more
   [junit4]   2> 1809921 INFO  (SUITE-HardAutoCommitTest-seed#[FFCC61ADF6F6B847]-worker)
[    x:collection1] o.a.s.SolrTestCaseJ4 ###deleteCore
   [junit4]   2> 1809921 INFO  (SUITE-HardAutoCommitTest-seed#[FFCC61ADF6F6B847]-worker)
[    x:collection1] o.a.s.c.CoreContainer Shutting down CoreContainer instance=1969533396
   [junit4]   2> 1809922 INFO  (coreCloseExecutor-7077-thread-1-processing-x:collection1)
[    x:collection1] o.a.s.c.SolrCore [collection1]  CLOSING SolrCore org.apache.solr.core.SolrCore@2593ee91
   [junit4]   2> 1809922 INFO  (coreCloseExecutor-7077-thread-1-processing-x:collection1)
[    x:collection1] o.a.s.u.DirectUpdateHandler2 Committing on IndexWriter close.
   [junit4]   2> 1809922 INFO  (coreCloseExecutor-7077-thread-1-processing-x:collection1)
[    x:collection1] o.a.s.u.SolrIndexWriter Calling setCommitData with IW:org.apache.solr.update.SolrIndexWriter@7c83f01e
   [junit4]   2> 1809937 INFO  (coreCloseExecutor-7077-thread-1-processing-x:collection1)
[    x:collection1] o.a.s.m.SolrMetricManager Closing metric reporters for: solr.core.collection1
   [junit4]   2> 1809938 INFO  (SUITE-HardAutoCommitTest-seed#[FFCC61ADF6F6B847]-worker)
[    x:collection1] o.a.s.m.SolrMetricManager Closing metric reporters for: solr.node
   [junit4]   2> NOTE: leaving temporary files on disk at: /export/home/jenkins/workspace/Lucene-Solr-6.x-Solaris/solr/build/solr-core/test/J1/temp/solr.update.HardAutoCommitTest_FFCC61ADF6F6B847-001
   [junit4]   2> NOTE: test params are: codec=Asserting(Lucene62): {range_facet_l_dv=PostingsFormat(name=Asserting),
_version_=PostingsFormat(name=LuceneFixedGap), field_t=PostingsFormat(name=LuceneVarGapFixedInterval),
multiDefault=TestBloomFilteredLucenePostings(BloomFilteringPostingsFormat(Lucene50(blocksize=128))),
subject=TestBloomFilteredLucenePostings(BloomFilteringPostingsFormat(Lucene50(blocksize=128))),
intDefault=PostingsFormat(name=LuceneFixedGap), id=PostingsFormat(name=Asserting), range_facet_i_dv=PostingsFormat(name=LuceneFixedGap),
text=PostingsFormat(name=LuceneVarGapFixedInterval), range_facet_l=PostingsFormat(name=LuceneFixedGap),
timestamp=PostingsFormat(name=LuceneFixedGap)}, docValues:{range_facet_l_dv=DocValuesFormat(name=Lucene54),
range_facet_i_dv=DocValuesFormat(name=Lucene54), timestamp=DocValuesFormat(name=Lucene54)},
maxPointsInLeafNode=486, maxMBSortInHeap=6.539614356224175, sim=RandomSimilarity(queryNorm=false,coord=yes):
{}, locale=it-CH, timezone=America/Louisville
   [junit4]   2> NOTE: SunOS 5.11 amd64/Oracle Corporation 1.8.0_112 (64-bit)/cpus=3,threads=1,free=105234192,total=530579456
   [junit4]   2> NOTE: All tests run in this JVM: [TestReRankQParserPlugin, TestLRUStatsCache,
TestFieldTypeCollectionResource, TermVectorComponentDistributedTest, TestBlendedInfixSuggestions,
ChangedSchemaMergeTest, SharedFSAutoReplicaFailoverTest, CollectionsAPIDistributedZkTest,
TestCloudInspectUtil, TestHdfsCloudBackupRestore, TestRebalanceLeaders, SmileWriterTest, TestSystemIdResolver,
SignatureUpdateProcessorFactoryTest, TestAuthenticationFramework, TestJavabinTupleStreamParser,
TestManagedStopFilterFactory, TestFieldCacheSortRandom, SolrCoreCheckLockOnStartupTest, TestNamedUpdateProcessors,
ShowFileRequestHandlerTest, TestSolrCloudSnapshots, TestMergePolicyConfig, ExplicitHLLTest,
TestFieldCacheSanityChecker, TestFreeTextSuggestions, CdcrReplicationHandlerTest, TestFieldCache,
TestBadConfig, NoCacheHeaderTest, AtomicUpdatesTest, TestSolrCloudWithDelegationTokens, SuggesterTSTTest,
TestSubQueryTransformer, URLClassifyProcessorTest, TestPHPSerializedResponseWriter, BasicZkTest,
TestCloudManagedSchema, ShardRoutingCustomTest, TestMiniSolrCloudCluster, TestManagedSchemaThreadSafety,
TestMiniSolrCloudClusterSSL, CreateCollectionCleanupTest, RemoteQueryErrorTest, FieldMutatingUpdateProcessorTest,
TestShortCircuitedRequests, DataDrivenBlockJoinTest, QueryResultKeyTest, LeaderElectionIntegrationTest,
CurrencyFieldOpenExchangeTest, DistributedIntervalFacetingTest, ConjunctionSolrSpellCheckerTest,
TestSolrDeletionPolicy2, ZkStateReaderTest, TestManagedSchema, TestNonDefinedSimilarityFactory,
ManagedSchemaRoundRobinCloudTest, DistributedFacetPivotSmallAdvancedTest, CollectionTooManyReplicasTest,
ClassificationUpdateProcessorIntegrationTest, ScriptEngineTest, LukeRequestHandlerTest, StatsComponentTest,
SliceStateTest, HdfsChaosMonkeyNothingIsSafeTest, CollectionsAPISolrJTest, TestSha256AuthenticationProvider,
SparseHLLTest, ZkSolrClientTest, TestExceedMaxTermLength, TestDownShardTolerantSearch, HdfsCollectionsAPIDistributedZkTest,
TestPivotHelperCode, TestLocalFSCloudBackupRestore, TestBulkSchemaAPI, SaslZkACLProviderTest,
BinaryUpdateRequestHandlerTest, TestTrie, WrapperMergePolicyFactoryTest, BasicFunctionalityTest,
CircularListTest, TestFiltering, ReturnFieldsTest, TestCloudSchemaless, TestAddFieldRealTimeGet,
TestWriterPerf, TestComplexPhraseQParserPlugin, SolrMetricReporterTest, DistanceFunctionTest,
DistributedExpandComponentTest, DistributedFacetPivotWhiteBoxTest, SuggesterWFSTTest, TestLeaderElectionZkExpiry,
SuggesterTest, TestUtils, CleanupOldIndexTest, SortByFunctionTest, TestImpersonationWithHadoopAuth,
ResourceLoaderTest, BadIndexSchemaTest, UUIDFieldTest, ConfigSetsAPITest, TestShardHandlerFactory,
RegexBoostProcessorTest, StatsReloadRaceTest, FileBasedSpellCheckerTest, CursorMarkTest, DistributedTermsComponentTest,
TestJoin, TestOrdValues, TestJsonFacets, TestNRTOpen, TestQuerySenderListener, AnalyticsMergeStrategyTest,
WordBreakSolrSpellCheckerTest, LoggingHandlerTest, TestSolrDynamicMBean, TestIndexingPerformance,
TestSerializedLuceneMatchVersion, HdfsRecoverLeaseTest, MBeansHandlerTest, UUIDUpdateProcessorFallbackTest,
FieldAnalysisRequestHandlerTest, CdcrVersionReplicationTest, TestCloudPseudoReturnFields,
TestRawResponseWriter, TestStressLiveNodes, TestGraphTermsQParserPlugin, HdfsThreadLeakTest,
TestDynamicLoading, ForceLeaderTest, TestSimpleQParserPlugin, CacheHeaderTest, DeleteShardTest,
TestNumericTerms32, IndexSchemaTest, PreAnalyzedUpdateProcessorTest, TestValueSourceCache,
TestMacros, TestSchemaSimilarityResource, SolrIndexMetricsTest, CloudMLTQParserTest, TestDocSet,
TestExactSharedStatsCache, StressHdfsTest, VersionInfoTest, CopyFieldTest, BasicDistributedZk2Test,
TestDFRSimilarityFactory, TestSolrCoreProperties, PeerSyncReplicationTest, SolrInfoMBeanTest,
TestClusterProperties, TestObjectReleaseTracker, SmileWriterTest, TestRecovery, TriLevelCompositeIdRoutingTest,
SpellCheckCollatorTest, BlockCacheTest, TestReloadDeadlock, MinimalSchemaTest, DebugComponentTest,
TestSQLHandlerNonCloud, CoreAdminHandlerTest, TestOverriddenPrefixQueryForCustomFieldType,
SpellPossibilityIteratorTest, BasicDistributedZkTest, ChaosMonkeySafeLeaderTest, SyncSliceTest,
OpenCloseCoreStressTest, OverseerTest, TestRandomFaceting, LeaderElectionTest, TestRandomDVFaceting,
AutoCommitTest, TestDistributedGrouping, TestFaceting, TestRealTimeGet, TestReload, HardAutoCommitTest]
   [junit4] Completed [355/677 (1!)] on J1 in 0.94s, 1 test, 1 error <<< FAILURES!

[...truncated 63554 lines...]


Mime
View raw message