lucene-dev mailing list archives

Site index · List index
Message view « Date » · « Thread »
Top « Date » · « Thread »
From Policeman Jenkins Server <jenk...@thetaphi.de>
Subject [JENKINS] Lucene-Solr-master-Windows (64bit/jdk1.8.0_112) - Build # 6330 - Unstable!
Date Tue, 03 Jan 2017 06:43:54 GMT
Build: https://jenkins.thetaphi.de/job/Lucene-Solr-master-Windows/6330/
Java: 64bit/jdk1.8.0_112 -XX:-UseCompressedOops -XX:+UseSerialGC

1 tests failed.
FAILED:  org.apache.solr.cloud.TestSolrCloudWithDelegationTokens.testDelegationTokenCancelFail

Error Message:
expected:<200> but was:<404>

Stack Trace:
java.lang.AssertionError: expected:<200> but was:<404>
	at __randomizedtesting.SeedInfo.seed([521434FFBEAD03FB:3AAB01D56E371117]:0)
	at org.junit.Assert.fail(Assert.java:93)
	at org.junit.Assert.failNotEquals(Assert.java:647)
	at org.junit.Assert.assertEquals(Assert.java:128)
	at org.junit.Assert.assertEquals(Assert.java:472)
	at org.junit.Assert.assertEquals(Assert.java:456)
	at org.apache.solr.cloud.TestSolrCloudWithDelegationTokens.cancelDelegationToken(TestSolrCloudWithDelegationTokens.java:140)
	at org.apache.solr.cloud.TestSolrCloudWithDelegationTokens.testDelegationTokenCancelFail(TestSolrCloudWithDelegationTokens.java:294)
	at sun.reflect.NativeMethodAccessorImpl.invoke0(Native Method)
	at sun.reflect.NativeMethodAccessorImpl.invoke(NativeMethodAccessorImpl.java:62)
	at sun.reflect.DelegatingMethodAccessorImpl.invoke(DelegatingMethodAccessorImpl.java:43)
	at java.lang.reflect.Method.invoke(Method.java:498)
	at com.carrotsearch.randomizedtesting.RandomizedRunner.invoke(RandomizedRunner.java:1713)
	at com.carrotsearch.randomizedtesting.RandomizedRunner$8.evaluate(RandomizedRunner.java:907)
	at com.carrotsearch.randomizedtesting.RandomizedRunner$9.evaluate(RandomizedRunner.java:943)
	at com.carrotsearch.randomizedtesting.RandomizedRunner$10.evaluate(RandomizedRunner.java:957)
	at com.carrotsearch.randomizedtesting.rules.SystemPropertiesRestoreRule$1.evaluate(SystemPropertiesRestoreRule.java:57)
	at org.apache.lucene.util.TestRuleSetupTeardownChained$1.evaluate(TestRuleSetupTeardownChained.java:49)
	at org.apache.lucene.util.AbstractBeforeAfterRule$1.evaluate(AbstractBeforeAfterRule.java:45)
	at org.apache.lucene.util.TestRuleThreadAndTestName$1.evaluate(TestRuleThreadAndTestName.java:48)
	at org.apache.lucene.util.TestRuleIgnoreAfterMaxFailures$1.evaluate(TestRuleIgnoreAfterMaxFailures.java:64)
	at org.apache.lucene.util.TestRuleMarkFailure$1.evaluate(TestRuleMarkFailure.java:47)
	at com.carrotsearch.randomizedtesting.rules.StatementAdapter.evaluate(StatementAdapter.java:36)
	at com.carrotsearch.randomizedtesting.ThreadLeakControl$StatementRunner.run(ThreadLeakControl.java:367)
	at com.carrotsearch.randomizedtesting.ThreadLeakControl.forkTimeoutingTask(ThreadLeakControl.java:811)
	at com.carrotsearch.randomizedtesting.ThreadLeakControl$3.evaluate(ThreadLeakControl.java:462)
	at com.carrotsearch.randomizedtesting.RandomizedRunner.runSingleTest(RandomizedRunner.java:916)
	at com.carrotsearch.randomizedtesting.RandomizedRunner$5.evaluate(RandomizedRunner.java:802)
	at com.carrotsearch.randomizedtesting.RandomizedRunner$6.evaluate(RandomizedRunner.java:852)
	at com.carrotsearch.randomizedtesting.RandomizedRunner$7.evaluate(RandomizedRunner.java:863)
	at com.carrotsearch.randomizedtesting.rules.StatementAdapter.evaluate(StatementAdapter.java:36)
	at com.carrotsearch.randomizedtesting.rules.SystemPropertiesRestoreRule$1.evaluate(SystemPropertiesRestoreRule.java:57)
	at org.apache.lucene.util.AbstractBeforeAfterRule$1.evaluate(AbstractBeforeAfterRule.java:45)
	at com.carrotsearch.randomizedtesting.rules.StatementAdapter.evaluate(StatementAdapter.java:36)
	at org.apache.lucene.util.TestRuleStoreClassName$1.evaluate(TestRuleStoreClassName.java:41)
	at com.carrotsearch.randomizedtesting.rules.NoShadowingOrOverridesOnMethodsRule$1.evaluate(NoShadowingOrOverridesOnMethodsRule.java:40)
	at com.carrotsearch.randomizedtesting.rules.NoShadowingOrOverridesOnMethodsRule$1.evaluate(NoShadowingOrOverridesOnMethodsRule.java:40)
	at com.carrotsearch.randomizedtesting.rules.StatementAdapter.evaluate(StatementAdapter.java:36)
	at com.carrotsearch.randomizedtesting.rules.StatementAdapter.evaluate(StatementAdapter.java:36)
	at com.carrotsearch.randomizedtesting.rules.StatementAdapter.evaluate(StatementAdapter.java:36)
	at org.apache.lucene.util.TestRuleAssertionsRequired$1.evaluate(TestRuleAssertionsRequired.java:53)
	at org.apache.lucene.util.TestRuleMarkFailure$1.evaluate(TestRuleMarkFailure.java:47)
	at org.apache.lucene.util.TestRuleIgnoreAfterMaxFailures$1.evaluate(TestRuleIgnoreAfterMaxFailures.java:64)
	at org.apache.lucene.util.TestRuleIgnoreTestSuites$1.evaluate(TestRuleIgnoreTestSuites.java:54)
	at com.carrotsearch.randomizedtesting.rules.StatementAdapter.evaluate(StatementAdapter.java:36)
	at com.carrotsearch.randomizedtesting.ThreadLeakControl$StatementRunner.run(ThreadLeakControl.java:367)
	at java.lang.Thread.run(Thread.java:745)




Build Log:
[...truncated 11543 lines...]
   [junit4] Suite: org.apache.solr.cloud.TestSolrCloudWithDelegationTokens
   [junit4]   2> Creating dataDir: C:\Users\jenkins\workspace\Lucene-Solr-master-Windows\solr\build\solr-core\test\J1\temp\solr.cloud.TestSolrCloudWithDelegationTokens_521434FFBEAD03FB-001\init-core-data-001
   [junit4]   2> 1163835 INFO  (SUITE-TestSolrCloudWithDelegationTokens-seed#[521434FFBEAD03FB]-worker) [    ] o.a.s.SolrTestCaseJ4 Randomized ssl (false) and clientAuth (true) via: @org.apache.solr.util.RandomizeSSL(reason=, value=NaN, ssl=NaN, clientAuth=NaN)
   [junit4]   2> 1163847 INFO  (SUITE-TestSolrCloudWithDelegationTokens-seed#[521434FFBEAD03FB]-worker) [    ] o.a.s.c.MiniSolrCloudCluster Starting cluster of 2 servers in C:\Users\jenkins\workspace\Lucene-Solr-master-Windows\solr\build\solr-core\test\J1\temp\solr.cloud.TestSolrCloudWithDelegationTokens_521434FFBEAD03FB-001\tempDir-001
   [junit4]   2> 1163847 INFO  (SUITE-TestSolrCloudWithDelegationTokens-seed#[521434FFBEAD03FB]-worker) [    ] o.a.s.c.ZkTestServer STARTING ZK TEST SERVER
   [junit4]   2> 1163848 INFO  (Thread-2815) [    ] o.a.s.c.ZkTestServer client port:0.0.0.0/0.0.0.0:0
   [junit4]   2> 1163848 INFO  (Thread-2815) [    ] o.a.s.c.ZkTestServer Starting server
   [junit4]   2> 1163949 INFO  (SUITE-TestSolrCloudWithDelegationTokens-seed#[521434FFBEAD03FB]-worker) [    ] o.a.s.c.ZkTestServer start zk server on port:58767
   [junit4]   2> 1163962 WARN  (NIOServerCxn.Factory:0.0.0.0/0.0.0.0:0) [    ] o.a.z.s.NIOServerCnxn caught end of stream exception
   [junit4]   2> EndOfStreamException: Unable to read additional data from client sessionid 0x15962e363a10000, likely client has closed socket
   [junit4]   2> 	at org.apache.zookeeper.server.NIOServerCnxn.doIO(NIOServerCnxn.java:228)
   [junit4]   2> 	at org.apache.zookeeper.server.NIOServerCnxnFactory.run(NIOServerCnxnFactory.java:208)
   [junit4]   2> 	at java.lang.Thread.run(Thread.java:745)
   [junit4]   2> 1163968 INFO  (jetty-launcher-2485-thread-1) [    ] o.e.j.s.Server jetty-9.3.14.v20161028
   [junit4]   2> 1163968 INFO  (jetty-launcher-2485-thread-2) [    ] o.e.j.s.Server jetty-9.3.14.v20161028
   [junit4]   2> 1163969 INFO  (jetty-launcher-2485-thread-1) [    ] o.e.j.s.h.ContextHandler Started o.e.j.s.ServletContextHandler@2e0cf4ed{/solr,null,AVAILABLE}
   [junit4]   2> 1163970 INFO  (jetty-launcher-2485-thread-2) [    ] o.e.j.s.h.ContextHandler Started o.e.j.s.ServletContextHandler@55912d2a{/solr,null,AVAILABLE}
   [junit4]   2> 1163970 INFO  (jetty-launcher-2485-thread-1) [    ] o.e.j.s.AbstractConnector Started ServerConnector@7d43a689{HTTP/1.1,[http/1.1]}{127.0.0.1:58771}
   [junit4]   2> 1163970 INFO  (jetty-launcher-2485-thread-1) [    ] o.e.j.s.Server Started @1171360ms
   [junit4]   2> 1163970 INFO  (jetty-launcher-2485-thread-1) [    ] o.a.s.c.s.e.JettySolrRunner Jetty properties: {hostContext=/solr, hostPort=58771}
   [junit4]   2> 1163970 ERROR (jetty-launcher-2485-thread-1) [    ] o.a.s.s.StartupLoggingUtils Missing Java Option solr.log.dir. Logging may be missing or incomplete.
   [junit4]   2> 1163970 INFO  (jetty-launcher-2485-thread-2) [    ] o.e.j.s.AbstractConnector Started ServerConnector@3865f442{HTTP/1.1,[http/1.1]}{127.0.0.1:58774}
   [junit4]   2> 1163978 INFO  (jetty-launcher-2485-thread-1) [    ] o.a.s.s.SolrDispatchFilter  ___      _       Welcome to Apache Solr™ version 7.0.0
   [junit4]   2> 1163978 INFO  (jetty-launcher-2485-thread-2) [    ] o.e.j.s.Server Started @1171367ms
   [junit4]   2> 1163978 INFO  (jetty-launcher-2485-thread-1) [    ] o.a.s.s.SolrDispatchFilter / __| ___| |_ _   Starting in cloud mode on port null
   [junit4]   2> 1163978 INFO  (jetty-launcher-2485-thread-2) [    ] o.a.s.c.s.e.JettySolrRunner Jetty properties: {hostContext=/solr, hostPort=58774}
   [junit4]   2> 1163978 INFO  (jetty-launcher-2485-thread-1) [    ] o.a.s.s.SolrDispatchFilter \__ \/ _ \ | '_|  Install dir: null
   [junit4]   2> 1163978 INFO  (jetty-launcher-2485-thread-1) [    ] o.a.s.s.SolrDispatchFilter |___/\___/_|_|    Start time: 2017-01-03T05:53:06.592Z
   [junit4]   2> 1163978 ERROR (jetty-launcher-2485-thread-2) [    ] o.a.s.s.StartupLoggingUtils Missing Java Option solr.log.dir. Logging may be missing or incomplete.
   [junit4]   2> 1163978 INFO  (jetty-launcher-2485-thread-2) [    ] o.a.s.s.SolrDispatchFilter  ___      _       Welcome to Apache Solr™ version 7.0.0
   [junit4]   2> 1163979 INFO  (jetty-launcher-2485-thread-2) [    ] o.a.s.s.SolrDispatchFilter / __| ___| |_ _   Starting in cloud mode on port null
   [junit4]   2> 1163979 INFO  (jetty-launcher-2485-thread-2) [    ] o.a.s.s.SolrDispatchFilter \__ \/ _ \ | '_|  Install dir: null
   [junit4]   2> 1163979 INFO  (jetty-launcher-2485-thread-2) [    ] o.a.s.s.SolrDispatchFilter |___/\___/_|_|    Start time: 2017-01-03T05:53:06.593Z
   [junit4]   2> 1163983 INFO  (jetty-launcher-2485-thread-2) [    ] o.a.s.s.SolrDispatchFilter solr.xml found in ZooKeeper. Loading...
   [junit4]   2> 1163984 INFO  (jetty-launcher-2485-thread-1) [    ] o.a.s.s.SolrDispatchFilter solr.xml found in ZooKeeper. Loading...
   [junit4]   2> 1164002 INFO  (jetty-launcher-2485-thread-1) [    ] o.a.s.c.ZkContainer Zookeeper client=127.0.0.1:58767/solr
   [junit4]   2> 1164002 INFO  (jetty-launcher-2485-thread-2) [    ] o.a.s.c.ZkContainer Zookeeper client=127.0.0.1:58767/solr
   [junit4]   2> 1164047 INFO  (jetty-launcher-2485-thread-2) [n:127.0.0.1:58774_solr    ] o.a.s.c.OverseerElectionContext I am going to be the leader 127.0.0.1:58774_solr
   [junit4]   2> 1164047 INFO  (jetty-launcher-2485-thread-1) [n:127.0.0.1:58771_solr    ] o.a.s.c.ZkController Register node as live in ZooKeeper:/live_nodes/127.0.0.1:58771_solr
   [junit4]   2> 1164050 INFO  (zkCallback-2495-thread-1-processing-n:127.0.0.1:58771_solr) [n:127.0.0.1:58771_solr    ] o.a.s.c.c.ZkStateReader Updated live nodes from ZooKeeper... (0) -> (1)
   [junit4]   2> 1164051 INFO  (jetty-launcher-2485-thread-2) [n:127.0.0.1:58774_solr    ] o.a.s.c.Overseer Overseer (id=97217595733770246-127.0.0.1:58774_solr-n_0000000000) starting
   [junit4]   2> 1164052 INFO  (zkCallback-2496-thread-1-processing-n:127.0.0.1:58774_solr) [n:127.0.0.1:58774_solr    ] o.a.s.c.c.ZkStateReader Updated live nodes from ZooKeeper... (0) -> (1)
   [junit4]   2> 1164061 INFO  (jetty-launcher-2485-thread-2) [n:127.0.0.1:58774_solr    ] o.a.s.c.ZkController Register node as live in ZooKeeper:/live_nodes/127.0.0.1:58774_solr
   [junit4]   2> 1164067 INFO  (zkCallback-2495-thread-1-processing-n:127.0.0.1:58771_solr) [n:127.0.0.1:58771_solr    ] o.a.s.c.c.ZkStateReader Updated live nodes from ZooKeeper... (1) -> (2)
   [junit4]   2> 1164067 INFO  (zkCallback-2496-thread-1-processing-n:127.0.0.1:58774_solr) [n:127.0.0.1:58774_solr    ] o.a.s.c.c.ZkStateReader Updated live nodes from ZooKeeper... (1) -> (2)
   [junit4]   2> 1164075 INFO  (jetty-launcher-2485-thread-1) [n:127.0.0.1:58771_solr    ] o.a.s.c.CoreContainer Initializing authentication plugin: org.apache.solr.security.HttpParamDelegationTokenPlugin
   [junit4]   2> 1164126 INFO  (jetty-launcher-2485-thread-2) [n:127.0.0.1:58774_solr    ] o.a.s.c.CoreContainer Initializing authentication plugin: org.apache.solr.security.HttpParamDelegationTokenPlugin
   [junit4]   2> 1164140 INFO  (jetty-launcher-2485-thread-2) [n:127.0.0.1:58774_solr    ] o.a.s.s.KerberosPlugin Params: {token.valid=30, delegation-token.token-kind=solr-dt, cookie.domain=127.0.0.1, cookie.path=/, zk-dt-secret-manager.znodeWorkingPath=solr/security/zkdtsm, token.validity=36000, signer.secret.provider.zookeeper.path=/token, type=kerberos, zk-dt-secret-manager.enable=true, kerberos.name.rules=DEFAULT, signer.secret.provider=zookeeper}
   [junit4]   2> 1164140 INFO  (jetty-launcher-2485-thread-1) [n:127.0.0.1:58771_solr    ] o.a.s.s.KerberosPlugin Params: {token.valid=30, delegation-token.token-kind=solr-dt, cookie.domain=127.0.0.1, cookie.path=/, zk-dt-secret-manager.znodeWorkingPath=solr/security/zkdtsm, token.validity=36000, signer.secret.provider.zookeeper.path=/token, type=kerberos, zk-dt-secret-manager.enable=true, kerberos.name.rules=DEFAULT, signer.secret.provider=zookeeper}
   [junit4]   2> 1164485 INFO  (jetty-launcher-2485-thread-1) [n:127.0.0.1:58771_solr    ] o.a.c.f.i.CuratorFrameworkImpl Starting
   [junit4]   2> 1164485 INFO  (jetty-launcher-2485-thread-2) [n:127.0.0.1:58774_solr    ] o.a.c.f.i.CuratorFrameworkImpl Starting
   [junit4]   2> 1164572 INFO  (jetty-launcher-2485-thread-2-EventThread) [n:127.0.0.1:58774_solr    ] o.a.c.f.s.ConnectionStateManager State change: CONNECTED
   [junit4]   2> 1164573 INFO  (jetty-launcher-2485-thread-1-EventThread) [n:127.0.0.1:58771_solr    ] o.a.c.f.s.ConnectionStateManager State change: CONNECTED
   [junit4]   2> 1164762 ERROR (jetty-launcher-2485-thread-2) [n:127.0.0.1:58774_solr    ] o.a.h.u.Shell Failed to locate the winutils binary in the hadoop binary path
   [junit4]   2> java.io.IOException: Could not locate executable null\bin\winutils.exe in the Hadoop binaries.
   [junit4]   2> 	at org.apache.hadoop.util.Shell.getQualifiedBinPath(Shell.java:356)
   [junit4]   2> 	at org.apache.hadoop.util.Shell.getWinUtilsPath(Shell.java:371)
   [junit4]   2> 	at org.apache.hadoop.util.Shell.<clinit>(Shell.java:364)
   [junit4]   2> 	at org.apache.hadoop.util.StringUtils.<clinit>(StringUtils.java:80)
   [junit4]   2> 	at org.apache.hadoop.conf.Configuration.getBoolean(Configuration.java:1437)
   [junit4]   2> 	at org.apache.hadoop.security.token.delegation.web.DelegationTokenManager.<init>(DelegationTokenManager.java:115)
   [junit4]   2> 	at org.apache.hadoop.security.token.delegation.web.DelegationTokenAuthenticationHandler.initTokenManager(DelegationTokenAuthenticationHandler.java:148)
   [junit4]   2> 	at org.apache.hadoop.security.token.delegation.web.DelegationTokenAuthenticationHandler.init(DelegationTokenAuthenticationHandler.java:118)
   [junit4]   2> 	at org.apache.solr.security.HttpParamDelegationTokenPlugin$HttpParamDelegationTokenAuthenticationHandler.init(HttpParamDelegationTokenPlugin.java:178)
   [junit4]   2> 	at org.apache.hadoop.security.authentication.server.AuthenticationFilter.initializeAuthHandler(AuthenticationFilter.java:238)
   [junit4]   2> 	at org.apache.hadoop.security.token.delegation.web.DelegationTokenAuthenticationFilter.initializeAuthHandler(DelegationTokenAuthenticationFilter.java:209)
   [junit4]   2> 	at org.apache.solr.security.DelegationTokenKerberosFilter.initializeAuthHandler(DelegationTokenKerberosFilter.java:142)
   [junit4]   2> 	at org.apache.hadoop.security.authentication.server.AuthenticationFilter.init(AuthenticationFilter.java:227)
   [junit4]   2> 	at org.apache.hadoop.security.token.delegation.web.DelegationTokenAuthenticationFilter.init(DelegationTokenAuthenticationFilter.java:175)
   [junit4]   2> 	at org.apache.solr.security.DelegationTokenKerberosFilter.init(DelegationTokenKerberosFilter.java:71)
   [junit4]   2> 	at org.apache.solr.security.HttpParamDelegationTokenPlugin.init(HttpParamDelegationTokenPlugin.java:134)
   [junit4]   2> 	at org.apache.solr.core.CoreContainer.initializeAuthenticationPlugin(CoreContainer.java:329)
   [junit4]   2> 	at org.apache.solr.core.CoreContainer.reloadSecurityProperties(CoreContainer.java:611)
   [junit4]   2> 	at org.apache.solr.core.CoreContainer.load(CoreContainer.java:486)
   [junit4]   2> 	at org.apache.solr.servlet.SolrDispatchFilter.createCoreContainer(SolrDispatchFilter.java:235)
   [junit4]   2> 	at org.apache.solr.servlet.SolrDispatchFilter.init(SolrDispatchFilter.java:167)
   [junit4]   2> 	at org.eclipse.jetty.servlet.FilterHolder.initialize(FilterHolder.java:137)
   [junit4]   2> 	at org.eclipse.jetty.servlet.ServletHandler.initialize(ServletHandler.java:873)
   [junit4]   2> 	at org.eclipse.jetty.servlet.ServletHandler.updateMappings(ServletHandler.java:1565)
   [junit4]   2> 	at org.eclipse.jetty.servlet.ServletHandler.setFilterMappings(ServletHandler.java:1599)
   [junit4]   2> 	at org.eclipse.jetty.servlet.ServletHandler.addFilterMapping(ServletHandler.java:1285)
   [junit4]   2> 	at org.eclipse.jetty.servlet.ServletHandler.addFilterWithMapping(ServletHandler.java:1130)
   [junit4]   2> 	at org.eclipse.jetty.servlet.ServletContextHandler.addFilter(ServletContextHandler.java:448)
   [junit4]   2> 	at org.apache.solr.client.solrj.embedded.JettySolrRunner$1.lifeCycleStarted(JettySolrRunner.java:260)
   [junit4]   2> 	at org.eclipse.jetty.util.component.AbstractLifeCycle.setStarted(AbstractLifeCycle.java:179)
   [junit4]   2> 	at org.eclipse.jetty.util.component.AbstractLifeCycle.start(AbstractLifeCycle.java:69)
   [junit4]   2> 	at org.apache.solr.client.solrj.embedded.JettySolrRunner.start(JettySolrRunner.java:348)
   [junit4]   2> 	at org.apache.solr.client.solrj.embedded.JettySolrRunner.start(JettySolrRunner.java:321)
   [junit4]   2> 	at org.apache.solr.cloud.MiniSolrCloudCluster.startJettySolrRunner(MiniSolrCloudCluster.java:376)
   [junit4]   2> 	at org.apache.solr.cloud.MiniSolrCloudCluster.lambda$new$0(MiniSolrCloudCluster.java:239)
   [junit4]   2> 	at java.util.concurrent.FutureTask.run(FutureTask.java:266)
   [junit4]   2> 	at org.apache.solr.common.util.ExecutorUtil$MDCAwareThreadPoolExecutor.lambda$execute$0(ExecutorUtil.java:229)
   [junit4]   2> 	at java.util.concurrent.ThreadPoolExecutor.runWorker(ThreadPoolExecutor.java:1142)
   [junit4]   2> 	at java.util.concurrent.ThreadPoolExecutor$Worker.run(ThreadPoolExecutor.java:617)
   [junit4]   2> 	at java.lang.Thread.run(Thread.java:745)
   [junit4]   2> 1165033 INFO  (jetty-launcher-2485-thread-1) [n:127.0.0.1:58771_solr    ] o.a.s.c.CorePropertiesLocator Found 0 core definitions underneath C:\Users\jenkins\workspace\Lucene-Solr-master-Windows\solr\build\solr-core\test\J1\temp\solr.cloud.TestSolrCloudWithDelegationTokens_521434FFBEAD03FB-001\tempDir-001\node1\.
   [junit4]   2> 1165042 INFO  (jetty-launcher-2485-thread-2) [n:127.0.0.1:58774_solr    ] o.a.s.c.CorePropertiesLocator Found 0 core definitions underneath C:\Users\jenkins\workspace\Lucene-Solr-master-Windows\solr\build\solr-core\test\J1\temp\solr.cloud.TestSolrCloudWithDelegationTokens_521434FFBEAD03FB-001\tempDir-001\node2\.
   [junit4]   2> 1165604 INFO  (TEST-TestSolrCloudWithDelegationTokens.testDelegationTokenCancel-seed#[521434FFBEAD03FB]) [    ] o.a.s.SolrTestCaseJ4 ###Starting testDelegationTokenCancel
   [junit4]   2> 1166885 INFO  (TEST-TestSolrCloudWithDelegationTokens.testDelegationTokenCancel-seed#[521434FFBEAD03FB]) [    ] o.a.s.c.c.ZkStateReader Updated live nodes from ZooKeeper... (0) -> (2)
   [junit4]   2> 1166886 INFO  (TEST-TestSolrCloudWithDelegationTokens.testDelegationTokenCancel-seed#[521434FFBEAD03FB]) [    ] o.a.s.c.s.i.ZkClientClusterStateProvider Cluster at 127.0.0.1:58767/solr ready
   [junit4]   2> 1166892 ERROR (qtp1987574726-13912) [    ] o.a.h.s.t.d.ZKDelegationTokenSecretManager No node in path [/ZKDTSMTokensRoot/DT_1]
   [junit4]   2> 1166934 WARN  (NIOServerCxn.Factory:0.0.0.0/0.0.0.0:0) [    ] o.a.z.s.NIOServerCnxn caught end of stream exception
   [junit4]   2> EndOfStreamException: Unable to read additional data from client sessionid 0x15962e363a1000a, likely client has closed socket
   [junit4]   2> 	at org.apache.zookeeper.server.NIOServerCnxn.doIO(NIOServerCnxn.java:228)
   [junit4]   2> 	at org.apache.zookeeper.server.NIOServerCnxnFactory.run(NIOServerCnxnFactory.java:208)
   [junit4]   2> 	at java.lang.Thread.run(Thread.java:745)
   [junit4]   2> 1166948 WARN  (TEST-TestSolrCloudWithDelegationTokens.testDelegationTokenCancel-seed#[521434FFBEAD03FB]) [    ] o.a.h.c.p.ResponseProcessCookies Invalid cookie header: "Set-Cookie: hadoop.auth=; Path=/; Domain=127.0.0.1; Expires= , 01-   -1970 00:00:00 GMT; HttpOnly". Invalid 'expires' attribute: , 01- -1970 00:00:00 GMT
   [junit4]   2> 1166952 WARN  (TEST-TestSolrCloudWithDelegationTokens.testDelegationTokenCancel-seed#[521434FFBEAD03FB]) [    ] o.a.h.c.p.ResponseProcessCookies Invalid cookie header: "Set-Cookie: hadoop.auth=; Path=/; Domain=127.0.0.1; Expires= , 01-   -1970 00:00:00 GMT; HttpOnly". Invalid 'expires' attribute: , 01- -1970 00:00:00 GMT
   [junit4]   2> 1166970 INFO  (TEST-TestSolrCloudWithDelegationTokens.testDelegationTokenCancel-seed#[521434FFBEAD03FB]) [    ] o.a.s.c.c.ZkStateReader Updated live nodes from ZooKeeper... (0) -> (2)
   [junit4]   2> 1166972 INFO  (TEST-TestSolrCloudWithDelegationTokens.testDelegationTokenCancel-seed#[521434FFBEAD03FB]) [    ] o.a.s.c.s.i.ZkClientClusterStateProvider Cluster at 127.0.0.1:58767/solr ready
   [junit4]   2> 1166973 ERROR (qtp1987574726-13916) [    ] o.a.h.s.t.d.ZKDelegationTokenSecretManager No node in path [/ZKDTSMTokensRoot/DT_2]
   [junit4]   2> 1166977 WARN  (NIOServerCxn.Factory:0.0.0.0/0.0.0.0:0) [    ] o.a.z.s.NIOServerCnxn caught end of stream exception
   [junit4]   2> EndOfStreamException: Unable to read additional data from client sessionid 0x15962e363a1000b, likely client has closed socket
   [junit4]   2> 	at org.apache.zookeeper.server.NIOServerCnxn.doIO(NIOServerCnxn.java:228)
   [junit4]   2> 	at org.apache.zookeeper.server.NIOServerCnxnFactory.run(NIOServerCnxnFactory.java:208)
   [junit4]   2> 	at java.lang.Thread.run(Thread.java:745)
   [junit4]   2> 1166988 INFO  (TEST-TestSolrCloudWithDelegationTokens.testDelegationTokenCancel-seed#[521434FFBEAD03FB]) [    ] o.a.s.c.c.ZkStateReader Updated live nodes from ZooKeeper... (0) -> (2)
   [junit4]   2> 1166989 INFO  (TEST-TestSolrCloudWithDelegationTokens.testDelegationTokenCancel-seed#[521434FFBEAD03FB]) [    ] o.a.s.c.s.i.ZkClientClusterStateProvider Cluster at 127.0.0.1:58767/solr ready
   [junit4]   2> 1166991 WARN  (TEST-TestSolrCloudWithDelegationTokens.testDelegationTokenCancel-seed#[521434FFBEAD03FB]) [    ] o.a.h.c.p.ResponseProcessCookies Invalid cookie header: "Set-Cookie: hadoop.auth=; Path=/; Domain=127.0.0.1; Expires= , 01-   -1970 00:00:00 GMT; HttpOnly". Invalid 'expires' attribute: , 01- -1970 00:00:00 GMT
   [junit4]   2> 1166993 WARN  (NIOServerCxn.Factory:0.0.0.0/0.0.0.0:0) [    ] o.a.z.s.NIOServerCnxn caught end of stream exception
   [junit4]   2> EndOfStreamException: Unable to read additional data from client sessionid 0x15962e363a1000c, likely client has closed socket
   [junit4]   2> 	at org.apache.zookeeper.server.NIOServerCnxn.doIO(NIOServerCnxn.java:228)
   [junit4]   2> 	at org.apache.zookeeper.server.NIOServerCnxnFactory.run(NIOServerCnxnFactory.java:208)
   [junit4]   2> 	at java.lang.Thread.run(Thread.java:745)
   [junit4]   2> 1166997 WARN  (TEST-TestSolrCloudWithDelegationTokens.testDelegationTokenCancel-seed#[521434FFBEAD03FB]) [    ] o.a.h.c.p.ResponseProcessCookies Invalid cookie header: "Set-Cookie: hadoop.auth=; Path=/; Domain=127.0.0.1; Expires= , 01-   -1970 00:00:00 GMT; HttpOnly". Invalid 'expires' attribute: , 01- -1970 00:00:00 GMT
   [junit4]   2> 1166998 INFO  (TEST-TestSolrCloudWithDelegationTokens.testDelegationTokenCancel-seed#[521434FFBEAD03FB]) [    ] o.a.s.SolrTestCaseJ4 ###Ending testDelegationTokenCancel
   [junit4]   2> 1167038 INFO  (TEST-TestSolrCloudWithDelegationTokens.testZNodePaths-seed#[521434FFBEAD03FB]) [    ] o.a.s.SolrTestCaseJ4 ###Starting testZNodePaths
   [junit4]   2> 1167072 INFO  (TEST-TestSolrCloudWithDelegationTokens.testZNodePaths-seed#[521434FFBEAD03FB]) [    ] o.a.s.SolrTestCaseJ4 ###Ending testZNodePaths
   [junit4]   2> 1167087 INFO  (TEST-TestSolrCloudWithDelegationTokens.testDelegationTokenRenewFail-seed#[521434FFBEAD03FB]) [    ] o.a.s.SolrTestCaseJ4 ###Starting testDelegationTokenRenewFail
   [junit4]   2> 1167103 WARN  (qtp702987225-13917) [    ] o.a.h.s.a.s.AuthenticationFilter Authentication exception: org.apache.hadoop.security.AccessControlException: foo tries to renew a token with renewer bar
   [junit4]   2> 1167104 WARN  (qtp702987225-13917) [    ] o.a.s.s.KerberosPlugin Could not find org.apache.solr.security.authentication.requestcontinues
   [junit4]   2> 1167105 WARN  (TEST-TestSolrCloudWithDelegationTokens.testDelegationTokenRenewFail-seed#[521434FFBEAD03FB]) [    ] o.a.h.c.p.ResponseProcessCookies Invalid cookie header: "Set-Cookie: hadoop.auth=; Path=/; Domain=127.0.0.1; Expires= , 01-   -1970 00:00:00 GMT; HttpOnly". Invalid 'expires' attribute: , 01- -1970 00:00:00 GMT
   [junit4]   2> 1167105 WARN  (qtp1987574726-13906) [    ] o.a.h.s.a.s.AuthenticationFilter Authentication exception: org.apache.hadoop.security.AccessControlException: foo tries to renew a token with renewer bar
   [junit4]   2> 1167106 WARN  (qtp1987574726-13906) [    ] o.a.s.s.KerberosPlugin Could not find org.apache.solr.security.authentication.requestcontinues
   [junit4]   2> 1167107 WARN  (TEST-TestSolrCloudWithDelegationTokens.testDelegationTokenRenewFail-seed#[521434FFBEAD03FB]) [    ] o.a.h.c.p.ResponseProcessCookies Invalid cookie header: "Set-Cookie: hadoop.auth=; Path=/; Domain=127.0.0.1; Expires= , 01-   -1970 00:00:00 GMT; HttpOnly". Invalid 'expires' attribute: , 01- -1970 00:00:00 GMT
   [junit4]   2> 1167113 WARN  (qtp702987225-13903) [    ] o.a.h.s.a.s.AuthenticationFilter Authentication exception: org.apache.hadoop.security.AccessControlException: notRenewUser tries to renew a token with renewer renewUser
   [junit4]   2> 1167113 WARN  (qtp702987225-13903) [    ] o.a.s.s.KerberosPlugin Could not find org.apache.solr.security.authentication.requestcontinues
   [junit4]   2> 1167113 WARN  (TEST-TestSolrCloudWithDelegationTokens.testDelegationTokenRenewFail-seed#[521434FFBEAD03FB]) [    ] o.a.h.c.p.ResponseProcessCookies Invalid cookie header: "Set-Cookie: hadoop.auth=; Path=/; Domain=127.0.0.1; Expires= , 01-   -1970 00:00:00 GMT; HttpOnly". Invalid 'expires' attribute: , 01- -1970 00:00:00 GMT
   [junit4]   2> 1167114 WARN  (qtp1987574726-13906) [    ] o.a.h.s.a.s.AuthenticationFilter Authentication exception: org.apache.hadoop.security.AccessControlException: notRenewUser tries to renew a token with renewer renewUser
   [junit4]   2> 1167114 WARN  (qtp1987574726-13906) [    ] o.a.s.s.KerberosPlugin Could not find org.apache.solr.security.authentication.requestcontinues
   [junit4]   2> 1167115 WARN  (TEST-TestSolrCloudWithDelegationTokens.testDelegationTokenRenewFail-seed#[521434FFBEAD03FB]) [    ] o.a.h.c.p.ResponseProcessCookies Invalid cookie header: "Set-Cookie: hadoop.auth=; Path=/; Domain=127.0.0.1; Expires= , 01-   -1970 00:00:00 GMT; HttpOnly". Invalid 'expires' attribute: , 01- -1970 00:00:00 GMT
   [junit4]   2> 1167115 INFO  (TEST-TestSolrCloudWithDelegationTokens.testDelegationTokenRenewFail-seed#[521434FFBEAD03FB]) [    ] o.a.s.SolrTestCaseJ4 ###Ending testDelegationTokenRenewFail
   [junit4]   2> 1167145 INFO  (TEST-TestSolrCloudWithDelegationTokens.testDelegationTokenSolrClient-seed#[521434FFBEAD03FB]) [    ] o.a.s.SolrTestCaseJ4 ###Starting testDelegationTokenSolrClient
   [junit4]   2> 1167171 WARN  (TEST-TestSolrCloudWithDelegationTokens.testDelegationTokenSolrClient-seed#[521434FFBEAD03FB]) [    ] o.a.h.c.p.ResponseProcessCookies Invalid cookie header: "Set-Cookie: hadoop.auth=; Path=/; Domain=127.0.0.1; Expires= , 01-   -1970 00:00:00 GMT; HttpOnly". Invalid 'expires' attribute: , 01- -1970 00:00:00 GMT
   [junit4]   2> 1167187 INFO  (qtp702987225-13899) [n:127.0.0.1:58771_solr    ] o.a.s.h.a.CollectionsHandler Invoked Collection Action :list with params action=LIST&delegation=GgADYmFyA2JhcgCKAVli43CAigFZhu_0gAYEFF6bqpxWelA3sIUmwREwKGL4H398B3NvbHItZHQA&wt=javabin&version=2 and sendToOCPQueue=true
   [junit4]   2> 1167187 INFO  (qtp702987225-13899) [n:127.0.0.1:58771_solr    ] o.a.s.s.HttpSolrCall [admin] webapp=null path=/admin/collections params={action=LIST&delegation=GgADYmFyA2JhcgCKAVli43CAigFZhu_0gAYEFF6bqpxWelA3sIUmwREwKGL4H398B3NvbHItZHQA&wt=javabin&version=2} status=0 QTime=0
   [junit4]   2> 1167188 INFO  (TEST-TestSolrCloudWithDelegationTokens.testDelegationTokenSolrClient-seed#[521434FFBEAD03FB]) [    ] o.a.s.SolrTestCaseJ4 ###Ending testDelegationTokenSolrClient
   [junit4]   2> 1167213 INFO  (TEST-TestSolrCloudWithDelegationTokens.testDelegationTokenRenew-seed#[521434FFBEAD03FB]) [    ] o.a.s.SolrTestCaseJ4 ###Starting testDelegationTokenRenew
   [junit4]   2> 1167241 INFO  (qtp702987225-13919) [n:127.0.0.1:58771_solr    ] o.a.s.h.a.CollectionsHandler Invoked Collection Action :list with params action=LIST&delegation=GgADYmFyA2JhcgCKAVli43DEigFZhu_0xAcEFDUQgN8IOVPnQYtNWM721IwJ8fefB3NvbHItZHQA&wt=javabin&version=2 and sendToOCPQueue=true
   [junit4]   2> 1167242 INFO  (qtp702987225-13919) [n:127.0.0.1:58771_solr    ] o.a.s.s.HttpSolrCall [admin] webapp=null path=/admin/collections params={action=LIST&delegation=GgADYmFyA2JhcgCKAVli43DEigFZhu_0xAcEFDUQgN8IOVPnQYtNWM721IwJ8fefB3NvbHItZHQA&wt=javabin&version=2} status=0 QTime=0
   [junit4]   2> 1167256 INFO  (TEST-TestSolrCloudWithDelegationTokens.testDelegationTokenRenew-seed#[521434FFBEAD03FB]) [    ] o.a.s.c.c.ZkStateReader Updated live nodes from ZooKeeper... (0) -> (2)
   [junit4]   2> 1167257 INFO  (TEST-TestSolrCloudWithDelegationTokens.testDelegationTokenRenew-seed#[521434FFBEAD03FB]) [    ] o.a.s.c.s.i.ZkClientClusterStateProvider Cluster at 127.0.0.1:58767/solr ready
   [junit4]   2> 1167259 WARN  (TEST-TestSolrCloudWithDelegationTokens.testDelegationTokenRenew-seed#[521434FFBEAD03FB]) [    ] o.a.h.c.p.ResponseProcessCookies Invalid cookie header: "Set-Cookie: hadoop.auth=; Path=/; Domain=127.0.0.1; Expires= , 01-   -1970 00:00:00 GMT; HttpOnly". Invalid 'expires' attribute: , 01- -1970 00:00:00 GMT
   [junit4]   2> 1167262 WARN  (NIOServerCxn.Factory:0.0.0.0/0.0.0.0:0) [    ] o.a.z.s.NIOServerCnxn caught end of stream exception
   [junit4]   2> EndOfStreamException: Unable to read additional data from client sessionid 0x15962e363a1000e, likely client has closed socket
   [junit4]   2> 	at org.apache.zookeeper.server.NIOServerCnxn.doIO(NIOServerCnxn.java:228)
   [junit4]   2> 	at org.apache.zookeeper.server.NIOServerCnxnFactory.run(NIOServerCnxnFactory.java:208)
   [junit4]   2> 	at java.lang.Thread.run(Thread.java:745)
   [junit4]   2> 1167269 INFO  (TEST-TestSolrCloudWithDelegationTokens.testDelegationTokenRenew-seed#[521434FFBEAD03FB]) [    ] o.a.s.c.c.ZkStateReader Updated live nodes from ZooKeeper... (0) -> (2)
   [junit4]   2> 1167270 INFO  (TEST-TestSolrCloudWithDelegationTokens.testDelegationTokenRenew-seed#[521434FFBEAD03FB]) [    ] o.a.s.c.s.i.ZkClientClusterStateProvider Cluster at 127.0.0.1:58767/solr ready
   [junit4]   2> 1167272 INFO  (qtp1987574726-13912) [n:127.0.0.1:58774_solr    ] o.a.s.h.a.CollectionsHandler Invoked Collection Action :list with params action=LIST&delegation=GgADYmFyA2JhcgCKAVli43DEigFZhu_0xAcEFDUQgN8IOVPnQYtNWM721IwJ8fefB3NvbHItZHQA&wt=javabin&version=2 and sendToOCPQueue=true
   [junit4]   2> 1167272 INFO  (qtp1987574726-13912) [n:127.0.0.1:58774_solr    ] o.a.s.s.HttpSolrCall [admin] webapp=null path=/admin/collections params={action=LIST&delegation=GgADYmFyA2JhcgCKAVli43DEigFZhu_0xAcEFDUQgN8IOVPnQYtNWM721IwJ8fefB3NvbHItZHQA&wt=javabin&version=2} status=0 QTime=0
   [junit4]   2> 1167273 WARN  (NIOServerCxn.Factory:0.0.0.0/0.0.0.0:0) [    ] o.a.z.s.NIOServerCnxn caught end of stream exception
   [junit4]   2> EndOfStreamException: Unable to read additional data from client sessionid 0x15962e363a1000f, likely client has closed socket
   [junit4]   2> 	at org.apache.zookeeper.server.NIOServerCnxn.doIO(NIOServerCnxn.java:228)
   [junit4]   2> 	at org.apache.zookeeper.server.NIOServerCnxnFactory.run(NIOServerCnxnFactory.java:208)
   [junit4]   2> 	at java.lang.Thread.run(Thread.java:745)
   [junit4]   2> 1167280 INFO  (TEST-TestSolrCloudWithDelegationTokens.testDelegationTokenRenew-seed#[521434FFBEAD03FB]) [    ] o.a.s.c.c.ZkStateReader Updated live nodes from ZooKeeper... (0) -> (2)
   [junit4]   2> 1167281 INFO  (TEST-TestSolrCloudWithDelegationTokens.testDelegationTokenRenew-seed#[521434FFBEAD03FB]) [    ] o.a.s.c.s.i.ZkClientClusterStateProvider Cluster at 127.0.0.1:58767/solr ready
   [junit4]   2> 1167283 WARN  (TEST-TestSolrCloudWithDelegationTokens.testDelegationTokenRenew-seed#[521434FFBEAD03FB]) [    ] o.a.h.c.p.ResponseProcessCookies Invalid cookie header: "Set-Cookie: hadoop.auth=; Path=/; Domain=127.0.0.1; Expires= , 01-   -1970 00:00:00 GMT; HttpOnly". Invalid 'expires' attribute: , 01- -1970 00:00:00 GMT
   [junit4]   2> 1167285 WARN  (NIOServerCxn.Factory:0.0.0.0/0.0.0.0:0) [    ] o.a.z.s.NIOServerCnxn caught end of stream exception
   [junit4]   2> EndOfStreamException: Unable to read additional data from client sessionid 0x15962e363a10010, likely client has closed socket
   [junit4]   2> 	at org.apache.zookeeper.server.NIOServerCnxn.doIO(NIOServerCnxn.java:228)
   [junit4]   2> 	at org.apache.zookeeper.server.NIOServerCnxnFactory.run(NIOServerCnxnFactory.java:208)
   [junit4]   2> 	at java.lang.Thread.run(Thread.java:745)
   [junit4]   2> 1167334 INFO  (TEST-TestSolrCloudWithDelegationTokens.testDelegationTokenRenew-seed#[521434FFBEAD03FB]) [    ] o.a.s.c.c.ZkStateReader Updated live nodes from ZooKeeper... (0) -> (2)
   [junit4]   2> 1167336 INFO  (TEST-TestSolrCloudWithDelegationTokens.testDelegationTokenRenew-seed#[521434FFBEAD03FB]) [    ] o.a.s.c.s.i.ZkClientClusterStateProvider Cluster at 127.0.0.1:58767/solr ready
   [junit4]   2> 1167337 INFO  (qtp1987574726-13907) [n:127.0.0.1:58774_solr    ] o.a.s.h.a.CollectionsHandler Invoked Collection Action :list with params action=LIST&delegation=GgADYmFyA2JhcgCKAVli43ELigFZhu_1CwgEFIEYRuBFEYncozzmH6Cbpv_TX6xeB3NvbHItZHQA&wt=javabin&version=2 and sendToOCPQueue=true
   [junit4]   2> 1167337 INFO  (qtp1987574726-13907) [n:127.0.0.1:58774_solr    ] o.a.s.s.HttpSolrCall [admin] webapp=null path=/admin/collections params={action=LIST&delegation=GgADYmFyA2JhcgCKAVli43ELigFZhu_1CwgEFIEYRuBFEYncozzmH6Cbpv_TX6xeB3NvbHItZHQA&wt=javabin&version=2} status=0 QTime=0
   [junit4]   2> 1167338 WARN  (NIOServerCxn.Factory:0.0.0.0/0.0.0.0:0) [    ] o.a.z.s.NIOServerCnxn caught end of stream exception
   [junit4]   2> EndOfStreamException: Unable to read additional data from client sessionid 0x15962e363a10011, likely client has closed socket
   [junit4]   2> 	at org.apache.zookeeper.server.NIOServerCnxn.doIO(NIOServerCnxn.java:228)
   [junit4]   2> 	at org.apache.zookeeper.server.NIOServerCnxnFactory.run(NIOServerCnxnFactory.java:208)
   [junit4]   2> 	at java.lang.Thread.run(Thread.java:745)
   [junit4]   2> 1167342 WARN  (TEST-TestSolrCloudWithDelegationTokens.testDelegationTokenRenew-seed#[521434FFBEAD03FB]) [    ] o.a.h.c.p.ResponseProcessCookies Invalid cookie header: "Set-Cookie: hadoop.auth=; Path=/; Domain=127.0.0.1; Expires= , 01-   -1970 00:00:00 GMT; HttpOnly". Invalid 'expires' attribute: , 01- -1970 00:00:00 GMT
   [junit4]   2> 1167351 INFO  (qtp1987574726-13916) [n:127.0.0.1:58774_solr    ] o.a.s.h.a.CollectionsHandler Invoked Collection Action :list with params action=LIST&delegation=GgADYmFyA2JhcgCKAVli43ELigFZhu_1CwgEFIEYRuBFEYncozzmH6Cbpv_TX6xeB3NvbHItZHQA&wt=javabin&version=2 and sendToOCPQueue=true
   [junit4]   2> 1167351 INFO  (qtp1987574726-13916) [n:127.0.0.1:58774_solr    ] o.a.s.s.HttpSolrCall [admin] webapp=null path=/admin/collections params={action=LIST&delegation=GgADYmFyA2JhcgCKAVli43ELigFZhu_1CwgEFIEYRuBFEYncozzmH6Cbpv_TX6xeB3NvbHItZHQA&wt=javabin&version=2} status=0 QTime=0
   [junit4]   2> 1167357 WARN  (TEST-TestSolrCloudWithDelegationTokens.testDelegationTokenRenew-seed#[521434FFBEAD03FB]) [    ] o.a.h.c.p.ResponseProcessCookies Invalid cookie header: "Set-Cookie: hadoop.auth=; Path=/; Domain=127.0.0.1; Expires= , 01-   -1970 00:00:00 GMT; HttpOnly". Invalid 'expires' attribute: , 01- -1970 00:00:00 GMT
   [junit4]   2> 1167390 INFO  (qtp702987225-13896) [n:127.0.0.1:58771_solr    ] o.a.s.h.a.CollectionsHandler Invoked Collection Action :list with params action=LIST&delegation=GgADYmFyA2JhcgCKAVli43FTigFZhu_1UwkEFP0joVZ-oM0MzmsSJinU3fqjZGGeB3NvbHItZHQA&wt=javabin&version=2 and sendToOCPQueue=true
   [junit4]   2> 1167392 INFO  (qtp702987225-13896) [n:127.0.0.1:58771_solr    ] o.a.s.s.HttpSolrCall [admin] webapp=null path=/admin/collections params={action=LIST&delegation=GgADYmFyA2JhcgCKAVli43FTigFZhu_1UwkEFP0joVZ-oM0MzmsSJinU3fqjZGGeB3NvbHItZHQA&wt=javabin&version=2} status=0 QTime=0
   [junit4]   2> 1167394 WARN  (TEST-TestSolrCloudWithDelegationTokens.testDelegationTokenRenew-seed#[521434FFBEAD03FB]) [    ] o.a.h.c.p.ResponseProcessCookies Invalid cookie header: "Set-Cookie: hadoop.auth=; Path=/; Domain=127.0.0.1; Expires= , 01-   -1970 00:00:00 GMT; HttpOnly". Invalid 'expires' attribute: , 01- -1970 00:00:00 GMT
   [junit4]   2> 1167404 INFO  (TEST-TestSolrCloudWithDelegationTokens.testDelegationTokenRenew-seed#[521434FFBEAD03FB]) [    ] o.a.s.c.c.ZkStateReader Updated live nodes from ZooKeeper... (0) -> (2)
   [junit4]   2> 1167406 INFO  (TEST-TestSolrCloudWithDelegationTokens.testDelegationTokenRenew-seed#[521434FFBEAD03FB]) [    ] o.a.s.c.s.i.ZkClientClusterStateProvider Cluster at 127.0.0.1:58767/solr ready
   [junit4]   2> 1167408 INFO  (qtp1987574726-13916) [n:127.0.0.1:58774_solr    ] o.a.s.h.a.CollectionsHandler Invoked Collection Action :list with params action=LIST&delegation=GgADYmFyA2JhcgCKAVli43FTigFZhu_1UwkEFP0joVZ-oM0MzmsSJinU3fqjZGGeB3NvbHItZHQA&wt=javabin&version=2 and sendToOCPQueue=true
   [junit4]   2> 1167408 INFO  (qtp1987574726-13916) [n:127.0.0.1:58774_solr    ] o.a.s.s.HttpSolrCall [admin] webapp=null path=/admin/collections params={action=LIST&delegation=GgADYmFyA2JhcgCKAVli43FTigFZhu_1UwkEFP0joVZ-oM0MzmsSJinU3fqjZGGeB3NvbHItZHQA&wt=javabin&version=2} status=0 QTime=0
   [junit4]   2> 1167412 WARN  (TEST-TestSolrCloudWithDelegationTokens.testDelegationTokenRenew-seed#[521434FFBEAD03FB]) [    ] o.a.h.c.p.ResponseProcessCookies Invalid cookie header: "Set-Cookie: hadoop.auth=; Path=/; Domain=127.0.0.1; Expires= , 01-   -1970 00:00:00 GMT; HttpOnly". Invalid 'expires' attribute: , 01- -1970 00:00:00 GMT
   [junit4]   2> 1167436 INFO  (qtp702987225-13917) [n:127.0.0.1:58771_solr    ] o.a.s.h.a.CollectionsHandler Invoked Collection Action :list with params action=LIST&delegation=GgADYmFyA2JhcgCKAVli43GLigFZhu_1iwoEFGIuKHCQS4iYn_583KSrIk-f0gxwB3NvbHItZHQA&wt=javabin&version=2 and sendToOCPQueue=true
   [junit4]   2> 1167436 INFO  (qtp702987225-13917) [n:127.0.0.1:58771_solr    ] o.a.s.s.HttpSolrCall [admin] webapp=null path=/admin/collections params={action=LIST&delegation=GgADYmFyA2JhcgCKAVli43GLigFZhu_1iwoEFGIuKHCQS4iYn_583KSrIk-f0gxwB3NvbHItZHQA&wt=javabin&version=2} status=0 QTime=0
   [junit4]   2> 1167445 INFO  (TEST-TestSolrCloudWithDelegationTokens.testDelegationTokenRenew-seed#[521434FFBEAD03FB]) [    ] o.a.s.c.c.ZkStateReader Updated live nodes from ZooKeeper... (0) -> (2)
   [junit4]   2> 1167446 INFO  (TEST-TestSolrCloudWithDelegationTokens.testDelegationTokenRenew-seed#[521434FFBEAD03FB]) [    ] o.a.s.c.s.i.ZkClientClusterStateProvider Cluster at 127.0.0.1:58767/solr ready
   [junit4]   2> 1167448 WARN  (TEST-TestSolrCloudWithDelegationTokens.testDelegationTokenRenew-seed#[521434FFBEAD03FB]) [    ] o.a.h.c.p.ResponseProcessCookies Invalid cookie header: "Set-Cookie: hadoop.auth=; Path=/; Domain=127.0.0.1; Expires= , 01-   -1970 00:00:00 GMT; HttpOnly". Invalid 'expires' attribute: , 01- -1970 00:00:00 GMT
   [junit4]   2> 1167449 WARN  (NIOServerCxn.Factory:0.0.0.0/0.0.0.0:0) [    ] o.a.z.s.NIOServerCnxn caught end of stream exception
   [junit4]   2> EndOfStreamException: Unable to read additional data from client sessionid 0x15962e363a10013, likely client has closed socket
   [junit4]   2> 	at org.apache.zookeeper.server.NIOServerCnxn.doIO(NIOServerCnxn.java:228)
   [junit4]   2> 	at org.apache.zookeeper.server.NIOServerCnxnFactory.run(NIOServerCnxnFactory.java:208)
   [junit4]   2> 	at java.lang.Thread.run(Thread.java:745)
   [junit4]   2> 1167455 INFO  (TEST-TestSolrCloudWithDelegationTokens.testDelegationTokenRenew-seed#[521434FFBEAD03FB]) [    ] o.a.s.c.c.ZkStateReader Updated live nodes from ZooKeeper... (0) -> (2)
   [junit4]   2> 1167456 INFO  (TEST-TestSolrCloudWithDelegationTokens.testDelegationTokenRenew-seed#[521434FFBEAD03FB]) [    ] o.a.s.c.s.i.ZkClientClusterStateProvider Cluster at 127.0.0.1:58767/solr ready
   [junit4]   2> 1167457 INFO  (qtp1987574726-13907) [n:127.0.0.1:58774_solr    ] o.a.s.h.a.CollectionsHandler Invoked Collection Action :list with params action=LIST&delegation=GgADYmFyA2JhcgCKAVli43GLigFZhu_1iwoEFGIuKHCQS4iYn_583KSrIk-f0gxwB3NvbHItZHQA&wt=javabin&version=2 and sendToOCPQueue=true
   [junit4]   2> 1167457 INFO  (qtp1987574726-13907) [n:127.0.0.1:58774_solr    ] o.a.s.s.HttpSolrCall [admin] webapp=null path=/admin/collections params={action=LIST&delegation=GgADYmFyA2JhcgCKAVli43GLigFZhu_1iwoEFGIuKHCQS4iYn_583KSrIk-f0gxwB3NvbHItZHQA&wt=javabin&version=2} status=0 QTime=0
   [junit4]   2> 1167457 WARN  (NIOServerCxn.Factory:0.0.0.0/0.0.0.0:0) [    ] o.a.z.s.NIOServerCnxn caught end of stream exception
   [junit4]   2> EndOfStreamException: Unable to read additional data from client sessionid 0x15962e363a10014, likely client has closed socket
   [junit4]   2> 	at org.apache.zookeeper.server.NIOServerCnxn.doIO(NIOServerCnxn.java:228)
   [junit4]   2> 	at org.apache.zookeeper.server.NIOServerCnxnFactory.run(NIOServerCnxnFactory.java:208)
   [junit4]   2> 	at java.lang.Thread.run(Thread.java:745)
   [junit4]   2> 1167461 WARN  (TEST-TestSolrCloudWithDelegationTokens.testDelegationTokenRenew-seed#[521434FFBEAD03FB]) [    ] o.a.h.c.p.ResponseProcessCookies Invalid cookie header: "Set-Cookie: hadoop.auth=; Path=/; Domain=127.0.0.1; Expires= , 01-   -1970 00:00:00 GMT; HttpOnly". Invalid 'expires' attribute: , 01- -1970 00:00:00 GMT
   [junit4]   2> 1167461 INFO  (TEST-TestSolrCloudWithDelegationTokens.testDelegationTokenRenew-seed#[521434FFBEAD03FB]) [    ] o.a.s.SolrTestCaseJ4 ###Ending testDelegationTokenRenew
   [junit4]   2> 1167486 INFO  (TEST-TestSolrCloudWithDelegationTokens.testDelegationTokenCancelFail-seed#[521434FFBEAD03FB]) [    ] o.a.s.SolrTestCaseJ4 ###Starting testDelegationTokenCancelFail
   [junit4]   2> 1167498 INFO  (TEST-TestSolrCloudWithDelegationTokens.testDelegationTokenCancelFail-seed#[521434FFBEAD03FB]) [    ] o.a.s.SolrTestCaseJ4 ###Ending testDelegationTokenCancelFail
   [junit4]   2> NOTE: reproduce with: ant test  -Dtestcase=TestSolrCloudWithDelegationTokens -Dtests.method=testDelegationTokenCancelFail -Dtests.seed=521434FFBEAD03FB -Dtests.slow=true -Dtests.locale=ar-QA -Dtests.timezone=America/Sitka -Dtests.asserts=true -Dtests.file.encoding=UTF-8
   [junit4] FAILURE 0.04s J1 | TestSolrCloudWithDelegationTokens.testDelegationTokenCancelFail <<<
   [junit4]    > Throwable #1: java.lang.AssertionError: expected:<200> but was:<404>
   [junit4]    > 	at __randomizedtesting.SeedInfo.seed([521434FFBEAD03FB:3AAB01D56E371117]:0)
   [junit4]    > 	at org.apache.solr.cloud.TestSolrCloudWithDelegationTokens.cancelDelegationToken(TestSolrCloudWithDelegationTokens.java:140)
   [junit4]    > 	at org.apache.solr.cloud.TestSolrCloudWithDelegationTokens.testDelegationTokenCancelFail(TestSolrCloudWithDelegationTokens.java:294)
   [junit4]    > 	at java.lang.Thread.run(Thread.java:745)
   [junit4]   2> 1167525 INFO  (TEST-TestSolrCloudWithDelegationTokens.testDelegationOtherOp-seed#[521434FFBEAD03FB]) [    ] o.a.s.SolrTestCaseJ4 ###Starting testDelegationOtherOp
   [junit4]   2> 1167534 INFO  (TEST-TestSolrCloudWithDelegationTokens.testDelegationOtherOp-seed#[521434FFBEAD03FB]) [    ] o.a.s.c.c.ZkStateReader Updated live nodes from ZooKeeper... (0) -> (2)
   [junit4]   2> 1167536 INFO  (TEST-TestSolrCloudWithDelegationTokens.testDelegationOtherOp-seed#[521434FFBEAD03FB]) [    ] o.a.s.c.s.i.ZkClientClusterStateProvider Cluster at 127.0.0.1:58767/solr ready
   [junit4]   2> 1167538 INFO  (qtp1987574726-13916) [n:127.0.0.1:58774_solr    ] o.a.s.h.a.CollectionsHandler Invoked Collection Action :list with params op=someSolrOperation&action=LIST&wt=javabin&version=2 and sendToOCPQueue=true
   [junit4]   2> 1167538 INFO  (qtp1987574726-13916) [n:127.0.0.1:58774_solr    ] o.a.s.s.HttpSolrCall [admin] webapp=null path=/admin/collections params={op=someSolrOperation&action=LIST&wt=javabin&version=2} status=0 QTime=0
   [junit4]   2> 1167538 WARN  (TEST-TestSolrCloudWithDelegationTokens.testDelegationOtherOp-seed#[521434FFBEAD03FB]) [    ] o.a.h.c.p.ResponseProcessCookies Invalid cookie header: "Set-Cookie: hadoop.auth="u=bar&p=bar&t=test&e=1483458790151&s=6BfV7VwxONWYMJ0vc/vCvkWQbzc="; Path=/; Domain=127.0.0.1; Expires= , 03-   -2017 15:53:10 GMT; HttpOnly". Invalid 'expires' attribute: , 03- -2017 15:53:10 GMT
   [junit4]   2> 1167539 WARN  (NIOServerCxn.Factory:0.0.0.0/0.0.0.0:0) [    ] o.a.z.s.NIOServerCnxn caught end of stream exception
   [junit4]   2> EndOfStreamException: Unable to read additional data from client sessionid 0x15962e363a10015, likely client has closed socket
   [junit4]   2> 	at org.apache.zookeeper.server.NIOServerCnxn.doIO(NIOServerCnxn.java:228)
   [junit4]   2> 	at org.apache.zookeeper.server.NIOServerCnxnFactory.run(NIOServerCnxnFactory.java:208)
   [junit4]   2> 	at java.lang.Thread.run(Thread.java:745)
   [junit4]   2> 1167540 INFO  (TEST-TestSolrCloudWithDelegationTokens.testDelegationOtherOp-seed#[521434FFBEAD03FB]) [    ] o.a.s.SolrTestCaseJ4 ###Ending testDelegationOtherOp
   [junit4]   2> 1167559 INFO  (TEST-TestSolrCloudWithDelegationTokens.testDelegationTokenVerify-seed#[521434FFBEAD03FB]) [    ] o.a.s.SolrTestCaseJ4 ###Starting testDelegationTokenVerify
   [junit4]   2> 1167569 INFO  (qtp702987225-13896) [n:127.0.0.1:58771_solr    ] o.a.s.h.a.CollectionsHandler Invoked Collection Action :list with params action=LIST&delegation=GgADYmFyA2JhcgCKAVli43IeigFZhu_2HgwEFAvU3XDKMOkS8J41QbYIHG-4Pb_lB3NvbHItZHQA&wt=javabin&version=2 and sendToOCPQueue=true
   [junit4]   2> 1167569 INFO  (qtp702987225-13896) [n:127.0.0.1:58771_solr    ] o.a.s.s.HttpSolrCall [admin] webapp=null path=/admin/collections params={action=LIST&delegation=GgADYmFyA2JhcgCKAVli43IeigFZhu_2HgwEFAvU3XDKMOkS8J41QbYIHG-4Pb_lB3NvbHItZHQA&wt=javabin&version=2} status=0 QTime=0
   [junit4]   2> 1167572 WARN  (TEST-TestSolrCloudWithDelegationTokens.testDelegationTokenVerify-seed#[521434FFBEAD03FB]) [    ] o.a.h.c.p.ResponseProcessCookies Invalid cookie header: "Set-Cookie: hadoop.auth=; Path=/; Domain=127.0.0.1; Expires= , 01-   -1970 00:00:00 GMT; HttpOnly". Invalid 'expires' attribute: , 01- -1970 00:00:00 GMT
   [junit4]   2> 1167574 INFO  (qtp1987574726-13914) [n:127.0.0.1:58774_solr    ] o.a.s.h.a.CollectionsHandler Invoked Collection Action :list with params action=LIST&delegation=GgADYmFyA2JhcgCKAVli43IeigFZhu_2HgwEFAvU3XDKMOkS8J41QbYIHG-4Pb_lB3NvbHItZHQA&wt=javabin&version=2 and sendToOCPQueue=true
   [junit4]   2> 1167574 INFO  (qtp1987574726-13914) [n:127.0.0.1:58774_solr    ] o.a.s.s.HttpSolrCall [admin] webapp=null path=/admin/collections params={action=LIST&delegation=GgADYmFyA2JhcgCKAVli43IeigFZhu_2HgwEFAvU3XDKMOkS8J41QbYIHG-4Pb_lB3NvbHItZHQA&wt=javabin&version=2} status=0 QTime=0
   [junit4]   2> 1167578 INFO  (TEST-TestSolrCloudWithDelegationTokens.testDelegationTokenVerify-seed#[521434FFBEAD03FB]) [    ] o.a.s.c.c.ZkStateReader Updated live nodes from ZooKeeper... (0) -> (2)
   [junit4]   2> 1167580 INFO  (TEST-TestSolrCloudWithDelegationTokens.testDelegationTokenVerify-seed#[521434FFBEAD03FB]) [    ] o.a.s.c.s.i.ZkClientClusterStateProvider Cluster at 127.0.0.1:58767/solr ready
   [junit4]   2> 1167581 WARN  (TEST-TestSolrCloudWithDelegationTokens.testDelegationTokenVerify-seed#[521434FFBEAD03FB]) [    ] o.a.h.c.p.ResponseProcessCookies Invalid cookie header: "Set-Cookie: hadoop.auth=; Path=/; Domain=127.0.0.1; Expires= , 01-   -1970 00:00:00 GMT; HttpOnly". Invalid 'expires' attribute: , 01- -1970 00:00:00 GMT
   [junit4]   2> 1167582 WARN  (NIOServerCxn.Factory:0.0.0.0/0.0.0.0:0) [    ] o.a.z.s.NIOServerCnxn caught end of stream exception
   [junit4]   2> EndOfStreamException: Unable to read additional data from client sessionid 0x15962e363a10016, likely client has closed socket
   [junit4]   2> 	at org.apache.zookeeper.server.NIOServerCnxn.doIO(NIOServerCnxn.java:228)
   [junit4]   2> 	at org.apache.zookeeper.server.NIOServerCnxnFactory.run(NIOServerCnxnFactory.java:208)
   [junit4]   2> 	at java.lang.Thread.run(Thread.java:745)
   [junit4]   2> 1167582 INFO  (TEST-TestSolrCloudWithDelegationTokens.testDelegationTokenVerify-seed#[521434FFBEAD03FB]) [    ] o.a.s.SolrTestCaseJ4 ###Ending testDelegationTokenVerify
   [junit4]   2> 1167585 INFO  (jetty-launcher-2485-thread-2) [    ] o.e.j.s.AbstractConnector Stopped ServerConnector@7d43a689{HTTP/1.1,[http/1.1]}{127.0.0.1:0}
   [junit4]   2> 1167586 INFO  (jetty-launcher-2485-thread-2) [    ] o.a.s.c.CoreContainer Shutting down CoreContainer instance=1162606054
   [junit4]   2> 1167587 INFO  (jetty-launcher-2485-thread-1) [    ] o.e.j.s.AbstractConnector Stopped ServerConnector@3865f442{HTTP/1.1,[http/1.1]}{127.0.0.1:0}
   [junit4]   2> 1167588 INFO  (jetty-launcher-2485-thread-1) [    ] o.a.s.c.CoreContainer Shutting down CoreContainer instance=391282291
   [junit4]   2> 1167595 INFO  (jetty-launcher-2485-thread-1) [    ] o.a.s.c.Overseer Overseer (id=97217595733770246-127.0.0.1:58774_solr-n_0000000000) closing
   [junit4]   2> 1167595 WARN  (NIOServerCxn.Factory:0.0.0.0/0.0.0.0:0) [    ] o.a.z.s.NIOServerCnxn caught end of stream exception
   [junit4]   2> EndOfStreamException: Unable to read additional data from client sessionid 0x15962e363a10005, likely client has closed socket
   [junit4]   2> 	at org.apache.zookeeper.server.NIOServerCnxn.doIO(NIOServerCnxn.java:228)
   [junit4]   2> 	at org.apache.zookeeper.server.NIOServerCnxnFactory.run(NIOServerCnxnFactory.java:208)
   [junit4]   2> 	at java.lang.Thread.run(Thread.java:745)
   [junit4]   2> 1167596 INFO  (OverseerStateUpdate-97217595733770246-127.0.0.1:58774_solr-n_0000000000) [n:127.0.0.1:58774_solr    ] o.a.s.c.Overseer Overseer Loop exiting : 127.0.0.1:58774_solr
   [junit4]   2> 1167597 INFO  (jetty-launcher-2485-thread-2) [    ] o.a.s.m.SolrMetricManager Closing metric reporters for: solr.node
   [junit4]   2> 1167597 ERROR (Thread[Thread-2838,5,TGRP-TestSolrCloudWithDelegationTokens]) [n:127.0.0.1:58771_solr    ] o.a.h.s.t.d.AbstractDelegationTokenSecretManager ExpiredTokenRemover received java.lang.InterruptedException: sleep interrupted
   [junit4]   2> 1167625 WARN  (NIOServerCxn.Factory:0.0.0.0/0.0.0.0:0) [    ] o.a.z.s.NIOServerCnxn caught end of stream exception
   [junit4]   2> EndOfStreamException: Unable to read additional data from client sessionid 0x15962e363a10007, likely client has closed socket
   [junit4]   2> 	at org.apache.zookeeper.server.NIOServerCnxn.doIO(NIOServerCnxn.java:228)
   [junit4]   2> 	at org.apache.zookeeper.server.NIOServerCnxnFactory.run(NIOServerCnxnFactory.java:208)
   [junit4]   2> 	at java.lang.Thread.run(Thread.java:745)
   [junit4]   2> 1167625 INFO  (jetty-launcher-2485-thread-2) [    ] o.e.j.s.h.ContextHandler Stopped o.e.j.s.ServletContextHandler@2e0cf4ed{/solr,null,UNAVAILABLE}
   [junit4]   2> 1169109 WARN  (zkCallback-2496-thread-1-processing-n:127.0.0.1:58774_solr) [n:127.0.0.1:58774_solr    ] o.a.s.c.c.ZkStateReader ZooKeeper watch triggered, but Solr cannot talk to ZK: [KeeperErrorCode = Session expired for /live_nodes]
   [junit4]   2> 1169109 INFO  (jetty-launcher-2485-thread-1) [    ] o.a.s.m.SolrMetricManager Closing metric reporters for: solr.node
   [junit4]   2> 1169110 ERROR (Thread[Thread-2840,5,TGRP-TestSolrCloudWithDelegationTokens]) [n:127.0.0.1:58774_solr    ] o.a.h.s.t.d.AbstractDelegationTokenSecretManager ExpiredTokenRemover received java.lang.InterruptedException: sleep interrupted
   [junit4]   2> 1169113 WARN  (NIOServerCxn.Factory:0.0.0.0/0.0.0.0:0) [    ] o.a.z.s.NIOServerCnxn caught end of stream exception
   [junit4]   2> EndOfStreamException: Unable to read additional data from client sessionid 0x15962e363a10008, likely client has closed socket
   [junit4]   2> 	at org.apache.zookeeper.server.NIOServerCnxn.doIO(NIOServerCnxn.java:228)
   [junit4]   2> 	at org.apache.zookeeper.server.NIOServerCnxnFactory.run(NIOServerCnxnFactory.java:208)
   [junit4]   2> 	at java.lang.Thread.run(Thread.java:745)
   [junit4]   2> 1169114 INFO  (jetty-launcher-2485-thread-1) [    ] o.e.j.s.h.ContextHandler Stopped o.e.j.s.ServletContextHandler@55912d2a{/solr,null,UNAVAILABLE}
   [junit4]   2> 1169119 INFO  (SUITE-TestSolrCloudWithDelegationTokens-seed#[521434FFBEAD03FB]-worker) [    ] o.a.s.c.ZkTestServer connecting to 127.0.0.1:58767 58767
   [junit4]   2> 1169121 INFO  (Thread-2815) [    ] o.a.s.c.ZkTestServer connecting to 127.0.0.1:58767 58767
   [junit4]   2> 1169122 WARN  (Thread-2815) [    ] o.a.s.c.ZkTestServer Watch limit violations: 
   [junit4]   2> Maximum concurrent create/delete watches above limit:
   [junit4]   2> 
   [junit4]   2> 	14	/solr/aliases.json
   [junit4]   2> 	14	/solr/clusterprops.json
   [junit4]   2> 	2	/solr/security.json
   [junit4]   2> 
   [junit4]   2> Maximum concurrent data watches above limit:
   [junit4]   2> 
   [junit4]   2> 	14	/solr/clusterstate.json
   [junit4]   2> 	4	/solr/security/zkdtsm/ZKDTSMRoot/ZKDTSMKeyIdRoot
   [junit4]   2> 	2	/solr/security/zkdtsm/ZKDTSMRoot/ZKDTSMTokensRoot/DT_7
   [junit4]   2> 	2	/solr/security/zkdtsm/ZKDTSMRoot/ZKDTSMTokensRoot/DT_6
   [junit4]   2> 	2	/solr/security/zkdtsm/ZKDTSMRoot/ZKDTSMTokensRoot/DT_9
   [junit4]   2> 	2	/solr/security/zkdtsm/ZKDTSMRoot/ZKDTSMTokensRoot/DT_8
   [junit4]   2> 	2	/solr/security/zkdtsm/ZKDTSMRoot/ZKDTSMMasterKeyRoot/DK_1
   [junit4]   2> 	2	/solr/security/zkdtsm/ZKDTSMRoot/ZKDTSMTokensRoot/DT_1
   [junit4]   2> 	2	/solr/security/zkdtsm/ZKDTSMRoot/ZKDTSMMasterKeyRoot/DK_3
   [junit4]   2> 	2	/solr/security/zkdtsm/ZKDTSMRoot/ZKDTSMTokensRoot/DT_3
   [junit4]   2> 	2	/solr/security/zkdtsm/ZKDTSMRoot/ZKDTSMMasterKeyRoot/DK_2
   [junit4]   2> 	2	/solr/security/zkdtsm/ZKDTSMRoot/ZKDTSMTokensRoot/DT_2
   [junit4]   2> 	2	/solr/security/zkdtsm/ZKDTSMRoot/ZKDTSMTokensRoot/DT_5
   [junit4]   2> 	2	/solr/security/zkdtsm/ZKDTSMRoot/ZKDTSMMasterKeyRoot/DK_4
   [junit4]   2> 	2	/solr/security/zkdtsm/ZKDTSMRoot/ZKDTSMTokensRoot/DT_4
   [junit4]   2> 	2	/solr/security/zkdtsm/ZKDTSMRoot/ZKDTSMTokensRoot/DT_12
   [junit4]   2> 	2	/solr/security/zkdtsm/ZKDTSMRoot/ZKDTSMSeqNumRoot
   [junit4]   2> 	2	/solr/security/zkdtsm/ZKDTSMRoot/ZKDTSMTokensRoot/DT_11
   [junit4]   2> 	2	/solr/security/zkdtsm/ZKDTSMRoot/ZKDTSMTokensRoot/DT_10
   [junit4]   2> 
   [junit4]   2> Maximum concurrent children watches above limit:
   [junit4]   2> 
   [junit4]   2> 	14	/solr/live_nodes
   [junit4]   2> 	14	/solr/collections
   [junit4]   2> 	3	/solr/overseer/queue
   [junit4]   2> 	3	/solr/overseer/collection-queue-work
   [junit4]   2> 	2	/solr/security/zkdtsm/ZKDTSMRoot/ZKDTSMMasterKeyRoot
   [junit4]   2> 	2	/solr/overseer/queue-work
   [junit4]   2> 	2	/solr/security/zkdtsm/ZKDTSMRoot/ZKDTSMTokensRoot
   [junit4]   2> 
   [junit4]   2> 1169122 INFO  (SUITE-TestSolrCloudWithDelegationTokens-seed#[521434FFBEAD03FB]-worker) [    ] o.a.s.SolrTestCaseJ4 ###deleteCore
   [junit4]   2> NOTE: leaving temporary files on disk at: C:\Users\jenkins\workspace\Lucene-Solr-master-Windows\solr\build\solr-core\test\J1\temp\solr.cloud.TestSolrCloudWithDelegationTokens_521434FFBEAD03FB-001
   [junit4]   2> Jan 03, 2017 5:53:11 AM com.carrotsearch.randomizedtesting.ThreadLeakControl checkThreadLeaks
   [junit4]   2> WARNING: Will linger awaiting termination of 2 leaked thread(s).
   [junit4]   2> NOTE: test params are: codec=Asserting(Lucene70): {}, docValues:{}, maxPointsInLeafNode=1345, maxMBSortInHeap=6.406712384241921, sim=RandomSimilarity(queryNorm=false): {}, locale=ar-QA, timezone=America/Sitka
   [junit4]   2> NOTE: Windows 10 10.0 amd64/Oracle Corporation 1.8.0_112 (64-bit)/cpus=3,threads=1,free=278584608,total=518979584
   [junit4]   2> NOTE: All tests run in this JVM: [TestAuthorizationFramework, WrapperMergePolicyFactoryTest, TestSubQueryTransformerCrossCore, CurrencyFieldOpenExchangeTest, AutoCommitTest, TestBinaryResponseWriter, TestDistributedGrouping, SolrCoreCheckLockOnStartupTest, SpellCheckCollatorTest, TestStressLiveNodes, TestCollationFieldDocValues, NoCacheHeaderTest, ClassificationUpdateProcessorIntegrationTest, SolrCmdDistributorTest, TestNumericTerms64, TestUseDocValuesAsStored2, InfoHandlerTest, TestShortCircuitedRequests, TestDynamicFieldResource, TestRebalanceLeaders, TestPHPSerializedResponseWriter, HLLSerializationTest, TestLMDirichletSimilarityFactory, TestRestoreCore, TestMacroExpander, LoggingHandlerTest, CleanupOldIndexTest, TestRawTransformer, TestNoOpRegenerator, HdfsRecoverLeaseTest, TestChildDocTransformer, TestBulkSchemaConcurrent, JavabinLoaderTest, TestManagedSchemaAPI, TestOmitPositions, TestNRTOpen, URLClassifyProcessorTest, TestShardHandlerFactory, TestSolrConfigHandlerConcurrent, RulesTest, TestRecovery, CSVRequestHandlerTest, TestSimpleTrackingShardHandler, TestRandomFaceting, RollingRestartTest, TestConfigReload, HdfsBasicDistributedZk2Test, TestLRUStatsCache, CoreAdminRequestStatusTest, ZkSolrClientTest, TestQueryWrapperFilter, TestSolrCLIRunExample, TestDistributedStatsComponentCardinality, TestIndexSearcher, FieldAnalysisRequestHandlerTest, TestSearcherReuse, CollectionsAPISolrJTest, TestZkChroot, TestSchemaResource, BigEndianAscendingWordSerializerTest, TestRuleBasedAuthorizationPlugin, TestDelegationWithHadoopAuth, TestManagedSynonymFilterFactory, CdcrBootstrapTest, DistanceFunctionTest, DistributedTermsComponentTest, BadIndexSchemaTest, AnalyticsQueryTest, TestCloudInspectUtil, CircularListTest, TestHdfsCloudBackupRestore, ExplicitHLLTest, ForceLeaderTest, DefaultValueUpdateProcessorTest, TestGraphTermsQParserPlugin, TestFoldingMultitermQuery, ShufflingReplicaListTransformerTest, TestCodecSupport, DebugComponentTest, TestExactSharedStatsCache, TestAtomicUpdateErrorCases, OverseerStatusTest, PreAnalyzedFieldTest, FileBasedSpellCheckerTest, CloneFieldUpdateProcessorFactoryTest, TestQuerySenderListener, RequestHandlersTest, CdcrVersionReplicationTest, TestComplexPhraseQParserPlugin, CdcrUpdateLogTest, TestDocTermOrds, TestConfigSetsAPIZkFailure, TestSolrIndexConfig, TestLocalFSCloudBackupRestore, SortByFunctionTest, TestWriterPerf, BasicFunctionalityTest, CacheHeaderTest, TestScoreJoinQPNoScore, ZkStateReaderTest, JsonLoaderTest, CoreSorterTest, AsyncCallRequestStatusResponseTest, TestRequestForwarding, TestUniqueKeyFieldResource, BooleanFieldTest, DeleteShardTest, TestDFRSimilarityFactory, UUIDFieldTest, LeaderElectionIntegrationTest, SpellPossibilityIteratorTest, AddBlockUpdateTest, TestAnalyzeInfixSuggestions, DistributedExpandComponentTest, TestFieldSortValues, TestSSLRandomization, LeaderInitiatedRecoveryOnShardRestartTest, DistributedQueryComponentOptimizationTest, UtilsToolTest, ChaosMonkeySafeLeaderTest, TestFiltering, MultiThreadedOCPTest, TestMiniSolrCloudClusterSSL, TestConfig, HdfsCollectionsAPIDistributedZkTest, TestBadConfig, TestMinMaxOnMultiValuedField, TestCorePropertiesReload, CdcrReplicationHandlerTest, ResponseHeaderTest, PreAnalyzedFieldManagedSchemaCloudTest, TestLeaderElectionZkExpiry, TestInitQParser, QueryResultKeyTest, SliceStateTest, FullSolrCloudDistribCmdsTest, ReplicationFactorTest, TriLevelCompositeIdRoutingTest, MinimalSchemaTest, DateMathParserTest, ReturnFieldsTest, TestDefaultSearchFieldResource, SolrJmxReporterTest, SharedFSAutoReplicaFailoverTest, ResourceLoaderTest, TestDistributedMissingSort, TestSolrCloudWithDelegationTokens]
   [junit4] Completed [269/673 (1!)] on J1 in 5.89s, 8 tests, 1 failure <<< FAILURES!

[...truncated 63754 lines...]


Mime
View raw message