lucene-dev mailing list archives

Site index · List index
Message view « Date » · « Thread »
Top « Date » · « Thread »
From Policeman Jenkins Server <jenk...@thetaphi.de>
Subject [JENKINS] Lucene-Solr-master-Windows (32bit/jdk1.8.0_112) - Build # 6327 - Unstable!
Date Mon, 02 Jan 2017 00:37:03 GMT
Build: https://jenkins.thetaphi.de/job/Lucene-Solr-master-Windows/6327/
Java: 32bit/jdk1.8.0_112 -client -XX:+UseParallelGC

1 tests failed.
FAILED:  org.apache.solr.cloud.TestSolrCloudWithDelegationTokens.testDelegationTokenCancelFail

Error Message:
expected:<200> but was:<404>

Stack Trace:
java.lang.AssertionError: expected:<200> but was:<404>
	at __randomizedtesting.SeedInfo.seed([240F80EB52B8593E:4CB0B5C182224BD2]:0)
	at org.junit.Assert.fail(Assert.java:93)
	at org.junit.Assert.failNotEquals(Assert.java:647)
	at org.junit.Assert.assertEquals(Assert.java:128)
	at org.junit.Assert.assertEquals(Assert.java:472)
	at org.junit.Assert.assertEquals(Assert.java:456)
	at org.apache.solr.cloud.TestSolrCloudWithDelegationTokens.cancelDelegationToken(TestSolrCloudWithDelegationTokens.java:140)
	at org.apache.solr.cloud.TestSolrCloudWithDelegationTokens.testDelegationTokenCancelFail(TestSolrCloudWithDelegationTokens.java:294)
	at sun.reflect.NativeMethodAccessorImpl.invoke0(Native Method)
	at sun.reflect.NativeMethodAccessorImpl.invoke(NativeMethodAccessorImpl.java:62)
	at sun.reflect.DelegatingMethodAccessorImpl.invoke(DelegatingMethodAccessorImpl.java:43)
	at java.lang.reflect.Method.invoke(Method.java:498)
	at com.carrotsearch.randomizedtesting.RandomizedRunner.invoke(RandomizedRunner.java:1713)
	at com.carrotsearch.randomizedtesting.RandomizedRunner$8.evaluate(RandomizedRunner.java:907)
	at com.carrotsearch.randomizedtesting.RandomizedRunner$9.evaluate(RandomizedRunner.java:943)
	at com.carrotsearch.randomizedtesting.RandomizedRunner$10.evaluate(RandomizedRunner.java:957)
	at com.carrotsearch.randomizedtesting.rules.SystemPropertiesRestoreRule$1.evaluate(SystemPropertiesRestoreRule.java:57)
	at org.apache.lucene.util.TestRuleSetupTeardownChained$1.evaluate(TestRuleSetupTeardownChained.java:49)
	at org.apache.lucene.util.AbstractBeforeAfterRule$1.evaluate(AbstractBeforeAfterRule.java:45)
	at org.apache.lucene.util.TestRuleThreadAndTestName$1.evaluate(TestRuleThreadAndTestName.java:48)
	at org.apache.lucene.util.TestRuleIgnoreAfterMaxFailures$1.evaluate(TestRuleIgnoreAfterMaxFailures.java:64)
	at org.apache.lucene.util.TestRuleMarkFailure$1.evaluate(TestRuleMarkFailure.java:47)
	at com.carrotsearch.randomizedtesting.rules.StatementAdapter.evaluate(StatementAdapter.java:36)
	at com.carrotsearch.randomizedtesting.ThreadLeakControl$StatementRunner.run(ThreadLeakControl.java:367)
	at com.carrotsearch.randomizedtesting.ThreadLeakControl.forkTimeoutingTask(ThreadLeakControl.java:811)
	at com.carrotsearch.randomizedtesting.ThreadLeakControl$3.evaluate(ThreadLeakControl.java:462)
	at com.carrotsearch.randomizedtesting.RandomizedRunner.runSingleTest(RandomizedRunner.java:916)
	at com.carrotsearch.randomizedtesting.RandomizedRunner$5.evaluate(RandomizedRunner.java:802)
	at com.carrotsearch.randomizedtesting.RandomizedRunner$6.evaluate(RandomizedRunner.java:852)
	at com.carrotsearch.randomizedtesting.RandomizedRunner$7.evaluate(RandomizedRunner.java:863)
	at com.carrotsearch.randomizedtesting.rules.StatementAdapter.evaluate(StatementAdapter.java:36)
	at com.carrotsearch.randomizedtesting.rules.SystemPropertiesRestoreRule$1.evaluate(SystemPropertiesRestoreRule.java:57)
	at org.apache.lucene.util.AbstractBeforeAfterRule$1.evaluate(AbstractBeforeAfterRule.java:45)
	at com.carrotsearch.randomizedtesting.rules.StatementAdapter.evaluate(StatementAdapter.java:36)
	at org.apache.lucene.util.TestRuleStoreClassName$1.evaluate(TestRuleStoreClassName.java:41)
	at com.carrotsearch.randomizedtesting.rules.NoShadowingOrOverridesOnMethodsRule$1.evaluate(NoShadowingOrOverridesOnMethodsRule.java:40)
	at com.carrotsearch.randomizedtesting.rules.NoShadowingOrOverridesOnMethodsRule$1.evaluate(NoShadowingOrOverridesOnMethodsRule.java:40)
	at com.carrotsearch.randomizedtesting.rules.StatementAdapter.evaluate(StatementAdapter.java:36)
	at com.carrotsearch.randomizedtesting.rules.StatementAdapter.evaluate(StatementAdapter.java:36)
	at com.carrotsearch.randomizedtesting.rules.StatementAdapter.evaluate(StatementAdapter.java:36)
	at org.apache.lucene.util.TestRuleAssertionsRequired$1.evaluate(TestRuleAssertionsRequired.java:53)
	at org.apache.lucene.util.TestRuleMarkFailure$1.evaluate(TestRuleMarkFailure.java:47)
	at org.apache.lucene.util.TestRuleIgnoreAfterMaxFailures$1.evaluate(TestRuleIgnoreAfterMaxFailures.java:64)
	at org.apache.lucene.util.TestRuleIgnoreTestSuites$1.evaluate(TestRuleIgnoreTestSuites.java:54)
	at com.carrotsearch.randomizedtesting.rules.StatementAdapter.evaluate(StatementAdapter.java:36)
	at com.carrotsearch.randomizedtesting.ThreadLeakControl$StatementRunner.run(ThreadLeakControl.java:367)
	at java.lang.Thread.run(Thread.java:745)




Build Log:
[...truncated 12367 lines...]
   [junit4] Suite: org.apache.solr.cloud.TestSolrCloudWithDelegationTokens
   [junit4]   2> Creating dataDir: C:\Users\jenkins\workspace\Lucene-Solr-master-Windows\solr\build\solr-core\test\J1\temp\solr.cloud.TestSolrCloudWithDelegationTokens_240F80EB52B8593E-001\init-core-data-001
   [junit4]   2> 2201906 INFO  (SUITE-TestSolrCloudWithDelegationTokens-seed#[240F80EB52B8593E]-worker) [    ] o.a.s.SolrTestCaseJ4 Randomized ssl (false) and clientAuth (false) via: @org.apache.solr.util.RandomizeSSL(reason=, value=NaN, ssl=NaN, clientAuth=NaN)
   [junit4]   2> 2201911 INFO  (SUITE-TestSolrCloudWithDelegationTokens-seed#[240F80EB52B8593E]-worker) [    ] o.a.s.c.MiniSolrCloudCluster Starting cluster of 2 servers in C:\Users\jenkins\workspace\Lucene-Solr-master-Windows\solr\build\solr-core\test\J1\temp\solr.cloud.TestSolrCloudWithDelegationTokens_240F80EB52B8593E-001\tempDir-001
   [junit4]   2> 2201912 INFO  (SUITE-TestSolrCloudWithDelegationTokens-seed#[240F80EB52B8593E]-worker) [    ] o.a.s.c.ZkTestServer STARTING ZK TEST SERVER
   [junit4]   2> 2201912 INFO  (Thread-4727) [    ] o.a.s.c.ZkTestServer client port:0.0.0.0/0.0.0.0:0
   [junit4]   2> 2201913 INFO  (Thread-4727) [    ] o.a.s.c.ZkTestServer Starting server
   [junit4]   2> 2202012 INFO  (SUITE-TestSolrCloudWithDelegationTokens-seed#[240F80EB52B8593E]-worker) [    ] o.a.s.c.ZkTestServer start zk server on port:60025
   [junit4]   2> 2202023 INFO  (jetty-launcher-3998-thread-2) [    ] o.e.j.s.Server jetty-9.3.14.v20161028
   [junit4]   2> 2202023 INFO  (jetty-launcher-3998-thread-1) [    ] o.e.j.s.Server jetty-9.3.14.v20161028
   [junit4]   2> 2202024 INFO  (jetty-launcher-3998-thread-2) [    ] o.e.j.s.h.ContextHandler Started o.e.j.s.ServletContextHandler@17c2b6c{/solr,null,AVAILABLE}
   [junit4]   2> 2202024 INFO  (jetty-launcher-3998-thread-1) [    ] o.e.j.s.h.ContextHandler Started o.e.j.s.ServletContextHandler@13052f0{/solr,null,AVAILABLE}
   [junit4]   2> 2202025 INFO  (jetty-launcher-3998-thread-2) [    ] o.e.j.s.AbstractConnector Started ServerConnector@10296d2{HTTP/1.1,[http/1.1]}{127.0.0.1:60029}
   [junit4]   2> 2202025 INFO  (jetty-launcher-3998-thread-1) [    ] o.e.j.s.AbstractConnector Started ServerConnector@1d39951{HTTP/1.1,[http/1.1]}{127.0.0.1:60032}
   [junit4]   2> 2202025 INFO  (jetty-launcher-3998-thread-2) [    ] o.e.j.s.Server Started @2206632ms
   [junit4]   2> 2202025 INFO  (jetty-launcher-3998-thread-1) [    ] o.e.j.s.Server Started @2206632ms
   [junit4]   2> 2202025 INFO  (jetty-launcher-3998-thread-2) [    ] o.a.s.c.s.e.JettySolrRunner Jetty properties: {hostContext=/solr, hostPort=60029}
   [junit4]   2> 2202025 INFO  (jetty-launcher-3998-thread-1) [    ] o.a.s.c.s.e.JettySolrRunner Jetty properties: {hostContext=/solr, hostPort=60032}
   [junit4]   2> 2202026 ERROR (jetty-launcher-3998-thread-1) [    ] o.a.s.s.StartupLoggingUtils Missing Java Option solr.log.dir. Logging may be missing or incomplete.
   [junit4]   2> 2202026 ERROR (jetty-launcher-3998-thread-2) [    ] o.a.s.s.StartupLoggingUtils Missing Java Option solr.log.dir. Logging may be missing or incomplete.
   [junit4]   2> 2202026 INFO  (jetty-launcher-3998-thread-1) [    ] o.a.s.s.SolrDispatchFilter  ___      _       Welcome to Apache Solr™ version 7.0.0
   [junit4]   2> 2202026 INFO  (jetty-launcher-3998-thread-2) [    ] o.a.s.s.SolrDispatchFilter  ___      _       Welcome to Apache Solr™ version 7.0.0
   [junit4]   2> 2202026 INFO  (jetty-launcher-3998-thread-1) [    ] o.a.s.s.SolrDispatchFilter / __| ___| |_ _   Starting in cloud mode on port null
   [junit4]   2> 2202026 INFO  (jetty-launcher-3998-thread-2) [    ] o.a.s.s.SolrDispatchFilter / __| ___| |_ _   Starting in cloud mode on port null
   [junit4]   2> 2202026 INFO  (jetty-launcher-3998-thread-1) [    ] o.a.s.s.SolrDispatchFilter \__ \/ _ \ | '_|  Install dir: null
   [junit4]   2> 2202026 INFO  (jetty-launcher-3998-thread-2) [    ] o.a.s.s.SolrDispatchFilter \__ \/ _ \ | '_|  Install dir: null
   [junit4]   2> 2202026 INFO  (jetty-launcher-3998-thread-1) [    ] o.a.s.s.SolrDispatchFilter |___/\___/_|_|    Start time: 2017-01-02T00:07:49.549Z
   [junit4]   2> 2202026 INFO  (jetty-launcher-3998-thread-2) [    ] o.a.s.s.SolrDispatchFilter |___/\___/_|_|    Start time: 2017-01-02T00:07:49.549Z
   [junit4]   2> 2202034 INFO  (jetty-launcher-3998-thread-2) [    ] o.a.s.s.SolrDispatchFilter solr.xml found in ZooKeeper. Loading...
   [junit4]   2> 2202034 INFO  (jetty-launcher-3998-thread-1) [    ] o.a.s.s.SolrDispatchFilter solr.xml found in ZooKeeper. Loading...
   [junit4]   2> 2202057 INFO  (jetty-launcher-3998-thread-1) [    ] o.a.s.c.ZkContainer Zookeeper client=127.0.0.1:60025/solr
   [junit4]   2> 2202057 INFO  (jetty-launcher-3998-thread-2) [    ] o.a.s.c.ZkContainer Zookeeper client=127.0.0.1:60025/solr
   [junit4]   2> 2202060 WARN  (NIOServerCxn.Factory:0.0.0.0/0.0.0.0:0) [    ] o.a.z.s.NIOServerCnxn caught end of stream exception
   [junit4]   2> EndOfStreamException: Unable to read additional data from client sessionid 0x1595c80e9c10003, likely client has closed socket
   [junit4]   2> 	at org.apache.zookeeper.server.NIOServerCnxn.doIO(NIOServerCnxn.java:228)
   [junit4]   2> 	at org.apache.zookeeper.server.NIOServerCnxnFactory.run(NIOServerCnxnFactory.java:208)
   [junit4]   2> 	at java.lang.Thread.run(Thread.java:745)
   [junit4]   2> 2202061 WARN  (NIOServerCxn.Factory:0.0.0.0/0.0.0.0:0) [    ] o.a.z.s.NIOServerCnxn caught end of stream exception
   [junit4]   2> EndOfStreamException: Unable to read additional data from client sessionid 0x1595c80e9c10004, likely client has closed socket
   [junit4]   2> 	at org.apache.zookeeper.server.NIOServerCnxn.doIO(NIOServerCnxn.java:228)
   [junit4]   2> 	at org.apache.zookeeper.server.NIOServerCnxnFactory.run(NIOServerCnxnFactory.java:208)
   [junit4]   2> 	at java.lang.Thread.run(Thread.java:745)
   [junit4]   2> 2202092 INFO  (jetty-launcher-3998-thread-1) [n:127.0.0.1:60032_solr    ] o.a.s.c.OverseerElectionContext I am going to be the leader 127.0.0.1:60032_solr
   [junit4]   2> 2202093 INFO  (jetty-launcher-3998-thread-2) [n:127.0.0.1:60029_solr    ] o.a.s.c.ZkController Register node as live in ZooKeeper:/live_nodes/127.0.0.1:60029_solr
   [junit4]   2> 2202094 INFO  (jetty-launcher-3998-thread-1) [n:127.0.0.1:60032_solr    ] o.a.s.c.Overseer Overseer (id=97210575712485382-127.0.0.1:60032_solr-n_0000000000) starting
   [junit4]   2> 2202095 INFO  (zkCallback-4008-thread-1-processing-n:127.0.0.1:60029_solr) [n:127.0.0.1:60029_solr    ] o.a.s.c.c.ZkStateReader Updated live nodes from ZooKeeper... (0) -> (1)
   [junit4]   2> 2202095 INFO  (zkCallback-4009-thread-1-processing-n:127.0.0.1:60032_solr) [n:127.0.0.1:60032_solr    ] o.a.s.c.c.ZkStateReader Updated live nodes from ZooKeeper... (0) -> (1)
   [junit4]   2> 2202107 INFO  (jetty-launcher-3998-thread-1) [n:127.0.0.1:60032_solr    ] o.a.s.c.ZkController Register node as live in ZooKeeper:/live_nodes/127.0.0.1:60032_solr
   [junit4]   2> 2202110 INFO  (zkCallback-4008-thread-1-processing-n:127.0.0.1:60029_solr) [n:127.0.0.1:60029_solr    ] o.a.s.c.c.ZkStateReader Updated live nodes from ZooKeeper... (1) -> (2)
   [junit4]   2> 2202110 INFO  (zkCallback-4009-thread-1-processing-n:127.0.0.1:60032_solr) [n:127.0.0.1:60032_solr    ] o.a.s.c.c.ZkStateReader Updated live nodes from ZooKeeper... (1) -> (2)
   [junit4]   2> 2202287 INFO  (jetty-launcher-3998-thread-2) [n:127.0.0.1:60029_solr    ] o.a.s.c.CoreContainer Initializing authentication plugin: org.apache.solr.security.HttpParamDelegationTokenPlugin
   [junit4]   2> 2202326 INFO  (jetty-launcher-3998-thread-1) [n:127.0.0.1:60032_solr    ] o.a.s.c.CoreContainer Initializing authentication plugin: org.apache.solr.security.HttpParamDelegationTokenPlugin
   [junit4]   2> 2202343 INFO  (jetty-launcher-3998-thread-2) [n:127.0.0.1:60029_solr    ] o.a.s.s.KerberosPlugin Params: {token.valid=30, delegation-token.token-kind=solr-dt, cookie.domain=127.0.0.1, cookie.path=/, zk-dt-secret-manager.znodeWorkingPath=solr/security/zkdtsm, token.validity=36000, signer.secret.provider.zookeeper.path=/token, type=kerberos, zk-dt-secret-manager.enable=true, kerberos.name.rules=DEFAULT, signer.secret.provider=zookeeper}
   [junit4]   2> 2202343 INFO  (jetty-launcher-3998-thread-1) [n:127.0.0.1:60032_solr    ] o.a.s.s.KerberosPlugin Params: {token.valid=30, delegation-token.token-kind=solr-dt, cookie.domain=127.0.0.1, cookie.path=/, zk-dt-secret-manager.znodeWorkingPath=solr/security/zkdtsm, token.validity=36000, signer.secret.provider.zookeeper.path=/token, type=kerberos, zk-dt-secret-manager.enable=true, kerberos.name.rules=DEFAULT, signer.secret.provider=zookeeper}
   [junit4]   2> 2202649 INFO  (jetty-launcher-3998-thread-1) [n:127.0.0.1:60032_solr    ] o.a.c.f.i.CuratorFrameworkImpl Starting
   [junit4]   2> 2202649 INFO  (jetty-launcher-3998-thread-2) [n:127.0.0.1:60029_solr    ] o.a.c.f.i.CuratorFrameworkImpl Starting
   [junit4]   2> 2202700 INFO  (jetty-launcher-3998-thread-1-EventThread) [n:127.0.0.1:60032_solr    ] o.a.c.f.s.ConnectionStateManager State change: CONNECTED
   [junit4]   2> 2202700 INFO  (jetty-launcher-3998-thread-2-EventThread) [n:127.0.0.1:60029_solr    ] o.a.c.f.s.ConnectionStateManager State change: CONNECTED
   [junit4]   2> 2202898 ERROR (jetty-launcher-3998-thread-1) [n:127.0.0.1:60032_solr    ] o.a.h.u.Shell Failed to locate the winutils binary in the hadoop binary path
   [junit4]   2> java.io.IOException: Could not locate executable null\bin\winutils.exe in the Hadoop binaries.
   [junit4]   2> 	at org.apache.hadoop.util.Shell.getQualifiedBinPath(Shell.java:356)
   [junit4]   2> 	at org.apache.hadoop.util.Shell.getWinUtilsPath(Shell.java:371)
   [junit4]   2> 	at org.apache.hadoop.util.Shell.<clinit>(Shell.java:364)
   [junit4]   2> 	at org.apache.hadoop.util.StringUtils.<clinit>(StringUtils.java:80)
   [junit4]   2> 	at org.apache.hadoop.conf.Configuration.getBoolean(Configuration.java:1437)
   [junit4]   2> 	at org.apache.hadoop.security.token.delegation.web.DelegationTokenManager.<init>(DelegationTokenManager.java:115)
   [junit4]   2> 	at org.apache.hadoop.security.token.delegation.web.DelegationTokenAuthenticationHandler.initTokenManager(DelegationTokenAuthenticationHandler.java:148)
   [junit4]   2> 	at org.apache.hadoop.security.token.delegation.web.DelegationTokenAuthenticationHandler.init(DelegationTokenAuthenticationHandler.java:118)
   [junit4]   2> 	at org.apache.solr.security.HttpParamDelegationTokenPlugin$HttpParamDelegationTokenAuthenticationHandler.init(HttpParamDelegationTokenPlugin.java:178)
   [junit4]   2> 	at org.apache.hadoop.security.authentication.server.AuthenticationFilter.initializeAuthHandler(AuthenticationFilter.java:238)
   [junit4]   2> 	at org.apache.hadoop.security.token.delegation.web.DelegationTokenAuthenticationFilter.initializeAuthHandler(DelegationTokenAuthenticationFilter.java:209)
   [junit4]   2> 	at org.apache.solr.security.DelegationTokenKerberosFilter.initializeAuthHandler(DelegationTokenKerberosFilter.java:142)
   [junit4]   2> 	at org.apache.hadoop.security.authentication.server.AuthenticationFilter.init(AuthenticationFilter.java:227)
   [junit4]   2> 	at org.apache.hadoop.security.token.delegation.web.DelegationTokenAuthenticationFilter.init(DelegationTokenAuthenticationFilter.java:175)
   [junit4]   2> 	at org.apache.solr.security.DelegationTokenKerberosFilter.init(DelegationTokenKerberosFilter.java:71)
   [junit4]   2> 	at org.apache.solr.security.HttpParamDelegationTokenPlugin.init(HttpParamDelegationTokenPlugin.java:134)
   [junit4]   2> 	at org.apache.solr.core.CoreContainer.initializeAuthenticationPlugin(CoreContainer.java:329)
   [junit4]   2> 	at org.apache.solr.core.CoreContainer.reloadSecurityProperties(CoreContainer.java:611)
   [junit4]   2> 	at org.apache.solr.core.CoreContainer.load(CoreContainer.java:486)
   [junit4]   2> 	at org.apache.solr.servlet.SolrDispatchFilter.createCoreContainer(SolrDispatchFilter.java:235)
   [junit4]   2> 	at org.apache.solr.servlet.SolrDispatchFilter.init(SolrDispatchFilter.java:167)
   [junit4]   2> 	at org.eclipse.jetty.servlet.FilterHolder.initialize(FilterHolder.java:137)
   [junit4]   2> 	at org.eclipse.jetty.servlet.ServletHandler.initialize(ServletHandler.java:873)
   [junit4]   2> 	at org.eclipse.jetty.servlet.ServletHandler.updateMappings(ServletHandler.java:1565)
   [junit4]   2> 	at org.eclipse.jetty.servlet.ServletHandler.setFilterMappings(ServletHandler.java:1599)
   [junit4]   2> 	at org.eclipse.jetty.servlet.ServletHandler.addFilterMapping(ServletHandler.java:1285)
   [junit4]   2> 	at org.eclipse.jetty.servlet.ServletHandler.addFilterWithMapping(ServletHandler.java:1130)
   [junit4]   2> 	at org.eclipse.jetty.servlet.ServletContextHandler.addFilter(ServletContextHandler.java:448)
   [junit4]   2> 	at org.apache.solr.client.solrj.embedded.JettySolrRunner$1.lifeCycleStarted(JettySolrRunner.java:260)
   [junit4]   2> 	at org.eclipse.jetty.util.component.AbstractLifeCycle.setStarted(AbstractLifeCycle.java:179)
   [junit4]   2> 	at org.eclipse.jetty.util.component.AbstractLifeCycle.start(AbstractLifeCycle.java:69)
   [junit4]   2> 	at org.apache.solr.client.solrj.embedded.JettySolrRunner.start(JettySolrRunner.java:348)
   [junit4]   2> 	at org.apache.solr.client.solrj.embedded.JettySolrRunner.start(JettySolrRunner.java:321)
   [junit4]   2> 	at org.apache.solr.cloud.MiniSolrCloudCluster.startJettySolrRunner(MiniSolrCloudCluster.java:376)
   [junit4]   2> 	at org.apache.solr.cloud.MiniSolrCloudCluster.lambda$new$0(MiniSolrCloudCluster.java:239)
   [junit4]   2> 	at java.util.concurrent.FutureTask.run(FutureTask.java:266)
   [junit4]   2> 	at org.apache.solr.common.util.ExecutorUtil$MDCAwareThreadPoolExecutor.lambda$execute$0(ExecutorUtil.java:229)
   [junit4]   2> 	at java.util.concurrent.ThreadPoolExecutor.runWorker(ThreadPoolExecutor.java:1142)
   [junit4]   2> 	at java.util.concurrent.ThreadPoolExecutor$Worker.run(ThreadPoolExecutor.java:617)
   [junit4]   2> 	at java.lang.Thread.run(Thread.java:745)
   [junit4]   2> 2203115 INFO  (jetty-launcher-3998-thread-1) [n:127.0.0.1:60032_solr    ] o.a.s.c.CorePropertiesLocator Found 0 core definitions underneath C:\Users\jenkins\workspace\Lucene-Solr-master-Windows\solr\build\solr-core\test\J1\temp\solr.cloud.TestSolrCloudWithDelegationTokens_240F80EB52B8593E-001\tempDir-001\node1\.
   [junit4]   2> 2203115 INFO  (jetty-launcher-3998-thread-2) [n:127.0.0.1:60029_solr    ] o.a.s.c.CorePropertiesLocator Found 0 core definitions underneath C:\Users\jenkins\workspace\Lucene-Solr-master-Windows\solr\build\solr-core\test\J1\temp\solr.cloud.TestSolrCloudWithDelegationTokens_240F80EB52B8593E-001\tempDir-001\node2\.
   [junit4]   2> 2205365 WARN  (NIOServerCxn.Factory:0.0.0.0/0.0.0.0:0) [    ] o.a.z.s.NIOServerCnxn caught end of stream exception
   [junit4]   2> EndOfStreamException: Unable to read additional data from client sessionid 0x1595c80e9c10009, likely client has closed socket
   [junit4]   2> 	at org.apache.zookeeper.server.NIOServerCnxn.doIO(NIOServerCnxn.java:228)
   [junit4]   2> 	at org.apache.zookeeper.server.NIOServerCnxnFactory.run(NIOServerCnxnFactory.java:208)
   [junit4]   2> 	at java.lang.Thread.run(Thread.java:745)
   [junit4]   2> 2205396 INFO  (TEST-TestSolrCloudWithDelegationTokens.testDelegationOtherOp-seed#[240F80EB52B8593E]) [    ] o.a.s.SolrTestCaseJ4 ###Starting testDelegationOtherOp
   [junit4]   2> 2205407 INFO  (TEST-TestSolrCloudWithDelegationTokens.testDelegationOtherOp-seed#[240F80EB52B8593E]) [    ] o.a.s.c.c.ZkStateReader Updated live nodes from ZooKeeper... (0) -> (2)
   [junit4]   2> 2205410 INFO  (TEST-TestSolrCloudWithDelegationTokens.testDelegationOtherOp-seed#[240F80EB52B8593E]) [    ] o.a.s.c.s.i.ZkClientClusterStateProvider Cluster at 127.0.0.1:60025/solr ready
   [junit4]   2> 2206037 INFO  (qtp8858072-22294) [n:127.0.0.1:60032_solr    ] o.a.s.h.a.CollectionsHandler Invoked Collection Action :list with params op=someSolrOperation&action=LIST&wt=javabin&version=2 and sendToOCPQueue=true
   [junit4]   2> 2206038 INFO  (qtp8858072-22294) [n:127.0.0.1:60032_solr    ] o.a.s.s.HttpSolrCall [admin] webapp=null path=/admin/collections params={op=someSolrOperation&action=LIST&wt=javabin&version=2} status=0 QTime=0
   [junit4]   2> 2206050 WARN  (TEST-TestSolrCloudWithDelegationTokens.testDelegationOtherOp-seed#[240F80EB52B8593E]) [    ] o.a.h.c.p.ResponseProcessCookies Invalid cookie header: "Set-Cookie: hadoop.auth="u=bar&p=bar&t=test&e=1483351672966&s=lmGpdwMceg9rrh9VtF+G7q7q1D8="; Path=/; Domain=127.0.0.1; Expires=Po, 02-Led-2017 10:07:52 GMT; HttpOnly". Invalid 'expires' attribute: Po, 02-Led-2017 10:07:52 GMT
   [junit4]   2> 2206051 WARN  (NIOServerCxn.Factory:0.0.0.0/0.0.0.0:0) [    ] o.a.z.s.NIOServerCnxn caught end of stream exception
   [junit4]   2> EndOfStreamException: Unable to read additional data from client sessionid 0x1595c80e9c1000a, likely client has closed socket
   [junit4]   2> 	at org.apache.zookeeper.server.NIOServerCnxn.doIO(NIOServerCnxn.java:228)
   [junit4]   2> 	at org.apache.zookeeper.server.NIOServerCnxnFactory.run(NIOServerCnxnFactory.java:208)
   [junit4]   2> 	at java.lang.Thread.run(Thread.java:745)
   [junit4]   2> 2206051 INFO  (TEST-TestSolrCloudWithDelegationTokens.testDelegationOtherOp-seed#[240F80EB52B8593E]) [    ] o.a.s.SolrTestCaseJ4 ###Ending testDelegationOtherOp
   [junit4]   2> 2206074 INFO  (TEST-TestSolrCloudWithDelegationTokens.testDelegationTokenSolrClient-seed#[240F80EB52B8593E]) [    ] o.a.s.SolrTestCaseJ4 ###Starting testDelegationTokenSolrClient
   [junit4]   2> 2207388 WARN  (TEST-TestSolrCloudWithDelegationTokens.testDelegationTokenSolrClient-seed#[240F80EB52B8593E]) [    ] o.a.h.c.p.ResponseProcessCookies Invalid cookie header: "Set-Cookie: hadoop.auth=; Path=/; Domain=127.0.0.1; Expires= t, 01-Led-1970 00:00:00 GMT; HttpOnly". Invalid 'expires' attribute: t, 01-Led-1970 00:00:00 GMT
   [junit4]   2> 2207409 INFO  (qtp26779116-22281) [n:127.0.0.1:60029_solr    ] o.a.s.h.a.CollectionsHandler Invoked Collection Action :list with params action=LIST&delegation=GgADYmFyA2JhcgCKAVlcgPo3igFZgI1-NwEDFKmMtqMCOOzWZwyfkgTqEld3ykdgB3NvbHItZHQA&wt=javabin&version=2 and sendToOCPQueue=true
   [junit4]   2> 2207409 INFO  (qtp26779116-22281) [n:127.0.0.1:60029_solr    ] o.a.s.s.HttpSolrCall [admin] webapp=null path=/admin/collections params={action=LIST&delegation=GgADYmFyA2JhcgCKAVlcgPo3igFZgI1-NwEDFKmMtqMCOOzWZwyfkgTqEld3ykdgB3NvbHItZHQA&wt=javabin&version=2} status=0 QTime=0
   [junit4]   2> 2207410 INFO  (TEST-TestSolrCloudWithDelegationTokens.testDelegationTokenSolrClient-seed#[240F80EB52B8593E]) [    ] o.a.s.SolrTestCaseJ4 ###Ending testDelegationTokenSolrClient
   [junit4]   2> 2207427 INFO  (TEST-TestSolrCloudWithDelegationTokens.testDelegationTokenRenewFail-seed#[240F80EB52B8593E]) [    ] o.a.s.SolrTestCaseJ4 ###Starting testDelegationTokenRenewFail
   [junit4]   2> 2207441 WARN  (qtp26779116-22296) [    ] o.a.h.s.a.s.AuthenticationFilter Authentication exception: org.apache.hadoop.security.AccessControlException: foo tries to renew a token with renewer bar
   [junit4]   2> 2207441 WARN  (qtp26779116-22296) [    ] o.a.s.s.KerberosPlugin Could not find org.apache.solr.security.authentication.requestcontinues
   [junit4]   2> 2207442 WARN  (TEST-TestSolrCloudWithDelegationTokens.testDelegationTokenRenewFail-seed#[240F80EB52B8593E]) [    ] o.a.h.c.p.ResponseProcessCookies Invalid cookie header: "Set-Cookie: hadoop.auth=; Path=/; Domain=127.0.0.1; Expires= t, 01-Led-1970 00:00:00 GMT; HttpOnly". Invalid 'expires' attribute: t, 01-Led-1970 00:00:00 GMT
   [junit4]   2> 2207444 WARN  (qtp8858072-22291) [    ] o.a.h.s.a.s.AuthenticationFilter Authentication exception: org.apache.hadoop.security.AccessControlException: foo tries to renew a token with renewer bar
   [junit4]   2> 2207445 WARN  (qtp8858072-22291) [    ] o.a.s.s.KerberosPlugin Could not find org.apache.solr.security.authentication.requestcontinues
   [junit4]   2> 2207445 WARN  (TEST-TestSolrCloudWithDelegationTokens.testDelegationTokenRenewFail-seed#[240F80EB52B8593E]) [    ] o.a.h.c.p.ResponseProcessCookies Invalid cookie header: "Set-Cookie: hadoop.auth=; Path=/; Domain=127.0.0.1; Expires= t, 01-Led-1970 00:00:00 GMT; HttpOnly". Invalid 'expires' attribute: t, 01-Led-1970 00:00:00 GMT
   [junit4]   2> 2207451 WARN  (qtp26779116-22284) [    ] o.a.h.s.a.s.AuthenticationFilter Authentication exception: org.apache.hadoop.security.AccessControlException: notRenewUser tries to renew a token with renewer renewUser
   [junit4]   2> 2207452 WARN  (qtp26779116-22284) [    ] o.a.s.s.KerberosPlugin Could not find org.apache.solr.security.authentication.requestcontinues
   [junit4]   2> 2207452 WARN  (TEST-TestSolrCloudWithDelegationTokens.testDelegationTokenRenewFail-seed#[240F80EB52B8593E]) [    ] o.a.h.c.p.ResponseProcessCookies Invalid cookie header: "Set-Cookie: hadoop.auth=; Path=/; Domain=127.0.0.1; Expires= t, 01-Led-1970 00:00:00 GMT; HttpOnly". Invalid 'expires' attribute: t, 01-Led-1970 00:00:00 GMT
   [junit4]   2> 2207453 WARN  (qtp8858072-22288) [    ] o.a.h.s.a.s.AuthenticationFilter Authentication exception: org.apache.hadoop.security.AccessControlException: notRenewUser tries to renew a token with renewer renewUser
   [junit4]   2> 2207454 WARN  (qtp8858072-22288) [    ] o.a.s.s.KerberosPlugin Could not find org.apache.solr.security.authentication.requestcontinues
   [junit4]   2> 2207454 WARN  (TEST-TestSolrCloudWithDelegationTokens.testDelegationTokenRenewFail-seed#[240F80EB52B8593E]) [    ] o.a.h.c.p.ResponseProcessCookies Invalid cookie header: "Set-Cookie: hadoop.auth=; Path=/; Domain=127.0.0.1; Expires= t, 01-Led-1970 00:00:00 GMT; HttpOnly". Invalid 'expires' attribute: t, 01-Led-1970 00:00:00 GMT
   [junit4]   2> 2207454 INFO  (TEST-TestSolrCloudWithDelegationTokens.testDelegationTokenRenewFail-seed#[240F80EB52B8593E]) [    ] o.a.s.SolrTestCaseJ4 ###Ending testDelegationTokenRenewFail
   [junit4]   2> 2207474 INFO  (TEST-TestSolrCloudWithDelegationTokens.testZNodePaths-seed#[240F80EB52B8593E]) [    ] o.a.s.SolrTestCaseJ4 ###Starting testZNodePaths
   [junit4]   2> 2207484 INFO  (TEST-TestSolrCloudWithDelegationTokens.testZNodePaths-seed#[240F80EB52B8593E]) [    ] o.a.s.SolrTestCaseJ4 ###Ending testZNodePaths
   [junit4]   2> 2207504 INFO  (TEST-TestSolrCloudWithDelegationTokens.testDelegationTokenCancel-seed#[240F80EB52B8593E]) [    ] o.a.s.SolrTestCaseJ4 ###Starting testDelegationTokenCancel
   [junit4]   2> 2207533 ERROR (qtp26779116-22278) [    ] o.a.h.s.t.d.ZKDelegationTokenSecretManager No node in path [/ZKDTSMTokensRoot/DT_5]
   [junit4]   2> 2207565 INFO  (TEST-TestSolrCloudWithDelegationTokens.testDelegationTokenCancel-seed#[240F80EB52B8593E]) [    ] o.a.s.c.c.ZkStateReader Updated live nodes from ZooKeeper... (0) -> (2)
   [junit4]   2> 2207567 INFO  (TEST-TestSolrCloudWithDelegationTokens.testDelegationTokenCancel-seed#[240F80EB52B8593E]) [    ] o.a.s.c.s.i.ZkClientClusterStateProvider Cluster at 127.0.0.1:60025/solr ready
   [junit4]   2> 2207569 WARN  (TEST-TestSolrCloudWithDelegationTokens.testDelegationTokenCancel-seed#[240F80EB52B8593E]) [    ] o.a.h.c.p.ResponseProcessCookies Invalid cookie header: "Set-Cookie: hadoop.auth=; Path=/; Domain=127.0.0.1; Expires= t, 01-Led-1970 00:00:00 GMT; HttpOnly". Invalid 'expires' attribute: t, 01-Led-1970 00:00:00 GMT
   [junit4]   2> 2207576 INFO  (TEST-TestSolrCloudWithDelegationTokens.testDelegationTokenCancel-seed#[240F80EB52B8593E]) [    ] o.a.s.c.c.ZkStateReader Updated live nodes from ZooKeeper... (0) -> (2)
   [junit4]   2> 2207578 INFO  (TEST-TestSolrCloudWithDelegationTokens.testDelegationTokenCancel-seed#[240F80EB52B8593E]) [    ] o.a.s.c.s.i.ZkClientClusterStateProvider Cluster at 127.0.0.1:60025/solr ready
   [junit4]   2> 2207580 WARN  (TEST-TestSolrCloudWithDelegationTokens.testDelegationTokenCancel-seed#[240F80EB52B8593E]) [    ] o.a.h.c.p.ResponseProcessCookies Invalid cookie header: "Set-Cookie: hadoop.auth=; Path=/; Domain=127.0.0.1; Expires= t, 01-Led-1970 00:00:00 GMT; HttpOnly". Invalid 'expires' attribute: t, 01-Led-1970 00:00:00 GMT
   [junit4]   2> 2207596 INFO  (TEST-TestSolrCloudWithDelegationTokens.testDelegationTokenCancel-seed#[240F80EB52B8593E]) [    ] o.a.s.c.c.ZkStateReader Updated live nodes from ZooKeeper... (0) -> (2)
   [junit4]   2> 2207598 INFO  (TEST-TestSolrCloudWithDelegationTokens.testDelegationTokenCancel-seed#[240F80EB52B8593E]) [    ] o.a.s.c.s.i.ZkClientClusterStateProvider Cluster at 127.0.0.1:60025/solr ready
   [junit4]   2> 2207600 ERROR (qtp8858072-22287) [    ] o.a.h.s.t.d.ZKDelegationTokenSecretManager No node in path [/ZKDTSMTokensRoot/DT_6]
   [junit4]   2> 2207604 WARN  (NIOServerCxn.Factory:0.0.0.0/0.0.0.0:0) [    ] o.a.z.s.NIOServerCnxn caught end of stream exception
   [junit4]   2> EndOfStreamException: Unable to read additional data from client sessionid 0x1595c80e9c1000e, likely client has closed socket
   [junit4]   2> 	at org.apache.zookeeper.server.NIOServerCnxn.doIO(NIOServerCnxn.java:228)
   [junit4]   2> 	at org.apache.zookeeper.server.NIOServerCnxnFactory.run(NIOServerCnxnFactory.java:208)
   [junit4]   2> 	at java.lang.Thread.run(Thread.java:745)
   [junit4]   2> 2207608 WARN  (TEST-TestSolrCloudWithDelegationTokens.testDelegationTokenCancel-seed#[240F80EB52B8593E]) [    ] o.a.h.c.p.ResponseProcessCookies Invalid cookie header: "Set-Cookie: hadoop.auth=; Path=/; Domain=127.0.0.1; Expires= t, 01-Led-1970 00:00:00 GMT; HttpOnly". Invalid 'expires' attribute: t, 01-Led-1970 00:00:00 GMT
   [junit4]   2> 2207615 INFO  (TEST-TestSolrCloudWithDelegationTokens.testDelegationTokenCancel-seed#[240F80EB52B8593E]) [    ] o.a.s.c.c.ZkStateReader Updated live nodes from ZooKeeper... (0) -> (2)
   [junit4]   2> 2207616 INFO  (TEST-TestSolrCloudWithDelegationTokens.testDelegationTokenCancel-seed#[240F80EB52B8593E]) [    ] o.a.s.c.s.i.ZkClientClusterStateProvider Cluster at 127.0.0.1:60025/solr ready
   [junit4]   2> 2207618 WARN  (TEST-TestSolrCloudWithDelegationTokens.testDelegationTokenCancel-seed#[240F80EB52B8593E]) [    ] o.a.h.c.p.ResponseProcessCookies Invalid cookie header: "Set-Cookie: hadoop.auth=; Path=/; Domain=127.0.0.1; Expires= t, 01-Led-1970 00:00:00 GMT; HttpOnly". Invalid 'expires' attribute: t, 01-Led-1970 00:00:00 GMT
   [junit4]   2> 2207619 WARN  (NIOServerCxn.Factory:0.0.0.0/0.0.0.0:0) [    ] o.a.z.s.NIOServerCnxn caught end of stream exception
   [junit4]   2> EndOfStreamException: Unable to read additional data from client sessionid 0x1595c80e9c1000f, likely client has closed socket
   [junit4]   2> 	at org.apache.zookeeper.server.NIOServerCnxn.doIO(NIOServerCnxn.java:228)
   [junit4]   2> 	at org.apache.zookeeper.server.NIOServerCnxnFactory.run(NIOServerCnxnFactory.java:208)
   [junit4]   2> 	at java.lang.Thread.run(Thread.java:745)
   [junit4]   2> 2207620 INFO  (TEST-TestSolrCloudWithDelegationTokens.testDelegationTokenCancel-seed#[240F80EB52B8593E]) [    ] o.a.s.SolrTestCaseJ4 ###Ending testDelegationTokenCancel
   [junit4]   2> 2207645 INFO  (TEST-TestSolrCloudWithDelegationTokens.testDelegationTokenRenew-seed#[240F80EB52B8593E]) [    ] o.a.s.SolrTestCaseJ4 ###Starting testDelegationTokenRenew
   [junit4]   2> 2207671 INFO  (qtp26779116-22278) [n:127.0.0.1:60029_solr    ] o.a.s.h.a.CollectionsHandler Invoked Collection Action :list with params action=LIST&delegation=GgADYmFyA2JhcgCKAVlcgQAgigFZgI2EIAcDFJhuP_zOdY59JmllUr6zdkNl5QnNB3NvbHItZHQA&wt=javabin&version=2 and sendToOCPQueue=true
   [junit4]   2> 2207672 INFO  (qtp26779116-22278) [n:127.0.0.1:60029_solr    ] o.a.s.s.HttpSolrCall [admin] webapp=null path=/admin/collections params={action=LIST&delegation=GgADYmFyA2JhcgCKAVlcgQAgigFZgI2EIAcDFJhuP_zOdY59JmllUr6zdkNl5QnNB3NvbHItZHQA&wt=javabin&version=2} status=0 QTime=0
   [junit4]   2> 2207679 INFO  (TEST-TestSolrCloudWithDelegationTokens.testDelegationTokenRenew-seed#[240F80EB52B8593E]) [    ] o.a.s.c.c.ZkStateReader Updated live nodes from ZooKeeper... (0) -> (2)
   [junit4]   2> 2207681 INFO  (TEST-TestSolrCloudWithDelegationTokens.testDelegationTokenRenew-seed#[240F80EB52B8593E]) [    ] o.a.s.c.s.i.ZkClientClusterStateProvider Cluster at 127.0.0.1:60025/solr ready
   [junit4]   2> 2207683 WARN  (TEST-TestSolrCloudWithDelegationTokens.testDelegationTokenRenew-seed#[240F80EB52B8593E]) [    ] o.a.h.c.p.ResponseProcessCookies Invalid cookie header: "Set-Cookie: hadoop.auth=; Path=/; Domain=127.0.0.1; Expires= t, 01-Led-1970 00:00:00 GMT; HttpOnly". Invalid 'expires' attribute: t, 01-Led-1970 00:00:00 GMT
   [junit4]   2> 2207687 INFO  (qtp8858072-22294) [n:127.0.0.1:60032_solr    ] o.a.s.h.a.CollectionsHandler Invoked Collection Action :list with params action=LIST&delegation=GgADYmFyA2JhcgCKAVlcgQAgigFZgI2EIAcDFJhuP_zOdY59JmllUr6zdkNl5QnNB3NvbHItZHQA&wt=javabin&version=2 and sendToOCPQueue=true
   [junit4]   2> 2207687 INFO  (qtp8858072-22294) [n:127.0.0.1:60032_solr    ] o.a.s.s.HttpSolrCall [admin] webapp=null path=/admin/collections params={action=LIST&delegation=GgADYmFyA2JhcgCKAVlcgQAgigFZgI2EIAcDFJhuP_zOdY59JmllUr6zdkNl5QnNB3NvbHItZHQA&wt=javabin&version=2} status=0 QTime=0
   [junit4]   2> 2207693 INFO  (TEST-TestSolrCloudWithDelegationTokens.testDelegationTokenRenew-seed#[240F80EB52B8593E]) [    ] o.a.s.c.c.ZkStateReader Updated live nodes from ZooKeeper... (0) -> (2)
   [junit4]   2> 2207695 INFO  (TEST-TestSolrCloudWithDelegationTokens.testDelegationTokenRenew-seed#[240F80EB52B8593E]) [    ] o.a.s.c.s.i.ZkClientClusterStateProvider Cluster at 127.0.0.1:60025/solr ready
   [junit4]   2> 2207697 WARN  (TEST-TestSolrCloudWithDelegationTokens.testDelegationTokenRenew-seed#[240F80EB52B8593E]) [    ] o.a.h.c.p.ResponseProcessCookies Invalid cookie header: "Set-Cookie: hadoop.auth=; Path=/; Domain=127.0.0.1; Expires= t, 01-Led-1970 00:00:00 GMT; HttpOnly". Invalid 'expires' attribute: t, 01-Led-1970 00:00:00 GMT
   [junit4]   2> 2207698 WARN  (NIOServerCxn.Factory:0.0.0.0/0.0.0.0:0) [    ] o.a.z.s.NIOServerCnxn caught end of stream exception
   [junit4]   2> EndOfStreamException: Unable to read additional data from client sessionid 0x1595c80e9c10011, likely client has closed socket
   [junit4]   2> 	at org.apache.zookeeper.server.NIOServerCnxn.doIO(NIOServerCnxn.java:228)
   [junit4]   2> 	at org.apache.zookeeper.server.NIOServerCnxnFactory.run(NIOServerCnxnFactory.java:208)
   [junit4]   2> 	at java.lang.Thread.run(Thread.java:745)
   [junit4]   2> 2207716 INFO  (TEST-TestSolrCloudWithDelegationTokens.testDelegationTokenRenew-seed#[240F80EB52B8593E]) [    ] o.a.s.c.c.ZkStateReader Updated live nodes from ZooKeeper... (0) -> (2)
   [junit4]   2> 2207718 INFO  (TEST-TestSolrCloudWithDelegationTokens.testDelegationTokenRenew-seed#[240F80EB52B8593E]) [    ] o.a.s.c.s.i.ZkClientClusterStateProvider Cluster at 127.0.0.1:60025/solr ready
   [junit4]   2> 2207720 INFO  (qtp8858072-22294) [n:127.0.0.1:60032_solr    ] o.a.s.h.a.CollectionsHandler Invoked Collection Action :list with params action=LIST&delegation=GgADYmFyA2JhcgCKAVlcgQBWigFZgI2EVggDFMlbHHfNLXcJvxNYoIDATgB_V2stB3NvbHItZHQA&wt=javabin&version=2 and sendToOCPQueue=true
   [junit4]   2> 2207720 INFO  (qtp8858072-22294) [n:127.0.0.1:60032_solr    ] o.a.s.s.HttpSolrCall [admin] webapp=null path=/admin/collections params={action=LIST&delegation=GgADYmFyA2JhcgCKAVlcgQBWigFZgI2EVggDFMlbHHfNLXcJvxNYoIDATgB_V2stB3NvbHItZHQA&wt=javabin&version=2} status=0 QTime=0
   [junit4]   2> 2207728 INFO  (TEST-TestSolrCloudWithDelegationTokens.testDelegationTokenRenew-seed#[240F80EB52B8593E]) [    ] o.a.s.c.c.ZkStateReader Updated live nodes from ZooKeeper... (0) -> (2)
   [junit4]   2> 2207730 INFO  (TEST-TestSolrCloudWithDelegationTokens.testDelegationTokenRenew-seed#[240F80EB52B8593E]) [    ] o.a.s.c.s.i.ZkClientClusterStateProvider Cluster at 127.0.0.1:60025/solr ready
   [junit4]   2> 2207732 WARN  (TEST-TestSolrCloudWithDelegationTokens.testDelegationTokenRenew-seed#[240F80EB52B8593E]) [    ] o.a.h.c.p.ResponseProcessCookies Invalid cookie header: "Set-Cookie: hadoop.auth=; Path=/; Domain=127.0.0.1; Expires= t, 01-Led-1970 00:00:00 GMT; HttpOnly". Invalid 'expires' attribute: t, 01-Led-1970 00:00:00 GMT
   [junit4]   2> 2207733 WARN  (NIOServerCxn.Factory:0.0.0.0/0.0.0.0:0) [    ] o.a.z.s.NIOServerCnxn caught end of stream exception
   [junit4]   2> EndOfStreamException: Unable to read additional data from client sessionid 0x1595c80e9c10013, likely client has closed socket
   [junit4]   2> 	at org.apache.zookeeper.server.NIOServerCnxn.doIO(NIOServerCnxn.java:228)
   [junit4]   2> 	at org.apache.zookeeper.server.NIOServerCnxnFactory.run(NIOServerCnxnFactory.java:208)
   [junit4]   2> 	at java.lang.Thread.run(Thread.java:745)
   [junit4]   2> 2207739 INFO  (TEST-TestSolrCloudWithDelegationTokens.testDelegationTokenRenew-seed#[240F80EB52B8593E]) [    ] o.a.s.c.c.ZkStateReader Updated live nodes from ZooKeeper... (0) -> (2)
   [junit4]   2> 2207741 INFO  (TEST-TestSolrCloudWithDelegationTokens.testDelegationTokenRenew-seed#[240F80EB52B8593E]) [    ] o.a.s.c.s.i.ZkClientClusterStateProvider Cluster at 127.0.0.1:60025/solr ready
   [junit4]   2> 2207743 INFO  (qtp8858072-22289) [n:127.0.0.1:60032_solr    ] o.a.s.h.a.CollectionsHandler Invoked Collection Action :list with params action=LIST&delegation=GgADYmFyA2JhcgCKAVlcgQBWigFZgI2EVggDFMlbHHfNLXcJvxNYoIDATgB_V2stB3NvbHItZHQA&wt=javabin&version=2 and sendToOCPQueue=true
   [junit4]   2> 2207743 INFO  (qtp8858072-22289) [n:127.0.0.1:60032_solr    ] o.a.s.s.HttpSolrCall [admin] webapp=null path=/admin/collections params={action=LIST&delegation=GgADYmFyA2JhcgCKAVlcgQBWigFZgI2EVggDFMlbHHfNLXcJvxNYoIDATgB_V2stB3NvbHItZHQA&wt=javabin&version=2} status=0 QTime=0
   [junit4]   2> 2207747 WARN  (TEST-TestSolrCloudWithDelegationTokens.testDelegationTokenRenew-seed#[240F80EB52B8593E]) [    ] o.a.h.c.p.ResponseProcessCookies Invalid cookie header: "Set-Cookie: hadoop.auth=; Path=/; Domain=127.0.0.1; Expires= t, 01-Led-1970 00:00:00 GMT; HttpOnly". Invalid 'expires' attribute: t, 01-Led-1970 00:00:00 GMT
   [junit4]   2> 2207759 INFO  (qtp26779116-22282) [n:127.0.0.1:60029_solr    ] o.a.s.h.a.CollectionsHandler Invoked Collection Action :list with params action=LIST&delegation=GgADYmFyA2JhcgCKAVlcgQCHigFZgI2EhwkDFB7IPHNaMyXjxD0tG2Trx9HSwEG9B3NvbHItZHQA&wt=javabin&version=2 and sendToOCPQueue=true
   [junit4]   2> 2207759 INFO  (qtp26779116-22282) [n:127.0.0.1:60029_solr    ] o.a.s.s.HttpSolrCall [admin] webapp=null path=/admin/collections params={action=LIST&delegation=GgADYmFyA2JhcgCKAVlcgQCHigFZgI2EhwkDFB7IPHNaMyXjxD0tG2Trx9HSwEG9B3NvbHItZHQA&wt=javabin&version=2} status=0 QTime=0
   [junit4]   2> 2207766 INFO  (TEST-TestSolrCloudWithDelegationTokens.testDelegationTokenRenew-seed#[240F80EB52B8593E]) [    ] o.a.s.c.c.ZkStateReader Updated live nodes from ZooKeeper... (0) -> (2)
   [junit4]   2> 2207768 INFO  (TEST-TestSolrCloudWithDelegationTokens.testDelegationTokenRenew-seed#[240F80EB52B8593E]) [    ] o.a.s.c.s.i.ZkClientClusterStateProvider Cluster at 127.0.0.1:60025/solr ready
   [junit4]   2> 2207770 WARN  (TEST-TestSolrCloudWithDelegationTokens.testDelegationTokenRenew-seed#[240F80EB52B8593E]) [    ] o.a.h.c.p.ResponseProcessCookies Invalid cookie header: "Set-Cookie: hadoop.auth=; Path=/; Domain=127.0.0.1; Expires= t, 01-Led-1970 00:00:00 GMT; HttpOnly". Invalid 'expires' attribute: t, 01-Led-1970 00:00:00 GMT
   [junit4]   2> 2207777 INFO  (TEST-TestSolrCloudWithDelegationTokens.testDelegationTokenRenew-seed#[240F80EB52B8593E]) [    ] o.a.s.c.c.ZkStateReader Updated live nodes from ZooKeeper... (0) -> (2)
   [junit4]   2> 2207778 INFO  (TEST-TestSolrCloudWithDelegationTokens.testDelegationTokenRenew-seed#[240F80EB52B8593E]) [    ] o.a.s.c.s.i.ZkClientClusterStateProvider Cluster at 127.0.0.1:60025/solr ready
   [junit4]   2> 2207779 INFO  (qtp8858072-22294) [n:127.0.0.1:60032_solr    ] o.a.s.h.a.CollectionsHandler Invoked Collection Action :list with params action=LIST&delegation=GgADYmFyA2JhcgCKAVlcgQCHigFZgI2EhwkDFB7IPHNaMyXjxD0tG2Trx9HSwEG9B3NvbHItZHQA&wt=javabin&version=2 and sendToOCPQueue=true
   [junit4]   2> 2207780 INFO  (qtp8858072-22294) [n:127.0.0.1:60032_solr    ] o.a.s.s.HttpSolrCall [admin] webapp=null path=/admin/collections params={action=LIST&delegation=GgADYmFyA2JhcgCKAVlcgQCHigFZgI2EhwkDFB7IPHNaMyXjxD0tG2Trx9HSwEG9B3NvbHItZHQA&wt=javabin&version=2} status=0 QTime=0
   [junit4]   2> 2207784 WARN  (TEST-TestSolrCloudWithDelegationTokens.testDelegationTokenRenew-seed#[240F80EB52B8593E]) [    ] o.a.h.c.p.ResponseProcessCookies Invalid cookie header: "Set-Cookie: hadoop.auth=; Path=/; Domain=127.0.0.1; Expires= t, 01-Led-1970 00:00:00 GMT; HttpOnly". Invalid 'expires' attribute: t, 01-Led-1970 00:00:00 GMT
   [junit4]   2> 2207800 INFO  (TEST-TestSolrCloudWithDelegationTokens.testDelegationTokenRenew-seed#[240F80EB52B8593E]) [    ] o.a.s.c.c.ZkStateReader Updated live nodes from ZooKeeper... (0) -> (2)
   [junit4]   2> 2207802 INFO  (TEST-TestSolrCloudWithDelegationTokens.testDelegationTokenRenew-seed#[240F80EB52B8593E]) [    ] o.a.s.c.s.i.ZkClientClusterStateProvider Cluster at 127.0.0.1:60025/solr ready
   [junit4]   2> 2207804 INFO  (qtp8858072-22288) [n:127.0.0.1:60032_solr    ] o.a.s.h.a.CollectionsHandler Invoked Collection Action :list with params action=LIST&delegation=GgADYmFyA2JhcgCKAVlcgQCsigFZgI2ErAoDFNhNmCDaM9Tr-xMw1oIMVB2lFkC9B3NvbHItZHQA&wt=javabin&version=2 and sendToOCPQueue=true
   [junit4]   2> 2207804 INFO  (qtp8858072-22288) [n:127.0.0.1:60032_solr    ] o.a.s.s.HttpSolrCall [admin] webapp=null path=/admin/collections params={action=LIST&delegation=GgADYmFyA2JhcgCKAVlcgQCsigFZgI2ErAoDFNhNmCDaM9Tr-xMw1oIMVB2lFkC9B3NvbHItZHQA&wt=javabin&version=2} status=0 QTime=0
   [junit4]   2> 2207811 INFO  (TEST-TestSolrCloudWithDelegationTokens.testDelegationTokenRenew-seed#[240F80EB52B8593E]) [    ] o.a.s.c.c.ZkStateReader Updated live nodes from ZooKeeper... (0) -> (2)
   [junit4]   2> 2207813 INFO  (TEST-TestSolrCloudWithDelegationTokens.testDelegationTokenRenew-seed#[240F80EB52B8593E]) [    ] o.a.s.c.s.i.ZkClientClusterStateProvider Cluster at 127.0.0.1:60025/solr ready
   [junit4]   2> 2207815 WARN  (TEST-TestSolrCloudWithDelegationTokens.testDelegationTokenRenew-seed#[240F80EB52B8593E]) [    ] o.a.h.c.p.ResponseProcessCookies Invalid cookie header: "Set-Cookie: hadoop.auth=; Path=/; Domain=127.0.0.1; Expires= t, 01-Led-1970 00:00:00 GMT; HttpOnly". Invalid 'expires' attribute: t, 01-Led-1970 00:00:00 GMT
   [junit4]   2> 2207819 INFO  (qtp8858072-22287) [n:127.0.0.1:60032_solr    ] o.a.s.h.a.CollectionsHandler Invoked Collection Action :list with params action=LIST&delegation=GgADYmFyA2JhcgCKAVlcgQCsigFZgI2ErAoDFNhNmCDaM9Tr-xMw1oIMVB2lFkC9B3NvbHItZHQA&wt=javabin&version=2 and sendToOCPQueue=true
   [junit4]   2> 2207819 INFO  (qtp8858072-22287) [n:127.0.0.1:60032_solr    ] o.a.s.s.HttpSolrCall [admin] webapp=null path=/admin/collections params={action=LIST&delegation=GgADYmFyA2JhcgCKAVlcgQCsigFZgI2ErAoDFNhNmCDaM9Tr-xMw1oIMVB2lFkC9B3NvbHItZHQA&wt=javabin&version=2} status=0 QTime=0
   [junit4]   2> 2207823 WARN  (TEST-TestSolrCloudWithDelegationTokens.testDelegationTokenRenew-seed#[240F80EB52B8593E]) [    ] o.a.h.c.p.ResponseProcessCookies Invalid cookie header: "Set-Cookie: hadoop.auth=; Path=/; Domain=127.0.0.1; Expires= t, 01-Led-1970 00:00:00 GMT; HttpOnly". Invalid 'expires' attribute: t, 01-Led-1970 00:00:00 GMT
   [junit4]   2> 2207823 INFO  (TEST-TestSolrCloudWithDelegationTokens.testDelegationTokenRenew-seed#[240F80EB52B8593E]) [    ] o.a.s.SolrTestCaseJ4 ###Ending testDelegationTokenRenew
   [junit4]   2> 2207844 INFO  (TEST-TestSolrCloudWithDelegationTokens.testDelegationTokenCancelFail-seed#[240F80EB52B8593E]) [    ] o.a.s.SolrTestCaseJ4 ###Starting testDelegationTokenCancelFail
   [junit4]   2> 2207861 INFO  (TEST-TestSolrCloudWithDelegationTokens.testDelegationTokenCancelFail-seed#[240F80EB52B8593E]) [    ] o.a.s.SolrTestCaseJ4 ###Ending testDelegationTokenCancelFail
   [junit4]   2> NOTE: reproduce with: ant test  -Dtestcase=TestSolrCloudWithDelegationTokens -Dtests.method=testDelegationTokenCancelFail -Dtests.seed=240F80EB52B8593E -Dtests.slow=true -Dtests.locale=cs-CZ -Dtests.timezone=America/Juneau -Dtests.asserts=true -Dtests.file.encoding=UTF-8
   [junit4] FAILURE 0.04s J1 | TestSolrCloudWithDelegationTokens.testDelegationTokenCancelFail <<<
   [junit4]    > Throwable #1: java.lang.AssertionError: expected:<200> but was:<404>
   [junit4]    > 	at __randomizedtesting.SeedInfo.seed([240F80EB52B8593E:4CB0B5C182224BD2]:0)
   [junit4]    > 	at org.apache.solr.cloud.TestSolrCloudWithDelegationTokens.cancelDelegationToken(TestSolrCloudWithDelegationTokens.java:140)
   [junit4]    > 	at org.apache.solr.cloud.TestSolrCloudWithDelegationTokens.testDelegationTokenCancelFail(TestSolrCloudWithDelegationTokens.java:294)
   [junit4]    > 	at java.lang.Thread.run(Thread.java:745)
   [junit4]   2> 2207884 INFO  (TEST-TestSolrCloudWithDelegationTokens.testDelegationTokenVerify-seed#[240F80EB52B8593E]) [    ] o.a.s.SolrTestCaseJ4 ###Starting testDelegationTokenVerify
   [junit4]   2> 2207897 INFO  (qtp26779116-22284) [n:127.0.0.1:60029_solr    ] o.a.s.h.a.CollectionsHandler Invoked Collection Action :list with params action=LIST&delegation=GgADYmFyA2JhcgCKAVlcgQEQigFZgI2FEAwDFKbM_l0Bt3std0ES6WiOFN1E8ziHB3NvbHItZHQA&wt=javabin&version=2 and sendToOCPQueue=true
   [junit4]   2> 2207897 INFO  (qtp26779116-22284) [n:127.0.0.1:60029_solr    ] o.a.s.s.HttpSolrCall [admin] webapp=null path=/admin/collections params={action=LIST&delegation=GgADYmFyA2JhcgCKAVlcgQEQigFZgI2FEAwDFKbM_l0Bt3std0ES6WiOFN1E8ziHB3NvbHItZHQA&wt=javabin&version=2} status=0 QTime=0
   [junit4]   2> 2207908 INFO  (TEST-TestSolrCloudWithDelegationTokens.testDelegationTokenVerify-seed#[240F80EB52B8593E]) [    ] o.a.s.c.c.ZkStateReader Updated live nodes from ZooKeeper... (0) -> (2)
   [junit4]   2> 2207910 INFO  (TEST-TestSolrCloudWithDelegationTokens.testDelegationTokenVerify-seed#[240F80EB52B8593E]) [    ] o.a.s.c.s.i.ZkClientClusterStateProvider Cluster at 127.0.0.1:60025/solr ready
   [junit4]   2> 2207912 WARN  (TEST-TestSolrCloudWithDelegationTokens.testDelegationTokenVerify-seed#[240F80EB52B8593E]) [    ] o.a.h.c.p.ResponseProcessCookies Invalid cookie header: "Set-Cookie: hadoop.auth=; Path=/; Domain=127.0.0.1; Expires= t, 01-Led-1970 00:00:00 GMT; HttpOnly". Invalid 'expires' attribute: t, 01-Led-1970 00:00:00 GMT
   [junit4]   2> 2207916 INFO  (qtp8858072-22300) [n:127.0.0.1:60032_solr    ] o.a.s.h.a.CollectionsHandler Invoked Collection Action :list with params action=LIST&delegation=GgADYmFyA2JhcgCKAVlcgQEQigFZgI2FEAwDFKbM_l0Bt3std0ES6WiOFN1E8ziHB3NvbHItZHQA&wt=javabin&version=2 and sendToOCPQueue=true
   [junit4]   2> 2207916 INFO  (qtp8858072-22300) [n:127.0.0.1:60032_solr    ] o.a.s.s.HttpSolrCall [admin] webapp=null path=/admin/collections params={action=LIST&delegation=GgADYmFyA2JhcgCKAVlcgQEQigFZgI2FEAwDFKbM_l0Bt3std0ES6WiOFN1E8ziHB3NvbHItZHQA&wt=javabin&version=2} status=0 QTime=0
   [junit4]   2> 2207922 INFO  (TEST-TestSolrCloudWithDelegationTokens.testDelegationTokenVerify-seed#[240F80EB52B8593E]) [    ] o.a.s.c.c.ZkStateReader Updated live nodes from ZooKeeper... (0) -> (2)
   [junit4]   2> 2207924 INFO  (TEST-TestSolrCloudWithDelegationTokens.testDelegationTokenVerify-seed#[240F80EB52B8593E]) [    ] o.a.s.c.s.i.ZkClientClusterStateProvider Cluster at 127.0.0.1:60025/solr ready
   [junit4]   2> 2207926 WARN  (TEST-TestSolrCloudWithDelegationTokens.testDelegationTokenVerify-seed#[240F80EB52B8593E]) [    ] o.a.h.c.p.ResponseProcessCookies Invalid cookie header: "Set-Cookie: hadoop.auth=; Path=/; Domain=127.0.0.1; Expires= t, 01-Led-1970 00:00:00 GMT; HttpOnly". Invalid 'expires' attribute: t, 01-Led-1970 00:00:00 GMT
   [junit4]   2> 2207927 INFO  (TEST-TestSolrCloudWithDelegationTokens.testDelegationTokenVerify-seed#[240F80EB52B8593E]) [    ] o.a.s.SolrTestCaseJ4 ###Ending testDelegationTokenVerify
   [junit4]   2> 2207928 INFO  (jetty-launcher-3998-thread-1) [    ] o.e.j.s.AbstractConnector Stopped ServerConnector@10296d2{HTTP/1.1,[http/1.1]}{127.0.0.1:0}
   [junit4]   2> 2207930 INFO  (jetty-launcher-3998-thread-2) [    ] o.e.j.s.AbstractConnector Stopped ServerConnector@1d39951{HTTP/1.1,[http/1.1]}{127.0.0.1:0}
   [junit4]   2> 2207930 INFO  (jetty-launcher-3998-thread-1) [    ] o.a.s.c.CoreContainer Shutting down CoreContainer instance=25587872
   [junit4]   2> 2207930 INFO  (jetty-launcher-3998-thread-2) [    ] o.a.s.c.CoreContainer Shutting down CoreContainer instance=3272769
   [junit4]   2> 2207933 INFO  (jetty-launcher-3998-thread-2) [    ] o.a.s.c.Overseer Overseer (id=97210575712485382-127.0.0.1:60032_solr-n_0000000000) closing
   [junit4]   2> 2207935 INFO  (OverseerStateUpdate-97210575712485382-127.0.0.1:60032_solr-n_0000000000) [n:127.0.0.1:60032_solr    ] o.a.s.c.Overseer Overseer Loop exiting : 127.0.0.1:60032_solr
   [junit4]   2> 2207935 WARN  (zkCallback-4008-thread-1-processing-n:127.0.0.1:60029_solr) [n:127.0.0.1:60029_solr    ] o.a.s.c.c.ZkStateReader ZooKeeper watch triggered, but Solr cannot talk to ZK: [KeeperErrorCode = Session expired for /live_nodes]
   [junit4]   2> 2207936 INFO  (jetty-launcher-3998-thread-1) [    ] o.a.s.m.SolrMetricManager Closing metric reporters for: solr.node
   [junit4]   2> 2207936 ERROR (Thread[Thread-4750,5,TGRP-TestSolrCloudWithDelegationTokens]) [n:127.0.0.1:60029_solr    ] o.a.h.s.t.d.AbstractDelegationTokenSecretManager ExpiredTokenRemover received java.lang.InterruptedException: sleep interrupted
   [junit4]   2> 2207964 INFO  (jetty-launcher-3998-thread-1) [    ] o.e.j.s.h.ContextHandler Stopped o.e.j.s.ServletContextHandler@17c2b6c{/solr,null,UNAVAILABLE}
   [junit4]   2> 2209436 WARN  (zkCallback-4009-thread-2-processing-n:127.0.0.1:60032_solr) [n:127.0.0.1:60032_solr    ] o.a.s.c.c.ZkStateReader ZooKeeper watch triggered, but Solr cannot talk to ZK: [KeeperErrorCode = Session expired for /live_nodes]
   [junit4]   2> 2209437 INFO  (jetty-launcher-3998-thread-2) [    ] o.a.s.m.SolrMetricManager Closing metric reporters for: solr.node
   [junit4]   2> 2209437 ERROR (Thread[Thread-4749,5,TGRP-TestSolrCloudWithDelegationTokens]) [n:127.0.0.1:60032_solr    ] o.a.h.s.t.d.AbstractDelegationTokenSecretManager ExpiredTokenRemover received java.lang.InterruptedException: sleep interrupted
   [junit4]   2> 2209439 INFO  (jetty-launcher-3998-thread-2) [    ] o.e.j.s.h.ContextHandler Stopped o.e.j.s.ServletContextHandler@13052f0{/solr,null,UNAVAILABLE}
   [junit4]   2> 2209441 INFO  (SUITE-TestSolrCloudWithDelegationTokens-seed#[240F80EB52B8593E]-worker) [    ] o.a.s.c.ZkTestServer connecting to 127.0.0.1:60025 60025
   [junit4]   2> 2209443 INFO  (Thread-4727) [    ] o.a.s.c.ZkTestServer connecting to 127.0.0.1:60025 60025
   [junit4]   2> 2209444 WARN  (Thread-4727) [    ] o.a.s.c.ZkTestServer Watch limit violations: 
   [junit4]   2> Maximum concurrent create/delete watches above limit:
   [junit4]   2> 
   [junit4]   2> 	18	/solr/aliases.json
   [junit4]   2> 	18	/solr/clusterprops.json
   [junit4]   2> 	2	/solr/security.json
   [junit4]   2> 
   [junit4]   2> Maximum concurrent data watches above limit:
   [junit4]   2> 
   [junit4]   2> 	18	/solr/clusterstate.json
   [junit4]   2> 	4	/solr/security/zkdtsm/ZKDTSMRoot/ZKDTSMKeyIdRoot
   [junit4]   2> 	2	/solr/security/zkdtsm/ZKDTSMRoot/ZKDTSMTokensRoot/DT_7
   [junit4]   2> 	2	/solr/security/zkdtsm/ZKDTSMRoot/ZKDTSMTokensRoot/DT_6
   [junit4]   2> 	2	/solr/security/zkdtsm/ZKDTSMRoot/ZKDTSMTokensRoot/DT_9
   [junit4]   2> 	2	/solr/security/zkdtsm/ZKDTSMRoot/ZKDTSMTokensRoot/DT_8
   [junit4]   2> 	2	/solr/security/zkdtsm/ZKDTSMRoot/ZKDTSMMasterKeyRoot/DK_1
   [junit4]   2> 	2	/solr/security/zkdtsm/ZKDTSMRoot/ZKDTSMTokensRoot/DT_1
   [junit4]   2> 	2	/solr/security/zkdtsm/ZKDTSMRoot/ZKDTSMMasterKeyRoot/DK_3
   [junit4]   2> 	2	/solr/security/zkdtsm/ZKDTSMRoot/ZKDTSMTokensRoot/DT_3
   [junit4]   2> 	2	/solr/security/zkdtsm/ZKDTSMRoot/ZKDTSMMasterKeyRoot/DK_2
   [junit4]   2> 	2	/solr/security/zkdtsm/ZKDTSMRoot/ZKDTSMTokensRoot/DT_2
   [junit4]   2> 	2	/solr/security/zkdtsm/ZKDTSMRoot/ZKDTSMTokensRoot/DT_5
   [junit4]   2> 	2	/solr/security/zkdtsm/ZKDTSMRoot/ZKDTSMMasterKeyRoot/DK_4
   [junit4]   2> 	2	/solr/security/zkdtsm/ZKDTSMRoot/ZKDTSMTokensRoot/DT_4
   [junit4]   2> 	2	/solr/security/zkdtsm/ZKDTSMRoot/ZKDTSMTokensRoot/DT_12
   [junit4]   2> 	2	/solr/security/zkdtsm/ZKDTSMRoot/ZKDTSMSeqNumRoot
   [junit4]   2> 	2	/solr/security/zkdtsm/ZKDTSMRoot/ZKDTSMTokensRoot/DT_11
   [junit4]   2> 	2	/solr/security/zkdtsm/ZKDTSMRoot/ZKDTSMTokensRoot/DT_10
   [junit4]   2> 
   [junit4]   2> Maximum concurrent children watches above limit:
   [junit4]   2> 
   [junit4]   2> 	18	/solr/live_nodes
   [junit4]   2> 	18	/solr/collections
   [junit4]   2> 	5	/solr/overseer/collection-queue-work
   [junit4]   2> 	2	/solr/overseer/queue
   [junit4]   2> 	2	/solr/security/zkdtsm/ZKDTSMRoot/ZKDTSMMasterKeyRoot
   [junit4]   2> 	2	/solr/overseer/queue-work
   [junit4]   2> 	2	/solr/security/zkdtsm/ZKDTSMRoot/ZKDTSMTokensRoot
   [junit4]   2> 
   [junit4]   2> 2209445 INFO  (SUITE-TestSolrCloudWithDelegationTokens-seed#[240F80EB52B8593E]-worker) [    ] o.a.s.SolrTestCaseJ4 ###deleteCore
   [junit4]   2> NOTE: leaving temporary files on disk at: C:\Users\jenkins\workspace\Lucene-Solr-master-Windows\solr\build\solr-core\test\J1\temp\solr.cloud.TestSolrCloudWithDelegationTokens_240F80EB52B8593E-001
   [junit4]   2> Jan 02, 2017 12:07:56 AM com.carrotsearch.randomizedtesting.ThreadLeakControl checkThreadLeaks
   [junit4]   2> WARNING: Will linger awaiting termination of 2 leaked thread(s).
   [junit4]   2> NOTE: test params are: codec=Asserting(Lucene70): {}, docValues:{}, maxPointsInLeafNode=1230, maxMBSortInHeap=5.942215214772158, sim=RandomSimilarity(queryNorm=true): {}, locale=cs-CZ, timezone=America/Juneau
   [junit4]   2> NOTE: Windows 10 10.0 x86/Oracle Corporation 1.8.0_112 (32-bit)/cpus=3,threads=1,free=180735104,total=429654016
   [junit4]   2> NOTE: All tests run in this JVM: [JSONWriterTest, SpellPossibilityIteratorTest, TestSchemaVersionResource, TestAuthorizationFramework, TestConfigOverlay, SharedFSAutoReplicaFailoverTest, OverseerStatusTest, TestQueryTypes, TestFieldCacheVsDocValues, TestRecovery, URLClassifyProcessorTest, SpellingQueryConverterTest, FullSolrCloudDistribCmdsTest, TestSolrFieldCacheMBean, CloneFieldUpdateProcessorFactoryTest, NoCacheHeaderTest, CoreAdminHandlerTest, TestUtils, DistributedFacetPivotLargeTest, TestMiniSolrCloudCluster, SolrGangliaReporterTest, TermVectorComponentTest, PeerSyncWithIndexFingerprintCachingTest, TestMaxScoreQueryParser, TestStressRecovery, TestFieldCacheSort, TestMiniSolrCloudClusterSSL, QueryResultKeyTest, TestRecoveryHdfs, TestSearcherReuse, ClassificationUpdateProcessorIntegrationTest, UpdateParamsTest, TestSystemIdResolver, TestDocTermOrds, TestLMDirichletSimilarityFactory, BlockDirectoryTest, TestSolrCloudSnapshots, AddBlockUpdateTest, CoreSorterTest, ForceLeaderTest, SuggesterTSTTest, DistributedVersionInfoTest, BadIndexSchemaTest, TestSolrDynamicMBean, TestShortCircuitedRequests, TestDistributedMissingSort, TestDocSet, TestUnifiedSolrHighlighter, ResponseHeaderTest, TestConfigSetProperties, TestDelegationWithHadoopAuth, SolrMetricReporterTest, TestObjectReleaseTracker, TestRandomFlRTGCloud, DistributedTermsComponentTest, TestRebalanceLeaders, AliasIntegrationTest, CircularListTest, SolrCmdDistributorTest, TestCloudInspectUtil, IndexSchemaTest, TestBadConfig, ShufflingReplicaListTransformerTest, TestFieldCacheReopen, TestDeleteCollectionOnDownNodes, TestInitQParser, ShowFileRequestHandlerTest, HdfsBasicDistributedZk2Test, ConnectionReuseTest, TestZkChroot, TestGraphTermsQParserPlugin, TestCollationFieldDocValues, DistribJoinFromCollectionTest, BasicZkTest, TestJsonRequest, TestDefaultSearchFieldResource, PreAnalyzedFieldTest, TestSmileRequest, TestMinMaxOnMultiValuedField, TestPushWriter, SuggestComponentContextFilterQueryTest, CoreAdminRequestStatusTest, TestComponentsName, CdcrUpdateLogTest, TestCorePropertiesReload, TestRuleBasedAuthorizationPlugin, BlockJoinFacetDistribTest, DefaultValueUpdateProcessorTest, TestExportWriter, TestPerFieldSimilarityWithDefaultOverride, TestJoin, TestLRUStatsCache, SpellCheckCollatorTest, TestDFISimilarityFactory, TestRangeQuery, DirectUpdateHandlerOptimizeTest, OverseerModifyCollectionTest, OverriddenZkACLAndCredentialsProvidersTest, CreateCollectionCleanupTest, TestMacroExpander, TestSuggestSpellingConverter, TestFiltering, TermVectorComponentDistributedTest, TriLevelCompositeIdRoutingTest, ZkStateReaderTest, TestRestManager, DistributedIntervalFacetingTest, HdfsRecoverLeaseTest, DistanceFunctionTest, TestQuerySenderListener, TestNoOpRegenerator, LeaderElectionContextKeyTest, SuggesterWFSTTest, JsonLoaderTest, TestDynamicFieldResource, TestSolr4Spatial, HdfsRestartWhileUpdatingTest, TestSolrCoreProperties, TestSSLRandomization, TestCodecSupport, TestSolrQueryParserDefaultOperatorResource, BasicFunctionalityTest, CdcrBootstrapTest, WrapperMergePolicyFactoryTest, TestAuthenticationFramework, MergeStrategyTest, TestJsonFacetRefinement, TestManagedSynonymFilterFactory, RegexBoostProcessorTest, AsyncCallRequestStatusResponseTest, DeleteInactiveReplicaTest, TestTrie, ChaosMonkeySafeLeaderTest, RequestLoggingTest, HdfsCollectionsAPIDistributedZkTest, TestAtomicUpdateErrorCases, TestRestoreCore, SortByFunctionTest, TestManagedResource, CollectionsAPIDistributedZkTest, TestConfigReload, QueryParsingTest, TestSolrCloudWithSecureImpersonation, TestSchemaResource, UUIDUpdateProcessorFallbackTest, PreAnalyzedUpdateProcessorTest, ConfigSetsAPITest, UUIDFieldTest, TestRealTimeGet, LoggingHandlerTest, ShardRoutingCustomTest, TestHighFrequencyDictionaryFactory, TestAnalyzeInfixSuggestions, TestStressLiveNodes, SliceStateTest, SimpleMLTQParserTest, TestCloudPseudoReturnFields, DateMathParserTest, SolrJmxReporterTest, TestUniqueKeyFieldResource, TestChildDocTransformer, TestReplicationHandlerBackup, BasicDistributedZk2Test, SyncSliceTest, OpenCloseCoreStressTest, OverseerTest, LeaderElectionIntegrationTest, RecoveryZkTest, ClusterStateUpdateTest, TestRandomFaceting, ZkSolrClientTest, TestRandomDVFaceting, TestDistributedSearch, AutoCommitTest, TestDistributedGrouping, TestFaceting, ZkControllerTest, TestStressReorder, TestReload, TestStressVersions, SimpleFacetsTest, StatsComponentTest, SpellCheckComponentTest, QueryElevationComponentTest, PeerSyncTest, ConvertedLegacyTest, TestLazyCores, DirectUpdateHandlerTest, TestIndexSearcher, CurrencyFieldOpenExchangeTest, DistributedQueryElevationComponentTest, SolrIndexSplitterTest, SimplePostToolTest, TestCoreDiscovery, SignatureUpdateProcessorFactoryTest, TestExtendedDismaxParser, SuggesterFSTTest, SolrRequestParserTest, TestFoldingMultitermQuery, SuggesterTest, PolyFieldTest, WordBreakSolrSpellCheckerTest, SolrCoreCheckLockOnStartupTest, TestPseudoReturnFields, FieldMutatingUpdateProcessorTest, QueryEqualityTest, StatelessScriptUpdateProcessorFactoryTest, DocValuesMultiTest, SolrInfoMBeanTest, XsltUpdateRequestHandlerTest, DebugComponentTest, CacheHeaderTest, LukeRequestHandlerTest, DisMaxRequestHandlerTest, TestQueryUtils, StandardRequestHandlerTest, TestWriterPerf, TestReversedWildcardFilterFactory, DocumentAnalysisRequestHandlerTest, PrimitiveFieldTypeTest, TestOmitPositions, XmlUpdateRequestHandlerTest, DocumentBuilderTest, TestIndexingPerformance, RequiredFieldsTest, TestSolrQueryParser, SolrPluginUtilsTest, UpdateRequestProcessorFactoryTest, UniqFieldsUpdateProcessorFactoryTest, TestPartialUpdateDeduplication, PingRequestHandlerTest, TestSolrIndexConfig, ResponseLogComponentTest, BadComponentTest, TestMergePolicyConfig, TestSearchPerf, MinimalSchemaTest, TestConfig, DirectSolrConnectionTest, TestLuceneMatchVersion, SynonymTokenizerTest, TestDFRSimilarityFactory, TestLMJelinekMercerSimilarityFactory, TestFastWriter, TimeZoneUtilsTest, TestFastOutputStream, PluginInfoTest, DOMUtilTest, RAMDirectoryFactoryTest, TestLRUCache, FileUtilsTest, DistributedMLTComponentTest, TestEmbeddedSolrServerConstructors, ActionThrottleTest, CdcrReplicationHandlerTest, CdcrVersionReplicationTest, CollectionStateFormat2Test, CollectionsAPISolrJTest, DeleteStatusTest, DistributedQueueTest, DocValuesNotIndexedTest, LeaderFailureAfterFreshStartTest, LeaderInitiatedRecoveryOnCommitTest, LeaderInitiatedRecoveryOnShardRestartTest, MigrateRouteKeyTest, MultiThreadedOCPTest, RecoveryAfterSoftCommitTest, RemoteQueryErrorTest, ReplicationFactorTest, RollingRestartTest, SolrCloudExampleTest, TestClusterProperties, TestConfigSetsAPI, TestConfigSetsAPIZkFailure, TestCryptoKeys, TestDownShardTolerantSearch, TestExclusionRuleCollectionAccess, TestHdfsCloudBackupRestore, TestLeaderElectionZkExpiry, TestLocalFSCloudBackupRestore, TestLockTree, TestRequestForwarding, TestSolrCloudWithDelegationTokens]
   [junit4] Completed [520/673 (1!)] on J1 in 7.82s, 8 tests, 1 failure <<< FAILURES!

[...truncated 55057 lines...]


Mime
View raw message