lucene-dev mailing list archives

Site index · List index
Message view « Date » · « Thread »
Top « Date » · « Thread »
From Policeman Jenkins Server <jenk...@thetaphi.de>
Subject [JENKINS] Lucene-Solr-master-Solaris (64bit/jdk1.8.0) - Build # 1059 - Still Unstable!
Date Fri, 06 Jan 2017 01:33:40 GMT
Build: https://jenkins.thetaphi.de/job/Lucene-Solr-master-Solaris/1059/
Java: 64bit/jdk1.8.0 -XX:-UseCompressedOops -XX:+UseSerialGC

2 tests failed.
FAILED:  org.apache.solr.cloud.TestSolrCloudWithDelegationTokens.testDelegationTokenCancelFail

Error Message:
expected:<200> but was:<404>

Stack Trace:
java.lang.AssertionError: expected:<200> but was:<404>
	at __randomizedtesting.SeedInfo.seed([784EE71CA405F489:10F1D236749FE665]:0)
	at org.junit.Assert.fail(Assert.java:93)
	at org.junit.Assert.failNotEquals(Assert.java:647)
	at org.junit.Assert.assertEquals(Assert.java:128)
	at org.junit.Assert.assertEquals(Assert.java:472)
	at org.junit.Assert.assertEquals(Assert.java:456)
	at org.apache.solr.cloud.TestSolrCloudWithDelegationTokens.cancelDelegationToken(TestSolrCloudWithDelegationTokens.java:140)
	at org.apache.solr.cloud.TestSolrCloudWithDelegationTokens.testDelegationTokenCancelFail(TestSolrCloudWithDelegationTokens.java:304)
	at sun.reflect.NativeMethodAccessorImpl.invoke0(Native Method)
	at sun.reflect.NativeMethodAccessorImpl.invoke(NativeMethodAccessorImpl.java:62)
	at sun.reflect.DelegatingMethodAccessorImpl.invoke(DelegatingMethodAccessorImpl.java:43)
	at java.lang.reflect.Method.invoke(Method.java:498)
	at com.carrotsearch.randomizedtesting.RandomizedRunner.invoke(RandomizedRunner.java:1713)
	at com.carrotsearch.randomizedtesting.RandomizedRunner$8.evaluate(RandomizedRunner.java:907)
	at com.carrotsearch.randomizedtesting.RandomizedRunner$9.evaluate(RandomizedRunner.java:943)
	at com.carrotsearch.randomizedtesting.RandomizedRunner$10.evaluate(RandomizedRunner.java:957)
	at com.carrotsearch.randomizedtesting.rules.SystemPropertiesRestoreRule$1.evaluate(SystemPropertiesRestoreRule.java:57)
	at org.apache.lucene.util.TestRuleSetupTeardownChained$1.evaluate(TestRuleSetupTeardownChained.java:49)
	at org.apache.lucene.util.AbstractBeforeAfterRule$1.evaluate(AbstractBeforeAfterRule.java:45)
	at org.apache.lucene.util.TestRuleThreadAndTestName$1.evaluate(TestRuleThreadAndTestName.java:48)
	at org.apache.lucene.util.TestRuleIgnoreAfterMaxFailures$1.evaluate(TestRuleIgnoreAfterMaxFailures.java:64)
	at org.apache.lucene.util.TestRuleMarkFailure$1.evaluate(TestRuleMarkFailure.java:47)
	at com.carrotsearch.randomizedtesting.rules.StatementAdapter.evaluate(StatementAdapter.java:36)
	at com.carrotsearch.randomizedtesting.ThreadLeakControl$StatementRunner.run(ThreadLeakControl.java:367)
	at com.carrotsearch.randomizedtesting.ThreadLeakControl.forkTimeoutingTask(ThreadLeakControl.java:811)
	at com.carrotsearch.randomizedtesting.ThreadLeakControl$3.evaluate(ThreadLeakControl.java:462)
	at com.carrotsearch.randomizedtesting.RandomizedRunner.runSingleTest(RandomizedRunner.java:916)
	at com.carrotsearch.randomizedtesting.RandomizedRunner$5.evaluate(RandomizedRunner.java:802)
	at com.carrotsearch.randomizedtesting.RandomizedRunner$6.evaluate(RandomizedRunner.java:852)
	at com.carrotsearch.randomizedtesting.RandomizedRunner$7.evaluate(RandomizedRunner.java:863)
	at com.carrotsearch.randomizedtesting.rules.StatementAdapter.evaluate(StatementAdapter.java:36)
	at com.carrotsearch.randomizedtesting.rules.SystemPropertiesRestoreRule$1.evaluate(SystemPropertiesRestoreRule.java:57)
	at org.apache.lucene.util.AbstractBeforeAfterRule$1.evaluate(AbstractBeforeAfterRule.java:45)
	at com.carrotsearch.randomizedtesting.rules.StatementAdapter.evaluate(StatementAdapter.java:36)
	at org.apache.lucene.util.TestRuleStoreClassName$1.evaluate(TestRuleStoreClassName.java:41)
	at com.carrotsearch.randomizedtesting.rules.NoShadowingOrOverridesOnMethodsRule$1.evaluate(NoShadowingOrOverridesOnMethodsRule.java:40)
	at com.carrotsearch.randomizedtesting.rules.NoShadowingOrOverridesOnMethodsRule$1.evaluate(NoShadowingOrOverridesOnMethodsRule.java:40)
	at com.carrotsearch.randomizedtesting.rules.StatementAdapter.evaluate(StatementAdapter.java:36)
	at com.carrotsearch.randomizedtesting.rules.StatementAdapter.evaluate(StatementAdapter.java:36)
	at com.carrotsearch.randomizedtesting.rules.StatementAdapter.evaluate(StatementAdapter.java:36)
	at org.apache.lucene.util.TestRuleAssertionsRequired$1.evaluate(TestRuleAssertionsRequired.java:53)
	at org.apache.lucene.util.TestRuleMarkFailure$1.evaluate(TestRuleMarkFailure.java:47)
	at org.apache.lucene.util.TestRuleIgnoreAfterMaxFailures$1.evaluate(TestRuleIgnoreAfterMaxFailures.java:64)
	at org.apache.lucene.util.TestRuleIgnoreTestSuites$1.evaluate(TestRuleIgnoreTestSuites.java:54)
	at com.carrotsearch.randomizedtesting.rules.StatementAdapter.evaluate(StatementAdapter.java:36)
	at com.carrotsearch.randomizedtesting.ThreadLeakControl$StatementRunner.run(ThreadLeakControl.java:367)
	at java.lang.Thread.run(Thread.java:745)


FAILED:  org.apache.solr.update.SolrIndexMetricsTest.testIndexMetrics

Error Message:
minorMerge: 3 expected:<4> but was:<3>

Stack Trace:
java.lang.AssertionError: minorMerge: 3 expected:<4> but was:<3>
	at __randomizedtesting.SeedInfo.seed([784EE71CA405F489:B49EDAA0648B0FB2]:0)
	at org.junit.Assert.fail(Assert.java:93)
	at org.junit.Assert.failNotEquals(Assert.java:647)
	at org.junit.Assert.assertEquals(Assert.java:128)
	at org.junit.Assert.assertEquals(Assert.java:472)
	at org.apache.solr.update.SolrIndexMetricsTest.testIndexMetrics(SolrIndexMetricsTest.java:70)
	at sun.reflect.NativeMethodAccessorImpl.invoke0(Native Method)
	at sun.reflect.NativeMethodAccessorImpl.invoke(NativeMethodAccessorImpl.java:62)
	at sun.reflect.DelegatingMethodAccessorImpl.invoke(DelegatingMethodAccessorImpl.java:43)
	at java.lang.reflect.Method.invoke(Method.java:498)
	at com.carrotsearch.randomizedtesting.RandomizedRunner.invoke(RandomizedRunner.java:1713)
	at com.carrotsearch.randomizedtesting.RandomizedRunner$8.evaluate(RandomizedRunner.java:907)
	at com.carrotsearch.randomizedtesting.RandomizedRunner$9.evaluate(RandomizedRunner.java:943)
	at com.carrotsearch.randomizedtesting.RandomizedRunner$10.evaluate(RandomizedRunner.java:957)
	at com.carrotsearch.randomizedtesting.rules.SystemPropertiesRestoreRule$1.evaluate(SystemPropertiesRestoreRule.java:57)
	at org.apache.lucene.util.TestRuleSetupTeardownChained$1.evaluate(TestRuleSetupTeardownChained.java:49)
	at org.apache.lucene.util.AbstractBeforeAfterRule$1.evaluate(AbstractBeforeAfterRule.java:45)
	at org.apache.lucene.util.TestRuleThreadAndTestName$1.evaluate(TestRuleThreadAndTestName.java:48)
	at org.apache.lucene.util.TestRuleIgnoreAfterMaxFailures$1.evaluate(TestRuleIgnoreAfterMaxFailures.java:64)
	at org.apache.lucene.util.TestRuleMarkFailure$1.evaluate(TestRuleMarkFailure.java:47)
	at com.carrotsearch.randomizedtesting.rules.StatementAdapter.evaluate(StatementAdapter.java:36)
	at com.carrotsearch.randomizedtesting.ThreadLeakControl$StatementRunner.run(ThreadLeakControl.java:367)
	at com.carrotsearch.randomizedtesting.ThreadLeakControl.forkTimeoutingTask(ThreadLeakControl.java:811)
	at com.carrotsearch.randomizedtesting.ThreadLeakControl$3.evaluate(ThreadLeakControl.java:462)
	at com.carrotsearch.randomizedtesting.RandomizedRunner.runSingleTest(RandomizedRunner.java:916)
	at com.carrotsearch.randomizedtesting.RandomizedRunner$5.evaluate(RandomizedRunner.java:802)
	at com.carrotsearch.randomizedtesting.RandomizedRunner$6.evaluate(RandomizedRunner.java:852)
	at com.carrotsearch.randomizedtesting.RandomizedRunner$7.evaluate(RandomizedRunner.java:863)
	at com.carrotsearch.randomizedtesting.rules.StatementAdapter.evaluate(StatementAdapter.java:36)
	at com.carrotsearch.randomizedtesting.rules.SystemPropertiesRestoreRule$1.evaluate(SystemPropertiesRestoreRule.java:57)
	at org.apache.lucene.util.AbstractBeforeAfterRule$1.evaluate(AbstractBeforeAfterRule.java:45)
	at com.carrotsearch.randomizedtesting.rules.StatementAdapter.evaluate(StatementAdapter.java:36)
	at org.apache.lucene.util.TestRuleStoreClassName$1.evaluate(TestRuleStoreClassName.java:41)
	at com.carrotsearch.randomizedtesting.rules.NoShadowingOrOverridesOnMethodsRule$1.evaluate(NoShadowingOrOverridesOnMethodsRule.java:40)
	at com.carrotsearch.randomizedtesting.rules.NoShadowingOrOverridesOnMethodsRule$1.evaluate(NoShadowingOrOverridesOnMethodsRule.java:40)
	at com.carrotsearch.randomizedtesting.rules.StatementAdapter.evaluate(StatementAdapter.java:36)
	at com.carrotsearch.randomizedtesting.rules.StatementAdapter.evaluate(StatementAdapter.java:36)
	at com.carrotsearch.randomizedtesting.rules.StatementAdapter.evaluate(StatementAdapter.java:36)
	at org.apache.lucene.util.TestRuleAssertionsRequired$1.evaluate(TestRuleAssertionsRequired.java:53)
	at org.apache.lucene.util.TestRuleMarkFailure$1.evaluate(TestRuleMarkFailure.java:47)
	at org.apache.lucene.util.TestRuleIgnoreAfterMaxFailures$1.evaluate(TestRuleIgnoreAfterMaxFailures.java:64)
	at org.apache.lucene.util.TestRuleIgnoreTestSuites$1.evaluate(TestRuleIgnoreTestSuites.java:54)
	at com.carrotsearch.randomizedtesting.rules.StatementAdapter.evaluate(StatementAdapter.java:36)
	at com.carrotsearch.randomizedtesting.ThreadLeakControl$StatementRunner.run(ThreadLeakControl.java:367)
	at java.lang.Thread.run(Thread.java:745)




Build Log:
[...truncated 11411 lines...]
   [junit4] Suite: org.apache.solr.update.SolrIndexMetricsTest
   [junit4]   2> Creating dataDir: /export/home/jenkins/workspace/Lucene-Solr-master-Solaris/solr/build/solr-core/test/J1/temp/solr.update.SolrIndexMetricsTest_784EE71CA405F489-001/init-core-data-001
   [junit4]   2> 1111680 INFO  (SUITE-SolrIndexMetricsTest-seed#[784EE71CA405F489]-worker) [    ] o.a.s.SolrTestCaseJ4 Randomized ssl (false) and clientAuth (false) via: @org.apache.solr.util.RandomizeSSL(reason=, value=NaN, ssl=NaN, clientAuth=NaN)
   [junit4]   2> 1111680 INFO  (SUITE-SolrIndexMetricsTest-seed#[784EE71CA405F489]-worker) [    ] o.a.s.SolrTestCaseJ4 ####initCore
   [junit4]   2> 1111680 INFO  (SUITE-SolrIndexMetricsTest-seed#[784EE71CA405F489]-worker) [    ] o.a.s.c.SolrResourceLoader [null] Added 2 libs to classloader, from paths: [/export/home/jenkins/workspace/Lucene-Solr-master-Solaris/solr/core/src/test-files/solr/collection1/lib, /export/home/jenkins/workspace/Lucene-Solr-master-Solaris/solr/core/src/test-files/solr/collection1/lib/classes]
   [junit4]   2> 1111703 WARN  (SUITE-SolrIndexMetricsTest-seed#[784EE71CA405F489]-worker) [    ] o.a.s.c.Config Beginning with Solr 5.5, <mergePolicy> is deprecated, use <mergePolicyFactory> instead.
   [junit4]   2> 1111703 WARN  (SUITE-SolrIndexMetricsTest-seed#[784EE71CA405F489]-worker) [    ] o.a.s.c.Config Beginning with Solr 5.5, <mergeFactor> is deprecated, configure it on the relevant <mergePolicyFactory> instead.
   [junit4]   2> 1111703 INFO  (SUITE-SolrIndexMetricsTest-seed#[784EE71CA405F489]-worker) [    ] o.a.s.c.SolrConfig Using Lucene MatchVersion: 7.0.0
   [junit4]   2> 1111712 INFO  (SUITE-SolrIndexMetricsTest-seed#[784EE71CA405F489]-worker) [    ] o.a.s.s.IndexSchema [null] Schema name=test
   [junit4]   2> 1111804 WARN  (SUITE-SolrIndexMetricsTest-seed#[784EE71CA405F489]-worker) [    ] o.a.s.s.IndexSchema [null] default search field in schema is text. WARNING: Deprecated, please use 'df' on request instead.
   [junit4]   2> 1111806 INFO  (SUITE-SolrIndexMetricsTest-seed#[784EE71CA405F489]-worker) [    ] o.a.s.s.IndexSchema Loaded schema test/1.0 with uniqueid field id
   [junit4]   2> 1111816 WARN  (SUITE-SolrIndexMetricsTest-seed#[784EE71CA405F489]-worker) [    ] o.a.s.m.r.SolrJmxReporter No serviceUrl or agentId was configured, using first MBeanServer.
   [junit4]   2> 1111818 INFO  (SUITE-SolrIndexMetricsTest-seed#[784EE71CA405F489]-worker) [    ] o.a.s.m.r.SolrJmxReporter JMX monitoring enabled at server: com.sun.jmx.mbeanserver.JmxMBeanServer@270b2078
   [junit4]   2> 1111818 WARN  (SUITE-SolrIndexMetricsTest-seed#[784EE71CA405F489]-worker) [    ] o.a.s.m.r.SolrJmxReporter No serviceUrl or agentId was configured, using first MBeanServer.
   [junit4]   2> 1111820 INFO  (SUITE-SolrIndexMetricsTest-seed#[784EE71CA405F489]-worker) [    ] o.a.s.m.r.SolrJmxReporter JMX monitoring enabled at server: com.sun.jmx.mbeanserver.JmxMBeanServer@270b2078
   [junit4]   2> 1111820 WARN  (SUITE-SolrIndexMetricsTest-seed#[784EE71CA405F489]-worker) [    ] o.a.s.m.r.SolrJmxReporter No serviceUrl or agentId was configured, using first MBeanServer.
   [junit4]   2> 1111820 INFO  (SUITE-SolrIndexMetricsTest-seed#[784EE71CA405F489]-worker) [    ] o.a.s.m.r.SolrJmxReporter JMX monitoring enabled at server: com.sun.jmx.mbeanserver.JmxMBeanServer@270b2078
   [junit4]   2> 1111822 INFO  (coreLoadExecutor-3821-thread-1) [    x:collection1] o.a.s.c.SolrResourceLoader [null] Added 2 libs to classloader, from paths: [/export/home/jenkins/workspace/Lucene-Solr-master-Solaris/solr/core/src/test-files/solr/collection1/lib, /export/home/jenkins/workspace/Lucene-Solr-master-Solaris/solr/core/src/test-files/solr/collection1/lib/classes]
   [junit4]   2> 1111840 WARN  (coreLoadExecutor-3821-thread-1) [    x:collection1] o.a.s.c.Config Beginning with Solr 5.5, <mergePolicy> is deprecated, use <mergePolicyFactory> instead.
   [junit4]   2> 1111841 WARN  (coreLoadExecutor-3821-thread-1) [    x:collection1] o.a.s.c.Config Beginning with Solr 5.5, <mergeFactor> is deprecated, configure it on the relevant <mergePolicyFactory> instead.
   [junit4]   2> 1111842 INFO  (coreLoadExecutor-3821-thread-1) [    x:collection1] o.a.s.c.SolrConfig Using Lucene MatchVersion: 7.0.0
   [junit4]   2> 1111850 INFO  (coreLoadExecutor-3821-thread-1) [    x:collection1] o.a.s.s.IndexSchema [collection1] Schema name=test
   [junit4]   2> 1111950 WARN  (coreLoadExecutor-3821-thread-1) [    x:collection1] o.a.s.s.IndexSchema [collection1] default search field in schema is text. WARNING: Deprecated, please use 'df' on request instead.
   [junit4]   2> 1111952 INFO  (coreLoadExecutor-3821-thread-1) [    x:collection1] o.a.s.s.IndexSchema Loaded schema test/1.0 with uniqueid field id
   [junit4]   2> 1111958 INFO  (coreLoadExecutor-3821-thread-1) [    x:collection1] o.a.s.c.CoreContainer Creating SolrCore 'collection1' using configuration from instancedir /export/home/jenkins/workspace/Lucene-Solr-master-Solaris/solr/core/src/test-files/solr/collection1
   [junit4]   2> 1111959 WARN  (coreLoadExecutor-3821-thread-1) [    x:collection1] o.a.s.m.r.SolrJmxReporter No serviceUrl or agentId was configured, using first MBeanServer.
   [junit4]   2> 1111959 INFO  (coreLoadExecutor-3821-thread-1) [    x:collection1] o.a.s.m.r.SolrJmxReporter JMX monitoring enabled at server: com.sun.jmx.mbeanserver.JmxMBeanServer@270b2078
   [junit4]   2> 1111959 INFO  (coreLoadExecutor-3821-thread-1) [    x:collection1] o.a.s.c.SolrCore [[collection1] ] Opening new SolrCore at [/export/home/jenkins/workspace/Lucene-Solr-master-Solaris/solr/core/src/test-files/solr/collection1], dataDir=[/export/home/jenkins/workspace/Lucene-Solr-master-Solaris/solr/build/solr-core/test/J1/temp/solr.update.SolrIndexMetricsTest_784EE71CA405F489-001/init-core-data-001/]
   [junit4]   2> 1111980 INFO  (coreLoadExecutor-3821-thread-1) [    x:collection1] o.a.s.u.CommitTracker Hard AutoCommit: disabled
   [junit4]   2> 1111980 INFO  (coreLoadExecutor-3821-thread-1) [    x:collection1] o.a.s.u.CommitTracker Soft AutoCommit: disabled
   [junit4]   2> 1111982 INFO  (coreLoadExecutor-3821-thread-1) [    x:collection1] o.a.s.s.SolrIndexSearcher Opening [Searcher@5b0dfca0[collection1] main]
   [junit4]   2> 1111982 WARN  (coreLoadExecutor-3821-thread-1) [    x:collection1] o.a.s.r.ManagedResourceStorage Cannot write to config directory /export/home/jenkins/workspace/Lucene-Solr-master-Solaris/solr/core/src/test-files/solr/collection1/conf; switching to use InMemory storage instead.
   [junit4]   2> 1111982 INFO  (coreLoadExecutor-3821-thread-1) [    x:collection1] o.a.s.h.ReplicationHandler Commits will be reserved for  10000
   [junit4]   2> 1111984 INFO  (SUITE-SolrIndexMetricsTest-seed#[784EE71CA405F489]-worker) [    ] o.a.s.SolrTestCaseJ4 ####initCore end
   [junit4]   2> 1111988 INFO  (TEST-SolrIndexMetricsTest.testIndexMetrics-seed#[784EE71CA405F489]) [    ] o.a.s.SolrTestCaseJ4 ###Starting testIndexMetrics
   [junit4]   2> 1111988 INFO  (searcherExecutor-3822-thread-1-processing-x:collection1) [    x:collection1] o.a.s.c.SolrCore [collection1] Registered new searcher Searcher@5b0dfca0[collection1] main{ExitableDirectoryReader(UninvertingDirectoryReader())}
   [junit4]   2> 1112856 INFO  (TEST-SolrIndexMetricsTest.testIndexMetrics-seed#[784EE71CA405F489]) [    ] o.a.s.u.DirectUpdateHandler2 start commit{,optimize=false,openSearcher=true,waitSearcher=true,expungeDeletes=false,softCommit=false,prepareCommit=false}
   [junit4]   2> 1112856 INFO  (TEST-SolrIndexMetricsTest.testIndexMetrics-seed#[784EE71CA405F489]) [    ] o.a.s.u.SolrIndexWriter Calling setCommitData with IW:org.apache.solr.update.SolrIndexWriter@51b14861
   [junit4]   2> 1112889 INFO  (TEST-SolrIndexMetricsTest.testIndexMetrics-seed#[784EE71CA405F489]) [    ] o.a.s.s.SolrIndexSearcher Opening [Searcher@36fbbc95[collection1] main]
   [junit4]   2> 1112889 INFO  (searcherExecutor-3822-thread-1) [    ] o.a.s.c.SolrCore [collection1] Registered new searcher Searcher@36fbbc95[collection1] main{ExitableDirectoryReader(UninvertingDirectoryReader(Uninverting(_0(7.0.0):C100) Uninverting(_1(7.0.0):C100) Uninverting(_2(7.0.0):C100) Uninverting(_3(7.0.0):C100) Uninverting(_5(7.0.0):C100) Uninverting(_6(7.0.0):C100) Uninverting(_7(7.0.0):C100) Uninverting(_9(7.0.0):C100) Uninverting(_a(7.0.0):C100) Uninverting(_b(7.0.0):C100)))}
   [junit4]   2> 1112890 INFO  (TEST-SolrIndexMetricsTest.testIndexMetrics-seed#[784EE71CA405F489]) [    ] o.a.s.u.DirectUpdateHandler2 end_commit_flush
   [junit4]   2> 1112890 INFO  (TEST-SolrIndexMetricsTest.testIndexMetrics-seed#[784EE71CA405F489]) [    ] o.a.s.c.SolrResourceLoader [null] Added 2 libs to classloader, from paths: [/export/home/jenkins/workspace/Lucene-Solr-master-Solaris/solr/core/src/test-files/solr/collection1/lib, /export/home/jenkins/workspace/Lucene-Solr-master-Solaris/solr/core/src/test-files/solr/collection1/lib/classes]
   [junit4]   2> 1112918 WARN  (TEST-SolrIndexMetricsTest.testIndexMetrics-seed#[784EE71CA405F489]) [    ] o.a.s.c.Config Beginning with Solr 5.5, <mergePolicy> is deprecated, use <mergePolicyFactory> instead.
   [junit4]   2> 1112918 WARN  (TEST-SolrIndexMetricsTest.testIndexMetrics-seed#[784EE71CA405F489]) [    ] o.a.s.c.Config Beginning with Solr 5.5, <mergeFactor> is deprecated, configure it on the relevant <mergePolicyFactory> instead.
   [junit4]   2> 1112918 INFO  (TEST-SolrIndexMetricsTest.testIndexMetrics-seed#[784EE71CA405F489]) [    ] o.a.s.c.SolrConfig Using Lucene MatchVersion: 7.0.0
   [junit4]   2> 1112953 INFO  (TEST-SolrIndexMetricsTest.testIndexMetrics-seed#[784EE71CA405F489]) [    ] o.a.s.s.IndexSchema [collection1] Schema name=test
   [junit4]   2> 1113039 WARN  (TEST-SolrIndexMetricsTest.testIndexMetrics-seed#[784EE71CA405F489]) [    ] o.a.s.s.IndexSchema [collection1] default search field in schema is text. WARNING: Deprecated, please use 'df' on request instead.
   [junit4]   2> 1113041 INFO  (TEST-SolrIndexMetricsTest.testIndexMetrics-seed#[784EE71CA405F489]) [    ] o.a.s.s.IndexSchema Loaded schema test/1.0 with uniqueid field id
   [junit4]   2> 1113049 INFO  (TEST-SolrIndexMetricsTest.testIndexMetrics-seed#[784EE71CA405F489]) [    ] o.a.s.c.CoreContainer Reloading SolrCore 'collection1' using configuration from instancedir /export/home/jenkins/workspace/Lucene-Solr-master-Solaris/solr/core/src/test-files/solr/collection1
   [junit4]   2> 1113049 WARN  (TEST-SolrIndexMetricsTest.testIndexMetrics-seed#[784EE71CA405F489]) [    x:collection1] o.a.s.m.r.SolrJmxReporter No serviceUrl or agentId was configured, using first MBeanServer.
   [junit4]   2> 1113059 INFO  (TEST-SolrIndexMetricsTest.testIndexMetrics-seed#[784EE71CA405F489]) [    x:collection1] o.a.s.m.r.SolrJmxReporter JMX monitoring enabled at server: com.sun.jmx.mbeanserver.JmxMBeanServer@270b2078
   [junit4]   2> 1113060 INFO  (TEST-SolrIndexMetricsTest.testIndexMetrics-seed#[784EE71CA405F489]) [    x:collection1] o.a.s.m.SolrMetricManager Replacing existing reporter 'default' in registry 'solr.core.collection1': [org.apache.solr.metrics.reporters.SolrJmxReporter@5cd37b30: domain = solr.core.collection1, service url = null, agent id = null]
   [junit4]   2> 1113064 INFO  (TEST-SolrIndexMetricsTest.testIndexMetrics-seed#[784EE71CA405F489]) [    x:collection1] o.a.s.c.SolrCore [[collection1] ] Opening new SolrCore at [/export/home/jenkins/workspace/Lucene-Solr-master-Solaris/solr/core/src/test-files/solr/collection1], dataDir=[/export/home/jenkins/workspace/Lucene-Solr-master-Solaris/solr/build/solr-core/test/J1/temp/solr.update.SolrIndexMetricsTest_784EE71CA405F489-001/init-core-data-001/]
   [junit4]   2> 1113079 INFO  (TEST-SolrIndexMetricsTest.testIndexMetrics-seed#[784EE71CA405F489]) [    x:collection1] o.a.s.u.CommitTracker Hard AutoCommit: disabled
   [junit4]   2> 1113079 INFO  (TEST-SolrIndexMetricsTest.testIndexMetrics-seed#[784EE71CA405F489]) [    x:collection1] o.a.s.u.CommitTracker Soft AutoCommit: disabled
   [junit4]   2> 1113080 INFO  (TEST-SolrIndexMetricsTest.testIndexMetrics-seed#[784EE71CA405F489]) [    x:collection1] o.a.s.s.SolrIndexSearcher Opening [Searcher@58e17dda[collection1] main]
   [junit4]   2> 1113080 WARN  (TEST-SolrIndexMetricsTest.testIndexMetrics-seed#[784EE71CA405F489]) [    x:collection1] o.a.s.r.ManagedResourceStorage Cannot write to config directory /export/home/jenkins/workspace/Lucene-Solr-master-Solaris/solr/core/src/test-files/solr/collection1/conf; switching to use InMemory storage instead.
   [junit4]   2> 1113081 INFO  (TEST-SolrIndexMetricsTest.testIndexMetrics-seed#[784EE71CA405F489]) [    x:collection1] o.a.s.h.ReplicationHandler Commits will be reserved for  10000
   [junit4]   2> 1113082 INFO  (searcherExecutor-3826-thread-1-processing-x:collection1) [    x:collection1] o.a.s.c.SolrCore [collection1] Registered new searcher Searcher@58e17dda[collection1] main{ExitableDirectoryReader(UninvertingDirectoryReader(Uninverting(_0(7.0.0):C100) Uninverting(_1(7.0.0):C100) Uninverting(_2(7.0.0):C100) Uninverting(_3(7.0.0):C100) Uninverting(_5(7.0.0):C100) Uninverting(_6(7.0.0):C100) Uninverting(_7(7.0.0):C100) Uninverting(_9(7.0.0):C100) Uninverting(_a(7.0.0):C100) Uninverting(_b(7.0.0):C100)))}
   [junit4]   2> 1113486 INFO  (TEST-SolrIndexMetricsTest.testIndexMetrics-seed#[784EE71CA405F489]) [    x:collection1] o.a.s.u.DefaultSolrCoreState New IndexWriter is ready to be used.
   [junit4]   2> 1113555 INFO  (TEST-SolrIndexMetricsTest.testIndexMetrics-seed#[784EE71CA405F489]) [    x:collection1] o.a.s.s.SolrIndexSearcher Opening [Searcher@54b6ca37[collection1] main]
   [junit4]   2> 1113555 INFO  (TEST-SolrIndexMetricsTest.testIndexMetrics-seed#[784EE71CA405F489]) [    x:collection1] o.a.s.c.SolrCore [collection1]  CLOSING SolrCore org.apache.solr.core.SolrCore@2debb3f
   [junit4]   2> 1113555 INFO  (searcherExecutor-3826-thread-1-processing-x:collection1) [    x:collection1] o.a.s.c.SolrCore [collection1] Registered new searcher Searcher@54b6ca37[collection1] main{ExitableDirectoryReader(UninvertingDirectoryReader(Uninverting(_4(7.0.0):C300) Uninverting(_8(7.0.0):C300) Uninverting(_c(7.0.0):C300) Uninverting(_b(7.0.0):C100)))}
   [junit4]   2> 1113556 INFO  (TEST-SolrIndexMetricsTest.testIndexMetrics-seed#[784EE71CA405F489]) [    x:collection1] o.a.s.m.SolrMetricManager Closing metric reporters for: solr.core.collection1
   [junit4]   2> 1113559 INFO  (TEST-SolrIndexMetricsTest.testIndexMetrics-seed#[784EE71CA405F489]) [    x:collection1] o.a.s.SolrTestCaseJ4 ###Ending testIndexMetrics
   [junit4]   2> NOTE: reproduce with: ant test  -Dtestcase=SolrIndexMetricsTest -Dtests.method=testIndexMetrics -Dtests.seed=784EE71CA405F489 -Dtests.slow=true -Dtests.locale=pl -Dtests.timezone=Europe/Prague -Dtests.asserts=true -Dtests.file.encoding=US-ASCII
   [junit4] FAILURE 1.58s J1 | SolrIndexMetricsTest.testIndexMetrics <<<
   [junit4]    > Throwable #1: java.lang.AssertionError: minorMerge: 3 expected:<4> but was:<3>
   [junit4]    > 	at __randomizedtesting.SeedInfo.seed([784EE71CA405F489:B49EDAA0648B0FB2]:0)
   [junit4]    > 	at org.apache.solr.update.SolrIndexMetricsTest.testIndexMetrics(SolrIndexMetricsTest.java:70)
   [junit4]    > 	at java.lang.Thread.run(Thread.java:745)
   [junit4]   2> 1113562 INFO  (SUITE-SolrIndexMetricsTest-seed#[784EE71CA405F489]-worker) [    x:collection1] o.a.s.SolrTestCaseJ4 ###deleteCore
   [junit4]   2> 1113562 INFO  (SUITE-SolrIndexMetricsTest-seed#[784EE71CA405F489]-worker) [    x:collection1] o.a.s.c.CoreContainer Shutting down CoreContainer instance=651316499
   [junit4]   2> 1113562 INFO  (coreCloseExecutor-3830-thread-1-processing-x:collection1) [    x:collection1] o.a.s.c.SolrCore [collection1]  CLOSING SolrCore org.apache.solr.core.SolrCore@25e4310a
   [junit4]   2> 1113564 INFO  (coreCloseExecutor-3830-thread-1-processing-x:collection1) [    x:collection1] o.a.s.m.SolrMetricManager Closing metric reporters for: solr.core.collection1
   [junit4]   2> 1113565 INFO  (SUITE-SolrIndexMetricsTest-seed#[784EE71CA405F489]-worker) [    x:collection1] o.a.s.m.SolrMetricManager Closing metric reporters for: solr.node
   [junit4]   2> NOTE: leaving temporary files on disk at: /export/home/jenkins/workspace/Lucene-Solr-master-Solaris/solr/build/solr-core/test/J1/temp/solr.update.SolrIndexMetricsTest_784EE71CA405F489-001
   [junit4]   2> NOTE: test params are: codec=Asserting(Lucene70): {range_facet_l_dv=PostingsFormat(name=LuceneFixedGap), multiDefault=Lucene50(blocksize=128), intDefault=PostingsFormat(name=MockRandom), foo_s=Lucene50(blocksize=128), id=PostingsFormat(name=LuceneFixedGap), range_facet_i_dv=Lucene50(blocksize=128), range_facet_l=Lucene50(blocksize=128), timestamp=Lucene50(blocksize=128)}, docValues:{range_facet_l_dv=DocValuesFormat(name=Direct), multiDefault=DocValuesFormat(name=Asserting), intDefault=DocValuesFormat(name=Memory), range_facet_i_dv=DocValuesFormat(name=Asserting), id=DocValuesFormat(name=Direct), foo_s=DocValuesFormat(name=Asserting), timestamp=DocValuesFormat(name=Asserting), range_facet_l=DocValuesFormat(name=Asserting)}, maxPointsInLeafNode=525, maxMBSortInHeap=7.299060301468916, sim=RandomSimilarity(queryNorm=true): {}, locale=pl, timezone=Europe/Prague
   [junit4]   2> NOTE: SunOS 5.11 amd64/Oracle Corporation 1.8.0_112 (64-bit)/cpus=3,threads=1,free=36864912,total=518979584
   [junit4]   2> NOTE: All tests run in this JVM: [URLClassifyProcessorTest, OpenCloseCoreStressTest, BooleanFieldTest, MergeStrategyTest, BigEndianAscendingWordSerializerTest, TestSearchPerf, TestFieldCacheSanityChecker, StatsReloadRaceTest, TestClusterProperties, TestOverriddenPrefixQueryForCustomFieldType, TestRangeQuery, TestDistributedGrouping, TestFoldingMultitermQuery, TestCodecSupport, MultiThreadedOCPTest, LeaderElectionContextKeyTest, TestWriterPerf, CreateCollectionCleanupTest, SuggesterTest, TestBinaryResponseWriter, TestSolrCloudSnapshots, NoCacheHeaderTest, TestSolrQueryParserDefaultOperatorResource, TestConfigSetsAPI, TestUtils, AnalysisErrorHandlingTest, TestLegacyNumericRangeQueryBuilder, TestDynamicLoading, CloneFieldUpdateProcessorFactoryTest, RollingRestartTest, AutoCommitTest, ForceLeaderTest, TestFieldCacheWithThreads, SuggesterWFSTTest, DeleteInactiveReplicaTest, SliceStateTest, SolrCloudExampleTest, ClusterStateTest, CollectionReloadTest, CdcrReplicationHandlerTest, SimpleCollectionCreateDeleteTest, TestFuzzyAnalyzedSuggestions, ClassificationUpdateProcessorIntegrationTest, TestCoreDiscovery, SolrJmxReporterTest, TestIndexSearcher, TestReplicationHandlerBackup, TestDownShardTolerantSearch, TestFieldResource, FieldMutatingUpdateProcessorTest, RAMDirectoryFactoryTest, TestLMDirichletSimilarityFactory, TestBlendedInfixSuggestions, FieldAnalysisRequestHandlerTest, DeleteNodeTest, TestFilteredDocIdSet, CacheHeaderTest, TestExceedMaxTermLength, DataDrivenBlockJoinTest, DistributedVersionInfoTest, TestRandomFlRTGCloud, HLLSerializationTest, RequestHandlersTest, TestSha256AuthenticationProvider, TestDFRSimilarityFactory, BasicZkTest, TestFieldTypeResource, OverseerModifyCollectionTest, SpellPossibilityIteratorTest, TestCollationFieldDocValues, TestAuthenticationFramework, TestStressLiveNodes, CollectionsAPIDistributedZkTest, TriLevelCompositeIdRoutingTest, DistributedTermsComponentTest, SparseHLLTest, ReplicationFactorTest, TestSolrDeletionPolicy2, DistributedFacetPivotSmallAdvancedTest, FacetPivotSmallTest, PKIAuthenticationIntegrationTest, TestUseDocValuesAsStored2, TestReversedWildcardFilterFactory, ConvertedLegacyTest, LeaderInitiatedRecoveryOnShardRestartTest, CoreSorterTest, SuggesterTSTTest, SpellingQueryConverterTest, DefaultValueUpdateProcessorTest, CloudMLTQParserTest, LukeRequestHandlerTest, ZkSolrClientTest, UpdateRequestProcessorFactoryTest, BJQParserTest, DistanceFunctionTest, GraphQueryTest, TestQueryUtils, UUIDUpdateProcessorFallbackTest, HttpSolrCallGetCoreTest, TestSimpleQParserPlugin, TestMacroExpander, TestStandardQParsers, DirectUpdateHandlerOptimizeTest, RequestLoggingTest, TestRandomCollapseQParserPlugin, RemoteQueryErrorTest, TestStressRecovery, StressHdfsTest, BlockJoinFacetRandomTest, SharedFSAutoReplicaFailoverTest, TestManagedSchemaAPI, TestTolerantUpdateProcessorRandomCloud, TestSolrQueryParser, TestEmbeddedSolrServerConstructors, CircularListTest, TestUninvertingReader, SolrIndexMetricsTest]
   [junit4] Completed [244/675 (1!)] on J1 in 1.90s, 1 test, 1 failure <<< FAILURES!

[...truncated 802 lines...]
   [junit4] Suite: org.apache.solr.cloud.TestSolrCloudWithDelegationTokens
   [junit4]   2> Creating dataDir: /export/home/jenkins/workspace/Lucene-Solr-master-Solaris/solr/build/solr-core/test/J1/temp/solr.cloud.TestSolrCloudWithDelegationTokens_784EE71CA405F489-001/init-core-data-001
   [junit4]   2> 2565231 INFO  (SUITE-TestSolrCloudWithDelegationTokens-seed#[784EE71CA405F489]-worker) [    ] o.a.s.SolrTestCaseJ4 Randomized ssl (false) and clientAuth (false) via: @org.apache.solr.util.RandomizeSSL(reason=, value=NaN, ssl=NaN, clientAuth=NaN)
   [junit4]   2> 2565234 INFO  (SUITE-TestSolrCloudWithDelegationTokens-seed#[784EE71CA405F489]-worker) [    ] o.a.s.c.MiniSolrCloudCluster Starting cluster of 2 servers in /export/home/jenkins/workspace/Lucene-Solr-master-Solaris/solr/build/solr-core/test/J1/temp/solr.cloud.TestSolrCloudWithDelegationTokens_784EE71CA405F489-001/tempDir-001
   [junit4]   2> 2565234 INFO  (SUITE-TestSolrCloudWithDelegationTokens-seed#[784EE71CA405F489]-worker) [    ] o.a.s.c.ZkTestServer STARTING ZK TEST SERVER
   [junit4]   2> 2565234 INFO  (Thread-6852) [    ] o.a.s.c.ZkTestServer client port:0.0.0.0/0.0.0.0:0
   [junit4]   2> 2565234 INFO  (Thread-6852) [    ] o.a.s.c.ZkTestServer Starting server
   [junit4]   2> 2565334 INFO  (SUITE-TestSolrCloudWithDelegationTokens-seed#[784EE71CA405F489]-worker) [    ] o.a.s.c.ZkTestServer start zk server on port:53844
   [junit4]   2> 2565343 INFO  (jetty-launcher-4271-thread-2) [    ] o.e.j.s.Server jetty-9.3.14.v20161028
   [junit4]   2> 2565343 INFO  (jetty-launcher-4271-thread-1) [    ] o.e.j.s.Server jetty-9.3.14.v20161028
   [junit4]   2> 2565345 INFO  (jetty-launcher-4271-thread-1) [    ] o.e.j.s.h.ContextHandler Started o.e.j.s.ServletContextHandler@301e52f1{/solr,null,AVAILABLE}
   [junit4]   2> 2565346 INFO  (jetty-launcher-4271-thread-1) [    ] o.e.j.s.AbstractConnector Started ServerConnector@412d45f3{HTTP/1.1,[http/1.1]}{127.0.0.1:45318}
   [junit4]   2> 2565346 INFO  (jetty-launcher-4271-thread-1) [    ] o.e.j.s.Server Started @2569387ms
   [junit4]   2> 2565346 INFO  (jetty-launcher-4271-thread-1) [    ] o.a.s.c.s.e.JettySolrRunner Jetty properties: {hostContext=/solr, hostPort=45318}
   [junit4]   2> 2565346 INFO  (jetty-launcher-4271-thread-2) [    ] o.e.j.s.h.ContextHandler Started o.e.j.s.ServletContextHandler@622880c6{/solr,null,AVAILABLE}
   [junit4]   2> 2565346 ERROR (jetty-launcher-4271-thread-1) [    ] o.a.s.s.StartupLoggingUtils Missing Java Option solr.log.dir. Logging may be missing or incomplete.
   [junit4]   2> 2565346 INFO  (jetty-launcher-4271-thread-1) [    ] o.a.s.s.SolrDispatchFilter  ___      _       Welcome to Apache Solr? version 7.0.0
   [junit4]   2> 2565346 INFO  (jetty-launcher-4271-thread-2) [    ] o.e.j.s.AbstractConnector Started ServerConnector@4aa1fae9{HTTP/1.1,[http/1.1]}{127.0.0.1:36335}
   [junit4]   2> 2565346 INFO  (jetty-launcher-4271-thread-2) [    ] o.e.j.s.Server Started @2569387ms
   [junit4]   2> 2565346 INFO  (jetty-launcher-4271-thread-2) [    ] o.a.s.c.s.e.JettySolrRunner Jetty properties: {hostContext=/solr, hostPort=36335}
   [junit4]   2> 2565346 INFO  (jetty-launcher-4271-thread-1) [    ] o.a.s.s.SolrDispatchFilter / __| ___| |_ _   Starting in cloud mode on port null
   [junit4]   2> 2565347 INFO  (jetty-launcher-4271-thread-1) [    ] o.a.s.s.SolrDispatchFilter \__ \/ _ \ | '_|  Install dir: null
   [junit4]   2> 2565347 ERROR (jetty-launcher-4271-thread-2) [    ] o.a.s.s.StartupLoggingUtils Missing Java Option solr.log.dir. Logging may be missing or incomplete.
   [junit4]   2> 2565347 INFO  (jetty-launcher-4271-thread-1) [    ] o.a.s.s.SolrDispatchFilter |___/\___/_|_|    Start time: 2017-01-06T01:04:34.279Z
   [junit4]   2> 2565347 INFO  (jetty-launcher-4271-thread-2) [    ] o.a.s.s.SolrDispatchFilter  ___      _       Welcome to Apache Solr? version 7.0.0
   [junit4]   2> 2565347 INFO  (jetty-launcher-4271-thread-2) [    ] o.a.s.s.SolrDispatchFilter / __| ___| |_ _   Starting in cloud mode on port null
   [junit4]   2> 2565347 INFO  (jetty-launcher-4271-thread-2) [    ] o.a.s.s.SolrDispatchFilter \__ \/ _ \ | '_|  Install dir: null
   [junit4]   2> 2565347 INFO  (jetty-launcher-4271-thread-2) [    ] o.a.s.s.SolrDispatchFilter |___/\___/_|_|    Start time: 2017-01-06T01:04:34.279Z
   [junit4]   2> 2565349 INFO  (jetty-launcher-4271-thread-1) [    ] o.a.s.s.SolrDispatchFilter solr.xml found in ZooKeeper. Loading...
   [junit4]   2> 2565350 INFO  (jetty-launcher-4271-thread-2) [    ] o.a.s.s.SolrDispatchFilter solr.xml found in ZooKeeper. Loading...
   [junit4]   2> 2565359 INFO  (jetty-launcher-4271-thread-1) [    ] o.a.s.c.ZkContainer Zookeeper client=127.0.0.1:53844/solr
   [junit4]   2> 2565360 INFO  (jetty-launcher-4271-thread-2) [    ] o.a.s.c.ZkContainer Zookeeper client=127.0.0.1:53844/solr
   [junit4]   2> 2565398 INFO  (jetty-launcher-4271-thread-1) [n:127.0.0.1:45318_solr    ] o.a.s.c.OverseerElectionContext I am going to be the leader 127.0.0.1:45318_solr
   [junit4]   2> 2565399 INFO  (jetty-launcher-4271-thread-2) [n:127.0.0.1:36335_solr    ] o.a.s.c.ZkController Register node as live in ZooKeeper:/live_nodes/127.0.0.1:36335_solr
   [junit4]   2> 2565400 INFO  (jetty-launcher-4271-thread-1) [n:127.0.0.1:45318_solr    ] o.a.s.c.Overseer Overseer (id=97233448086274053-127.0.0.1:45318_solr-n_0000000000) starting
   [junit4]   2> 2565402 INFO  (zkCallback-4282-thread-1-processing-n:127.0.0.1:36335_solr) [n:127.0.0.1:36335_solr    ] o.a.s.c.c.ZkStateReader Updated live nodes from ZooKeeper... (0) -> (1)
   [junit4]   2> 2565402 INFO  (zkCallback-4281-thread-1-processing-n:127.0.0.1:45318_solr) [n:127.0.0.1:45318_solr    ] o.a.s.c.c.ZkStateReader Updated live nodes from ZooKeeper... (0) -> (1)
   [junit4]   2> 2565414 INFO  (jetty-launcher-4271-thread-1) [n:127.0.0.1:45318_solr    ] o.a.s.c.ZkController Register node as live in ZooKeeper:/live_nodes/127.0.0.1:45318_solr
   [junit4]   2> 2565418 INFO  (zkCallback-4282-thread-1-processing-n:127.0.0.1:36335_solr) [n:127.0.0.1:36335_solr    ] o.a.s.c.c.ZkStateReader Updated live nodes from ZooKeeper... (1) -> (2)
   [junit4]   2> 2565419 INFO  (zkCallback-4281-thread-1-processing-n:127.0.0.1:45318_solr) [n:127.0.0.1:45318_solr    ] o.a.s.c.c.ZkStateReader Updated live nodes from ZooKeeper... (1) -> (2)
   [junit4]   2> 2565444 INFO  (jetty-launcher-4271-thread-2) [n:127.0.0.1:36335_solr    ] o.a.s.c.CoreContainer Initializing authentication plugin: org.apache.solr.security.HttpParamDelegationTokenPlugin
   [junit4]   2> 2565459 INFO  (jetty-launcher-4271-thread-2) [n:127.0.0.1:36335_solr    ] o.a.s.s.KerberosPlugin Params: {token.valid=30, delegation-token.token-kind=solr-dt, cookie.domain=127.0.0.1, cookie.path=/, zk-dt-secret-manager.znodeWorkingPath=solr/security/zkdtsm, token.validity=36000, signer.secret.provider.zookeeper.path=/token, type=kerberos, zk-dt-secret-manager.enable=true, kerberos.name.rules=DEFAULT, signer.secret.provider=zookeeper}
   [junit4]   2> 2565471 INFO  (jetty-launcher-4271-thread-1) [n:127.0.0.1:45318_solr    ] o.a.s.c.CoreContainer Initializing authentication plugin: org.apache.solr.security.HttpParamDelegationTokenPlugin
   [junit4]   2> 2565471 INFO  (jetty-launcher-4271-thread-1) [n:127.0.0.1:45318_solr    ] o.a.s.s.KerberosPlugin Params: {token.valid=30, delegation-token.token-kind=solr-dt, cookie.domain=127.0.0.1, cookie.path=/, zk-dt-secret-manager.znodeWorkingPath=solr/security/zkdtsm, token.validity=36000, signer.secret.provider.zookeeper.path=/token, type=kerberos, zk-dt-secret-manager.enable=true, kerberos.name.rules=DEFAULT, signer.secret.provider=zookeeper}
   [junit4]   2> 2565567 INFO  (jetty-launcher-4271-thread-2) [n:127.0.0.1:36335_solr    ] o.a.c.f.i.CuratorFrameworkImpl Starting
   [junit4]   2> 2565567 INFO  (jetty-launcher-4271-thread-1) [n:127.0.0.1:45318_solr    ] o.a.c.f.i.CuratorFrameworkImpl Starting
   [junit4]   2> 2565598 INFO  (jetty-launcher-4271-thread-1-EventThread) [n:127.0.0.1:45318_solr    ] o.a.c.f.s.ConnectionStateManager State change: CONNECTED
   [junit4]   2> 2565598 INFO  (jetty-launcher-4271-thread-2-EventThread) [n:127.0.0.1:36335_solr    ] o.a.c.f.s.ConnectionStateManager State change: CONNECTED
   [junit4]   2> 2565750 INFO  (jetty-launcher-4271-thread-1) [n:127.0.0.1:45318_solr    ] o.a.s.c.CorePropertiesLocator Found 0 core definitions underneath /export/home/jenkins/workspace/Lucene-Solr-master-Solaris/solr/build/solr-core/test/J1/temp/solr.cloud.TestSolrCloudWithDelegationTokens_784EE71CA405F489-001/tempDir-001/node1/.
   [junit4]   2> 2565760 INFO  (jetty-launcher-4271-thread-2) [n:127.0.0.1:36335_solr    ] o.a.s.c.CorePropertiesLocator Found 0 core definitions underneath /export/home/jenkins/workspace/Lucene-Solr-master-Solaris/solr/build/solr-core/test/J1/temp/solr.cloud.TestSolrCloudWithDelegationTokens_784EE71CA405F489-001/tempDir-001/node2/.
   [junit4]   2> 2566978 INFO  (TEST-TestSolrCloudWithDelegationTokens.testDelegationTokenCancelFail-seed#[784EE71CA405F489]) [    ] o.a.s.SolrTestCaseJ4 ###Starting testDelegationTokenCancelFail
   [junit4]   2> 2567128 ERROR (qtp818712600-25019) [    ] o.a.h.s.t.d.ZKDelegationTokenSecretManager No node in path [/ZKDTSMTokensRoot/DT_1]
   [junit4]   2> 2567131 ERROR (qtp1538864277-25028) [    ] o.a.h.s.t.d.ZKDelegationTokenSecretManager No node in path [/ZKDTSMTokensRoot/DT_1]
   [junit4]   2> 2567154 ERROR (qtp818712600-25021) [    ] o.a.h.s.t.d.ZKDelegationTokenSecretManager No node in path [/ZKDTSMTokensRoot/DT_2]
   [junit4]   2> 2567157 INFO  (TEST-TestSolrCloudWithDelegationTokens.testDelegationTokenCancelFail-seed#[784EE71CA405F489]) [    ] o.a.s.SolrTestCaseJ4 ###Ending testDelegationTokenCancelFail
   [junit4]   2> NOTE: reproduce with: ant test  -Dtestcase=TestSolrCloudWithDelegationTokens -Dtests.method=testDelegationTokenCancelFail -Dtests.seed=784EE71CA405F489 -Dtests.slow=true -Dtests.locale=sr-RS -Dtests.timezone=Antarctica/Davis -Dtests.asserts=true -Dtests.file.encoding=US-ASCII
   [junit4] FAILURE 0.21s J1 | TestSolrCloudWithDelegationTokens.testDelegationTokenCancelFail <<<
   [junit4]    > Throwable #1: java.lang.AssertionError: expected:<200> but was:<404>
   [junit4]    > 	at __randomizedtesting.SeedInfo.seed([784EE71CA405F489:10F1D236749FE665]:0)
   [junit4]    > 	at org.apache.solr.cloud.TestSolrCloudWithDelegationTokens.cancelDelegationToken(TestSolrCloudWithDelegationTokens.java:140)
   [junit4]    > 	at org.apache.solr.cloud.TestSolrCloudWithDelegationTokens.testDelegationTokenCancelFail(TestSolrCloudWithDelegationTokens.java:304)
   [junit4]    > 	at java.lang.Thread.run(Thread.java:745)
   [junit4]   2> 2567226 INFO  (TEST-TestSolrCloudWithDelegationTokens.testDelegationTokenSolrClient-seed#[784EE71CA405F489]) [    ] o.a.s.SolrTestCaseJ4 ###Starting testDelegationTokenSolrClient
   [junit4]   2> 2567253 WARN  (TEST-TestSolrCloudWithDelegationTokens.testDelegationTokenSolrClient-seed#[784EE71CA405F489]) [    ] o.a.h.c.p.ResponseProcessCookies Invalid cookie header: "Set-Cookie: hadoop.auth=; Path=/; Domain=127.0.0.1; Expires=   , 01-   -1970 00:00:00 GMT; HttpOnly". Invalid 'expires' attribute: , 01- -1970 00:00:00 GMT
   [junit4]   2> 2567270 INFO  (qtp1538864277-25028) [n:127.0.0.1:36335_solr    ] o.a.s.h.a.CollectionsHandler Invoked Collection Action :list with params action=LIST&delegation=GgADYmFyA2JhcgCKAVlxTlU_igFZlVrZPwMEFFnYVoklmCz-AExZE7f6rf7ZAz_uB3NvbHItZHQA&wt=javabin&version=2 and sendToOCPQueue=true
   [junit4]   2> 2567270 INFO  (qtp1538864277-25028) [n:127.0.0.1:36335_solr    ] o.a.s.s.HttpSolrCall [admin] webapp=null path=/admin/collections params={action=LIST&delegation=GgADYmFyA2JhcgCKAVlxTlU_igFZlVrZPwMEFFnYVoklmCz-AExZE7f6rf7ZAz_uB3NvbHItZHQA&wt=javabin&version=2} status=0 QTime=0
   [junit4]   2> 2567272 INFO  (TEST-TestSolrCloudWithDelegationTokens.testDelegationTokenSolrClient-seed#[784EE71CA405F489]) [    ] o.a.s.SolrTestCaseJ4 ###Ending testDelegationTokenSolrClient
   [junit4]   2> 2567305 INFO  (TEST-TestSolrCloudWithDelegationTokens.testZNodePaths-seed#[784EE71CA405F489]) [    ] o.a.s.SolrTestCaseJ4 ###Starting testZNodePaths
   [junit4]   2> 2567320 INFO  (TEST-TestSolrCloudWithDelegationTokens.testZNodePaths-seed#[784EE71CA405F489]) [    ] o.a.s.SolrTestCaseJ4 ###Ending testZNodePaths
   [junit4]   2> 2567382 INFO  (TEST-TestSolrCloudWithDelegationTokens.testDelegationTokenCancel-seed#[784EE71CA405F489]) [    ] o.a.s.SolrTestCaseJ4 ###Starting testDelegationTokenCancel
   [junit4]   2> 2567401 INFO  (TEST-TestSolrCloudWithDelegationTokens.testDelegationTokenCancel-seed#[784EE71CA405F489]) [    ] o.a.s.c.c.ZkStateReader Updated live nodes from ZooKeeper... (0) -> (2)
   [junit4]   2> 2567403 INFO  (TEST-TestSolrCloudWithDelegationTokens.testDelegationTokenCancel-seed#[784EE71CA405F489]) [    ] o.a.s.c.s.i.ZkClientClusterStateProvider Cluster at 127.0.0.1:53844/solr ready
   [junit4]   2> 2567406 ERROR (qtp1538864277-25028) [n:127.0.0.1:36335_solr    ] o.a.h.s.t.d.ZKDelegationTokenSecretManager No node in path [/ZKDTSMTokensRoot/DT_5]
   [junit4]   2> 2567418 WARN  (TEST-TestSolrCloudWithDelegationTokens.testDelegationTokenCancel-seed#[784EE71CA405F489]) [    ] o.a.h.c.p.ResponseProcessCookies Invalid cookie header: "Set-Cookie: hadoop.auth=; Path=/; Domain=127.0.0.1; Expires=   , 01-   -1970 00:00:00 GMT; HttpOnly". Invalid 'expires' attribute: , 01- -1970 00:00:00 GMT
   [junit4]   2> 2567423 INFO  (TEST-TestSolrCloudWithDelegationTokens.testDelegationTokenCancel-seed#[784EE71CA405F489]) [    ] o.a.s.c.c.ZkStateReader Updated live nodes from ZooKeeper... (0) -> (2)
   [junit4]   2> 2567424 INFO  (TEST-TestSolrCloudWithDelegationTokens.testDelegationTokenCancel-seed#[784EE71CA405F489]) [    ] o.a.s.c.s.i.ZkClientClusterStateProvider Cluster at 127.0.0.1:53844/solr ready
   [junit4]   2> 2567428 WARN  (TEST-TestSolrCloudWithDelegationTokens.testDelegationTokenCancel-seed#[784EE71CA405F489]) [    ] o.a.h.c.p.ResponseProcessCookies Invalid cookie header: "Set-Cookie: hadoop.auth=; Path=/; Domain=127.0.0.1; Expires=   , 01-   -1970 00:00:00 GMT; HttpOnly". Invalid 'expires' attribute: , 01- -1970 00:00:00 GMT
   [junit4]   2> 2567448 ERROR (qtp818712600-25022) [    ] o.a.h.s.t.d.ZKDelegationTokenSecretManager No node in path [/ZKDTSMTokensRoot/DT_6]
   [junit4]   2> 2567459 INFO  (TEST-TestSolrCloudWithDelegationTokens.testDelegationTokenCancel-seed#[784EE71CA405F489]) [    ] o.a.s.c.c.ZkStateReader Updated live nodes from ZooKeeper... (0) -> (2)
   [junit4]   2> 2567460 INFO  (TEST-TestSolrCloudWithDelegationTokens.testDelegationTokenCancel-seed#[784EE71CA405F489]) [    ] o.a.s.c.s.i.ZkClientClusterStateProvider Cluster at 127.0.0.1:53844/solr ready
   [junit4]   2> 2567462 WARN  (TEST-TestSolrCloudWithDelegationTokens.testDelegationTokenCancel-seed#[784EE71CA405F489]) [    ] o.a.h.c.p.ResponseProcessCookies Invalid cookie header: "Set-Cookie: hadoop.auth=; Path=/; Domain=127.0.0.1; Expires=   , 01-   -1970 00:00:00 GMT; HttpOnly". Invalid 'expires' attribute: , 01- -1970 00:00:00 GMT
   [junit4]   2> 2567472 INFO  (TEST-TestSolrCloudWithDelegationTokens.testDelegationTokenCancel-seed#[784EE71CA405F489]) [    ] o.a.s.c.c.ZkStateReader Updated live nodes from ZooKeeper... (0) -> (2)
   [junit4]   2> 2567473 INFO  (TEST-TestSolrCloudWithDelegationTokens.testDelegationTokenCancel-seed#[784EE71CA405F489]) [    ] o.a.s.c.s.i.ZkClientClusterStateProvider Cluster at 127.0.0.1:53844/solr ready
   [junit4]   2> 2567475 WARN  (TEST-TestSolrCloudWithDelegationTokens.testDelegationTokenCancel-seed#[784EE71CA405F489]) [    ] o.a.h.c.p.ResponseProcessCookies Invalid cookie header: "Set-Cookie: hadoop.auth=; Path=/; Domain=127.0.0.1; Expires=   , 01-   -1970 00:00:00 GMT; HttpOnly". Invalid 'expires' attribute: , 01- -1970 00:00:00 GMT
   [junit4]   2> 2567476 INFO  (TEST-TestSolrCloudWithDelegationTokens.testDelegationTokenCancel-seed#[784EE71CA405F489]) [    ] o.a.s.SolrTestCaseJ4 ###Ending testDelegationTokenCancel
   [junit4]   2> 2567518 INFO  (TEST-TestSolrCloudWithDelegationTokens.testDelegationTokenRenewFail-seed#[784EE71CA405F489]) [    ] o.a.s.SolrTestCaseJ4 ###Starting testDelegationTokenRenewFail
   [junit4]   2> 2567531 WARN  (qtp1538864277-25017) [    ] o.a.h.s.a.s.AuthenticationFilter Authentication exception: org.apache.hadoop.security.AccessControlException: foo tries to renew a token with renewer bar
   [junit4]   2> 2567531 WARN  (qtp1538864277-25017) [    ] o.a.s.s.KerberosPlugin Could not find org.apache.solr.security.authentication.requestcontinues
   [junit4]   2> 2567531 WARN  (TEST-TestSolrCloudWithDelegationTokens.testDelegationTokenRenewFail-seed#[784EE71CA405F489]) [    ] o.a.h.c.p.ResponseProcessCookies Invalid cookie header: "Set-Cookie: hadoop.auth=; Path=/; Domain=127.0.0.1; Expires=   , 01-   -1970 00:00:00 GMT; HttpOnly". Invalid 'expires' attribute: , 01- -1970 00:00:00 GMT
   [junit4]   2> 2567532 WARN  (qtp818712600-25019) [    ] o.a.h.s.a.s.AuthenticationFilter Authentication exception: org.apache.hadoop.security.AccessControlException: foo tries to renew a token with renewer bar
   [junit4]   2> 2567534 WARN  (qtp818712600-25019) [    ] o.a.s.s.KerberosPlugin Could not find org.apache.solr.security.authentication.requestcontinues
   [junit4]   2> 2567535 WARN  (TEST-TestSolrCloudWithDelegationTokens.testDelegationTokenRenewFail-seed#[784EE71CA405F489]) [    ] o.a.h.c.p.ResponseProcessCookies Invalid cookie header: "Set-Cookie: hadoop.auth=; Path=/; Domain=127.0.0.1; Expires=   , 01-   -1970 00:00:00 GMT; HttpOnly". Invalid 'expires' attribute: , 01- -1970 00:00:00 GMT
   [junit4]   2> 2567546 WARN  (qtp1538864277-25028) [n:127.0.0.1:36335_solr    ] o.a.h.s.a.s.AuthenticationFilter Authentication exception: org.apache.hadoop.security.AccessControlException: notRenewUser tries to renew a token with renewer renewUser
   [junit4]   2> 2567547 WARN  (qtp1538864277-25028) [n:127.0.0.1:36335_solr    ] o.a.s.s.KerberosPlugin Could not find org.apache.solr.security.authentication.requestcontinues
   [junit4]   2> 2567547 WARN  (TEST-TestSolrCloudWithDelegationTokens.testDelegationTokenRenewFail-seed#[784EE71CA405F489]) [    ] o.a.h.c.p.ResponseProcessCookies Invalid cookie header: "Set-Cookie: hadoop.auth=; Path=/; Domain=127.0.0.1; Expires=   , 01-   -1970 00:00:00 GMT; HttpOnly". Invalid 'expires' attribute: , 01- -1970 00:00:00 GMT
   [junit4]   2> 2567548 WARN  (qtp818712600-25018) [    ] o.a.h.s.a.s.AuthenticationFilter Authentication exception: org.apache.hadoop.security.AccessControlException: notRenewUser tries to renew a token with renewer renewUser
   [junit4]   2> 2567549 WARN  (qtp818712600-25018) [    ] o.a.s.s.KerberosPlugin Could not find org.apache.solr.security.authentication.requestcontinues
   [junit4]   2> 2567550 WARN  (TEST-TestSolrCloudWithDelegationTokens.testDelegationTokenRenewFail-seed#[784EE71CA405F489]) [    ] o.a.h.c.p.ResponseProcessCookies Invalid cookie header: "Set-Cookie: hadoop.auth=; Path=/; Domain=127.0.0.1; Expires=   , 01-   -1970 00:00:00 GMT; HttpOnly". Invalid 'expires' attribute: , 01- -1970 00:00:00 GMT
   [junit4]   2> 2567550 INFO  (TEST-TestSolrCloudWithDelegationTokens.testDelegationTokenRenewFail-seed#[784EE71CA405F489]) [    ] o.a.s.SolrTestCaseJ4 ###Ending testDelegationTokenRenewFail
   [junit4]   2> 2567615 INFO  (TEST-TestSolrCloudWithDelegationTokens.testDelegationTokenRenew-seed#[784EE71CA405F489]) [    ] o.a.s.SolrTestCaseJ4 ###Starting testDelegationTokenRenew
   [junit4]   2> 2567642 INFO  (qtp1538864277-25027) [n:127.0.0.1:36335_solr    ] o.a.s.h.a.CollectionsHandler Invoked Collection Action :list with params action=LIST&delegation=GgADYmFyA2JhcgCKAVlxTlbEigFZlVraxAkEFCUZcTlLtk1ChWQemvLT35y8LIhCB3NvbHItZHQA&wt=javabin&version=2 and sendToOCPQueue=true
   [junit4]   2> 2567643 INFO  (qtp1538864277-25027) [n:127.0.0.1:36335_solr    ] o.a.s.s.HttpSolrCall [admin] webapp=null path=/admin/collections params={action=LIST&delegation=GgADYmFyA2JhcgCKAVlxTlbEigFZlVraxAkEFCUZcTlLtk1ChWQemvLT35y8LIhCB3NvbHItZHQA&wt=javabin&version=2} status=0 QTime=0
   [junit4]   2> 2567649 INFO  (TEST-TestSolrCloudWithDelegationTokens.testDelegationTokenRenew-seed#[784EE71CA405F489]) [    ] o.a.s.c.c.ZkStateReader Updated live nodes from ZooKeeper... (0) -> (2)
   [junit4]   2> 2567652 INFO  (TEST-TestSolrCloudWithDelegationTokens.testDelegationTokenRenew-seed#[784EE71CA405F489]) [    ] o.a.s.c.s.i.ZkClientClusterStateProvider Cluster at 127.0.0.1:53844/solr ready
   [junit4]   2> 2567654 WARN  (TEST-TestSolrCloudWithDelegationTokens.testDelegationTokenRenew-seed#[784EE71CA405F489]) [    ] o.a.h.c.p.ResponseProcessCookies Invalid cookie header: "Set-Cookie: hadoop.auth=; Path=/; Domain=127.0.0.1; Expires=   , 01-   -1970 00:00:00 GMT; HttpOnly". Invalid 'expires' attribute: , 01- -1970 00:00:00 GMT
   [junit4]   2> 2567662 INFO  (TEST-TestSolrCloudWithDelegationTokens.testDelegationTokenRenew-seed#[784EE71CA405F489]) [    ] o.a.s.c.c.ZkStateReader Updated live nodes from ZooKeeper... (0) -> (2)
   [junit4]   2> 2567664 INFO  (TEST-TestSolrCloudWithDelegationTokens.testDelegationTokenRenew-seed#[784EE71CA405F489]) [    ] o.a.s.c.s.i.ZkClientClusterStateProvider Cluster at 127.0.0.1:53844/solr ready
   [junit4]   2> 2567666 INFO  (qtp1538864277-25027) [n:127.0.0.1:36335_solr    ] o.a.s.h.a.CollectionsHandler Invoked Collection Action :list with params action=LIST&delegation=GgADYmFyA2JhcgCKAVlxTlbEigFZlVraxAkEFCUZcTlLtk1ChWQemvLT35y8LIhCB3NvbHItZHQA&wt=javabin&version=2 and sendToOCPQueue=true
   [junit4]   2> 2567666 INFO  (qtp1538864277-25027) [n:127.0.0.1:36335_solr    ] o.a.s.s.HttpSolrCall [admin] webapp=null path=/admin/collections params={action=LIST&delegation=GgADYmFyA2JhcgCKAVlxTlbEigFZlVraxAkEFCUZcTlLtk1ChWQemvLT35y8LIhCB3NvbHItZHQA&wt=javabin&version=2} status=0 QTime=0
   [junit4]   2> 2567672 WARN  (TEST-TestSolrCloudWithDelegationTokens.testDelegationTokenRenew-seed#[784EE71CA405F489]) [    ] o.a.h.c.p.ResponseProcessCookies Invalid cookie header: "Set-Cookie: hadoop.auth=; Path=/; Domain=127.0.0.1; Expires=   , 01-   -1970 00:00:00 GMT; HttpOnly". Invalid 'expires' attribute: , 01- -1970 00:00:00 GMT
   [junit4]   2> 2567695 INFO  (qtp1538864277-25030) [n:127.0.0.1:36335_solr    ] o.a.s.h.a.CollectionsHandler Invoked Collection Action :list with params action=LIST&delegation=GgADYmFyA2JhcgCKAVlxTlb-igFZlVra_goEFByJfL5_35sIpLwPFlyONdXt9SetB3NvbHItZHQA&wt=javabin&version=2 and sendToOCPQueue=true
   [junit4]   2> 2567695 INFO  (qtp1538864277-25030) [n:127.0.0.1:36335_solr    ] o.a.s.s.HttpSolrCall [admin] webapp=null path=/admin/collections params={action=LIST&delegation=GgADYmFyA2JhcgCKAVlxTlb-igFZlVra_goEFByJfL5_35sIpLwPFlyONdXt9SetB3NvbHItZHQA&wt=javabin&version=2} status=0 QTime=0
   [junit4]   2> 2567701 INFO  (TEST-TestSolrCloudWithDelegationTokens.testDelegationTokenRenew-seed#[784EE71CA405F489]) [    ] o.a.s.c.c.ZkStateReader Updated live nodes from ZooKeeper... (0) -> (2)
   [junit4]   2> 2567703 INFO  (TEST-TestSolrCloudWithDelegationTokens.testDelegationTokenRenew-seed#[784EE71CA405F489]) [    ] o.a.s.c.s.i.ZkClientClusterStateProvider Cluster at 127.0.0.1:53844/solr ready
   [junit4]   2> 2567706 WARN  (TEST-TestSolrCloudWithDelegationTokens.testDelegationTokenRenew-seed#[784EE71CA405F489]) [    ] o.a.h.c.p.ResponseProcessCookies Invalid cookie header: "Set-Cookie: hadoop.auth=; Path=/; Domain=127.0.0.1; Expires=   , 01-   -1970 00:00:00 GMT; HttpOnly". Invalid 'expires' attribute: , 01- -1970 00:00:00 GMT
   [junit4]   2> 2567710 INFO  (qtp818712600-25019) [n:127.0.0.1:45318_solr    ] o.a.s.h.a.CollectionsHandler Invoked Collection Action :list with params action=LIST&delegation=GgADYmFyA2JhcgCKAVlxTlb-igFZlVra_goEFByJfL5_35sIpLwPFlyONdXt9SetB3NvbHItZHQA&wt=javabin&version=2 and sendToOCPQueue=true
   [junit4]   2> 2567710 INFO  (qtp818712600-25019) [n:127.0.0.1:45318_solr    ] o.a.s.s.HttpSolrCall [admin] webapp=null path=/admin/collections params={action=LIST&delegation=GgADYmFyA2JhcgCKAVlxTlb-igFZlVra_goEFByJfL5_35sIpLwPFlyONdXt9SetB3NvbHItZHQA&wt=javabin&version=2} status=0 QTime=0
   [junit4]   2> 2567716 INFO  (TEST-TestSolrCloudWithDelegationTokens.testDelegationTokenRenew-seed#[784EE71CA405F489]) [    ] o.a.s.c.c.ZkStateReader Updated live nodes from ZooKeeper... (0) -> (2)
   [junit4]   2> 2567719 INFO  (TEST-TestSolrCloudWithDelegationTokens.testDelegationTokenRenew-seed#[784EE71CA405F489]) [    ] o.a.s.c.s.i.ZkClientClusterStateProvider Cluster at 127.0.0.1:53844/solr ready
   [junit4]   2> 2567722 WARN  (TEST-TestSolrCloudWithDelegationTokens.testDelegationTokenRenew-seed#[784EE71CA405F489]) [    ] o.a.h.c.p.ResponseProcessCookies Invalid cookie header: "Set-Cookie: hadoop.auth=; Path=/; Domain=127.0.0.1; Expires=   , 01-   -1970 00:00:00 GMT; HttpOnly". Invalid 'expires' attribute: , 01- -1970 00:00:00 GMT
   [junit4]   2> 2567764 INFO  (TEST-TestSolrCloudWithDelegationTokens.testDelegationTokenRenew-seed#[784EE71CA405F489]) [    ] o.a.s.c.c.ZkStateReader Updated live nodes from ZooKeeper... (0) -> (2)
   [junit4]   2> 2567766 INFO  (TEST-TestSolrCloudWithDelegationTokens.testDelegationTokenRenew-seed#[784EE71CA405F489]) [    ] o.a.s.c.s.i.ZkClientClusterStateProvider Cluster at 127.0.0.1:53844/solr ready
   [junit4]   2> 2567768 INFO  (qtp1538864277-25027) [n:127.0.0.1:36335_solr    ] o.a.s.h.a.CollectionsHandler Invoked Collection Action :list with params action=LIST&delegation=GgADYmFyA2JhcgCKAVlxTlcxigFZlVrbMQsEFKtXyjqqmGr4u_XEcR5e1kqKQu2-B3NvbHItZHQA&wt=javabin&version=2 and sendToOCPQueue=true
   [junit4]   2> 2567768 INFO  (qtp1538864277-25027) [n:127.0.0.1:36335_solr    ] o.a.s.s.HttpSolrCall [admin] webapp=null path=/admin/collections params={action=LIST&delegation=GgADYmFyA2JhcgCKAVlxTlcxigFZlVrbMQsEFKtXyjqqmGr4u_XEcR5e1kqKQu2-B3NvbHItZHQA&wt=javabin&version=2} status=0 QTime=0
   [junit4]   2> 2567774 WARN  (TEST-TestSolrCloudWithDelegationTokens.testDelegationTokenRenew-seed#[784EE71CA405F489]) [    ] o.a.h.c.p.ResponseProcessCookies Invalid cookie header: "Set-Cookie: hadoop.auth=; Path=/; Domain=127.0.0.1; Expires=   , 01-   -1970 00:00:00 GMT; HttpOnly". Invalid 'expires' attribute: , 01- -1970 00:00:00 GMT
   [junit4]   2> 2567777 INFO  (qtp818712600-25022) [n:127.0.0.1:45318_solr    ] o.a.s.h.a.CollectionsHandler Invoked Collection Action :list with params action=LIST&delegation=GgADYmFyA2JhcgCKAVlxTlcxigFZlVrbMQsEFKtXyjqqmGr4u_XEcR5e1kqKQu2-B3NvbHItZHQA&wt=javabin&version=2 and sendToOCPQueue=true
   [junit4]   2> 2567777 INFO  (qtp818712600-25022) [n:127.0.0.1:45318_solr    ] o.a.s.s.HttpSolrCall [admin] webapp=null path=/admin/collections params={action=LIST&delegation=GgADYmFyA2JhcgCKAVlxTlcxigFZlVrbMQsEFKtXyjqqmGr4u_XEcR5e1kqKQu2-B3NvbHItZHQA&wt=javabin&version=2} status=0 QTime=0
   [junit4]   2> 2567782 WARN  (TEST-TestSolrCloudWithDelegationTokens.testDelegationTokenRenew-seed#[784EE71CA405F489]) [    ] o.a.h.c.p.ResponseProcessCookies Invalid cookie header: "Set-Cookie: hadoop.auth=; Path=/; Domain=127.0.0.1; Expires=   , 01-   -1970 00:00:00 GMT; HttpOnly". Invalid 'expires' attribute: , 01- -1970 00:00:00 GMT
   [junit4]   2> 2567803 INFO  (TEST-TestSolrCloudWithDelegationTokens.testDelegationTokenRenew-seed#[784EE71CA405F489]) [    ] o.a.s.c.c.ZkStateReader Updated live nodes from ZooKeeper... (0) -> (2)
   [junit4]   2> 2567805 INFO  (TEST-TestSolrCloudWithDelegationTokens.testDelegationTokenRenew-seed#[784EE71CA405F489]) [    ] o.a.s.c.s.i.ZkClientClusterStateProvider Cluster at 127.0.0.1:53844/solr ready
   [junit4]   2> 2567807 INFO  (qtp1538864277-25017) [n:127.0.0.1:36335_solr    ] o.a.s.h.a.CollectionsHandler Invoked Collection Action :list with params action=LIST&delegation=GgADYmFyA2JhcgCKAVlxTldrigFZlVrbawwEFCWyUrwc4jO-qsygBN6pvVS6f9X3B3NvbHItZHQA&wt=javabin&version=2 and sendToOCPQueue=true
   [junit4]   2> 2567807 INFO  (qtp1538864277-25017) [n:127.0.0.1:36335_solr    ] o.a.s.s.HttpSolrCall [admin] webapp=null path=/admin/collections params={action=LIST&delegation=GgADYmFyA2JhcgCKAVlxTldrigFZlVrbawwEFCWyUrwc4jO-qsygBN6pvVS6f9X3B3NvbHItZHQA&wt=javabin&version=2} status=0 QTime=0
   [junit4]   2> 2567813 WARN  (TEST-TestSolrCloudWithDelegationTokens.testDelegationTokenRenew-seed#[784EE71CA405F489]) [    ] o.a.h.c.p.ResponseProcessCookies Invalid cookie header: "Set-Cookie: hadoop.auth=; Path=/; Domain=127.0.0.1; Expires=   , 01-   -1970 00:00:00 GMT; HttpOnly". Invalid 'expires' attribute: , 01- -1970 00:00:00 GMT
   [junit4]   2> 2567817 INFO  (qtp818712600-25020) [n:127.0.0.1:45318_solr    ] o.a.s.h.a.CollectionsHandler Invoked Collection Action :list with params action=LIST&delegation=GgADYmFyA2JhcgCKAVlxTldrigFZlVrbawwEFCWyUrwc4jO-qsygBN6pvVS6f9X3B3NvbHItZHQA&wt=javabin&version=2 and sendToOCPQueue=true
   [junit4]   2> 2567817 INFO  (qtp818712600-25020) [n:127.0.0.1:45318_solr    ] o.a.s.s.HttpSolrCall [admin] webapp=null path=/admin/collections params={action=LIST&delegation=GgADYmFyA2JhcgCKAVlxTldrigFZlVrbawwEFCWyUrwc4jO-qsygBN6pvVS6f9X3B3NvbHItZHQA&wt=javabin&version=2} status=0 QTime=0
   [junit4]   2> 2567838 INFO  (TEST-TestSolrCloudWithDelegationTokens.testDelegationTokenRenew-seed#[784EE71CA405F489]) [    ] o.a.s.c.c.ZkStateReader Updated live nodes from ZooKeeper... (0) -> (2)
   [junit4]   2> 2567842 INFO  (TEST-TestSolrCloudWithDelegationTokens.testDelegationTokenRenew-seed#[784EE71CA405F489]) [    ] o.a.s.c.s.i.ZkClientClusterStateProvider Cluster at 127.0.0.1:53844/solr ready
   [junit4]   2> 2567845 WARN  (TEST-TestSolrCloudWithDelegationTokens.testDelegationTokenRenew-seed#[784EE71CA405F489]) [    ] o.a.h.c.p.ResponseProcessCookies Invalid cookie header: "Set-Cookie: hadoop.auth=; Path=/; Domain=127.0.0.1; Expires=   , 01-   -1970 00:00:00 GMT; HttpOnly". Invalid 'expires' attribute: , 01- -1970 00:00:00 GMT
   [junit4]   2> 2567848 INFO  (TEST-TestSolrCloudWithDelegationTokens.testDelegationTokenRenew-seed#[784EE71CA405F489]) [    ] o.a.s.SolrTestCaseJ4 ###Ending testDelegationTokenRenew
   [junit4]   2> 2567911 INFO  (TEST-TestSolrCloudWithDelegationTokens.testDelegationTokenVerify-seed#[784EE71CA405F489]) [    ] o.a.s.SolrTestCaseJ4 ###Starting testDelegationTokenVerify
   [junit4]   2> 2567935 INFO  (TEST-TestSolrCloudWithDelegationTokens.testDelegationTokenVerify-seed#[784EE71CA405F489]) [    ] o.a.s.c.c.ZkStateReader Updated live nodes from ZooKeeper... (0) -> (2)
   [junit4]   2> 2567937 INFO  (TEST-TestSolrCloudWithDelegationTokens.testDelegationTokenVerify-seed#[784EE71CA405F489]) [    ] o.a.s.c.s.i.ZkClientClusterStateProvider Cluster at 127.0.0.1:53844/solr ready
   [junit4]   2> 2567939 INFO  (qtp1538864277-25024) [n:127.0.0.1:36335_solr    ] o.a.s.h.a.CollectionsHandler Invoked Collection Action :list with params action=LIST&delegation=GgADYmFyA2JhcgCKAVlxTlfrigFZlVrb6w0EFHbi2t7V_sI_9xEtOqrtnTsCiOgiB3NvbHItZHQA&wt=javabin&version=2 and sendToOCPQueue=true
   [junit4]   2> 2567939 INFO  (qtp1538864277-25024) [n:127.0.0.1:36335_solr    ] o.a.s.s.HttpSolrCall [admin] webapp=null path=/admin/collections params={action=LIST&delegation=GgADYmFyA2JhcgCKAVlxTlfrigFZlVrb6w0EFHbi2t7V_sI_9xEtOqrtnTsCiOgiB3NvbHItZHQA&wt=javabin&version=2} status=0 QTime=0
   [junit4]   2> 2567949 INFO  (TEST-TestSolrCloudWithDelegationTokens.testDelegationTokenVerify-seed#[784EE71CA405F489]) [    ] o.a.s.c.c.ZkStateReader Updated live nodes from ZooKeeper... (0) -> (2)
   [junit4]   2> 2567951 INFO  (TEST-TestSolrCloudWithDelegationTokens.testDelegationTokenVerify-seed#[784EE71CA405F489]) [    ] o.a.s.c.s.i.ZkClientClusterStateProvider Cluster at 127.0.0.1:53844/solr ready
   [junit4]   2> 2567954 WARN  (TEST-TestSolrCloudWithDelegationTokens.testDelegationTokenVerify-seed#[784EE71CA405F489]) [    ] o.a.h.c.p.ResponseProcessCookies Invalid cookie header: "Set-Cookie: hadoop.auth=; Path=/; Domain=127.0.0.1; Expires=   , 01-   -1970 00:00:00 GMT; HttpOnly". Invalid 'expires' attribute: , 01- -1970 00:00:00 GMT
   [junit4]   2> 2567964 INFO  (qtp818712600-25021) [n:127.0.0.1:45318_solr    ] o.a.s.h.a.CollectionsHandler Invoked Collection Action :list with params action=LIST&delegation=GgADYmFyA2JhcgCKAVlxTlfrigFZlVrb6w0EFHbi2t7V_sI_9xEtOqrtnTsCiOgiB3NvbHItZHQA&wt=javabin&version=2 and sendToOCPQueue=true
   [junit4]   2> 2567964 INFO  (qtp818712600-25021) [n:127.0.0.1:45318_solr    ] o.a.s.s.HttpSolrCall [admin] webapp=null path=/admin/collections params={action=LIST&delegation=GgADYmFyA2JhcgCKAVlxTlfrigFZlVrb6w0EFHbi2t7V_sI_9xEtOqrtnTsCiOgiB3NvbHItZHQA&wt=javabin&version=2} status=0 QTime=0
   [junit4]   2> 2567969 WARN  (TEST-TestSolrCloudWithDelegationTokens.testDelegationTokenVerify-seed#[784EE71CA405F489]) [    ] o.a.h.c.p.ResponseProcessCookies Invalid cookie header: "Set-Cookie: hadoop.auth=; Path=/; Domain=127.0.0.1; Expires=   , 01-   -1970 00:00:00 GMT; HttpOnly". Invalid 'expires' attribute: , 01- -1970 00:00:00 GMT
   [junit4]   2> 2567971 INFO  (TEST-TestSolrCloudWithDelegationTokens.testDelegationTokenVerify-seed#[784EE71CA405F489]) [    ] o.a.s.SolrTestCaseJ4 ###Ending testDelegationTokenVerify
   [junit4]   2> 2568010 INFO  (TEST-TestSolrCloudWithDelegationTokens.testDelegationOtherOp-seed#[784EE71CA405F489]) [    ] o.a.s.SolrTestCaseJ4 ###Starting testDelegationOtherOp
   [junit4]   2> 2568020 INFO  (TEST-TestSolrCloudWithDelegationTokens.testDelegationOtherOp-seed#[784EE71CA405F489]) [    ] o.a.s.c.c.ZkStateReader Updated live nodes from ZooKeeper... (0) -> (2)
   [junit4]   2> 2568022 INFO  (TEST-TestSolrCloudWithDelegationTokens.testDelegationOtherOp-seed#[784EE71CA405F489]) [    ] o.a.s.c.s.i.ZkClientClusterStateProvider Cluster at 127.0.0.1:53844/solr ready
   [junit4]   2> 2568024 INFO  (qtp1538864277-25024) [n:127.0.0.1:36335_solr    ] o.a.s.h.a.CollectionsHandler Invoked Collection Action :list with params op=someSolrOperation&action=LIST&wt=javabin&version=2 and sendToOCPQueue=true
   [junit4]   2> 2568024 INFO  (qtp1538864277-25024) [n:127.0.0.1:36335_solr    ] o.a.s.s.HttpSolrCall [admin] webapp=null path=/admin/collections params={op=someSolrOperation&action=LIST&wt=javabin&version=2} status=0 QTime=0
   [junit4]   2> 2568025 WARN  (TEST-TestSolrCloudWithDelegationTokens.testDelegationOtherOp-seed#[784EE71CA405F489]) [    ] o.a.h.c.p.ResponseProcessCookies Invalid cookie header: "Set-Cookie: hadoop.auth="u=bar&p=bar&t=test&e=1483700676955&s=cDOL4BjqePx9yBkPNW/sSUBJBqw="; Path=/; Domain=127.0.0.1; Expires=   , 06-   -2017 11:04:36 GMT; HttpOnly". Invalid 'expires' attribute: , 06- -2017 11:04:36 GMT
   [junit4]   2> 2568027 INFO  (TEST-TestSolrCloudWithDelegationTokens.testDelegationOtherOp-seed#[784EE71CA405F489]) [    ] o.a.s.SolrTestCaseJ4 ###Ending testDelegationOtherOp
   [junit4]   2> 2568029 INFO  (jetty-launcher-4271-thread-2) [    ] o.e.j.s.AbstractConnector Stopped ServerConnector@412d45f3{HTTP/1.1,[http/1.1]}{127.0.0.1:0}
   [junit4]   2> 2568029 INFO  (jetty-launcher-4271-thread-1) [    ] o.e.j.s.AbstractConnector Stopped ServerConnector@4aa1fae9{HTTP/1.1,[http/1.1]}{127.0.0.1:0}
   [junit4]   2> 2568030 INFO  (jetty-launcher-4271-thread-2) [    ] o.a.s.c.CoreContainer Shutting down CoreContainer instance=1008702305
   [junit4]   2> 2568031 INFO  (jetty-launcher-4271-thread-1) [    ] o.a.s.c.CoreContainer Shutting down CoreContainer instance=1809346948
   [junit4]   2> 2568044 INFO  (jetty-launcher-4271-thread-2) [    ] o.a.s.c.Overseer Overseer (id=97233448086274053-127.0.0.1:45318_solr-n_0000000000) closing
   [junit4]   2> 2568045 INFO  (OverseerStateUpdate-97233448086274053-127.0.0.1:45318_solr-n_0000000000) [n:127.0.0.1:45318_solr    ] o.a.s.c.Overseer Overseer Loop exiting : 127.0.0.1:45318_solr
   [junit4]   2> 2568047 WARN  (zkCallback-4282-thread-1-processing-n:127.0.0.1:36335_solr) [n:127.0.0.1:36335_solr    ] o.a.s.c.c.ZkStateReader ZooKeeper watch triggered, but Solr cannot talk to ZK: [KeeperErrorCode = Session expired for /live_nodes]
   [junit4]   2> 2568049 INFO  (jetty-launcher-4271-thread-1) [    ] o.a.s.m.SolrMetricManager Closing metric reporters for: solr.node
   [junit4]   2> 2568049 ERROR (Thread[Thread-6871,5,TGRP-TestSolrCloudWithDelegationTokens]) [n:127.0.0.1:36335_solr    ] o.a.h.s.t.d.AbstractDelegationTokenSecretManager ExpiredTokenRemover received java.lang.InterruptedException: sleep interrupted
   [junit4]   2> 2568063 INFO  (jetty-launcher-4271-thread-1) [    ] o.e.j.s.h.ContextHandler Stopped o.e.j.s.ServletContextHandler@622880c6{/solr,null,UNAVAILABLE}
   [junit4]   2> 2569546 WARN  (zkCallback-4281-thread-1-processing-n:127.0.0.1:45318_solr) [n:127.0.0.1:45318_solr    ] o.a.s.c.c.ZkStateReader ZooKeeper watch triggered, but Solr cannot talk to ZK: [KeeperErrorCode = Session expired for /live_nodes]
   [junit4]   2> 2569547 INFO  (jetty-launcher-4271-thread-2) [    ] o.a.s.m.SolrMetricManager Closing metric reporters for: solr.node
   [junit4]   2> 2569547 ERROR (Thread[Thread-6869,5,TGRP-TestSolrCloudWithDelegationTokens]) [n:127.0.0.1:45318_solr    ] o.a.h.s.t.d.AbstractDelegationTokenSecretManager ExpiredTokenRemover received java.lang.InterruptedException: sleep interrupted
   [junit4]   2> 2569554 INFO  (jetty-launcher-4271-thread-2) [    ] o.e.j.s.h.ContextHandler Stopped o.e.j.s.ServletContextHandler@301e52f1{/solr,null,UNAVAILABLE}
   [junit4]   2> 2569557 INFO  (SUITE-TestSolrCloudWithDelegationTokens-seed#[784EE71CA405F489]-worker) [    ] o.a.s.c.ZkTestServer connecting to 127.0.0.1:53844 53844
   [junit4]   2> 2569660 INFO  (Thread-6852) [    ] o.a.s.c.ZkTestServer connecting to 127.0.0.1:53844 53844
   [junit4]   2> 2569662 WARN  (Thread-6852) [    ] o.a.s.c.ZkTestServer Watch limit violations: 
   [junit4]   2> Maximum concurrent create/delete watches above limit:
   [junit4]   2> 
   [junit4]   2> 	16	/solr/aliases.json
   [junit4]   2> 	16	/solr/clusterprops.json
   [junit4]   2> 	2	/solr/security.json
   [junit4]   2> 
   [junit4]   2> Maximum concurrent data watches above limit:
   [junit4]   2> 
   [junit4]   2> 	16	/solr/clusterstate.json
   [junit4]   2> 	3	/solr/security/zkdtsm/ZKDTSMRoot/ZKDTSMKeyIdRoot
   [junit4]   2> 	2	/solr/security/zkdtsm/ZKDTSMRoot/ZKDTSMTokensRoot/DT_7
   [junit4]   2> 	2	/solr/security/zkdtsm/ZKDTSMRoot/ZKDTSMTokensRoot/DT_6
   [junit4]   2> 	2	/solr/security/zkdtsm/ZKDTSMRoot/ZKDTSMTokensRoot/DT_9
   [junit4]   2> 	2	/solr/security/zkdtsm/ZKDTSMRoot/ZKDTSMTokensRoot/DT_8
   [junit4]   2> 	2	/solr/security/zkdtsm/ZKDTSMRoot/ZKDTSMMasterKeyRoot/DK_1
   [junit4]   2> 	2	/solr/security/zkdtsm/ZKDTSMRoot/ZKDTSMTokensRoot/DT_1
   [junit4]   2> 	2	/solr/security/zkdtsm/ZKDTSMRoot/ZKDTSMMasterKeyRoot/DK_3
   [junit4]   2> 	2	/solr/security/zkdtsm/ZKDTSMRoot/ZKDTSMTokensRoot/DT_3
   [junit4]   2> 	2	/solr/security/zkdtsm/ZKDTSMRoot/ZKDTSMMasterKeyRoot/DK_2
   [junit4]   2> 	2	/solr/security/zkdtsm/ZKDTSMRoot/ZKDTSMTokensRoot/DT_2
   [junit4]   2> 	2	/solr/security/zkdtsm/ZKDTSMRoot/ZKDTSMTokensRoot/DT_5
   [junit4]   2> 	2	/solr/security/zkdtsm/ZKDTSMRoot/ZKDTSMMasterKeyRoot/DK_4
   [junit4]   2> 	2	/solr/security/zkdtsm/ZKDTSMRoot/ZKDTSMTokensRoot/DT_4
   [junit4]   2> 	2	/solr/security/zkdtsm/ZKDTSMRoot/ZKDTSMTokensRoot/DT_13
   [junit4]   2> 	2	/solr/security/zkdtsm/ZKDTSMRoot/ZKDTSMTokensRoot/DT_12
   [junit4]   2> 	2	/solr/security/zkdtsm/ZKDTSMRoot/ZKDTSMSeqNumRoot
   [junit4]   2> 	2	/solr/security/zkdtsm/ZKDTSMRoot/ZKDTSMTokensRoot/DT_11
   [junit4]   2> 	2	/solr/security/zkdtsm/ZKDTSMRoot/ZKDTSMTokensRoot/DT_10
   [junit4]   2> 
   [junit4]   2> Maximum concurrent children watches above limit:
   [junit4]   2> 
   [junit4]   2> 	16	/solr/live_nodes
   [junit4]   2> 	16	/solr/collections
   [junit4]   2> 	3	/solr/overseer/queue
   [junit4]   2> 	3	/solr/overseer/collection-queue-work
   [junit4]   2> 	2	/solr/security/zkdtsm/ZKDTSMRoot/ZKDTSMMasterKeyRoot
   [junit4]   2> 	2	/solr/overseer/queue-work
   [junit4]   2> 	2	/solr/security/zkdtsm/ZKDTSMRoot/ZKDTSMTokensRoot
   [junit4]   2> 
   [junit4]   2> 2569662 INFO  (SUITE-TestSolrCloudWithDelegationTokens-seed#[784EE71CA405F489]-worker) [    ] o.a.s.SolrTestCaseJ4 ###deleteCore
   [junit4]   2> NOTE: leaving temporary files on disk at: /export/home/jenkins/workspace/Lucene-Solr-master-Solaris/solr/build/solr-core/test/J1/temp/solr.cloud.TestSolrCloudWithDelegationTokens_784EE71CA405F489-001
   [junit4]   2> Jan 06, 2017 1:04:38 AM com.carrotsearch.randomizedtesting.ThreadLeakControl checkThreadLeaks
   [junit4]   2> WARNING: Will linger awaiting termination of 1 leaked thread(s).
   [junit4]   2> NOTE: test params are: codec=Asserting(Lucene70): {}, docValues:{}, maxPointsInLeafNode=1878, maxMBSortInHeap=5.603648243449099, sim=RandomSimilarity(queryNorm=true): {}, locale=sr-RS, timezone=Antarctica/Davis
   [junit4]   2> NOTE: SunOS 5.11 amd64/Oracle Corporation 1.8.0_112 (64-bit)/cpus=3,threads=1,free=135057048,total=518979584
   [junit4]   2> NOTE: All tests run in this JVM: [URLClassifyProcessorTest, OpenCloseCoreStressTest, BooleanFieldTest, MergeStrategyTest, BigEndianAscendingWordSerializerTest, TestSearchPerf, TestFieldCacheSanityChecker, StatsReloadRaceTest, TestClusterProperties, TestOverriddenPrefixQueryForCustomFieldType, TestRangeQuery, TestDistributedGrouping, TestFoldingMultitermQuery, TestCodecSupport, MultiThreadedOCPTest, LeaderElectionContextKeyTest, TestWriterPerf, CreateCollectionCleanupTest, SuggesterTest, TestBinaryResponseWriter, TestSolrCloudSnapshots, NoCacheHeaderTest, TestSolrQueryParserDefaultOperatorResource, TestConfigSetsAPI, TestUtils, AnalysisErrorHandlingTest, TestLegacyNumericRangeQueryBuilder, TestDynamicLoading, CloneFieldUpdateProcessorFactoryTest, RollingRestartTest, AutoCommitTest, ForceLeaderTest, TestFieldCacheWithThreads, SuggesterWFSTTest, DeleteInactiveReplicaTest, SliceStateTest, SolrCloudExampleTest, ClusterStateTest, CollectionReloadTest, CdcrReplicationHandlerTest, SimpleCollectionCreateDeleteTest, TestFuzzyAnalyzedSuggestions, ClassificationUpdateProcessorIntegrationTest, TestCoreDiscovery, SolrJmxReporterTest, TestIndexSearcher, TestReplicationHandlerBackup, TestDownShardTolerantSearch, TestFieldResource, FieldMutatingUpdateProcessorTest, RAMDirectoryFactoryTest, TestLMDirichletSimilarityFactory, TestBlendedInfixSuggestions, FieldAnalysisRequestHandlerTest, DeleteNodeTest, TestFilteredDocIdSet, CacheHeaderTest, TestExceedMaxTermLength, DataDrivenBlockJoinTest, DistributedVersionInfoTest, TestRandomFlRTGCloud, HLLSerializationTest, RequestHandlersTest, TestSha256AuthenticationProvider, TestDFRSimilarityFactory, BasicZkTest, TestFieldTypeResource, OverseerModifyCollectionTest, SpellPossibilityIteratorTest, TestCollationFieldDocValues, TestAuthenticationFramework, TestStressLiveNodes, CollectionsAPIDistributedZkTest, TriLevelCompositeIdRoutingTest, DistributedTermsComponentTest, SparseHLLTest, ReplicationFactorTest, TestSolrDeletionPolicy2, DistributedFacetPivotSmallAdvancedTest, FacetPivotSmallTest, PKIAuthenticationIntegrationTest, TestUseDocValuesAsStored2, TestReversedWildcardFilterFactory, ConvertedLegacyTest, LeaderInitiatedRecoveryOnShardRestartTest, CoreSorterTest, SuggesterTSTTest, SpellingQueryConverterTest, DefaultValueUpdateProcessorTest, CloudMLTQParserTest, LukeRequestHandlerTest, ZkSolrClientTest, UpdateRequestProcessorFactoryTest, BJQParserTest, DistanceFunctionTest, GraphQueryTest, TestQueryUtils, UUIDUpdateProcessorFallbackTest, HttpSolrCallGetCoreTest, TestSimpleQParserPlugin, TestMacroExpander, TestStandardQParsers, DirectUpdateHandlerOptimizeTest, RequestLoggingTest, TestRandomCollapseQParserPlugin, RemoteQueryErrorTest, TestStressRecovery, StressHdfsTest, BlockJoinFacetRandomTest, SharedFSAutoReplicaFailoverTest, TestManagedSchemaAPI, TestTolerantUpdateProcessorRandomCloud, TestSolrQueryParser, TestEmbeddedSolrServerConstructors, CircularListTest, TestUninvertingReader, SolrIndexMetricsTest, DistributedFacetPivotWhiteBoxTest, TestCorePropertiesReload, CollectionTooManyReplicasTest, RegexBoostProcessorTest, ReturnFieldsTest, AsyncCallRequestStatusResponseTest, TermVectorComponentTest, TestPivotHelperCode, TestHashQParserPlugin, UUIDFieldTest, TestTrie, MinimalSchemaTest, TestCloudInspectUtil, TestNRTOpen, TestQuerySenderListener, FullSolrCloudDistribCmdsTest, CollectionsAPISolrJTest, DistributedFacetPivotLargeTest, LeaderFailureAfterFreshStartTest, TestRestManager, HighlighterConfigTest, TestSolrConfigHandlerConcurrent, ScriptEngineTest, ResourceLoaderTest, TestPHPSerializedResponseWriter, TestJmxMonitoredMap, ShowFileRequestHandlerTest, CSVRequestHandlerTest, RulesTest, TestConfig, TestDefaultSearchFieldResource, TestJsonFacets, TestRandomFaceting, EchoParamsTest, TestRecovery, SpellCheckComponentTest, TestChildDocTransformer, DistributedExpandComponentTest, ExternalFileFieldSortTest, IndexSchemaTest, TestFastWriter, TestLocalFSCloudBackupRestore, TestLuceneMatchVersion, AliasIntegrationTest, TestConfigReload, TestAtomicUpdateErrorCases, TestObjectReleaseTracker, TestJoin, ChaosMonkeySafeLeaderTest, OverseerTest, TestReplicationHandler, ShardRoutingCustomTest, TestHashPartitioner, DistributedSpellCheckComponentTest, TermVectorComponentDistributedTest, TestReload, HardAutoCommitTest, SolrCoreTest, StatsComponentTest, BadIndexSchemaTest, TestSort, DirectUpdateHandlerTest, SoftAutoCommitTest, SolrRequestParserTest, DocValuesTest, StandardRequestHandlerTest, TestOmitPositions, TermsComponentTest, DocumentBuilderTest, PathHierarchyTokenizerFactoryTest, MoreLikeThisHandlerTest, LoggingHandlerTest, MBeansHandlerTest, TestAnalyzedSuggestions, TestPartialUpdateDeduplication, UpdateParamsTest, TestQuerySenderNoQuery, BadComponentTest, TestMergePolicyConfig, TestSolrCoreProperties, DirectSolrConnectionTest, TestPhraseSuggestions, TestSweetSpotSimilarityFactory, TestFastOutputStream, DateMathParserTest, PreAnalyzedFieldTest, TestSystemIdResolver, PrimUtilsTest, TestSuggestSpellingConverter, TestSolrJ, TestLRUCache, ZkNodePropsTest, SystemInfoHandlerTest, TestRTGBase, DistributedIntervalFacetingTest, SolrTestCaseJ4Test, TestCrossCoreJoin, TestDistributedMissingSort, TestHighlightDedupGrouping, TestSimpleTrackingShardHandler, ActionThrottleTest, BaseCdcrDistributedZkTest, CdcrBootstrapTest, ConfigSetsAPITest, DeleteLastCustomShardedReplicaTest, DeleteShardTest, DistribCursorPagingTest, OverriddenZkACLAndCredentialsProvidersTest, OverseerRolesTest, OverseerStatusTest, PeerSyncReplicationTest, SharedFSAutoReplicaFailoverUtilsTest, SolrCLIZkUtilsTest, TestCloudDeleteByQuery, TestCloudPivotFacet, TestCloudPseudoReturnFields, TestCollectionAPI, TestConfigSetsAPIExclusivity, TestConfigSetsAPIZkFailure, TestDeleteCollectionOnDownNodes, TestDistribDocBasedVersion, TestHdfsCloudBackupRestore, TestLeaderElectionZkExpiry, TestMiniSolrCloudCluster, TestMiniSolrCloudClusterSSL, TestRebalanceLeaders, TestShortCircuitedRequests, TestSolrCloudWithDelegationTokens]
   [junit4] Completed [499/675 (2!)] on J1 in 4.95s, 8 tests, 1 failure <<< FAILURES!

[...truncated 63040 lines...]


Mime
View raw message