lucene-dev mailing list archives

Site index · List index
Message view « Date » · « Thread »
Top « Date » · « Thread »
From Policeman Jenkins Server <jenk...@thetaphi.de>
Subject [JENKINS] Lucene-Solr-master-Solaris (64bit/jdk1.8.0) - Build # 1054 - Still Unstable!
Date Tue, 03 Jan 2017 23:18:04 GMT
Build: https://jenkins.thetaphi.de/job/Lucene-Solr-master-Solaris/1054/
Java: 64bit/jdk1.8.0 -XX:+UseCompressedOops -XX:+UseSerialGC

2 tests failed.
FAILED:  org.apache.solr.cloud.TestSolrCloudWithDelegationTokens.testDelegationTokenCancelFail

Error Message:
expected:<200> but was:<404>

Stack Trace:
java.lang.AssertionError: expected:<200> but was:<404>
	at __randomizedtesting.SeedInfo.seed([50577D0E7D517A41:38E84824ADCB68AD]:0)
	at org.junit.Assert.fail(Assert.java:93)
	at org.junit.Assert.failNotEquals(Assert.java:647)
	at org.junit.Assert.assertEquals(Assert.java:128)
	at org.junit.Assert.assertEquals(Assert.java:472)
	at org.junit.Assert.assertEquals(Assert.java:456)
	at org.apache.solr.cloud.TestSolrCloudWithDelegationTokens.cancelDelegationToken(TestSolrCloudWithDelegationTokens.java:140)
	at org.apache.solr.cloud.TestSolrCloudWithDelegationTokens.testDelegationTokenCancelFail(TestSolrCloudWithDelegationTokens.java:294)
	at sun.reflect.NativeMethodAccessorImpl.invoke0(Native Method)
	at sun.reflect.NativeMethodAccessorImpl.invoke(NativeMethodAccessorImpl.java:62)
	at sun.reflect.DelegatingMethodAccessorImpl.invoke(DelegatingMethodAccessorImpl.java:43)
	at java.lang.reflect.Method.invoke(Method.java:498)
	at com.carrotsearch.randomizedtesting.RandomizedRunner.invoke(RandomizedRunner.java:1713)
	at com.carrotsearch.randomizedtesting.RandomizedRunner$8.evaluate(RandomizedRunner.java:907)
	at com.carrotsearch.randomizedtesting.RandomizedRunner$9.evaluate(RandomizedRunner.java:943)
	at com.carrotsearch.randomizedtesting.RandomizedRunner$10.evaluate(RandomizedRunner.java:957)
	at com.carrotsearch.randomizedtesting.rules.SystemPropertiesRestoreRule$1.evaluate(SystemPropertiesRestoreRule.java:57)
	at org.apache.lucene.util.TestRuleSetupTeardownChained$1.evaluate(TestRuleSetupTeardownChained.java:49)
	at org.apache.lucene.util.AbstractBeforeAfterRule$1.evaluate(AbstractBeforeAfterRule.java:45)
	at org.apache.lucene.util.TestRuleThreadAndTestName$1.evaluate(TestRuleThreadAndTestName.java:48)
	at org.apache.lucene.util.TestRuleIgnoreAfterMaxFailures$1.evaluate(TestRuleIgnoreAfterMaxFailures.java:64)
	at org.apache.lucene.util.TestRuleMarkFailure$1.evaluate(TestRuleMarkFailure.java:47)
	at com.carrotsearch.randomizedtesting.rules.StatementAdapter.evaluate(StatementAdapter.java:36)
	at com.carrotsearch.randomizedtesting.ThreadLeakControl$StatementRunner.run(ThreadLeakControl.java:367)
	at com.carrotsearch.randomizedtesting.ThreadLeakControl.forkTimeoutingTask(ThreadLeakControl.java:811)
	at com.carrotsearch.randomizedtesting.ThreadLeakControl$3.evaluate(ThreadLeakControl.java:462)
	at com.carrotsearch.randomizedtesting.RandomizedRunner.runSingleTest(RandomizedRunner.java:916)
	at com.carrotsearch.randomizedtesting.RandomizedRunner$5.evaluate(RandomizedRunner.java:802)
	at com.carrotsearch.randomizedtesting.RandomizedRunner$6.evaluate(RandomizedRunner.java:852)
	at com.carrotsearch.randomizedtesting.RandomizedRunner$7.evaluate(RandomizedRunner.java:863)
	at com.carrotsearch.randomizedtesting.rules.StatementAdapter.evaluate(StatementAdapter.java:36)
	at com.carrotsearch.randomizedtesting.rules.SystemPropertiesRestoreRule$1.evaluate(SystemPropertiesRestoreRule.java:57)
	at org.apache.lucene.util.AbstractBeforeAfterRule$1.evaluate(AbstractBeforeAfterRule.java:45)
	at com.carrotsearch.randomizedtesting.rules.StatementAdapter.evaluate(StatementAdapter.java:36)
	at org.apache.lucene.util.TestRuleStoreClassName$1.evaluate(TestRuleStoreClassName.java:41)
	at com.carrotsearch.randomizedtesting.rules.NoShadowingOrOverridesOnMethodsRule$1.evaluate(NoShadowingOrOverridesOnMethodsRule.java:40)
	at com.carrotsearch.randomizedtesting.rules.NoShadowingOrOverridesOnMethodsRule$1.evaluate(NoShadowingOrOverridesOnMethodsRule.java:40)
	at com.carrotsearch.randomizedtesting.rules.StatementAdapter.evaluate(StatementAdapter.java:36)
	at com.carrotsearch.randomizedtesting.rules.StatementAdapter.evaluate(StatementAdapter.java:36)
	at com.carrotsearch.randomizedtesting.rules.StatementAdapter.evaluate(StatementAdapter.java:36)
	at org.apache.lucene.util.TestRuleAssertionsRequired$1.evaluate(TestRuleAssertionsRequired.java:53)
	at org.apache.lucene.util.TestRuleMarkFailure$1.evaluate(TestRuleMarkFailure.java:47)
	at org.apache.lucene.util.TestRuleIgnoreAfterMaxFailures$1.evaluate(TestRuleIgnoreAfterMaxFailures.java:64)
	at org.apache.lucene.util.TestRuleIgnoreTestSuites$1.evaluate(TestRuleIgnoreTestSuites.java:54)
	at com.carrotsearch.randomizedtesting.rules.StatementAdapter.evaluate(StatementAdapter.java:36)
	at com.carrotsearch.randomizedtesting.ThreadLeakControl$StatementRunner.run(ThreadLeakControl.java:367)
	at java.lang.Thread.run(Thread.java:745)


FAILED:  org.apache.solr.cloud.PeerSyncReplicationTest.test

Error Message:
timeout waiting to see all nodes active

Stack Trace:
java.lang.AssertionError: timeout waiting to see all nodes active
	at __randomizedtesting.SeedInfo.seed([50577D0E7D517A41:D80342D4D3AD17B9]:0)
	at org.junit.Assert.fail(Assert.java:93)
	at org.apache.solr.cloud.PeerSyncReplicationTest.waitTillNodesActive(PeerSyncReplicationTest.java:311)
	at org.apache.solr.cloud.PeerSyncReplicationTest.bringUpDeadNodeAndEnsureNoReplication(PeerSyncReplicationTest.java:262)
	at org.apache.solr.cloud.PeerSyncReplicationTest.forceNodeFailureAndDoPeerSync(PeerSyncReplicationTest.java:244)
	at org.apache.solr.cloud.PeerSyncReplicationTest.test(PeerSyncReplicationTest.java:133)
	at sun.reflect.NativeMethodAccessorImpl.invoke0(Native Method)
	at sun.reflect.NativeMethodAccessorImpl.invoke(NativeMethodAccessorImpl.java:62)
	at sun.reflect.DelegatingMethodAccessorImpl.invoke(DelegatingMethodAccessorImpl.java:43)
	at java.lang.reflect.Method.invoke(Method.java:498)
	at com.carrotsearch.randomizedtesting.RandomizedRunner.invoke(RandomizedRunner.java:1713)
	at com.carrotsearch.randomizedtesting.RandomizedRunner$8.evaluate(RandomizedRunner.java:907)
	at com.carrotsearch.randomizedtesting.RandomizedRunner$9.evaluate(RandomizedRunner.java:943)
	at com.carrotsearch.randomizedtesting.RandomizedRunner$10.evaluate(RandomizedRunner.java:957)
	at org.apache.solr.BaseDistributedSearchTestCase$ShardsRepeatRule$ShardsFixedStatement.callStatement(BaseDistributedSearchTestCase.java:985)
	at org.apache.solr.BaseDistributedSearchTestCase$ShardsRepeatRule$ShardsStatement.evaluate(BaseDistributedSearchTestCase.java:960)
	at com.carrotsearch.randomizedtesting.rules.SystemPropertiesRestoreRule$1.evaluate(SystemPropertiesRestoreRule.java:57)
	at org.apache.lucene.util.TestRuleSetupTeardownChained$1.evaluate(TestRuleSetupTeardownChained.java:49)
	at org.apache.lucene.util.AbstractBeforeAfterRule$1.evaluate(AbstractBeforeAfterRule.java:45)
	at org.apache.lucene.util.TestRuleThreadAndTestName$1.evaluate(TestRuleThreadAndTestName.java:48)
	at org.apache.lucene.util.TestRuleIgnoreAfterMaxFailures$1.evaluate(TestRuleIgnoreAfterMaxFailures.java:64)
	at org.apache.lucene.util.TestRuleMarkFailure$1.evaluate(TestRuleMarkFailure.java:47)
	at com.carrotsearch.randomizedtesting.rules.StatementAdapter.evaluate(StatementAdapter.java:36)
	at com.carrotsearch.randomizedtesting.ThreadLeakControl$StatementRunner.run(ThreadLeakControl.java:367)
	at com.carrotsearch.randomizedtesting.ThreadLeakControl.forkTimeoutingTask(ThreadLeakControl.java:811)
	at com.carrotsearch.randomizedtesting.ThreadLeakControl$3.evaluate(ThreadLeakControl.java:462)
	at com.carrotsearch.randomizedtesting.RandomizedRunner.runSingleTest(RandomizedRunner.java:916)
	at com.carrotsearch.randomizedtesting.RandomizedRunner$5.evaluate(RandomizedRunner.java:802)
	at com.carrotsearch.randomizedtesting.RandomizedRunner$6.evaluate(RandomizedRunner.java:852)
	at com.carrotsearch.randomizedtesting.RandomizedRunner$7.evaluate(RandomizedRunner.java:863)
	at com.carrotsearch.randomizedtesting.rules.StatementAdapter.evaluate(StatementAdapter.java:36)
	at com.carrotsearch.randomizedtesting.rules.SystemPropertiesRestoreRule$1.evaluate(SystemPropertiesRestoreRule.java:57)
	at org.apache.lucene.util.AbstractBeforeAfterRule$1.evaluate(AbstractBeforeAfterRule.java:45)
	at com.carrotsearch.randomizedtesting.rules.StatementAdapter.evaluate(StatementAdapter.java:36)
	at org.apache.lucene.util.TestRuleStoreClassName$1.evaluate(TestRuleStoreClassName.java:41)
	at com.carrotsearch.randomizedtesting.rules.NoShadowingOrOverridesOnMethodsRule$1.evaluate(NoShadowingOrOverridesOnMethodsRule.java:40)
	at com.carrotsearch.randomizedtesting.rules.NoShadowingOrOverridesOnMethodsRule$1.evaluate(NoShadowingOrOverridesOnMethodsRule.java:40)
	at com.carrotsearch.randomizedtesting.rules.StatementAdapter.evaluate(StatementAdapter.java:36)
	at com.carrotsearch.randomizedtesting.rules.StatementAdapter.evaluate(StatementAdapter.java:36)
	at com.carrotsearch.randomizedtesting.rules.StatementAdapter.evaluate(StatementAdapter.java:36)
	at org.apache.lucene.util.TestRuleAssertionsRequired$1.evaluate(TestRuleAssertionsRequired.java:53)
	at org.apache.lucene.util.TestRuleMarkFailure$1.evaluate(TestRuleMarkFailure.java:47)
	at org.apache.lucene.util.TestRuleIgnoreAfterMaxFailures$1.evaluate(TestRuleIgnoreAfterMaxFailures.java:64)
	at org.apache.lucene.util.TestRuleIgnoreTestSuites$1.evaluate(TestRuleIgnoreTestSuites.java:54)
	at com.carrotsearch.randomizedtesting.rules.StatementAdapter.evaluate(StatementAdapter.java:36)
	at com.carrotsearch.randomizedtesting.ThreadLeakControl$StatementRunner.run(ThreadLeakControl.java:367)
	at java.lang.Thread.run(Thread.java:745)




Build Log:
[...truncated 12196 lines...]
   [junit4] Suite: org.apache.solr.cloud.PeerSyncReplicationTest
   [junit4]   2> Creating dataDir: /export/home/jenkins/workspace/Lucene-Solr-master-Solaris/solr/build/solr-core/test/J1/temp/solr.cloud.PeerSyncReplicationTest_50577D0E7D517A41-001/init-core-data-001
   [junit4]   2> 2145496 INFO  (SUITE-PeerSyncReplicationTest-seed#[50577D0E7D517A41]-worker) [    ] o.a.s.SolrTestCaseJ4 Randomized ssl (true) and clientAuth (false) via: @org.apache.solr.util.RandomizeSSL(reason=, value=NaN, ssl=NaN, clientAuth=NaN)
   [junit4]   2> 2145496 INFO  (SUITE-PeerSyncReplicationTest-seed#[50577D0E7D517A41]-worker) [    ] o.a.s.BaseDistributedSearchTestCase Setting hostContext system property: /
   [junit4]   2> 2145498 INFO  (TEST-PeerSyncReplicationTest.test-seed#[50577D0E7D517A41]) [    ] o.a.s.c.ZkTestServer STARTING ZK TEST SERVER
   [junit4]   2> 2145499 INFO  (Thread-4585) [    ] o.a.s.c.ZkTestServer client port:0.0.0.0/0.0.0.0:0
   [junit4]   2> 2145499 INFO  (Thread-4585) [    ] o.a.s.c.ZkTestServer Starting server
   [junit4]   2> 2145599 INFO  (TEST-PeerSyncReplicationTest.test-seed#[50577D0E7D517A41]) [    ] o.a.s.c.ZkTestServer start zk server on port:50234
   [junit4]   2> 2145616 INFO  (TEST-PeerSyncReplicationTest.test-seed#[50577D0E7D517A41]) [    ] o.a.s.c.AbstractZkTestCase put /export/home/jenkins/workspace/Lucene-Solr-master-Solaris/solr/core/src/test-files/solr/collection1/conf/solrconfig-tlog.xml to /configs/conf1/solrconfig.xml
   [junit4]   2> 2145619 INFO  (TEST-PeerSyncReplicationTest.test-seed#[50577D0E7D517A41]) [    ] o.a.s.c.AbstractZkTestCase put /export/home/jenkins/workspace/Lucene-Solr-master-Solaris/solr/core/src/test-files/solr/collection1/conf/schema.xml to /configs/conf1/schema.xml
   [junit4]   2> 2145622 INFO  (TEST-PeerSyncReplicationTest.test-seed#[50577D0E7D517A41]) [    ] o.a.s.c.AbstractZkTestCase put /export/home/jenkins/workspace/Lucene-Solr-master-Solaris/solr/core/src/test-files/solr/collection1/conf/solrconfig.snippet.randomindexconfig.xml to /configs/conf1/solrconfig.snippet.randomindexconfig.xml
   [junit4]   2> 2145625 INFO  (TEST-PeerSyncReplicationTest.test-seed#[50577D0E7D517A41]) [    ] o.a.s.c.AbstractZkTestCase put /export/home/jenkins/workspace/Lucene-Solr-master-Solaris/solr/core/src/test-files/solr/collection1/conf/stopwords.txt to /configs/conf1/stopwords.txt
   [junit4]   2> 2145627 INFO  (TEST-PeerSyncReplicationTest.test-seed#[50577D0E7D517A41]) [    ] o.a.s.c.AbstractZkTestCase put /export/home/jenkins/workspace/Lucene-Solr-master-Solaris/solr/core/src/test-files/solr/collection1/conf/protwords.txt to /configs/conf1/protwords.txt
   [junit4]   2> 2145629 INFO  (TEST-PeerSyncReplicationTest.test-seed#[50577D0E7D517A41]) [    ] o.a.s.c.AbstractZkTestCase put /export/home/jenkins/workspace/Lucene-Solr-master-Solaris/solr/core/src/test-files/solr/collection1/conf/currency.xml to /configs/conf1/currency.xml
   [junit4]   2> 2145631 INFO  (TEST-PeerSyncReplicationTest.test-seed#[50577D0E7D517A41]) [    ] o.a.s.c.AbstractZkTestCase put /export/home/jenkins/workspace/Lucene-Solr-master-Solaris/solr/core/src/test-files/solr/collection1/conf/enumsConfig.xml to /configs/conf1/enumsConfig.xml
   [junit4]   2> 2145634 INFO  (TEST-PeerSyncReplicationTest.test-seed#[50577D0E7D517A41]) [    ] o.a.s.c.AbstractZkTestCase put /export/home/jenkins/workspace/Lucene-Solr-master-Solaris/solr/core/src/test-files/solr/collection1/conf/open-exchange-rates.json to /configs/conf1/open-exchange-rates.json
   [junit4]   2> 2145636 INFO  (TEST-PeerSyncReplicationTest.test-seed#[50577D0E7D517A41]) [    ] o.a.s.c.AbstractZkTestCase put /export/home/jenkins/workspace/Lucene-Solr-master-Solaris/solr/core/src/test-files/solr/collection1/conf/mapping-ISOLatin1Accent.txt to /configs/conf1/mapping-ISOLatin1Accent.txt
   [junit4]   2> 2145639 INFO  (TEST-PeerSyncReplicationTest.test-seed#[50577D0E7D517A41]) [    ] o.a.s.c.AbstractZkTestCase put /export/home/jenkins/workspace/Lucene-Solr-master-Solaris/solr/core/src/test-files/solr/collection1/conf/old_synonyms.txt to /configs/conf1/old_synonyms.txt
   [junit4]   2> 2145641 INFO  (TEST-PeerSyncReplicationTest.test-seed#[50577D0E7D517A41]) [    ] o.a.s.c.AbstractZkTestCase put /export/home/jenkins/workspace/Lucene-Solr-master-Solaris/solr/core/src/test-files/solr/collection1/conf/synonyms.txt to /configs/conf1/synonyms.txt
   [junit4]   2> 2145799 INFO  (TEST-PeerSyncReplicationTest.test-seed#[50577D0E7D517A41]) [    ] o.a.s.SolrTestCaseJ4 Writing core.properties file to /export/home/jenkins/workspace/Lucene-Solr-master-Solaris/solr/build/solr-core/test/J1/temp/solr.cloud.PeerSyncReplicationTest_50577D0E7D517A41-001/control-001/cores/collection1
   [junit4]   2> 2145803 INFO  (TEST-PeerSyncReplicationTest.test-seed#[50577D0E7D517A41]) [    ] o.e.j.s.Server jetty-9.3.14.v20161028
   [junit4]   2> 2145804 INFO  (TEST-PeerSyncReplicationTest.test-seed#[50577D0E7D517A41]) [    ] o.e.j.s.h.ContextHandler Started o.e.j.s.ServletContextHandler@5cafcaca{/,null,AVAILABLE}
   [junit4]   2> 2145807 INFO  (TEST-PeerSyncReplicationTest.test-seed#[50577D0E7D517A41]) [    ] o.e.j.s.AbstractConnector Started ServerConnector@5234ab0d{SSL,[ssl, http/1.1]}{127.0.0.1:?????}
   [junit4]   2> 2145807 INFO  (TEST-PeerSyncReplicationTest.test-seed#[50577D0E7D517A41]) [    ] o.e.j.s.Server Started @???????ms
   [junit4]   2> 2145807 INFO  (TEST-PeerSyncReplicationTest.test-seed#[50577D0E7D517A41]) [    ] o.a.s.c.s.e.JettySolrRunner Jetty properties: {solr.data.dir=/export/home/jenkins/workspace/Lucene-Solr-master-Solaris/solr/build/solr-core/test/J1/temp/solr.cloud.PeerSyncReplicationTest_50577D0E7D517A41-001/tempDir-001/control/data, hostContext=/, hostPort=34188, coreRootDirectory=/export/home/jenkins/workspace/Lucene-Solr-master-Solaris/solr/build/solr-core/test/J1/temp/solr.cloud.PeerSyncReplicationTest_50577D0E7D517A41-001/control-001/cores}
   [junit4]   2> 2145807 ERROR (TEST-PeerSyncReplicationTest.test-seed#[50577D0E7D517A41]) [    ] o.a.s.s.StartupLoggingUtils Missing Java Option solr.log.dir. Logging may be missing or incomplete.
   [junit4]   2> 2145808 INFO  (TEST-PeerSyncReplicationTest.test-seed#[50577D0E7D517A41]) [    ] o.a.s.s.SolrDispatchFilter  ___      _       Welcome to Apache Solr? version 7.0.0
   [junit4]   2> 2145808 INFO  (TEST-PeerSyncReplicationTest.test-seed#[50577D0E7D517A41]) [    ] o.a.s.s.SolrDispatchFilter / __| ___| |_ _   Starting in cloud mode on port null
   [junit4]   2> 2145808 INFO  (TEST-PeerSyncReplicationTest.test-seed#[50577D0E7D517A41]) [    ] o.a.s.s.SolrDispatchFilter \__ \/ _ \ | '_|  Install dir: null
   [junit4]   2> 2145808 INFO  (TEST-PeerSyncReplicationTest.test-seed#[50577D0E7D517A41]) [    ] o.a.s.s.SolrDispatchFilter |___/\___/_|_|    Start time: 2017-01-03T22:45:24.656Z
   [junit4]   2> 2145811 INFO  (TEST-PeerSyncReplicationTest.test-seed#[50577D0E7D517A41]) [    ] o.a.s.s.SolrDispatchFilter Loading solr.xml from SolrHome (not found in ZooKeeper)
   [junit4]   2> 2145811 INFO  (TEST-PeerSyncReplicationTest.test-seed#[50577D0E7D517A41]) [    ] o.a.s.c.SolrXmlConfig Loading container configuration from /export/home/jenkins/workspace/Lucene-Solr-master-Solaris/solr/build/solr-core/test/J1/temp/solr.cloud.PeerSyncReplicationTest_50577D0E7D517A41-001/control-001/solr.xml
   [junit4]   2> 2145819 INFO  (TEST-PeerSyncReplicationTest.test-seed#[50577D0E7D517A41]) [    ] o.a.s.c.ZkContainer Zookeeper client=127.0.0.1:50234/solr
   [junit4]   2> 2145857 INFO  (TEST-PeerSyncReplicationTest.test-seed#[50577D0E7D517A41]) [n:127.0.0.1:34188_    ] o.a.s.c.OverseerElectionContext I am going to be the leader 127.0.0.1:34188_
   [junit4]   2> 2145860 INFO  (TEST-PeerSyncReplicationTest.test-seed#[50577D0E7D517A41]) [n:127.0.0.1:34188_    ] o.a.s.c.Overseer Overseer (id=97221576251670533-127.0.0.1:34188_-n_0000000000) starting
   [junit4]   2> 2145872 INFO  (TEST-PeerSyncReplicationTest.test-seed#[50577D0E7D517A41]) [n:127.0.0.1:34188_    ] o.a.s.c.ZkController Register node as live in ZooKeeper:/live_nodes/127.0.0.1:34188_
   [junit4]   2> 2145876 INFO  (OverseerStateUpdate-97221576251670533-127.0.0.1:34188_-n_0000000000) [n:127.0.0.1:34188_    ] o.a.s.c.c.ZkStateReader Updated live nodes from ZooKeeper... (0) -> (1)
   [junit4]   2> 2145930 INFO  (TEST-PeerSyncReplicationTest.test-seed#[50577D0E7D517A41]) [n:127.0.0.1:34188_    ] o.a.s.c.CorePropertiesLocator Found 1 core definitions underneath /export/home/jenkins/workspace/Lucene-Solr-master-Solaris/solr/build/solr-core/test/J1/temp/solr.cloud.PeerSyncReplicationTest_50577D0E7D517A41-001/control-001/cores
   [junit4]   2> 2145930 INFO  (TEST-PeerSyncReplicationTest.test-seed#[50577D0E7D517A41]) [n:127.0.0.1:34188_    ] o.a.s.c.CorePropertiesLocator Cores are: [collection1]
   [junit4]   2> 2145936 INFO  (OverseerStateUpdate-97221576251670533-127.0.0.1:34188_-n_0000000000) [n:127.0.0.1:34188_    ] o.a.s.c.o.ReplicaMutator Assigning new node to shard shard=shard1
   [junit4]   2> 2146947 WARN  (coreLoadExecutor-8083-thread-1-processing-n:127.0.0.1:34188_) [n:127.0.0.1:34188_ c:control_collection   x:collection1] o.a.s.c.Config Beginning with Solr 5.5, <mergePolicy> is deprecated, use <mergePolicyFactory> instead.
   [junit4]   2> 2146948 INFO  (coreLoadExecutor-8083-thread-1-processing-n:127.0.0.1:34188_) [n:127.0.0.1:34188_ c:control_collection   x:collection1] o.a.s.c.SolrConfig Using Lucene MatchVersion: 7.0.0
   [junit4]   2> 2146973 INFO  (coreLoadExecutor-8083-thread-1-processing-n:127.0.0.1:34188_) [n:127.0.0.1:34188_ c:control_collection   x:collection1] o.a.s.s.IndexSchema [collection1] Schema name=test
   [junit4]   2> 2147069 WARN  (coreLoadExecutor-8083-thread-1-processing-n:127.0.0.1:34188_) [n:127.0.0.1:34188_ c:control_collection   x:collection1] o.a.s.s.IndexSchema [collection1] default search field in schema is text. WARNING: Deprecated, please use 'df' on request instead.
   [junit4]   2> 2147071 INFO  (coreLoadExecutor-8083-thread-1-processing-n:127.0.0.1:34188_) [n:127.0.0.1:34188_ c:control_collection   x:collection1] o.a.s.s.IndexSchema Loaded schema test/1.0 with uniqueid field id
   [junit4]   2> 2147093 INFO  (coreLoadExecutor-8083-thread-1-processing-n:127.0.0.1:34188_) [n:127.0.0.1:34188_ c:control_collection   x:collection1] o.a.s.c.CoreContainer Creating SolrCore 'collection1' using configuration from collection control_collection
   [junit4]   2> 2147093 INFO  (coreLoadExecutor-8083-thread-1-processing-n:127.0.0.1:34188_) [n:127.0.0.1:34188_ c:control_collection   x:collection1] o.a.s.c.SolrCore [[collection1] ] Opening new SolrCore at [/export/home/jenkins/workspace/Lucene-Solr-master-Solaris/solr/build/solr-core/test/J1/temp/solr.cloud.PeerSyncReplicationTest_50577D0E7D517A41-001/control-001/cores/collection1], dataDir=[/export/home/jenkins/workspace/Lucene-Solr-master-Solaris/solr/build/solr-core/test/J1/temp/solr.cloud.PeerSyncReplicationTest_50577D0E7D517A41-001/control-001/cores/collection1/data/]
   [junit4]   2> 2147093 INFO  (coreLoadExecutor-8083-thread-1-processing-n:127.0.0.1:34188_) [n:127.0.0.1:34188_ c:control_collection   x:collection1] o.a.s.c.JmxMonitoredMap JMX monitoring is enabled. Adding Solr mbeans to JMX Server: com.sun.jmx.mbeanserver.JmxMBeanServer@e329b15
   [junit4]   2> 2147095 INFO  (coreLoadExecutor-8083-thread-1-processing-n:127.0.0.1:34188_) [n:127.0.0.1:34188_ c:control_collection   x:collection1] o.a.s.u.RandomMergePolicy RandomMergePolicy wrapping class org.apache.lucene.index.TieredMergePolicy: [TieredMergePolicy: maxMergeAtOnce=42, maxMergeAtOnceExplicit=14, maxMergedSegmentMB=51.2333984375, floorSegmentMB=1.17578125, forceMergeDeletesPctAllowed=27.54441213687038, segmentsPerTier=25.0, maxCFSSegmentSizeMB=8.796093022207999E12, noCFSRatio=0.0
   [junit4]   2> 2147101 WARN  (coreLoadExecutor-8083-thread-1-processing-n:127.0.0.1:34188_) [n:127.0.0.1:34188_ c:control_collection   x:collection1] o.a.s.c.RequestHandlers INVALID paramSet a in requestHandler {type = requestHandler,name = /dump,class = DumpRequestHandler,attributes = {initParams=a, name=/dump, class=DumpRequestHandler},args = {defaults={a=A,b=B}}}
   [junit4]   2> 2147111 INFO  (coreLoadExecutor-8083-thread-1-processing-n:127.0.0.1:34188_) [n:127.0.0.1:34188_ c:control_collection   x:collection1] o.a.s.u.UpdateHandler Using UpdateLog implementation: org.apache.solr.update.UpdateLog
   [junit4]   2> 2147111 INFO  (coreLoadExecutor-8083-thread-1-processing-n:127.0.0.1:34188_) [n:127.0.0.1:34188_ c:control_collection   x:collection1] o.a.s.u.UpdateLog Initializing UpdateLog: dataDir= defaultSyncLevel=FLUSH numRecordsToKeep=1000 maxNumLogsToKeep=10 numVersionBuckets=65536
   [junit4]   2> 2147111 INFO  (coreLoadExecutor-8083-thread-1-processing-n:127.0.0.1:34188_) [n:127.0.0.1:34188_ c:control_collection   x:collection1] o.a.s.u.CommitTracker Hard AutoCommit: disabled
   [junit4]   2> 2147112 INFO  (coreLoadExecutor-8083-thread-1-processing-n:127.0.0.1:34188_) [n:127.0.0.1:34188_ c:control_collection   x:collection1] o.a.s.u.CommitTracker Soft AutoCommit: disabled
   [junit4]   2> 2147112 INFO  (coreLoadExecutor-8083-thread-1-processing-n:127.0.0.1:34188_) [n:127.0.0.1:34188_ c:control_collection   x:collection1] o.a.s.u.RandomMergePolicy RandomMergePolicy wrapping class org.apache.lucene.index.MockRandomMergePolicy: org.apache.lucene.index.MockRandomMergePolicy@1ee19f84
   [junit4]   2> 2147114 INFO  (coreLoadExecutor-8083-thread-1-processing-n:127.0.0.1:34188_) [n:127.0.0.1:34188_ c:control_collection   x:collection1] o.a.s.s.SolrIndexSearcher Opening [Searcher@65a35457[collection1] main]
   [junit4]   2> 2147116 INFO  (coreLoadExecutor-8083-thread-1-processing-n:127.0.0.1:34188_) [n:127.0.0.1:34188_ c:control_collection   x:collection1] o.a.s.r.ManagedResourceStorage Configured ZooKeeperStorageIO with znodeBase: /configs/conf1
   [junit4]   2> 2147116 INFO  (coreLoadExecutor-8083-thread-1-processing-n:127.0.0.1:34188_) [n:127.0.0.1:34188_ c:control_collection   x:collection1] o.a.s.r.ManagedResourceStorage Loaded null at path _rest_managed.json using ZooKeeperStorageIO:path=/configs/conf1
   [junit4]   2> 2147116 INFO  (coreLoadExecutor-8083-thread-1-processing-n:127.0.0.1:34188_) [n:127.0.0.1:34188_ c:control_collection   x:collection1] o.a.s.h.ReplicationHandler Commits will be reserved for  10000
   [junit4]   2> 2147118 INFO  (searcherExecutor-8084-thread-1-processing-n:127.0.0.1:34188_ x:collection1 c:control_collection) [n:127.0.0.1:34188_ c:control_collection   x:collection1] o.a.s.c.SolrCore [collection1] Registered new searcher Searcher@65a35457[collection1] main{ExitableDirectoryReader(UninvertingDirectoryReader())}
   [junit4]   2> 2147118 INFO  (coreLoadExecutor-8083-thread-1-processing-n:127.0.0.1:34188_) [n:127.0.0.1:34188_ c:control_collection   x:collection1] o.a.s.u.UpdateLog Could not find max version in index or recent updates, using new clock 1555545221723324416
   [junit4]   2> 2147130 INFO  (coreZkRegister-8076-thread-1-processing-n:127.0.0.1:34188_ x:collection1 c:control_collection) [n:127.0.0.1:34188_ c:control_collection s:shard1 r:core_node1 x:collection1] o.a.s.c.ShardLeaderElectionContext Enough replicas found to continue.
   [junit4]   2> 2147131 INFO  (coreZkRegister-8076-thread-1-processing-n:127.0.0.1:34188_ x:collection1 c:control_collection) [n:127.0.0.1:34188_ c:control_collection s:shard1 r:core_node1 x:collection1] o.a.s.c.ShardLeaderElectionContext I may be the new leader - try and sync
   [junit4]   2> 2147131 INFO  (coreZkRegister-8076-thread-1-processing-n:127.0.0.1:34188_ x:collection1 c:control_collection) [n:127.0.0.1:34188_ c:control_collection s:shard1 r:core_node1 x:collection1] o.a.s.c.SyncStrategy Sync replicas to https://127.0.0.1:34188/collection1/
   [junit4]   2> 2147131 INFO  (coreZkRegister-8076-thread-1-processing-n:127.0.0.1:34188_ x:collection1 c:control_collection) [n:127.0.0.1:34188_ c:control_collection s:shard1 r:core_node1 x:collection1] o.a.s.c.SyncStrategy Sync Success - now sync replicas to me
   [junit4]   2> 2147132 INFO  (coreZkRegister-8076-thread-1-processing-n:127.0.0.1:34188_ x:collection1 c:control_collection) [n:127.0.0.1:34188_ c:control_collection s:shard1 r:core_node1 x:collection1] o.a.s.c.SyncStrategy https://127.0.0.1:34188/collection1/ has no replicas
   [junit4]   2> 2147140 INFO  (coreZkRegister-8076-thread-1-processing-n:127.0.0.1:34188_ x:collection1 c:control_collection) [n:127.0.0.1:34188_ c:control_collection s:shard1 r:core_node1 x:collection1] o.a.s.c.ShardLeaderElectionContext I am the new leader: https://127.0.0.1:34188/collection1/ shard1
   [junit4]   2> 2147293 INFO  (coreZkRegister-8076-thread-1-processing-n:127.0.0.1:34188_ x:collection1 c:control_collection) [n:127.0.0.1:34188_ c:control_collection s:shard1 r:core_node1 x:collection1] o.a.s.c.ZkController I am the leader, no recovery necessary
   [junit4]   2> 2147306 INFO  (TEST-PeerSyncReplicationTest.test-seed#[50577D0E7D517A41]) [    ] o.a.s.c.c.ZkStateReader Updated live nodes from ZooKeeper... (0) -> (1)
   [junit4]   2> 2147308 INFO  (TEST-PeerSyncReplicationTest.test-seed#[50577D0E7D517A41]) [    ] o.a.s.c.s.i.ZkClientClusterStateProvider Cluster at 127.0.0.1:50234/solr ready
   [junit4]   2> 2147308 INFO  (TEST-PeerSyncReplicationTest.test-seed#[50577D0E7D517A41]) [    ] o.a.s.c.ChaosMonkey monkey: init - expire sessions:false cause connection loss:false
   [junit4]   2> 2147308 INFO  (TEST-PeerSyncReplicationTest.test-seed#[50577D0E7D517A41]) [    ] o.a.s.c.AbstractFullDistribZkTestBase Creating collection1 with stateFormat=2
   [junit4]   2> 2147467 INFO  (TEST-PeerSyncReplicationTest.test-seed#[50577D0E7D517A41]) [    ] o.a.s.SolrTestCaseJ4 Writing core.properties file to /export/home/jenkins/workspace/Lucene-Solr-master-Solaris/solr/build/solr-core/test/J1/temp/solr.cloud.PeerSyncReplicationTest_50577D0E7D517A41-001/shard-1-001/cores/collection1
   [junit4]   2> 2147468 INFO  (TEST-PeerSyncReplicationTest.test-seed#[50577D0E7D517A41]) [    ] o.a.s.c.AbstractFullDistribZkTestBase create jetty 1 in directory /export/home/jenkins/workspace/Lucene-Solr-master-Solaris/solr/build/solr-core/test/J1/temp/solr.cloud.PeerSyncReplicationTest_50577D0E7D517A41-001/shard-1-001
   [junit4]   2> 2147471 INFO  (TEST-PeerSyncReplicationTest.test-seed#[50577D0E7D517A41]) [    ] o.e.j.s.Server jetty-9.3.14.v20161028
   [junit4]   2> 2147472 INFO  (TEST-PeerSyncReplicationTest.test-seed#[50577D0E7D517A41]) [    ] o.e.j.s.h.ContextHandler Started o.e.j.s.ServletContextHandler@27ff2939{/,null,AVAILABLE}
   [junit4]   2> 2147473 INFO  (TEST-PeerSyncReplicationTest.test-seed#[50577D0E7D517A41]) [    ] o.e.j.s.AbstractConnector Started ServerConnector@79f5b06e{SSL,[ssl, http/1.1]}{127.0.0.1:?????}
   [junit4]   2> 2147473 INFO  (TEST-PeerSyncReplicationTest.test-seed#[50577D0E7D517A41]) [    ] o.e.j.s.Server Started @???????ms
   [junit4]   2> 2147473 INFO  (TEST-PeerSyncReplicationTest.test-seed#[50577D0E7D517A41]) [    ] o.a.s.c.s.e.JettySolrRunner Jetty properties: {solr.data.dir=/export/home/jenkins/workspace/Lucene-Solr-master-Solaris/solr/build/solr-core/test/J1/temp/solr.cloud.PeerSyncReplicationTest_50577D0E7D517A41-001/tempDir-001/jetty1, solrconfig=solrconfig.xml, hostContext=/, hostPort=51905, coreRootDirectory=/export/home/jenkins/workspace/Lucene-Solr-master-Solaris/solr/build/solr-core/test/J1/../../../../../../../../../../export/home/jenkins/workspace/Lucene-Solr-master-Solaris/solr/build/solr-core/test/J1/temp/solr.cloud.PeerSyncReplicationTest_50577D0E7D517A41-001/shard-1-001/cores}
   [junit4]   2> 2147473 ERROR (TEST-PeerSyncReplicationTest.test-seed#[50577D0E7D517A41]) [    ] o.a.s.s.StartupLoggingUtils Missing Java Option solr.log.dir. Logging may be missing or incomplete.
   [junit4]   2> 2147474 INFO  (TEST-PeerSyncReplicationTest.test-seed#[50577D0E7D517A41]) [    ] o.a.s.s.SolrDispatchFilter  ___      _       Welcome to Apache Solr? version 7.0.0
   [junit4]   2> 2147474 INFO  (TEST-PeerSyncReplicationTest.test-seed#[50577D0E7D517A41]) [    ] o.a.s.s.SolrDispatchFilter / __| ___| |_ _   Starting in cloud mode on port null
   [junit4]   2> 2147475 INFO  (TEST-PeerSyncReplicationTest.test-seed#[50577D0E7D517A41]) [    ] o.a.s.s.SolrDispatchFilter \__ \/ _ \ | '_|  Install dir: null
   [junit4]   2> 2147475 INFO  (TEST-PeerSyncReplicationTest.test-seed#[50577D0E7D517A41]) [    ] o.a.s.s.SolrDispatchFilter |___/\___/_|_|    Start time: 2017-01-03T22:45:26.323Z
   [junit4]   2> 2147478 INFO  (TEST-PeerSyncReplicationTest.test-seed#[50577D0E7D517A41]) [    ] o.a.s.s.SolrDispatchFilter Loading solr.xml from SolrHome (not found in ZooKeeper)
   [junit4]   2> 2147478 INFO  (TEST-PeerSyncReplicationTest.test-seed#[50577D0E7D517A41]) [    ] o.a.s.c.SolrXmlConfig Loading container configuration from /export/home/jenkins/workspace/Lucene-Solr-master-Solaris/solr/build/solr-core/test/J1/temp/solr.cloud.PeerSyncReplicationTest_50577D0E7D517A41-001/shard-1-001/solr.xml
   [junit4]   2> 2147484 INFO  (TEST-PeerSyncReplicationTest.test-seed#[50577D0E7D517A41]) [    ] o.a.s.c.ZkContainer Zookeeper client=127.0.0.1:50234/solr
   [junit4]   2> 2147499 INFO  (TEST-PeerSyncReplicationTest.test-seed#[50577D0E7D517A41]) [n:127.0.0.1:51905_    ] o.a.s.c.c.ZkStateReader Updated live nodes from ZooKeeper... (0) -> (1)
   [junit4]   2> 2147506 INFO  (TEST-PeerSyncReplicationTest.test-seed#[50577D0E7D517A41]) [n:127.0.0.1:51905_    ] o.a.s.c.ZkController Register node as live in ZooKeeper:/live_nodes/127.0.0.1:51905_
   [junit4]   2> 2147510 INFO  (zkCallback-2751-thread-2-processing-n:127.0.0.1:34188_) [n:127.0.0.1:34188_    ] o.a.s.c.c.ZkStateReader Updated live nodes from ZooKeeper... (1) -> (2)
   [junit4]   2> 2147510 INFO  (zkCallback-2755-thread-1) [    ] o.a.s.c.c.ZkStateReader Updated live nodes from ZooKeeper... (1) -> (2)
   [junit4]   2> 2147512 INFO  (zkCallback-2761-thread-1-processing-n:127.0.0.1:51905_) [n:127.0.0.1:51905_    ] o.a.s.c.c.ZkStateReader Updated live nodes from ZooKeeper... (1) -> (2)
   [junit4]   2> 2147668 INFO  (TEST-PeerSyncReplicationTest.test-seed#[50577D0E7D517A41]) [n:127.0.0.1:51905_    ] o.a.s.c.CorePropertiesLocator Found 1 core definitions underneath /export/home/jenkins/workspace/Lucene-Solr-master-Solaris/solr/build/solr-core/test/J1/../../../../../../../../../../export/home/jenkins/workspace/Lucene-Solr-master-Solaris/solr/build/solr-core/test/J1/temp/solr.cloud.PeerSyncReplicationTest_50577D0E7D517A41-001/shard-1-001/cores
   [junit4]   2> 2147668 INFO  (TEST-PeerSyncReplicationTest.test-seed#[50577D0E7D517A41]) [n:127.0.0.1:51905_    ] o.a.s.c.CorePropertiesLocator Cores are: [collection1]
   [junit4]   2> 2147672 INFO  (OverseerStateUpdate-97221576251670533-127.0.0.1:34188_-n_0000000000) [n:127.0.0.1:34188_    ] o.a.s.c.o.ReplicaMutator Assigning new node to shard shard=shard1
   [junit4]   2> 2147776 INFO  (zkCallback-2761-thread-2-processing-n:127.0.0.1:51905_) [n:127.0.0.1:51905_    ] o.a.s.c.c.ZkStateReader A cluster state change: [WatchedEvent state:SyncConnected type:NodeDataChanged path:/collections/collection1/state.json] for collection [collection1] has occurred - updating... (live nodes size: [2])
   [junit4]   2> 2148685 WARN  (coreLoadExecutor-8094-thread-1-processing-n:127.0.0.1:51905_) [n:127.0.0.1:51905_ c:collection1   x:collection1] o.a.s.c.Config Beginning with Solr 5.5, <mergePolicy> is deprecated, use <mergePolicyFactory> instead.
   [junit4]   2> 2148686 INFO  (coreLoadExecutor-8094-thread-1-processing-n:127.0.0.1:51905_) [n:127.0.0.1:51905_ c:collection1   x:collection1] o.a.s.c.SolrConfig Using Lucene MatchVersion: 7.0.0
   [junit4]   2> 2148699 INFO  (coreLoadExecutor-8094-thread-1-processing-n:127.0.0.1:51905_) [n:127.0.0.1:51905_ c:collection1   x:collection1] o.a.s.s.IndexSchema [collection1] Schema name=test
   [junit4]   2> 2148796 WARN  (coreLoadExecutor-8094-thread-1-processing-n:127.0.0.1:51905_) [n:127.0.0.1:51905_ c:collection1   x:collection1] o.a.s.s.IndexSchema [collection1] default search field in schema is text. WARNING: Deprecated, please use 'df' on request instead.
   [junit4]   2> 2148798 INFO  (coreLoadExecutor-8094-thread-1-processing-n:127.0.0.1:51905_) [n:127.0.0.1:51905_ c:collection1   x:collection1] o.a.s.s.IndexSchema Loaded schema test/1.0 with uniqueid field id
   [junit4]   2> 2148819 INFO  (coreLoadExecutor-8094-thread-1-processing-n:127.0.0.1:51905_) [n:127.0.0.1:51905_ c:collection1   x:collection1] o.a.s.c.CoreContainer Creating SolrCore 'collection1' using configuration from collection collection1
   [junit4]   2> 2148820 INFO  (coreLoadExecutor-8094-thread-1-processing-n:127.0.0.1:51905_) [n:127.0.0.1:51905_ c:collection1   x:collection1] o.a.s.c.SolrCore [[collection1] ] Opening new SolrCore at [/export/home/jenkins/workspace/Lucene-Solr-master-Solaris/solr/build/solr-core/test/J1/temp/solr.cloud.PeerSyncReplicationTest_50577D0E7D517A41-001/shard-1-001/cores/collection1], dataDir=[/export/home/jenkins/workspace/Lucene-Solr-master-Solaris/solr/build/solr-core/test/J1/../../../../../../../../../../export/home/jenkins/workspace/Lucene-Solr-master-Solaris/solr/build/solr-core/test/J1/temp/solr.cloud.PeerSyncReplicationTest_50577D0E7D517A41-001/shard-1-001/cores/collection1/data/]
   [junit4]   2> 2148820 INFO  (coreLoadExecutor-8094-thread-1-processing-n:127.0.0.1:51905_) [n:127.0.0.1:51905_ c:collection1   x:collection1] o.a.s.c.JmxMonitoredMap JMX monitoring is enabled. Adding Solr mbeans to JMX Server: com.sun.jmx.mbeanserver.JmxMBeanServer@e329b15
   [junit4]   2> 2148822 INFO  (coreLoadExecutor-8094-thread-1-processing-n:127.0.0.1:51905_) [n:127.0.0.1:51905_ c:collection1   x:collection1] o.a.s.u.RandomMergePolicy RandomMergePolicy wrapping class org.apache.lucene.index.TieredMergePolicy: [TieredMergePolicy: maxMergeAtOnce=42, maxMergeAtOnceExplicit=14, maxMergedSegmentMB=51.2333984375, floorSegmentMB=1.17578125, forceMergeDeletesPctAllowed=27.54441213687038, segmentsPerTier=25.0, maxCFSSegmentSizeMB=8.796093022207999E12, noCFSRatio=0.0
   [junit4]   2> 2148829 WARN  (coreLoadExecutor-8094-thread-1-processing-n:127.0.0.1:51905_) [n:127.0.0.1:51905_ c:collection1   x:collection1] o.a.s.c.RequestHandlers INVALID paramSet a in requestHandler {type = requestHandler,name = /dump,class = DumpRequestHandler,attributes = {initParams=a, name=/dump, class=DumpRequestHandler},args = {defaults={a=A,b=B}}}
   [junit4]   2> 2148840 INFO  (coreLoadExecutor-8094-thread-1-processing-n:127.0.0.1:51905_) [n:127.0.0.1:51905_ c:collection1   x:collection1] o.a.s.u.UpdateHandler Using UpdateLog implementation: org.apache.solr.update.UpdateLog
   [junit4]   2> 2148840 INFO  (coreLoadExecutor-8094-thread-1-processing-n:127.0.0.1:51905_) [n:127.0.0.1:51905_ c:collection1   x:collection1] o.a.s.u.UpdateLog Initializing UpdateLog: dataDir= defaultSyncLevel=FLUSH numRecordsToKeep=1000 maxNumLogsToKeep=10 numVersionBuckets=65536
   [junit4]   2> 2148841 INFO  (coreLoadExecutor-8094-thread-1-processing-n:127.0.0.1:51905_) [n:127.0.0.1:51905_ c:collection1   x:collection1] o.a.s.u.CommitTracker Hard AutoCommit: disabled
   [junit4]   2> 2148841 INFO  (coreLoadExecutor-8094-thread-1-processing-n:127.0.0.1:51905_) [n:127.0.0.1:51905_ c:collection1   x:collection1] o.a.s.u.CommitTracker Soft AutoCommit: disabled
   [junit4]   2> 2148842 INFO  (coreLoadExecutor-8094-thread-1-processing-n:127.0.0.1:51905_) [n:127.0.0.1:51905_ c:collection1   x:collection1] o.a.s.u.RandomMergePolicy RandomMergePolicy wrapping class org.apache.lucene.index.MockRandomMergePolicy: org.apache.lucene.index.MockRandomMergePolicy@3c4dd8a5
   [junit4]   2> 2148843 INFO  (coreLoadExecutor-8094-thread-1-processing-n:127.0.0.1:51905_) [n:127.0.0.1:51905_ c:collection1   x:collection1] o.a.s.s.SolrIndexSearcher Opening [Searcher@5c7a3f39[collection1] main]
   [junit4]   2> 2148844 INFO  (coreLoadExecutor-8094-thread-1-processing-n:127.0.0.1:51905_) [n:127.0.0.1:51905_ c:collection1   x:collection1] o.a.s.r.ManagedResourceStorage Configured ZooKeeperStorageIO with znodeBase: /configs/conf1
   [junit4]   2> 2148845 INFO  (coreLoadExecutor-8094-thread-1-processing-n:127.0.0.1:51905_) [n:127.0.0.1:51905_ c:collection1   x:collection1] o.a.s.r.ManagedResourceStorage Loaded null at path _rest_managed.json using ZooKeeperStorageIO:path=/configs/conf1
   [junit4]   2> 2148845 INFO  (coreLoadExecutor-8094-thread-1-processing-n:127.0.0.1:51905_) [n:127.0.0.1:51905_ c:collection1   x:collection1] o.a.s.h.ReplicationHandler Commits will be reserved for  10000
   [junit4]   2> 2148845 INFO  (searcherExecutor-8095-thread-1-processing-n:127.0.0.1:51905_ x:collection1 c:collection1) [n:127.0.0.1:51905_ c:collection1   x:collection1] o.a.s.c.SolrCore [collection1] Registered new searcher Searcher@5c7a3f39[collection1] main{ExitableDirectoryReader(UninvertingDirectoryReader())}
   [junit4]   2> 2148846 INFO  (coreLoadExecutor-8094-thread-1-processing-n:127.0.0.1:51905_) [n:127.0.0.1:51905_ c:collection1   x:collection1] o.a.s.u.UpdateLog Could not find max version in index or recent updates, using new clock 1555545223535263744
   [junit4]   2> 2148856 INFO  (coreZkRegister-8089-thread-1-processing-n:127.0.0.1:51905_ x:collection1 c:collection1) [n:127.0.0.1:51905_ c:collection1 s:shard1 r:core_node1 x:collection1] o.a.s.c.ShardLeaderElectionContext Enough replicas found to continue.
   [junit4]   2> 2148856 INFO  (coreZkRegister-8089-thread-1-processing-n:127.0.0.1:51905_ x:collection1 c:collection1) [n:127.0.0.1:51905_ c:collection1 s:shard1 r:core_node1 x:collection1] o.a.s.c.ShardLeaderElectionContext I may be the new leader - try and sync
   [junit4]   2> 2148856 INFO  (coreZkRegister-8089-thread-1-processing-n:127.0.0.1:51905_ x:collection1 c:collection1) [n:127.0.0.1:51905_ c:collection1 s:shard1 r:core_node1 x:collection1] o.a.s.c.SyncStrategy Sync replicas to https://127.0.0.1:51905/collection1/
   [junit4]   2> 2148856 INFO  (coreZkRegister-8089-thread-1-processing-n:127.0.0.1:51905_ x:collection1 c:collection1) [n:127.0.0.1:51905_ c:collection1 s:shard1 r:core_node1 x:collection1] o.a.s.c.SyncStrategy Sync Success - now sync replicas to me
   [junit4]   2> 2148856 INFO  (coreZkRegister-8089-thread-1-processing-n:127.0.0.1:51905_ x:collection1 c:collection1) [n:127.0.0.1:51905_ c:collection1 s:shard1 r:core_node1 x:collection1] o.a.s.c.SyncStrategy https://127.0.0.1:51905/collection1/ has no replicas
   [junit4]   2> 2148863 INFO  (coreZkRegister-8089-thread-1-processing-n:127.0.0.1:51905_ x:collection1 c:collection1) [n:127.0.0.1:51905_ c:collection1 s:shard1 r:core_node1 x:collection1] o.a.s.c.ShardLeaderElectionContext I am the new leader: https://127.0.0.1:51905/collection1/ shard1
   [junit4]   2> 2148970 INFO  (zkCallback-2761-thread-2-processing-n:127.0.0.1:51905_) [n:127.0.0.1:51905_    ] o.a.s.c.c.ZkStateReader A cluster state change: [WatchedEvent state:SyncConnected type:NodeDataChanged path:/collections/collection1/state.json] for collection [collection1] has occurred - updating... (live nodes size: [2])
   [junit4]   2> 2149015 INFO  (coreZkRegister-8089-thread-1-processing-n:127.0.0.1:51905_ x:collection1 c:collection1) [n:127.0.0.1:51905_ c:collection1 s:shard1 r:core_node1 x:collection1] o.a.s.c.ZkController I am the leader, no recovery necessary
   [junit4]   2> 2149094 INFO  (TEST-PeerSyncReplicationTest.test-seed#[50577D0E7D517A41]) [    ] o.a.s.SolrTestCaseJ4 Writing core.properties file to /export/home/jenkins/workspace/Lucene-Solr-master-Solaris/solr/build/solr-core/test/J1/temp/solr.cloud.PeerSyncReplicationTest_50577D0E7D517A41-001/shard-2-001/cores/collection1
   [junit4]   2> 2149095 INFO  (TEST-PeerSyncReplicationTest.test-seed#[50577D0E7D517A41]) [    ] o.a.s.c.AbstractFullDistribZkTestBase create jetty 2 in directory /export/home/jenkins/workspace/Lucene-Solr-master-Solaris/solr/build/solr-core/test/J1/temp/solr.cloud.PeerSyncReplicationTest_50577D0E7D517A41-001/shard-2-001
   [junit4]   2> 2149097 INFO  (TEST-PeerSyncReplicationTest.test-seed#[50577D0E7D517A41]) [    ] o.e.j.s.Server jetty-9.3.14.v20161028
   [junit4]   2> 2149099 INFO  (TEST-PeerSyncReplicationTest.test-seed#[50577D0E7D517A41]) [    ] o.e.j.s.h.ContextHandler Started o.e.j.s.ServletContextHandler@66a7ff46{/,null,AVAILABLE}
   [junit4]   2> 2149099 INFO  (TEST-PeerSyncReplicationTest.test-seed#[50577D0E7D517A41]) [    ] o.e.j.s.AbstractConnector Started ServerConnector@139fb3bf{SSL,[ssl, http/1.1]}{127.0.0.1:?????}
   [junit4]   2> 2149099 INFO  (TEST-PeerSyncReplicationTest.test-seed#[50577D0E7D517A41]) [    ] o.e.j.s.Server Started @???????ms
   [junit4]   2> 2149099 INFO  (TEST-PeerSyncReplicationTest.test-seed#[50577D0E7D517A41]) [    ] o.a.s.c.s.e.JettySolrRunner Jetty properties: {solr.data.dir=/export/home/jenkins/workspace/Lucene-Solr-master-Solaris/solr/build/solr-core/test/J1/temp/solr.cloud.PeerSyncReplicationTest_50577D0E7D517A41-001/tempDir-001/jetty2, solrconfig=solrconfig.xml, hostContext=/, hostPort=52123, coreRootDirectory=/export/home/jenkins/workspace/Lucene-Solr-master-Solaris/solr/build/solr-core/test/J1/temp/solr.cloud.PeerSyncReplicationTest_50577D0E7D517A41-001/shard-2-001/cores}
   [junit4]   2> 2149100 ERROR (TEST-PeerSyncReplicationTest.test-seed#[50577D0E7D517A41]) [    ] o.a.s.s.StartupLoggingUtils Missing Java Option solr.log.dir. Logging may be missing or incomplete.
   [junit4]   2> 2149101 INFO  (TEST-PeerSyncReplicationTest.test-seed#[50577D0E7D517A41]) [    ] o.a.s.s.SolrDispatchFilter  ___      _       Welcome to Apache Solr? version 7.0.0
   [junit4]   2> 2149101 INFO  (TEST-PeerSyncReplicationTest.test-seed#[50577D0E7D517A41]) [    ] o.a.s.s.SolrDispatchFilter / __| ___| |_ _   Starting in cloud mode on port null
   [junit4]   2> 2149102 INFO  (TEST-PeerSyncReplicationTest.test-seed#[50577D0E7D517A41]) [    ] o.a.s.s.SolrDispatchFilter \__ \/ _ \ | '_|  Install dir: null
   [junit4]   2> 2149102 INFO  (TEST-PeerSyncReplicationTest.test-seed#[50577D0E7D517A41]) [    ] o.a.s.s.SolrDispatchFilter |___/\___/_|_|    Start time: 2017-01-03T22:45:27.950Z
   [junit4]   2> 2149105 INFO  (TEST-PeerSyncReplicationTest.test-seed#[50577D0E7D517A41]) [    ] o.a.s.s.SolrDispatchFilter Loading solr.xml from SolrHome (not found in ZooKeeper)
   [junit4]   2> 2149105 INFO  (TEST-PeerSyncReplicationTest.test-seed#[50577D0E7D517A41]) [    ] o.a.s.c.SolrXmlConfig Loading container configuration from /export/home/jenkins/workspace/Lucene-Solr-master-Solaris/solr/build/solr-core/test/J1/temp/solr.cloud.PeerSyncReplicationTest_50577D0E7D517A41-001/shard-2-001/solr.xml
   [junit4]   2> 2149111 INFO  (TEST-PeerSyncReplicationTest.test-seed#[50577D0E7D517A41]) [    ] o.a.s.c.ZkContainer Zookeeper client=127.0.0.1:50234/solr
   [junit4]   2> 2149121 INFO  (zkCallback-2761-thread-2-processing-n:127.0.0.1:51905_) [n:127.0.0.1:51905_    ] o.a.s.c.c.ZkStateReader A cluster state change: [WatchedEvent state:SyncConnected type:NodeDataChanged path:/collections/collection1/state.json] for collection [collection1] has occurred - updating... (live nodes size: [2])
   [junit4]   2> 2149128 INFO  (TEST-PeerSyncReplicationTest.test-seed#[50577D0E7D517A41]) [n:127.0.0.1:52123_    ] o.a.s.c.c.ZkStateReader Updated live nodes from ZooKeeper... (0) -> (2)
   [junit4]   2> 2149135 INFO  (TEST-PeerSyncReplicationTest.test-seed#[50577D0E7D517A41]) [n:127.0.0.1:52123_    ] o.a.s.c.ZkController Register node as live in ZooKeeper:/live_nodes/127.0.0.1:52123_
   [junit4]   2> 2149139 INFO  (zkCallback-2751-thread-1-processing-n:127.0.0.1:34188_) [n:127.0.0.1:34188_    ] o.a.s.c.c.ZkStateReader Updated live nodes from ZooKeeper... (2) -> (3)
   [junit4]   2> 2149139 INFO  (zkCallback-2755-thread-1) [    ] o.a.s.c.c.ZkStateReader Updated live nodes from ZooKeeper... (2) -> (3)
   [junit4]   2> 2149140 INFO  (zkCallback-2761-thread-2-processing-n:127.0.0.1:51905_) [n:127.0.0.1:51905_    ] o.a.s.c.c.ZkStateReader Updated live nodes from ZooKeeper... (2) -> (3)
   [junit4]   2> 2149143 INFO  (zkCallback-2767-thread-1-processing-n:127.0.0.1:52123_) [n:127.0.0.1:52123_    ] o.a.s.c.c.ZkStateReader Updated live nodes from ZooKeeper... (2) -> (3)
   [junit4]   2> 2149221 INFO  (TEST-PeerSyncReplicationTest.test-seed#[50577D0E7D517A41]) [n:127.0.0.1:52123_    ] o.a.s.c.CorePropertiesLocator Found 1 core definitions underneath /export/home/jenkins/workspace/Lucene-Solr-master-Solaris/solr/build/solr-core/test/J1/temp/solr.cloud.PeerSyncReplicationTest_50577D0E7D517A41-001/shard-2-001/cores
   [junit4]   2> 2149222 INFO  (TEST-PeerSyncReplicationTest.test-seed#[50577D0E7D517A41]) [n:127.0.0.1:52123_    ] o.a.s.c.CorePropertiesLocator Cores are: [collection1]
   [junit4]   2> 2149225 INFO  (OverseerStateUpdate-97221576251670533-127.0.0.1:34188_-n_0000000000) [n:127.0.0.1:34188_    ] o.a.s.c.o.ReplicaMutator Assigning new node to shard shard=shard1
   [junit4]   2> 2149330 INFO  (zkCallback-2761-thread-2-processing-n:127.0.0.1:51905_) [n:127.0.0.1:51905_    ] o.a.s.c.c.ZkStateReader A cluster state change: [WatchedEvent state:SyncConnected type:NodeDataChanged path:/collections/collection1/state.json] for collection [collection1] has occurred - updating... (live nodes size: [3])
   [junit4]   2> 2149330 INFO  (zkCallback-2767-thread-2-processing-n:127.0.0.1:52123_) [n:127.0.0.1:52123_    ] o.a.s.c.c.ZkStateReader A cluster state change: [WatchedEvent state:SyncConnected type:NodeDataChanged path:/collections/collection1/state.json] for collection [collection1] has occurred - updating... (live nodes size: [3])
   [junit4]   2> 2150257 WARN  (coreLoadExecutor-8105-thread-1-processing-n:127.0.0.1:52123_) [n:127.0.0.1:52123_ c:collection1   x:collection1] o.a.s.c.Config Beginning with Solr 5.5, <mergePolicy> is deprecated, use <mergePolicyFactory> instead.
   [junit4]   2> 2150258 INFO  (coreLoadExecutor-8105-thread-1-processing-n:127.0.0.1:52123_) [n:127.0.0.1:52123_ c:collection1   x:collection1] o.a.s.c.SolrConfig Using Lucene MatchVersion: 7.0.0
   [junit4]   2> 2150271 INFO  (coreLoadExecutor-8105-thread-1-processing-n:127.0.0.1:52123_) [n:127.0.0.1:52123_ c:collection1   x:collection1] o.a.s.s.IndexSchema [collection1] Schema name=test
   [junit4]   2> 2150374 WARN  (coreLoadExecutor-8105-thread-1-processing-n:127.0.0.1:52123_) [n:127.0.0.1:52123_ c:collection1   x:collection1] o.a.s.s.IndexSchema [collection1] default search field in schema is text. WARNING: Deprecated, please use 'df' on request instead.
   [junit4]   2> 2150376 INFO  (coreLoadExecutor-8105-thread-1-processing-n:127.0.0.1:52123_) [n:127.0.0.1:52123_ c:collection1   x:collection1] o.a.s.s.IndexSchema Loaded schema test/1.0 with uniqueid field id
   [junit4]   2> 2150396 INFO  (coreLoadExecutor-8105-thread-1-processing-n:127.0.0.1:52123_) [n:127.0.0.1:52123_ c:collection1   x:collection1] o.a.s.c.CoreContainer Creating SolrCore 'collection1' using configuration from collection collection1
   [junit4]   2> 2150396 INFO  (coreLoadExecutor-8105-thread-1-processing-n:127.0.0.1:52123_) [n:127.0.0.1:52123_ c:collection1   x:collection1] o.a.s.c.SolrCore [[collection1] ] Opening new SolrCore at [/export/home/jenkins/workspace/Lucene-Solr-master-Solaris/solr/build/solr-core/test/J1/temp/solr.cloud.PeerSyncReplicationTest_50577D0E7D517A41-001/shard-2-001/cores/collection1], dataDir=[/export/home/jenkins/workspace/Lucene-Solr-master-Solaris/solr/build/solr-core/test/J1/temp/solr.cloud.PeerSyncReplicationTest_50577D0E7D517A41-001/shard-2-001/cores/collection1/data/]
   [junit4]   2> 2150396 INFO  (coreLoadExecutor-8105-thread-1-processing-n:127.0.0.1:52123_) [n:127.0.0.1:52123_ c:collection1   x:collection1] o.a.s.c.JmxMonitoredMap JMX monitoring is enabled. Adding Solr mbeans to JMX Server: com.sun.jmx.mbeanserver.JmxMBeanServer@e329b15
   [junit4]   2> 2150398 INFO  (coreLoadExecutor-8105-thread-1-processing-n:127.0.0.1:52123_) [n:127.0.0.1:52123_ c:collection1   x:collection1] o.a.s.u.RandomMergePolicy RandomMergePolicy wrapping class org.apache.lucene.index.TieredMergePolicy: [TieredMergePolicy: maxMergeAtOnce=42, maxMergeAtOnceExplicit=14, maxMergedSegmentMB=51.2333984375, floorSegmentMB=1.17578125, forceMergeDeletesPctAllowed=27.54441213687038, segmentsPerTier=25.0, maxCFSSegmentSizeMB=8.796093022207999E12, noCFSRatio=0.0
   [junit4]   2> 2150404 WARN  (coreLoadExecutor-8105-thread-1-processing-n:127.0.0.1:52123_) [n:127.0.0.1:52123_ c:collection1   x:collection1] o.a.s.c.RequestHandlers INVALID paramSet a in requestHandler {type = requestHandler,name = /dump,class = DumpRequestHandler,attributes = {initParams=a, name=/dump, class=DumpRequestHandler},args = {defaults={a=A,b=B}}}
   [junit4]   2> 2150417 INFO  (coreLoadExecutor-8105-thread-1-processing-n:127.0.0.1:52123_) [n:127.0.0.1:52123_ c:collection1   x:collection1] o.a.s.u.UpdateHandler Using UpdateLog implementation: org.apache.solr.update.UpdateLog
   [junit4]   2> 2150417 INFO  (coreLoadExecutor-8105-thread-1-processing-n:127.0.0.1:52123_) [n:127.0.0.1:52123_ c:collection1   x:collection1] o.a.s.u.UpdateLog Initializing UpdateLog: dataDir= defaultSyncLevel=FLUSH numRecordsToKeep=1000 maxNumLogsToKeep=10 numVersionBuckets=65536
   [junit4]   2> 2150418 INFO  (coreLoadExecutor-8105-thread-1-processing-n:127.0.0.1:52123_) [n:127.0.0.1:52123_ c:collection1   x:collection1] o.a.s.u.CommitTracker Hard AutoCommit: disabled
   [junit4]   2> 2150418 INFO  (coreLoadExecutor-8105-thread-1-processing-n:127.0.0.1:52123_) [n:127.0.0.1:52123_ c:collection1   x:collection1] o.a.s.u.CommitTracker Soft AutoCommit: disabled
   [junit4]   2> 2150419 INFO  (coreLoadExecutor-8105-thread-1-processing-n:127.0.0.1:52123_) [n:127.0.0.1:52123_ c:collection1   x:collection1] o.a.s.u.RandomMergePolicy RandomMergePolicy wrapping class org.apache.lucene.index.MockRandomMergePolicy: org.apache.lucene.index.MockRandomMergePolicy@d5eaa2c
   [junit4]   2> 2150420 INFO  (coreLoadExecutor-8105-thread-1-processing-n:127.0.0.1:52123_) [n:127.0.0.1:52123_ c:collection1   x:collection1] o.a.s.s.SolrIndexSearcher Opening [Searcher@41af85e2[collection1] main]
   [junit4]   2> 2150422 INFO  (coreLoadExecutor-8105-thread-1-processing-n:127.0.0.1:52123_) [n:127.0.0.1:52123_ c:collection1   x:collection1] o.a.s.r.ManagedResourceStorage Configured ZooKeeperStorageIO with znodeBase: /configs/conf1
   [junit4]   2> 2150422 INFO  (coreLoadExecutor-8105-thread-1-processing-n:127.0.0.1:52123_) [n:127.0.0.1:52123_ c:collection1   x:collection1] o.a.s.r.ManagedResourceStorage Loaded null at path _rest_managed.json using ZooKeeperStorageIO:path=/configs/conf1
   [junit4]   2> 2150422 INFO  (coreLoadExecutor-8105-thread-1-processing-n:127.0.0.1:52123_) [n:127.0.0.1:52123_ c:collection1   x:collection1] o.a.s.h.ReplicationHandler Commits will be reserved for  10000
   [junit4]   2> 2150423 INFO  (searcherExecutor-8106-thread-1-processing-n:127.0.0.1:52123_ x:collection1 c:collection1) [n:127.0.0.1:52123_ c:collection1   x:collection1] o.a.s.c.SolrCore [collection1] Registered new searcher Searcher@41af85e2[collection1] main{ExitableDirectoryReader(UninvertingDirectoryReader())}
   [junit4]   2> 2150423 INFO  (coreLoadExecutor-8105-thread-1-processing-n:127.0.0.1:52123_) [n:127.0.0.1:52123_ c:collection1   x:collection1] o.a.s.u.UpdateLog Could not find max version in index or recent updates, using new clock 1555545225188868096
   [junit4]   2> 2150429 INFO  (coreZkRegister-8100-thread-1-processing-n:127.0.0.1:52123_ x:collection1 c:collection1) [n:127.0.0.1:52123_ c:collection1 s:shard1 r:core_node2 x:collection1] o.a.s.c.ZkController Core needs to recover:collection1
   [junit4]   2> 2150429 INFO  (updateExecutor-2764-thread-1-processing-n:127.0.0.1:52123_ x:collection1 s:shard1 c:collection1 r:core_node2) [n:127.0.0.1:52123_ c:collection1 s:shard1 r:core_node2 x:collection1] o.a.s.u.DefaultSolrCoreState Running recovery
   [junit4]   2> 2150430 INFO  (recoveryExecutor-2765-thread-1-processing-n:127.0.0.1:52123_ x:collection1 s:shard1 c:collection1 r:core_node2) [n:127.0.0.1:52123_ c:collection1 s:shard1 r:core_node2 x:collection1] o.a.s.c.RecoveryStrategy Starting recovery process. recoveringAfterStartup=true
   [junit4]   2> 2150430 INFO  (recoveryExecutor-2765-thread-1-processing-n:127.0.0.1:52123_ x:collection1 s:shard1 c:collection1 r:core_node2) [n:127.0.0.1:52123_ c:collection1 s:shard1 r:core_node2 x:collection1] o.a.s.c.RecoveryStrategy ###### startupVersions=[[]]
   [junit4]   2> 2150430 INFO  (recoveryExecutor-2765-thread-1-processing-n:127.0.0.1:52123_ x:collection1 s:shard1 c:collection1 r:core_node2) [n:127.0.0.1:52123_ c:collection1 s:shard1 r:core_node2 x:collection1] o.a.s.c.RecoveryStrategy Begin buffering updates. core=[collection1]
   [junit4]   2> 2150430 INFO  (recoveryExecutor-2765-thread-1-processing-n:127.0.0.1:52123_ x:collection1 s:shard1 c:collection1 r:core_node2) [n:127.0.0.1:52123_ c:collection1 s:shard1 r:core_node2 x:collection1] o.a.s.u.UpdateLog Starting to buffer updates. FSUpdateLog{state=ACTIVE, tlog=null}
   [junit4]   2> 2150430 INFO  (recoveryExecutor-2765-thread-1-processing-n:127.0.0.1:52123_ x:collection1 s:shard1 c:collection1 r:core_node2) [n:127.0.0.1:52123_ c:collection1 s:shard1 r:core_node2 x:collection1] o.a.s.c.RecoveryStrategy Publishing state of core [collection1] as recovering, leader is [https://127.0.0.1:51905/collection1/] and I am [https://127.0.0.1:52123/collection1/]
   [junit4]   2> 2150434 INFO  (recoveryExecutor-2765-thread-1-processing-n:127.0.0.1:52123_ x:collection1 s:shard1 c:collection1 r:core_node2) [n:127.0.0.1:52123_ c:collection1 s:shard1 r:core_node2 x:collection1] o.a.s.c.RecoveryStrategy Sending prep recovery command to [https://127.0.0.1:51905]; [WaitForState: action=PREPRECOVERY&core=collection1&nodeName=127.0.0.1:52123_&coreNodeName=core_node2&state=recovering&checkLive=true&onlyIfLeader=true&onlyIfLeaderActive=true]
   [junit4]   2> 2150459 INFO  (qtp2068460479-17675) [n:127.0.0.1:51905_    ] o.a.s.h.a.PrepRecoveryOp Going to wait for coreNodeName: core_node2, state: recovering, checkLive: true, onlyIfLeader: true, onlyIfLeaderActive: true
   [junit4]   2> 2150460 INFO  (qtp2068460479-17675) [n:127.0.0.1:51905_    ] o.a.s.h.a.PrepRecoveryOp Will wait a max of 183 seconds to see collection1 (shard1 of collection1) have state: recovering
   [junit4]   2> 2150460 INFO  (qtp2068460479-17675) [n:127.0.0.1:51905_    ] o.a.s.h.a.PrepRecoveryOp In WaitForState(recovering): collection=collection1, shard=shard1, thisCore=collection1, leaderDoesNotNeedRecovery=false, isLeader? true, live=true, checkLive=true, currentState=down, localState=active, nodeName=127.0.0.1:52123_, coreNodeName=core_node2, onlyIfActiveCheckResult=false, nodeProps: core_node2:{"core":"collection1","base_url":"https://127.0.0.1:52123","node_name":"127.0.0.1:52123_","state":"down"}
   [junit4]   2> 2150538 INFO  (zkCallback-2767-thread-2-processing-n:127.0.0.1:52123_) [n:127.0.0.1:52123_    ] o.a.s.c.c.ZkStateReader A cluster state change: [WatchedEvent state:SyncConnected type:NodeDataChanged path:/collections/collection1/state.json] for collection [collection1] has occurred - updating... (live nodes size: [3])
   [junit4]   2> 2150538 INFO  (zkCallback-2761-thread-2-processing-n:127.0.0.1:51905_) [n:127.0.0.1:51905_    ] o.a.s.c.c.ZkStateReader A cluster state change: [WatchedEvent state:SyncConnected type:NodeDataChanged path:/collections/collection1/state.json] for collection [collection1] has occurred - updating... (live nodes size: [3])
   [junit4]   2> 2150726 INFO  (TEST-PeerSyncReplicationTest.test-seed#[50577D0E7D517A41]) [    ] o.a.s.SolrTestCaseJ4 Writing core.properties file to /export/home/jenkins/workspace/Lucene-Solr-master-Solaris/solr/build/solr-core/test/J1/temp/solr.cloud.PeerSyncReplicationTest_50577D0E7D517A41-001/shard-3-001/cores/collection1
   [junit4]   2> 2150727 INFO  (TEST-PeerSyncReplicationTest.test-seed#[50577D0E7D517A41]) [    ] o.a.s.c.AbstractFullDistribZkTestBase create jetty 3 in directory /export/home/jenkins/workspace/Lucene-Solr-master-Solaris/solr/build/solr-core/test/J1/temp/solr.cloud.PeerSyncReplicationTest_50577D0E7D517A41-001/shard-3-001
   [junit4]   2> 2150729 INFO  (TEST-PeerSyncReplicationTest.test-seed#[50577D0E7D517A41]) [    ] o.e.j.s.Server jetty-9.3.14.v20161028
   [junit4]   2> 2150731 INFO  (TEST-PeerSyncReplicationTest.test-seed#[50577D0E7D517A41]) [    ] o.e.j.s.h.ContextHandler Started o.e.j.s.ServletContextHandler@62b79ba{/,null,AVAILABLE}
   [junit4]   2> 2150731 INFO  (TEST-PeerSyncReplicationTest.test-seed#[50577D0E7D517A41]) [    ] o.e.j.s.AbstractConnector Started ServerConnector@3e4d5721{SSL,[ssl, http/1.1]}{127.0.0.1:?????}
   [junit4]   2> 2150731 INFO  (TEST-PeerSyncReplicationTest.test-seed#[50577D0E7D517A41]) [    ] o.e.j.s.Server Started @???????ms
   [junit4]   2> 2150731 INFO  (TEST-PeerSyncReplicationTest.test-seed#[50577D0E7D517A41]) [    ] o.a.s.c.s.e.JettySolrRunner Jetty properties: {solr.data.dir=/export/home/jenkins/workspace/Lucene-Solr-master-Solaris/solr/build/solr-core/test/J1/temp/solr.cloud.PeerSyncReplicationTest_50577D0E7D517A41-001/tempDir-001/jetty3, solrconfig=solrconfig.xml, hostContext=/, hostPort=64467, coreRootDirectory=/export/home/jenkins/workspace/Lucene-Solr-master-Solaris/solr/build/solr-core/test/J1/../../../../../../../../../../export/home/jenkins/workspace/Lucene-Solr-master-Solaris/solr/build/solr-core/test/J1/temp/solr.cloud.PeerSyncReplicationTest_50577D0E7D517A41-001/shard-3-001/cores}
   [junit4]   2> 2150731 ERROR (TEST-PeerSyncReplicationTest.test-seed#[50577D0E7D517A41]) [    ] o.a.s.s.StartupLoggingUtils Missing Java Option solr.log.dir. Logging may be missing or incomplete.
   [junit4]   2> 2150732 INFO  (TEST-PeerSyncReplicationTest.test-seed#[50577D0E7D517A41]) [    ] o.a.s.s.SolrDispatchFilter  ___      _       Welcome to Apache Solr? version 7.0.0
   [junit4]   2> 2150732 INFO  (TEST-PeerSyncReplicationTest.test-seed#[50577D0E7D517A41]) [    ] o.a.s.s.SolrDispatchFilter / __| ___| |_ _   Starting in cloud mode on port null
   [junit4]   2> 2150732 INFO  (TEST-PeerSyncReplicationTest.test-seed#[50577D0E7D517A41]) [    ] o.a.s.s.SolrDispatchFilter \__ \/ _ \ | '_|  Install dir: null
   [junit4]   2> 2150733 INFO  (TEST-PeerSyncReplicationTest.test-seed#[50577D0E7D517A41]) [    ] o.a.s.s.SolrDispatchFilter |___/\___/_|_|    Start time: 2017-01-03T22:45:29.580Z
   [junit4]   2> 2150737 INFO  (TEST-PeerSyncReplicationTest.test-seed#[50577D0E7D517A41]) [    ] o.a.s.s.SolrDispatchFilter Loading solr.xml from SolrHome (not found in ZooKeeper)
   [junit4]   2> 2150737 INFO  (TEST-PeerSyncReplicationTest.test-seed#[50577D0E7D517A41]) [    ] o.a.s.c.SolrXmlConfig Loading container configuration from /export/home/jenkins/workspace/Lucene-Solr-master-Solaris/solr/build/solr-core/test/J1/temp/solr.cloud.PeerSyncReplicationTest_50577D0E7D517A41-001/shard-3-001/solr.xml
   [junit4]   2> 2150743 INFO  (TEST-PeerSyncReplicationTest.test-seed#[50577D0E7D517A41]) [    ] o.a.s.c.ZkContainer Zookeeper client=127.0.0.1:50234/solr
   [junit4]   2> 2150758 INFO  (TEST-PeerSyncReplicationTest.test-seed#[50577D0E7D517A41]) [n:127.0.0.1:64467_    ] o.a.s.c.c.ZkStateReader Updated live nodes from ZooKeeper... (0) -> (3)
   [junit4]   2> 2150766 INFO  (TEST-PeerSyncReplicationTest.test-seed#[50577D0E7D517A41]) [n:127.0.0.1:64467_    ] o.a.s.c.ZkController Register node as live in ZooKeeper:/live_nodes/127.0.0.1:64467_
   [junit4]   2> 2150769 INFO  (zkCallback-2751-thread-2-processing-n:127.0.0.1:34188_) [n:127.0.0.1:34188_    ] o.a.s.c.c.ZkStateReader Updated live nodes from ZooKeeper... (3) -> (4)
   [junit4]   2> 2150770 INFO  (zkCallback-2755-thread-2) [    ] o.a.s.c.c.ZkStateReader Updated live nodes from ZooKeeper... (3) -> (4)
   [junit4]   2> 2150770 INFO  (zkCallback-2767-thread-2-processing-n:127.0.0.1:52123_) [n:127.0.0.1:52123_    ] o.a.s.c.c.ZkStateReader Updated live nodes from ZooKeeper... (3) -> (4)
   [junit4]   2> 2150771 INFO  (zkCallback-2761-thread-2-processing-n:127.0.0.1:51905_) [n:127.0.0.1:51905_    ] o.a.s.c.c.ZkStateReader Updated live nodes from ZooKeeper... (3) -> (4)
   [junit4]   2> 2150772 INFO  (zkCallback-2774-thread-1-processing-n:127.0.0.1:64467_) [n:127.0.0.1:64467_    ] o.a.s.c.c.ZkStateReader Updated live nodes from ZooKeeper... (3) -> (4)
   [junit4]   2> 2150854 INFO  (TEST-PeerSyncReplicationTest.test-seed#[50577D0E7D517A41]) [n:127.0.0.1:64467_    ] o.a.s.c.CorePropertiesLocator Found 1 core definitions underneath /export/home/jenkins/workspace/Lucene-Solr-master-Solaris/solr/build/solr-core/test/J1/../../../../../../../../../../export/home/jenkins/workspace/Lucene-Solr-master-Solaris/solr/build/solr-core/test/J1/temp/solr.cloud.PeerSyncReplicationTest_50577D0E7D517A41-001/shard-3-001/cores
   [junit4]   2> 2150854 INFO  (TEST-PeerSyncReplicationTest.test-seed#[50577D0E7D517A41]) [n:127.0.0.1:64467_    ] o.a.s.c.CorePropertiesLocator Cores are: [collection1]
   [junit4]   2> 2150858 INFO  (OverseerStateUpdate-97221576251670533-127.0.0.1:34188_-n_0000000000) [n:127.0.0.1:34188_    ] o.a.s.c.o.ReplicaMutator Assigning new node to shard shard=shard1
   [junit4]   2> 2150962 INFO  (zkCallback-2761-thread-1-processing-n:127.0.0.1:51905_) [n:127.0.0.1:51905_    ] o.a.s.c.c.ZkStateReader A cluster state change: [WatchedEvent state:SyncConnected type:NodeDataChanged path:/collections/collection1/state.json] for collection [collection1] has occurred - updating... (live nodes size: [4])
   [junit4]   2> 2150962 INFO  (zkCallback-2767-thread-2-processing-n:127.0.0.1:52123_) [n:127.0.0.1:52123_    ] o.a.s.c.c.ZkStateReader A cluster state change: [WatchedEvent state:SyncConnected type:NodeDataChanged path:/collections/collection1/state.json] for collection [collection1] has occurred - updating... (live nodes size: [4])
   [junit4]   2> 2150962 INFO  (zkCallback-2774-thread-1-processing-n:127.0.0.1:64467_) [n:127.0.0.1:64467_    ] o.a.s.c.c.ZkStateReader A cluster state change: [WatchedEvent state:SyncConnected type:NodeDataChanged path:/collections/collection1/state.json] for collection [collection1] has occurred - updating... (live nodes size: [4])
   [junit4]   2> 2151477 INFO  (qtp2068460479-17675) [n:127.0.0.1:51905_    ] o.a.s.h.a.PrepRecoveryOp In WaitForState(recovering): collection=collection1, shard=shard1, thisCore=collection1, leaderDoesNotNeedRecovery=false, isLeader? true, live=true, checkLive=true, currentState=recovering, localState=active, nodeName=127.0.0.1:52123_, coreNodeName=core_node2, onlyIfActiveCheckResult=false, nodeProps: core_node2:{"core":"collection1","base_url":"https://127.0.0.1:52123","node_name":"127.0.0.1:52123_","state":"recovering"}
   [junit4]   2> 2151478 INFO  (qtp2068460479-17675) [n:127.0.0.1:51905_    ] o.a.s.h.a.PrepRecoveryOp Waited coreNodeName: core_node2, state: recovering, checkLive: true, onlyIfLeader: true for: 1 seconds.
   [junit4]   2> 2151478 INFO  (qtp2068460479-17675) [n:127.0.0.1:51905_    ] o.a.s.s.HttpSolrCall [admin] webapp=null path=/admin/cores params={nodeName=127.0.0.1:52123_&onlyIfLeaderActive=true&core=collection1&coreNodeName=core_node2&action=PREPRECOVERY&checkLive=true&state=recovering&onlyIfLeader=true&wt=javabin&version=2} status=0 QTime=1019
   [junit4]   2> 2151874 WARN  (coreLoadExecutor-8116-thread-1-processing-n:127.0.0.1:64467_) [n:127.0.0.1:64467_ c:collection1   x:collection1] o.a.s.c.Config Beginning with Solr 5.5, <mergePolicy> is deprecated, use <mergePolicyFactory> instead.
   [junit4]   2> 2151875 INFO  (coreLoadExecutor-8116-thread-1-processing-n:127.0.0.1:64467_) [n:127.0.0.1:64467_ c:collection1   x:collection1] o.a.s.c.SolrConfig Using Lucene MatchVersion: 7.0.0
   [junit4]   2> 2151888 INFO  (coreLoadExecutor-8116-thread-1-processing-n:127.0.0.1:64467_) [n:127.0.0.1:64467_ c:collection1   x:collection1] o.a.s.s.IndexSchema [collection1] Schema name=test
   [junit4]   2> 2151980 WARN  (coreLoadExecutor-8116-thread-1-processing-n:127.0.0.1:64467_) [n:127.0.0.1:64467_ c:collection1   x:collection1] o.a.s.s.IndexSchema [collection1] default search field in schema is text. WARNING: Deprecated, please use 'df' on request instead.
   [junit4]   2> 2151983 INFO  (coreLoadExecutor-8116-thread-1-processing-n:127.0.0.1:64467_) [n:127.0.0.1:64467_ c:collection1   x:collection1] o.a.s.s.IndexSchema Loaded schema test/1.0 with uniqueid field id
   [junit4]   2> 2151999 INFO  (coreLoadExecutor-8116-thread-1-processing-n:127.0.0.1:64467_) [n:127.0.0.1:64467_ c:collection1   x:collection1] o.a.s.c.CoreContainer Creating SolrCore 'collection1' using configuration from collection collection1
   [junit4]   2> 2151999 INFO  (coreLoadExecutor-8116-thread-1-processing-n:127.0.0.1:64467_) [n:127.0.0.1:64467_ c:collection1   x:collection1] o.a.s.c.SolrCore [[collection1] ] Opening new SolrCore at [/export/home/jenkins/workspace/Lucene-Solr-master-Solaris/solr/build/solr-core/test/J1/temp/solr.cloud.PeerSyncReplicationTest_50577D0E7D517A41-001/shard-3-001/cores/collection1], dataDir=[/export/home/jenkins/workspace/Lucene-Solr-master-Solaris/solr/build/solr-core/test/J1/../../../../../../../../../../export/home/jenkins/workspace/Lucene-Solr-master-Solaris/solr/build/solr-core/test/J1/temp/solr.cloud.PeerSyncReplicationTest_50577D0E7D517A41-001/shard-3-001/cores/collection1/data/]
   [junit4]   2> 2152000 INFO  (coreLoadExecutor-8116-thread-1-processing-n:127.0.0.1:64467_) [n:127.0.0.1:64467_ c:collection1   x:collection1] o.a.s.c.JmxMonitoredMap JMX monitoring is enabled. Adding Solr mbeans to JMX Server: com.sun.jmx.mbeanserver.JmxMBeanServer@e329b15
   [junit4]   2> 2152002 INFO  (coreLoadExecutor-8116-thread-1-processing-n:127.0.0.1:64467_) [n:127.0.0.1:64467_ c:collection1   x:collection1] o.a.s.u.RandomMergePolicy RandomMergePolicy wrapping class org.apache.lucene.index.TieredMergePolicy: [TieredMergePolicy: maxMergeAtOnce=42, maxMergeAtOnceExplicit=14, maxMergedSegmentMB=51.2333984375, floorSegmentMB=1.17578125, forceMergeDeletesPctAllowed=27.54441213687038, segmentsPerTier=25.0, maxCFSSegmentSizeMB=8.796093022207999E12, noCFSRatio=0.0
   [junit4]   2> 2152008 WARN  (coreLoadExecutor-8116-thread-1-processing-n:127.0.0.1:64467_) [n:127.0.0.1:64467_ c:collection1   x:collection1] o.a.s.c.RequestHandlers INVALID paramSet a in requestHandler {type = requestHandler,name = /dump,class = DumpRequestHandler,attributes = {initParams=a, name=/dump, class=DumpRequestHandler},args = {defaults={a=A,b=B}}}
   [junit4]   2> 2152019 INFO  (coreLoadExecutor-8116-thread-1-processing-n:127.0.0.1:64467_) [n:127.0.0.1:64467_ c:collection1   x:collection1] o.a.s.u.UpdateHandler Using UpdateLog implementation: org.apache.solr.update.UpdateLog
   [junit4]   2> 2152019 INFO  (coreLoadExecutor-8116-thread-1-processing-n:127.0.0.1:64467_) [n:127.0.0.1:64467_ c:collection1   x:collection1] o.a.s.u.UpdateLog Initializing UpdateLog: dataDir= defaultSyncLevel=FLUSH numRecordsToKeep=1000 maxNumLogsToKeep=10 numVersionBuckets=65536
   [junit4]   2> 2152019 INFO  (coreLoadExecutor-8116-thread-1-processing-n:127.0.0.1:64467_) [n:127.0.0.1:64467_ c:collection1   x:collection1] o.a.s.u.CommitTracker Hard AutoCommit: disabled
   [junit4]   2> 2152019 INFO  (coreLoadExecutor-8116-thread-1-processing-n:127.0.0.1:64467_) [n:127.0.0.1:64467_ c:collection1   x:collection1] o.a.s.u.CommitTracker Soft AutoCommit: disabled
   [junit4]   2> 2152021 INFO  (coreLoadExecutor-8116-thread-1-processing-n:127.0.0.1:64467_) [n:127.0.0.1:64467_ c:collection1   x:collection1] o.a.s.u.RandomMergePolicy RandomMergePolicy wrapping class org.apache.lucene.index.MockRandomMergePolicy: org.apache.lucene.index.MockRandomMergePolicy@19b76036
   [junit4]   2> 2152022 INFO  (coreLoadExecutor-8116-thread-1-processing-n:127.0.0.1:64467_) [n:127.0.0.1:64467_ c:collection1   x:collection1] o.a.s.s.SolrIndexSearcher Opening [Searcher@8b08f44[collection1] main]
   [junit4]   2> 2152024 INFO  (coreLoadExecutor-8116-thread-1-processing-n:127.0.0.1:64467_) [n:127.0.0.1:64467_ c:collection1   x:collection1] o.a.s.r.ManagedResourceStorage Configured ZooKeeperStorageIO with znodeBase: /configs/conf1
   [junit4]   2> 2152024 INFO  (coreLoadExecutor-8116-thread-1-processing-n:127.0.0.1:64467_) [n:127.0.0.1:64467_ c:collection1   x:collection1] o.a.s.r.ManagedResourceStorage Loaded null at path _rest_managed.json using ZooKeeperStorageIO:path=/configs/conf1
   [junit4]   2> 2152024 INFO  (coreLoadExecutor-8116-thread-1-processing-n:127.0.0.1:64467_) [n:127.0.0.1:64467_ c:collection1   x:collection1] o.a.s.h.ReplicationHandler Commits will be reserved for  10000
   [junit4]   2> 2152025 INFO  (searcherExecutor-8117-thread-1-processing-n:127.0.0.1:64467_ x:collection1 c:collection1) [n:127.0.0.1:64467_ c:collection1   x:collection1] o.a.s.c.SolrCore [collection1] Registered new searcher Searcher@8b08f44[collection1] main{ExitableDirectoryReader(UninvertingDirectoryReader())}
   [junit4]   2> 2152025 INFO  (coreLoadExecutor-8116-thread-1-processing-n:127.0.0.1:64467_) [n:127.0.0.1:64467_ c:collection1   x:collection1] o.a.s.u.UpdateLog Could not find max version in index or recent updates, using new clock 1555545226868686848
   [junit4]   2> 2152031 INFO  (coreZkRegister-8111-thread-1-processing-n:127.0.0.1:64467_ x:collection1 c:collection1) [n:127.0.0.1:64467_ c:collection1 s:shard1 r:core_node3 x:collection1] o.a.s.c.ZkController Core needs to recover:collection1
   [junit4]   2> 2152031 INFO  (updateExecutor-2771-thread-1-processing-n:127.0.0.1:64467_ x:collection1 s:shard1 c:collection1 r:core_node3) [n:127.0.0.1:64467_ c:collection1 s:shard1 r:core_node3 x:collection1] o.a.s.u.DefaultSolrCoreState Running recovery
   [junit4]   2> 2152032 INFO  (recoveryExecutor-2772-thread-1-processing-n:127.0.0.1:64467_ x:collection1 s:shard1 c:collection1 r:core_node3) [n:127.0.0.1:64467_ c:collection1 s:shard1 r:core_node3 x:collection1] o.a.s.c.RecoveryStrategy Starting recovery process. recoveringAfterStartup=true
   [junit4]   2> 2152033 INFO  (recoveryExecutor-2772-thread-1-processing-n:127.0.0.1:64467_ x:collection1 s:shard1 c:collection1 r:core_node3) [n:127.0.0.1:64467_ c:collection1 s:shard1 r:core_node3 x:collection1] o.a.s.c.RecoveryStrategy ###### startupVersions=[[]]
   [junit4]   2> 2152033 INFO  (recoveryExecutor-2772-thread-1-processing-n:127.0.0.1:64467_ x:collection1 s:shard1 c:collection1 r:core_node3) [n:127.0.0.1:64467_ c:collection1 s:shard1 r:core_node3 x:collection1] o.a.s.c.RecoveryStrategy Begin buffering updates. core=[collection1]
   [junit4]   2> 2152033 INFO  (recoveryExecutor-2772-thread-1-processing-n:127.0.0.1:64467_ x:collection1 s:shard1 c:collection1 r:core_node3) [n:127.0.0.1:64467_ c:collection1 s:shard1 r:core_node3 x:collection1] o.a.s.u.UpdateLog Starting to buffer updates. FSUpdateLog{state=ACTIVE, tlog=null}
   [junit4]   2> 2152033 INFO  (recoveryExecutor-2772-thread-1-processing-n:127.0.0.1:64467_ x:collection1 s:shard1 c:collection1 r:core_node3) [n:127.0.0.1:64467_ c:collection1 s:shard1 r:core_node3 x:collection1] o.a.s.c.RecoveryStrategy Publishing state of core [collection1] as recovering, leader is [https://127.0.0.1:51905/collection1/] and I am [https://127.0.0.1:64467/collection1/]
   [junit4]   2> 2152037 INFO  (recoveryExecutor-2772-thread-1-processing-n:127.0.0.1:64467_ x:collection1 s:shard1 c:collection1 r:core_node3) [n:127.0.0.1:64467_ c:collection1 s:shard1 r:core_node3 x:collection1] o.a.s.c.RecoveryStrategy Sending prep recovery command to [https://127.0.0.1:51905]; [WaitForState: action=PREPRECOVERY&core=collection1&nodeName=127.0.0.1:64467_&coreNodeName=core_node3&state=recovering&checkLive=true&onlyIfLeader=true&onlyIfLeaderActive=true]
   [junit4]   2> 2152042 INFO  (qtp2068460479-17673) [n:127.0.0.1:51905_    ] o.a.s.h.a.PrepRecoveryOp Going to wait for coreNodeName: core_node3, state: recovering, checkLive: true, onlyIfLeader: true, onlyIfLeaderActive: true
   [junit4]   2> 2152043 INFO  (qtp2068460479-17673) [n:127.0.0.1:51905_    ] o.a.s.h.a.PrepRecoveryOp Will wait a max of 183 seconds to see collection1 (shard1 of collection1) have state: recovering
   [junit4]   2> 2152043 INFO  (qtp2068460479-17673) [n:127.0.0.1:51905_    ] o.a.s.h.a.PrepRecoveryOp In WaitForState(recovering): collection=collection1, shard=shard1, thisCore=collection1, leaderDoesNotNeedRecovery=false, isLeader? true, live=true, checkLive=true, currentState=down, localState=active, nodeName=127.0.0.1:64467_, coreNodeName=core_node3, onlyIfActiveCheckResult=false, nodeProps: core_node3:{"core":"collection1","base_url":"https://127.0.0.1:64467","node_name":"127.0.0.1:64467_","state":"down"}
   [junit4]   2> 2152144 INFO  (zkCallback-2761-thread-1-processing-n:127.0.0.1:51905_) [n:127.0.0.1:51905_    ] o.a.s.c.c.ZkStateReader A cluster state change: [WatchedEvent state:SyncConnected type:NodeDataChanged path:/collections/collection1/state.json] for collection [collection1] has occurred - updating... (live nodes size: [4])
   [junit4]   2> 2152144 INFO  (zkCallback-2767-thread-2-processing-n:127.0.0.1:52123_) [n:127.0.0.1:52123_    ] o.a.s.c.c.ZkStateReader A cluster state change: [WatchedEvent state:SyncConnected type:NodeDataChanged path:/collections/collection1/state.json] for collection [collection1] has occurred - updating... (live nodes size: [4])
   [junit4]   2> 2152144 INFO  (zkCallback-2774-thread-1-processing-n:127.0.0.1:64467_) [n:127.0.0.1:64467_    ] o.a.s.c.c.ZkStateReader A cluster state change: [WatchedEvent state:SyncConnected type:NodeDataChanged path:/collections/collection1/state.json] for collection [collection1] has occurred - updating... (live nodes size: [4])
   [junit4]   2> 2152152 INFO  (TEST-PeerSyncReplicationTest.test-seed#[50577D0E7D517A41]) [    ] o.a.s.SolrTestCaseJ4 ###Starting test
   [junit4]   2> 2152152 INFO  (TEST-PeerSyncReplicationTest.test-seed#[50577D0E7D517A41]) [    ] o.a.s.c.AbstractFullDistribZkTestBase Wait for recoveries to finish - wait 30 for each attempt
   [junit4]   2> 2152152 INFO  (TEST-PeerSyncReplicationTest.test-seed#[50577D0E7D517A41]) [    ] o.a.s.c.AbstractDistribZkTestBase Wait for recoveries to finish - collection: collection1 failOnTimeout:true timeout (sec):30
   [junit4]   2> 2153044 INFO  (qtp2068460479-17673) [n:127.0.0.1:51905_    ] o.a.s.h.a.PrepRecoveryOp In WaitForState(recovering): collection=collection1, shard=shard1, thisCore=collection1, leaderDoesNotNeedRecovery=false, isLeader? true, live=true, checkLive=true, currentState=recovering, localState=active, nodeName=127.0.0.1:64467_, coreNodeName=core_node3, onlyIfActiveCheckResult=false, nodeProps: core_node3:{"core":"collection1","base_url":"https://127.0.0.1:64467","node_name":"127.0.0.1:64467_","state":"recovering"}
   [junit4]   2> 2153044 INFO  (qtp2068460479-17673) [n:127.0.0.1:51905_    ] o.a.s.h.a.PrepRecoveryOp Waited coreNodeName: core_node3, state: recovering, checkLive: true, onlyIfLeader: true for: 1 seconds.
   [junit4]   2> 2153044 INFO  (qtp2068460479-17673) [n:127.0.0.1:51905_    ] o.a.s.s.HttpSolrCall [admin] webapp=null path=/admin/cores params={nodeName=127.0.0.1:64467_&onlyIfLeaderActive=true&core=collection1&coreNodeName=core_node3&action=PREPRECOVERY&checkLive=true&state=recovering&onlyIfLeader=true&wt=javabin&version=2} status=0 QTime=1002
   [junit4]   2> 2158479 INFO  (recoveryExecutor-2765-thread-1-processing-n:127.0.0.1:52123_ x:collection1 s:shard1 c:collection1 r:core_node2) [n:127.0.0.1:52123_ c:collection1 s:shard1 r:core_node2 x:collection1] o.a.s.c.RecoveryStrategy Attempting to PeerSync from [https://127.0.0.1:51905/collection1/] - recoveringAfterStartup=[true]
   [junit4]   2> 2158479 INFO  (recoveryExecutor-2765-thread-1-processing-n:127.0.0.1:52123_ x:collection1 s:shard1 c:collection1 r:core_node2) [n:127.0.0.1:52123_ c:collection1 s:shard1 r:core_node2 x:collection1] o.a.s.u.PeerSync PeerSync: core=collection1 url=https://127.0.0.1:52123 START replicas=[https://127.0.0.1:51905/collection1/] nUpdates=1000
   [junit4]   2> 2158483 INFO  (qtp2068460479-17672) [n:127.0.0.1:51905_ c:collection1 s:shard1 r:core_node1 x:collection1] o.a.s.u.IndexFingerprint IndexFingerprint millis:0.0 result:{maxVersionSpecified=9223372036854775807, maxVersionEncountered=0, maxInHash=0, versionsHash=0, numVersions=0, numDocs=0, maxDoc=0}
   [junit4]   2> 2158483 INFO  (qtp2068460479-17672) [n:127.0.0.1:51905_ c:collection1 s:shard1 r:core_node1 x:collection1] o.a.s.c.S.Request [collection1]  webapp= path=/get params={distrib=false&qt=/get&getFingerprint=9223372036854775807&wt=javabin&version=2} status=0 QTime=0
   [junit4]   2> 2158484 INFO  (recoveryExecutor-2765-thread-1-processing-n:127.0.0.1:52123_ x:collection1 s:shard1 c:collection1 r:core_node2) [n:127.0.0.1:52123_ c:collection1 s:shard1 r:core_node2 x:collection1] o.a.s.u.IndexFingerprint IndexFingerprint millis:0.0 result:{maxVersionSpecified=9223372036854775807, maxVersionEncountered=0, maxInHash=0, versionsHash=0, numVersions=0, numDocs=0, maxDoc=0}
   [junit4]   2> 2158484 INFO  (recoveryExecutor-2765-thread-1-processing-n:127.0.0.1:52123_ x:collection1 s:shard1 c:collection1 r:core_node2) [n:127.0.0.1:52123_ c:collection1 s:shard1 r:core_node2 x:collection1] o.a.s.u.PeerSync We are already in sync. No need to do a PeerSync 
   [junit4]   2> 2158484 INFO  (recoveryExecutor-2765-thread-1-processing-n:127.0.0.1:52123_ x:collection1 s:shard1 c:collection1 r:core_node2) [n:127.0.0.1:52123_ c:collection1 s:shard1 r:core_node2 x:collection1] o.a.s.u.DirectUpdateHandler2 start commit{,optimize=false,openSearcher=true,waitSearcher=true,expungeDeletes=false,softCommit=false,prepareCommit=false}
   [junit4]   2> 2158484 INFO  (recoveryExecutor-2765-thread-1-processing-n:127.0.0.1:52123_ x:collection1 s:shard1 c:collection1 r:core_node2) [n:127.0.0.1:52123_ c:collection1 s:shard1 r:core_node2 x:collection1] o.a.s.u.DirectUpdateHandler2 No uncommitted changes. Skipping IW.commit.
   [junit4]   2> 2158484 INFO  (recoveryExecutor-2765-thread-1-processing-n:127.0.0.1:52123_ x:collection1 s:shard1 c:collection1 r:core_node2) [n:127.0.0.1:52123_ c:collection1 s:shard1 r:core_node2 x:collection1] o.a.s.u.DirectUpdateHandler2 end_commit_flush
   [junit4]   2> 2158484 INFO  (recoveryExecutor-2765-thread-1-processing-n:127.0.0.1:52123_ x:collection1 s:shard1 c:collection1 r:core_node2) [n:127.0.0.1:52123_ c:collection1 s:shard1 r:core_node2 x:collection1] o.a.s.c.RecoveryStrategy PeerSync stage of recovery was successful.
   [junit4]   2> 2158484 INFO  (recoveryExecutor-2765-thread-1-processing-n:127.0.0.1:52123_ x:collection1 s:shard1 c:collection1 r:core_node2) [n:127.0.0.1:52123_ c:collection1 s:shard1 r:core_node2 x:collection1] o.a.s.c.RecoveryStrategy Replaying updates buffered during PeerSync.
   [junit4]   2> 2158484 INFO  (recoveryExecutor-2765-thread-1-processing-n:127.0.0.1:52123_ x:collection1 s:shard1 c:collection1 r:core_node2) [n:127.0.0.1:52123_ c:collection1 s:shard1 r:core_node2 x:collection1] o.a.s.c.RecoveryStrategy No replay needed.
   [junit4]   2> 2158484 INFO  (recoveryExecutor-2765-thread-1-processing-n:127.0.0.1:52123_ x:collection1 s:shard1 c:collection1 r:core_node2) [n:127.0.0.1:52123_ c:collection1 s:shard1 r:core_node2 x:collection1] o.a.s.c.RecoveryStrategy Registering as Active after recovery.
   [junit4]   2> 2158489 INFO  (zkCallback-2767-thread-2-processing-n:127.0.0.1:52123_) [n:127.0.0.1:52123_    ] o.a.s.c.c.ZkStateReader A cluster state change: [WatchedEvent state:SyncConnected type:NodeDataChanged path:/collections/collection1/state.json] for collection [collection1] has occurred - updating... (live nodes size: [4])
   [junit4]   2> 2158490 INFO  (zkCallback-2761-thread-1-processing-n:127.0.0.1:51905_) [n:127.0.0.1:51905_    ] o.a.s.c.c.ZkStateReader A cluster state change: [WatchedEvent state:SyncConnected type:NodeDataChanged path:/collections/collection1/state.json] for collection [collection1] has occurred - updating... (live nodes size: [4])
   [junit4]   2> 2158490 INFO  (zkCallback-2774-thread-1-processing-n:127.0.0.1:64467_) [n:127.0.0.1:64467_    ] o.a.s.c.c.ZkStateReader A cluster state change: [WatchedEvent state:SyncConnected type:NodeDataChanged path:/collections/collection1/state.json] for collection [collection1] has occurred - updating... (live nodes size: [4])
   [junit4]   2> 2160045 INFO  (recoveryExecutor-2772-thread-1-processing-n:127.0.0.1:64467_ x:collection1 s:shard1 c:collection1 r:core_node3) [n:127.0.0.1:64467_ c:collection1 s:shard1 r:core_node3 x:collection1] o.a.s.c.RecoveryStrategy Attempting to PeerSync from [https://127.0.0.1:51905/collection1/] - recoveringAfterStartup=[true]
   [junit4]   2> 2160045 INFO  (recoveryExecutor-2772-thread-1-processing-n:127.0.0.1:64467_ x:collection1 s:shard1 c:collection1 r:core_node3) [n:127.0.0.1:64467_ c:collection1 s:shard1 r:core_node3 x:collection1] o.a.s.u.PeerSync PeerSync: core=collection1 url=https://127.0.0.1:64467 START replicas=[https://127.0.0.1:51905/collection1/] nUpdates=1000
   [junit4]   2> 2160049 INFO  (qtp2068460479-17674) [n:127.0.0.1:51905_ c:collection1 s:shard1 r:core_node1 x:collection1] o.a.s.u.IndexFingerprint IndexFingerprint millis:0.0 result:{maxVersionSpecified=9223372036854775807, maxVersionEncountered=0, maxInHash=0, versionsHash=0, numVersions=0, numDocs=0, maxDoc=0}
   [junit4]   2> 2160049 INFO  (qtp2068460479-17674) [n:127.0.0.1:51905_ c:collection1 s:shard1 r:core_node1 x:collection1] o.a.s.c.S.Request [collection1]  webapp= path=/get params={distrib=false&qt=/get&getFingerprint=9223372036854775807&wt=javabin&version=2} status=0 QTime=0
   [junit4]   2> 2160051 INFO  (recoveryExecutor-2772-thread-1-processing-n:127.0.0.1:64467_ x:collection1 s:shard1 c:collection1 r:core_node3) [n:127.0.0.1:64467_ c:collection1 s:shard1 r:core_node3 x:collection1] o.a.s.u.IndexFingerprint IndexFingerprint millis:0.0 result:{maxVersionSpecified=9223372036854775807, maxVersionEncountered=0, maxInHash=0, versionsHash=0, numVersions=0, numDocs=0, maxDoc=0}
   [junit4]   2> 2160051 INFO  (recoveryExecutor-2772-thread-1-processing-n:127.0.0.1:64467_ x:collection1 s:shard1 c:collection1 r:core_node3) [n:127.0.0.1:64467_ c:collection1 s:shard1 r:core_node3 x:collection1] o.a.s.u.PeerSync We are already in sync. No need to do a PeerSync 
   [junit4]   2> 2160051 INFO  (recoveryExecutor-2772-thread-1-processing-n:127.0.0.1:64467_ x:collection1 s:shard1 c:collection1 r:core_node3) [n:127.0.0.1:64467_ c:collection1 s:shard1 r:core_node3 x:collection1] o.a.s.u.DirectUpdateHandler2 start commit{,optimize=false,openSearcher=true,waitSearcher=true,expungeDeletes=false,softCommit=false,prepareCommit=false}
   [junit4]   2> 2160051 INFO  (recoveryExecutor-2772-thread-1-processing-n:127.0.0.1:64467_ x:collection1 s:shard1 c:collection1 r:core_node3) [n:127.0.0.1:64467_ c:collection1 s:shard1 r:core_node3 x:collection1] o.a.s.u.DirectUpdateHandler2 No uncommitted changes. Skipping IW.commit.
   [junit4]   2> 2160051 INFO  (recoveryExecutor-2772-thread-1-processing-n:127.0.0.1:64467_ x:collection1 s:shard1 c:collection1 r:core_node3) [n:127.0.0.1:64467_ c:collection1 s:shard1 r:core_node3 x:collection1] o.a.s.u.DirectUpdateHandler2 end_commit_flush
   [junit4]   2> 2160051 INFO  (recoveryExecutor-2772-thread-1-processing-n:127.0.0.1:64467_ x:collection1 s:shard1 c:collection1 r:core_node3) [n:127.0.0.1:64467_ c:collection1 s:shard1 r:core_node3 x:collection1] o.a.s.c.RecoveryStrategy PeerSync stage of recovery was successful.
   [junit4]   2> 2160051 INFO  (recoveryExecutor-2772-thread-1-processing-n:127.0.0.1:64467_ x:collection1 s:shard1 c:collection1 r:core_node3) [n:127.0.0.1:64467_ c:collection1 s:shard1 r:core_node3 x:collection1] o.a.s.c.RecoveryStrategy Replaying updates buffered during PeerSync.
   [junit4]   2> 2160051 INFO  (recoveryExecutor-2772-thread-1-processing-n:127.0.0.1:64467_ x:collection1 s:shard1 c:collection1 r:core_node3) [n:127.0.0.1:64467_ c:collection1 s:shard1 r:core_node3 x:collection1] o.a.s.c.RecoveryStrategy No replay needed.
   [junit4]   2> 2160051 INFO  (recoveryExecutor-2772-thread-1-processing-n:127.0.0.1:64467_ x:collection1 s:shard1 c:collection1 r:core_node3) [n:127.0.0.1:64467_ c:collection1 s:shard1 r:core_node3 x:collection1] o.a.s.c.RecoveryStrategy Registering as Active after recovery.
   [junit4]   2> 2160055 INFO  (zkCallback-2774-thread-1-processing-n:127.0.0.1:64467_) [n:127.0.0.1:64467_    ] o.a.s.c.c.ZkStateReader A cluster state change: [WatchedEvent state:SyncConnected type:NodeDataChanged path:/collections/collection1/state.json] for collection [collection1] has occurred - updating... (live nodes size: [4])
   [junit4]   2> 2160055 INFO  (zkCallback-2767-thread-2-processing-n:127.0.0.1:52123_) [n:127.0.0.1:52123_    ] o.a.s.c.c.ZkStateReader A cluster state change: [WatchedEvent state:SyncConnected type:NodeDataChanged path:/collections/collection1/state.json] for collection [collection1] has occurred - updating... (live nodes size: [4])
   [junit4]   2> 2160055 INFO  (zkCallback-2761-thread-1-processing-n:127.0.0.1:51905_) [n:127.0.0.1:51905_    ] o.a.s.c.c.ZkStateReader A cluster state change: [WatchedEvent state:SyncConnected type:NodeDataChanged path:/collections/collection1/state.json] for collection [collection1] has occurred - updating... (live nodes size: [4])
   [junit4]   2> 2160166 INFO  (TEST-PeerSyncReplicationTest.test-seed#[50577D0E7D517A41]) [    ] o.a.s.c.AbstractDistribZkTestBase Recoveries finished - collection: collection1
   [junit4]   2> 2160184 INFO  (qtp162390062-17631) [n:127.0.0.1:34188_ c:control_collection s:shard1 r:core_node1 x:collection1] o.a.s.u.DirectUpdateHandler2 start commit{,optimize=false,openSearcher=true,waitSearcher=true,expungeDeletes=false,softCommit=false,prepareCommit=false}
   [junit4]   2> 2160184 INFO  (qtp162390062-17631) [n:127.0.0.1:34188_ c:control_collection s:shard1 r:core_node1 x:collection1] o.a.s.u.DirectUpdateHandler2 No uncommitted changes. Skipping IW.commit.
   [junit4]   2> 2160184 INFO  (qtp162390062-17631) [n:127.0.0.1:34188_ c:control_collection s:shard1 r:core_node1 x:collection1] o.a.s.u.DirectUpdateHandler2 end_commit_flush
   [junit4]   2> 2160184 INFO  (qtp162390062-17631) [n:127.0.0.1:34188_ c:control_collection s:shard1 r:core_node1 x:collection1] o.a.s.u.p.LogUpdateProcessorFactory [collection1]  webapp= path=/update params={waitSearcher=true&commit=true&softCommit=false&wt=javabin&version=2}{commit=} 0 0
   [junit4]   2> 2160202 INFO  (qtp2068460479-17674) [n:127.0.0.1:51905_ c:collection1 s:shard1 r:core_node1 x:collection1] o.a.s.u.DirectUpdateHandler2 start commit{,optimize=false,openSearcher=true,waitSearcher=true,expungeDeletes=false,softCommit=false,prepareCommit=false}
   [junit4]   2> 2160202 INFO  (qtp2068460479-17674) [n:127.0.0.1:51905_ c:collection1 s:shard1 r:core_node1 x:collection1] o.a.s.u.DirectUpdateHandler2 No uncommitted changes. Skipping IW.commit.
   [junit4]   2> 2160202 INFO  (qtp2068460479-17674) [n:127.0.0.1:51905_ c:collection1 s:shard1 r:core_node1 x:collection1] o.a.s.u.DirectUpdateHandler2 end_commit_flush
   [junit4]   2> 2160208 INFO  (qtp2068460479-17674) [n:127.0.0.1:51905_ c:collection1 s:shard1 r:core_node1 x:collection1] o.a.s.u.p.LogUpdateProcessorFactory [collection1]  webapp= path=/update params={update.distrib=FROMLEADER&waitSearcher=true&openSearcher=true&commit=true&softCommit=false&distrib.from=https://127.0.0.1:51905/collection1/&commit_end_point=true&wt=javabin&version=2&expungeDeletes=false}{commit=} 0 6
   [junit4]   2> 2160217 INFO  (qtp1537685759-17703) [n:127.0.0.1:52123_ c:collection1 s:shard1 r:core_node2 x:collection1] o.a.s.u.DirectUpdateHandler2 start commit{,optimize=false,openSearcher=true,waitSearcher=true,expungeDeletes=false,softCommit=false,prepareCommit=false}
   [junit4]   2> 2160217 INFO  (qtp1537685759-17703) [n:127.0.0.1:52123_ c:collection1 s:shard1 r:core_node2 x:collection1] o.a.s.u.DirectUpdateHandler2 No uncommitted changes. Skipping IW.commit.
   [junit4]   2> 2160218 INFO  (qtp1537685759-17703) [n:127.0.0.1:52123_ c:collection1 s:shard1 r:core_node2 x:collection1] o.a.s.u.DirectUpdateHandler2 end_commit_flush
   [junit4]   2> 2160218 INFO  (qtp1395182747-17740) [n:127.0.0.1:64467_ c:collection1 s:shard1 r:core_node3 x:collection1] o.a.s.u.DirectUpdateHandler2 start commit{,optimize=false,openSearcher=true,waitSearcher=true,expungeDeletes=false,softCommit=false,prepareCommit=false}
   [junit4]   2> 2160218 INFO  (qtp1395182747-17740) [n:127.0.0.1:64467_ c:collection1 

[...truncated too long message...]

ession expired for /live_nodes]
   [junit4]   2> 2494244 INFO  (jetty-launcher-2963-thread-2) [    ] o.a.s.m.SolrMetricManager Closing metric reporters for: solr.node
   [junit4]   2> 2494244 ERROR (Thread[Thread-5192,5,TGRP-TestSolrCloudWithDelegationTokens]) [n:127.0.0.1:59089_solr    ] o.a.h.s.t.d.AbstractDelegationTokenSecretManager ExpiredTokenRemover received java.lang.InterruptedException: sleep interrupted
   [junit4]   2> 2494244 INFO  (jetty-launcher-2963-thread-1) [    ] o.e.j.s.h.ContextHandler Stopped o.e.j.s.ServletContextHandler@42fbe39b{/solr,null,UNAVAILABLE}
   [junit4]   2> 2494251 INFO  (jetty-launcher-2963-thread-2) [    ] o.e.j.s.h.ContextHandler Stopped o.e.j.s.ServletContextHandler@69266fb6{/solr,null,UNAVAILABLE}
   [junit4]   2> 2494254 INFO  (SUITE-TestSolrCloudWithDelegationTokens-seed#[50577D0E7D517A41]-worker) [    ] o.a.s.c.ZkTestServer connecting to 127.0.0.1:46861 46861
   [junit4]   2> 2499285 INFO  (Thread-5172) [    ] o.a.s.c.ZkTestServer connecting to 127.0.0.1:46861 46861
   [junit4]   2> 2499286 WARN  (Thread-5172) [    ] o.a.s.c.ZkTestServer Watch limit violations: 
   [junit4]   2> Maximum concurrent create/delete watches above limit:
   [junit4]   2> 
   [junit4]   2> 	15	/solr/aliases.json
   [junit4]   2> 	15	/solr/clusterprops.json
   [junit4]   2> 	2	/solr/security.json
   [junit4]   2> 
   [junit4]   2> Maximum concurrent data watches above limit:
   [junit4]   2> 
   [junit4]   2> 	15	/solr/clusterstate.json
   [junit4]   2> 	2	/solr/security/zkdtsm/ZKDTSMRoot/ZKDTSMTokensRoot/DT_7
   [junit4]   2> 	2	/solr/security/zkdtsm/ZKDTSMRoot/ZKDTSMTokensRoot/DT_6
   [junit4]   2> 	2	/solr/security/zkdtsm/ZKDTSMRoot/ZKDTSMTokensRoot/DT_9
   [junit4]   2> 	2	/solr/security/zkdtsm/ZKDTSMRoot/ZKDTSMTokensRoot/DT_8
   [junit4]   2> 	2	/solr/security/zkdtsm/ZKDTSMRoot/ZKDTSMKeyIdRoot
   [junit4]   2> 	2	/solr/security/zkdtsm/ZKDTSMRoot/ZKDTSMMasterKeyRoot/DK_1
   [junit4]   2> 	2	/solr/security/zkdtsm/ZKDTSMRoot/ZKDTSMTokensRoot/DT_1
   [junit4]   2> 	2	/solr/security/zkdtsm/ZKDTSMRoot/ZKDTSMMasterKeyRoot/DK_3
   [junit4]   2> 	2	/solr/security/zkdtsm/ZKDTSMRoot/ZKDTSMTokensRoot/DT_3
   [junit4]   2> 	2	/solr/security/zkdtsm/ZKDTSMRoot/ZKDTSMMasterKeyRoot/DK_2
   [junit4]   2> 	2	/solr/security/zkdtsm/ZKDTSMRoot/ZKDTSMTokensRoot/DT_2
   [junit4]   2> 	2	/solr/security/zkdtsm/ZKDTSMRoot/ZKDTSMTokensRoot/DT_5
   [junit4]   2> 	2	/solr/security/zkdtsm/ZKDTSMRoot/ZKDTSMMasterKeyRoot/DK_4
   [junit4]   2> 	2	/solr/security/zkdtsm/ZKDTSMRoot/ZKDTSMTokensRoot/DT_4
   [junit4]   2> 	2	/solr/security/zkdtsm/ZKDTSMRoot/ZKDTSMTokensRoot/DT_12
   [junit4]   2> 	2	/solr/security/zkdtsm/ZKDTSMRoot/ZKDTSMSeqNumRoot
   [junit4]   2> 	2	/solr/security/zkdtsm/ZKDTSMRoot/ZKDTSMTokensRoot/DT_11
   [junit4]   2> 	2	/solr/security/zkdtsm/ZKDTSMRoot/ZKDTSMTokensRoot/DT_10
   [junit4]   2> 
   [junit4]   2> Maximum concurrent children watches above limit:
   [junit4]   2> 
   [junit4]   2> 	15	/solr/live_nodes
   [junit4]   2> 	15	/solr/collections
   [junit4]   2> 	3	/solr/overseer/queue
   [junit4]   2> 	3	/solr/overseer/collection-queue-work
   [junit4]   2> 	2	/solr/security/zkdtsm/ZKDTSMRoot/ZKDTSMMasterKeyRoot
   [junit4]   2> 	2	/solr/overseer/queue-work
   [junit4]   2> 	2	/solr/security/zkdtsm/ZKDTSMRoot/ZKDTSMTokensRoot
   [junit4]   2> 
   [junit4]   2> 2499287 INFO  (SUITE-TestSolrCloudWithDelegationTokens-seed#[50577D0E7D517A41]-worker) [    ] o.a.s.SolrTestCaseJ4 ###deleteCore
   [junit4]   2> NOTE: leaving temporary files on disk at: /export/home/jenkins/workspace/Lucene-Solr-master-Solaris/solr/build/solr-core/test/J1/temp/solr.cloud.TestSolrCloudWithDelegationTokens_50577D0E7D517A41-001
   [junit4]   2> NOTE: test params are: codec=Asserting(Lucene70), sim=RandomSimilarity(queryNorm=true): {}, locale=en-PH, timezone=America/Porto_Velho
   [junit4]   2> NOTE: SunOS 5.11 amd64/Oracle Corporation 1.8.0_112 (64-bit)/cpus=3,threads=1,free=140413144,total=518979584
   [junit4]   2> NOTE: All tests run in this JVM: [TestPushWriter, TestLMJelinekMercerSimilarityFactory, SuggesterTest, ClassificationUpdateProcessorFactoryTest, SimpleMLTQParserTest, TestDocSet, UpdateParamsTest, CollectionsAPIDistributedZkTest, MetricUtilsTest, EchoParamsTest, DeleteNodeTest, TestWriterPerf, TestFastWriter, TestMiniSolrCloudCluster, ResponseLogComponentTest, LeaderElectionIntegrationTest, TestSmileRequest, DocExpirationUpdateProcessorFactoryTest, CdcrBootstrapTest, TestSolrDynamicMBean, ShardRoutingCustomTest, MergeStrategyTest, SuggesterWFSTTest, DistributedTermsComponentTest, TestFiltering, AsyncCallRequestStatusResponseTest, ExternalFileFieldSortTest, DefaultValueUpdateProcessorTest, FileBasedSpellCheckerTest, TestLMDirichletSimilarityFactory, TestDelegationWithHadoopAuth, NoCacheHeaderTest, TestManagedResource, PreAnalyzedFieldManagedSchemaCloudTest, TestRequestForwarding, TestMiniSolrCloudClusterSSL, HdfsDirectoryTest, TestOmitPositions, TestXmlQParser, JSONWriterTest, TestSolrIndexConfig, ForceLeaderTest, SliceStateTest, SolrCoreCheckLockOnStartupTest, TestCloudInspectUtil, TestConfigReload, ConnectionReuseTest, FullHLLTest, TestRandomFaceting, CreateCollectionCleanupTest, CdcrVersionReplicationTest, BlockJoinFacetSimpleTest, HdfsBasicDistributedZk2Test, CoreAdminRequestStatusTest, BooleanFieldTest, TestConfigSetsAPIZkFailure, TestValueSourceCache, LeaderInitiatedRecoveryOnShardRestartTest, CircularListTest, TestSolr4Spatial, FullSolrCloudDistribCmdsTest, UUIDFieldTest, SolrMetricReporterTest, TestFuzzyAnalyzedSuggestions, TestReversedWildcardFilterFactory, OpenCloseCoreStressTest, CacheHeaderTest, TestPerFieldSimilarityWithDefaultOverride, QueryResultKeyTest, TestShortCircuitedRequests, TemplateUpdateProcessorTest, TestSuggestSpellingConverter, DateMathParserTest, DistribCursorPagingTest, TestSolrDeletionPolicy2, IndexSchemaTest, SolrIndexSplitterTest, TestRecovery, AnalyticsQueryTest, HdfsUnloadDistributedZkTest, TestAuthenticationFramework, ResponseHeaderTest, TestTolerantUpdateProcessorRandomCloud, SaslZkACLProviderTest, TestRestManager, DistributedIntervalFacetingTest, TestBinaryResponseWriter, TestIndexingPerformance, TestReload, TestAtomicUpdateErrorCases, TestUnifiedSolrHighlighter, CoreAdminHandlerTest, TestBulkSchemaConcurrent, TestTestInjection, DateRangeFieldTest, ParsingFieldUpdateProcessorsTest, RegexBoostProcessorTest, ClusterStateTest, SpellCheckComponentTest, TolerantUpdateProcessorTest, UpdateRequestProcessorFactoryTest, TestJsonFacetRefinement, TestFoldingMultitermQuery, TestCloudPseudoReturnFields, DeleteInactiveReplicaTest, SolrJmxReporterTest, TestRTimerTree, TestExactSharedStatsCache, PreAnalyzedFieldTest, ZkSolrClientTest, FieldMutatingUpdateProcessorTest, LoggingHandlerTest, TestEmbeddedSolrServerConstructors, TestUtils, TestRawTransformer, TestDistributedGrouping, TestSchemaVersionResource, SolrCoreMetricManagerTest, TestSolrCloudWithSecureImpersonation, TestSolrCloudSnapshots, LeaderFailureAfterFreshStartTest, TestIndexSearcher, TestDFISimilarityFactory, PeerSyncWithIndexFingerprintCachingTest, TestFieldCacheSort, CSVRequestHandlerTest, TestJoin, CollectionReloadTest, TestHighFrequencyDictionaryFactory, TestNumericTerms64, TestChildDocTransformer, TestQueryTypes, AutoCommitTest, TestStressUserVersions, BigEndianAscendingWordDeserializerTest, URLClassifyProcessorTest, WordBreakSolrSpellCheckerTest, TestSearchPerf, StressHdfsTest, TestPivotHelperCode, TestDeleteCollectionOnDownNodes, TestJmxMonitoredMap, BasicDistributedZk2Test, TestFieldCacheVsDocValues, SignatureUpdateProcessorFactoryTest, TestGraphTermsQParserPlugin, HLLUtilTest, CurrencyFieldOpenExchangeTest, TestInitQParser, TestSolrCoreProperties, ReplicationFactorTest, RulesTest, TestNoOpRegenerator, TestUniqueKeyFieldResource, ConfigSetsAPITest, DistributedFacetPivotLargeTest, DistributedQueryComponentOptimizationTest, SolrGangliaReporterTest, MultiThreadedOCPTest, TestMacroExpander, DistributedVersionInfoTest, NotRequiredUniqueKeyTest, TestComplexPhraseQParserPlugin, TestSolrFieldCacheMBean, BasicDistributedZkTest, ChaosMonkeySafeLeaderTest, UnloadDistributedZkTest, ShardRoutingTest, BasicZkTest, LeaderElectionTest, TestZkChroot, TestHashPartitioner, ZkControllerTest, HardAutoCommitTest, TestGroupingSearch, SolrCmdDistributorTest, QueryElevationComponentTest, BadIndexSchemaTest, TestFunctionQuery, BasicFunctionalityTest, DirectUpdateHandlerTest, TestBadConfig, CurrencyFieldXmlFileTest, TestCoreDiscovery, SuggesterFSTTest, SolrRequestParserTest, SuggesterTSTTest, TestStressLucene, TestTrie, SpatialFilterTest, TestCSVLoader, PolyFieldTest, SchemaVersionSpecificBehaviorTest, TestPseudoReturnFields, TestUpdate, DirectUpdateHandlerOptimizeTest, SortByFunctionTest, TestRemoteStreaming, DistanceFunctionTest, SolrInfoMBeanTest, DebugComponentTest, IndexBasedSpellCheckerTest, LukeRequestHandlerTest, PrimitiveFieldTypeTest, TermsComponentTest, TermVectorComponentTest, TestSolrQueryParser, TestJmxIntegration, TestCSVResponseWriter, QueryParsingTest, UniqFieldsUpdateProcessorFactoryTest, JsonLoaderTest, TestComponentsName, TestLFUCache, SampleTest, TestBinaryField, NumericFieldsTest, MinimalSchemaTest, TestConfig, OutputWriterTest, TestLuceneMatchVersion, SpellPossibilityIteratorTest, TestCodecSupport, TestBM25SimilarityFactory, ScriptEngineTest, ChaosMonkeyNothingIsSafeTest, CloudExitableDirectoryReaderTest, CollectionStateFormat2Test, CollectionsAPIAsyncDistributedZkTest, DeleteLastCustomShardedReplicaTest, DeleteShardTest, DeleteStatusTest, DistribDocExpirationUpdateProcessorTest, LeaderElectionContextKeyTest, LeaderInitiatedRecoveryOnCommitTest, OverseerModifyCollectionTest, PeerSyncReplicationTest, TestDownShardTolerantSearch, TestHdfsCloudBackupRestore, TestLeaderElectionWithEmptyReplica, TestLeaderInitiatedRecoveryThread, TestRandomFlRTGCloud, TestRequestStatusCollectionAPI, TestSolrCloudWithDelegationTokens]
   [junit4] Completed [513/674 (2!)] on J1 in 8.79s, 8 tests, 1 failure <<< FAILURES!

[...truncated 62989 lines...]


Mime
View raw message