lucene-dev mailing list archives

Site index · List index
Message view « Date » · « Thread »
Top « Date » · « Thread »
From Policeman Jenkins Server <jenk...@thetaphi.de>
Subject [JENKINS] Lucene-Solr-master-Linux (32bit/jdk1.8.0_112) - Build # 18720 - Still Unstable!
Date Sat, 07 Jan 2017 17:50:07 GMT
Build: https://jenkins.thetaphi.de/job/Lucene-Solr-master-Linux/18720/
Java: 32bit/jdk1.8.0_112 -client -XX:+UseSerialGC

3 tests failed.
FAILED:  org.apache.solr.cloud.CollectionsAPISolrJTest.testCreateAndDeleteShard

Error Message:
Error from server at https://127.0.0.1:34652/solr: create the collection time out:180s

Stack Trace:
org.apache.solr.client.solrj.impl.HttpSolrClient$RemoteSolrException: Error from server at https://127.0.0.1:34652/solr: create the collection time out:180s
	at __randomizedtesting.SeedInfo.seed([5DB0A3CE006A4F90:98EE17D2869F856D]:0)
	at org.apache.solr.client.solrj.impl.HttpSolrClient.executeMethod(HttpSolrClient.java:627)
	at org.apache.solr.client.solrj.impl.HttpSolrClient.request(HttpSolrClient.java:279)
	at org.apache.solr.client.solrj.impl.HttpSolrClient.request(HttpSolrClient.java:268)
	at org.apache.solr.client.solrj.impl.LBHttpSolrClient.doRequest(LBHttpSolrClient.java:439)
	at org.apache.solr.client.solrj.impl.LBHttpSolrClient.request(LBHttpSolrClient.java:391)
	at org.apache.solr.client.solrj.impl.CloudSolrClient.sendRequest(CloudSolrClient.java:1344)
	at org.apache.solr.client.solrj.impl.CloudSolrClient.requestWithRetryOnStaleState(CloudSolrClient.java:1095)
	at org.apache.solr.client.solrj.impl.CloudSolrClient.request(CloudSolrClient.java:1037)
	at org.apache.solr.client.solrj.SolrRequest.process(SolrRequest.java:149)
	at org.apache.solr.client.solrj.SolrRequest.process(SolrRequest.java:166)
	at org.apache.solr.cloud.CollectionsAPISolrJTest.testCreateAndDeleteShard(CollectionsAPISolrJTest.java:100)
	at sun.reflect.NativeMethodAccessorImpl.invoke0(Native Method)
	at sun.reflect.NativeMethodAccessorImpl.invoke(NativeMethodAccessorImpl.java:62)
	at sun.reflect.DelegatingMethodAccessorImpl.invoke(DelegatingMethodAccessorImpl.java:43)
	at java.lang.reflect.Method.invoke(Method.java:498)
	at com.carrotsearch.randomizedtesting.RandomizedRunner.invoke(RandomizedRunner.java:1713)
	at com.carrotsearch.randomizedtesting.RandomizedRunner$8.evaluate(RandomizedRunner.java:907)
	at com.carrotsearch.randomizedtesting.RandomizedRunner$9.evaluate(RandomizedRunner.java:943)
	at com.carrotsearch.randomizedtesting.RandomizedRunner$10.evaluate(RandomizedRunner.java:957)
	at com.carrotsearch.randomizedtesting.rules.SystemPropertiesRestoreRule$1.evaluate(SystemPropertiesRestoreRule.java:57)
	at org.apache.lucene.util.TestRuleSetupTeardownChained$1.evaluate(TestRuleSetupTeardownChained.java:49)
	at org.apache.lucene.util.AbstractBeforeAfterRule$1.evaluate(AbstractBeforeAfterRule.java:45)
	at org.apache.lucene.util.TestRuleThreadAndTestName$1.evaluate(TestRuleThreadAndTestName.java:48)
	at org.apache.lucene.util.TestRuleIgnoreAfterMaxFailures$1.evaluate(TestRuleIgnoreAfterMaxFailures.java:64)
	at org.apache.lucene.util.TestRuleMarkFailure$1.evaluate(TestRuleMarkFailure.java:47)
	at com.carrotsearch.randomizedtesting.rules.StatementAdapter.evaluate(StatementAdapter.java:36)
	at com.carrotsearch.randomizedtesting.ThreadLeakControl$StatementRunner.run(ThreadLeakControl.java:367)
	at com.carrotsearch.randomizedtesting.ThreadLeakControl.forkTimeoutingTask(ThreadLeakControl.java:811)
	at com.carrotsearch.randomizedtesting.ThreadLeakControl$3.evaluate(ThreadLeakControl.java:462)
	at com.carrotsearch.randomizedtesting.RandomizedRunner.runSingleTest(RandomizedRunner.java:916)
	at com.carrotsearch.randomizedtesting.RandomizedRunner$5.evaluate(RandomizedRunner.java:802)
	at com.carrotsearch.randomizedtesting.RandomizedRunner$6.evaluate(RandomizedRunner.java:852)
	at com.carrotsearch.randomizedtesting.RandomizedRunner$7.evaluate(RandomizedRunner.java:863)
	at com.carrotsearch.randomizedtesting.rules.StatementAdapter.evaluate(StatementAdapter.java:36)
	at com.carrotsearch.randomizedtesting.rules.SystemPropertiesRestoreRule$1.evaluate(SystemPropertiesRestoreRule.java:57)
	at org.apache.lucene.util.AbstractBeforeAfterRule$1.evaluate(AbstractBeforeAfterRule.java:45)
	at com.carrotsearch.randomizedtesting.rules.StatementAdapter.evaluate(StatementAdapter.java:36)
	at org.apache.lucene.util.TestRuleStoreClassName$1.evaluate(TestRuleStoreClassName.java:41)
	at com.carrotsearch.randomizedtesting.rules.NoShadowingOrOverridesOnMethodsRule$1.evaluate(NoShadowingOrOverridesOnMethodsRule.java:40)
	at com.carrotsearch.randomizedtesting.rules.NoShadowingOrOverridesOnMethodsRule$1.evaluate(NoShadowingOrOverridesOnMethodsRule.java:40)
	at com.carrotsearch.randomizedtesting.rules.StatementAdapter.evaluate(StatementAdapter.java:36)
	at com.carrotsearch.randomizedtesting.rules.StatementAdapter.evaluate(StatementAdapter.java:36)
	at com.carrotsearch.randomizedtesting.rules.StatementAdapter.evaluate(StatementAdapter.java:36)
	at org.apache.lucene.util.TestRuleAssertionsRequired$1.evaluate(TestRuleAssertionsRequired.java:53)
	at org.apache.lucene.util.TestRuleMarkFailure$1.evaluate(TestRuleMarkFailure.java:47)
	at org.apache.lucene.util.TestRuleIgnoreAfterMaxFailures$1.evaluate(TestRuleIgnoreAfterMaxFailures.java:64)
	at org.apache.lucene.util.TestRuleIgnoreTestSuites$1.evaluate(TestRuleIgnoreTestSuites.java:54)
	at com.carrotsearch.randomizedtesting.rules.StatementAdapter.evaluate(StatementAdapter.java:36)
	at com.carrotsearch.randomizedtesting.ThreadLeakControl$StatementRunner.run(ThreadLeakControl.java:367)
	at java.lang.Thread.run(Thread.java:745)


FAILED:  org.apache.solr.cloud.CollectionsAPISolrJTest.testBalanceShardUnique

Error Message:
Error from server at https://127.0.0.1:34652/solr: create the collection time out:180s

Stack Trace:
org.apache.solr.client.solrj.impl.HttpSolrClient$RemoteSolrException: Error from server at https://127.0.0.1:34652/solr: create the collection time out:180s
	at __randomizedtesting.SeedInfo.seed([5DB0A3CE006A4F90:15081583BACAE753]:0)
	at org.apache.solr.client.solrj.impl.HttpSolrClient.executeMethod(HttpSolrClient.java:627)
	at org.apache.solr.client.solrj.impl.HttpSolrClient.request(HttpSolrClient.java:279)
	at org.apache.solr.client.solrj.impl.HttpSolrClient.request(HttpSolrClient.java:268)
	at org.apache.solr.client.solrj.impl.LBHttpSolrClient.doRequest(LBHttpSolrClient.java:439)
	at org.apache.solr.client.solrj.impl.LBHttpSolrClient.request(LBHttpSolrClient.java:391)
	at org.apache.solr.client.solrj.impl.CloudSolrClient.sendRequest(CloudSolrClient.java:1344)
	at org.apache.solr.client.solrj.impl.CloudSolrClient.requestWithRetryOnStaleState(CloudSolrClient.java:1095)
	at org.apache.solr.client.solrj.impl.CloudSolrClient.request(CloudSolrClient.java:1037)
	at org.apache.solr.client.solrj.SolrRequest.process(SolrRequest.java:149)
	at org.apache.solr.client.solrj.SolrRequest.process(SolrRequest.java:166)
	at org.apache.solr.cloud.CollectionsAPISolrJTest.testBalanceShardUnique(CollectionsAPISolrJTest.java:335)
	at sun.reflect.NativeMethodAccessorImpl.invoke0(Native Method)
	at sun.reflect.NativeMethodAccessorImpl.invoke(NativeMethodAccessorImpl.java:62)
	at sun.reflect.DelegatingMethodAccessorImpl.invoke(DelegatingMethodAccessorImpl.java:43)
	at java.lang.reflect.Method.invoke(Method.java:498)
	at com.carrotsearch.randomizedtesting.RandomizedRunner.invoke(RandomizedRunner.java:1713)
	at com.carrotsearch.randomizedtesting.RandomizedRunner$8.evaluate(RandomizedRunner.java:907)
	at com.carrotsearch.randomizedtesting.RandomizedRunner$9.evaluate(RandomizedRunner.java:943)
	at com.carrotsearch.randomizedtesting.RandomizedRunner$10.evaluate(RandomizedRunner.java:957)
	at com.carrotsearch.randomizedtesting.rules.SystemPropertiesRestoreRule$1.evaluate(SystemPropertiesRestoreRule.java:57)
	at org.apache.lucene.util.TestRuleSetupTeardownChained$1.evaluate(TestRuleSetupTeardownChained.java:49)
	at org.apache.lucene.util.AbstractBeforeAfterRule$1.evaluate(AbstractBeforeAfterRule.java:45)
	at org.apache.lucene.util.TestRuleThreadAndTestName$1.evaluate(TestRuleThreadAndTestName.java:48)
	at org.apache.lucene.util.TestRuleIgnoreAfterMaxFailures$1.evaluate(TestRuleIgnoreAfterMaxFailures.java:64)
	at org.apache.lucene.util.TestRuleMarkFailure$1.evaluate(TestRuleMarkFailure.java:47)
	at com.carrotsearch.randomizedtesting.rules.StatementAdapter.evaluate(StatementAdapter.java:36)
	at com.carrotsearch.randomizedtesting.ThreadLeakControl$StatementRunner.run(ThreadLeakControl.java:367)
	at com.carrotsearch.randomizedtesting.ThreadLeakControl.forkTimeoutingTask(ThreadLeakControl.java:811)
	at com.carrotsearch.randomizedtesting.ThreadLeakControl$3.evaluate(ThreadLeakControl.java:462)
	at com.carrotsearch.randomizedtesting.RandomizedRunner.runSingleTest(RandomizedRunner.java:916)
	at com.carrotsearch.randomizedtesting.RandomizedRunner$5.evaluate(RandomizedRunner.java:802)
	at com.carrotsearch.randomizedtesting.RandomizedRunner$6.evaluate(RandomizedRunner.java:852)
	at com.carrotsearch.randomizedtesting.RandomizedRunner$7.evaluate(RandomizedRunner.java:863)
	at com.carrotsearch.randomizedtesting.rules.StatementAdapter.evaluate(StatementAdapter.java:36)
	at com.carrotsearch.randomizedtesting.rules.SystemPropertiesRestoreRule$1.evaluate(SystemPropertiesRestoreRule.java:57)
	at org.apache.lucene.util.AbstractBeforeAfterRule$1.evaluate(AbstractBeforeAfterRule.java:45)
	at com.carrotsearch.randomizedtesting.rules.StatementAdapter.evaluate(StatementAdapter.java:36)
	at org.apache.lucene.util.TestRuleStoreClassName$1.evaluate(TestRuleStoreClassName.java:41)
	at com.carrotsearch.randomizedtesting.rules.NoShadowingOrOverridesOnMethodsRule$1.evaluate(NoShadowingOrOverridesOnMethodsRule.java:40)
	at com.carrotsearch.randomizedtesting.rules.NoShadowingOrOverridesOnMethodsRule$1.evaluate(NoShadowingOrOverridesOnMethodsRule.java:40)
	at com.carrotsearch.randomizedtesting.rules.StatementAdapter.evaluate(StatementAdapter.java:36)
	at com.carrotsearch.randomizedtesting.rules.StatementAdapter.evaluate(StatementAdapter.java:36)
	at com.carrotsearch.randomizedtesting.rules.StatementAdapter.evaluate(StatementAdapter.java:36)
	at org.apache.lucene.util.TestRuleAssertionsRequired$1.evaluate(TestRuleAssertionsRequired.java:53)
	at org.apache.lucene.util.TestRuleMarkFailure$1.evaluate(TestRuleMarkFailure.java:47)
	at org.apache.lucene.util.TestRuleIgnoreAfterMaxFailures$1.evaluate(TestRuleIgnoreAfterMaxFailures.java:64)
	at org.apache.lucene.util.TestRuleIgnoreTestSuites$1.evaluate(TestRuleIgnoreTestSuites.java:54)
	at com.carrotsearch.randomizedtesting.rules.StatementAdapter.evaluate(StatementAdapter.java:36)
	at com.carrotsearch.randomizedtesting.ThreadLeakControl$StatementRunner.run(ThreadLeakControl.java:367)
	at java.lang.Thread.run(Thread.java:745)


FAILED:  org.apache.solr.cloud.CollectionsAPISolrJTest.testCreateAndDeleteAlias

Error Message:
Error from server at https://127.0.0.1:34652/solr: create the collection time out:180s

Stack Trace:
org.apache.solr.client.solrj.impl.HttpSolrClient$RemoteSolrException: Error from server at https://127.0.0.1:34652/solr: create the collection time out:180s
	at __randomizedtesting.SeedInfo.seed([5DB0A3CE006A4F90:9353E434A0D5BE0B]:0)
	at org.apache.solr.client.solrj.impl.HttpSolrClient.executeMethod(HttpSolrClient.java:627)
	at org.apache.solr.client.solrj.impl.HttpSolrClient.request(HttpSolrClient.java:279)
	at org.apache.solr.client.solrj.impl.HttpSolrClient.request(HttpSolrClient.java:268)
	at org.apache.solr.client.solrj.impl.LBHttpSolrClient.doRequest(LBHttpSolrClient.java:439)
	at org.apache.solr.client.solrj.impl.LBHttpSolrClient.request(LBHttpSolrClient.java:391)
	at org.apache.solr.client.solrj.impl.CloudSolrClient.sendRequest(CloudSolrClient.java:1344)
	at org.apache.solr.client.solrj.impl.CloudSolrClient.requestWithRetryOnStaleState(CloudSolrClient.java:1095)
	at org.apache.solr.client.solrj.impl.CloudSolrClient.request(CloudSolrClient.java:1037)
	at org.apache.solr.client.solrj.SolrRequest.process(SolrRequest.java:149)
	at org.apache.solr.client.solrj.SolrRequest.process(SolrRequest.java:166)
	at org.apache.solr.cloud.CollectionsAPISolrJTest.testCreateAndDeleteAlias(CollectionsAPISolrJTest.java:128)
	at sun.reflect.NativeMethodAccessorImpl.invoke0(Native Method)
	at sun.reflect.NativeMethodAccessorImpl.invoke(NativeMethodAccessorImpl.java:62)
	at sun.reflect.DelegatingMethodAccessorImpl.invoke(DelegatingMethodAccessorImpl.java:43)
	at java.lang.reflect.Method.invoke(Method.java:498)
	at com.carrotsearch.randomizedtesting.RandomizedRunner.invoke(RandomizedRunner.java:1713)
	at com.carrotsearch.randomizedtesting.RandomizedRunner$8.evaluate(RandomizedRunner.java:907)
	at com.carrotsearch.randomizedtesting.RandomizedRunner$9.evaluate(RandomizedRunner.java:943)
	at com.carrotsearch.randomizedtesting.RandomizedRunner$10.evaluate(RandomizedRunner.java:957)
	at com.carrotsearch.randomizedtesting.rules.SystemPropertiesRestoreRule$1.evaluate(SystemPropertiesRestoreRule.java:57)
	at org.apache.lucene.util.TestRuleSetupTeardownChained$1.evaluate(TestRuleSetupTeardownChained.java:49)
	at org.apache.lucene.util.AbstractBeforeAfterRule$1.evaluate(AbstractBeforeAfterRule.java:45)
	at org.apache.lucene.util.TestRuleThreadAndTestName$1.evaluate(TestRuleThreadAndTestName.java:48)
	at org.apache.lucene.util.TestRuleIgnoreAfterMaxFailures$1.evaluate(TestRuleIgnoreAfterMaxFailures.java:64)
	at org.apache.lucene.util.TestRuleMarkFailure$1.evaluate(TestRuleMarkFailure.java:47)
	at com.carrotsearch.randomizedtesting.rules.StatementAdapter.evaluate(StatementAdapter.java:36)
	at com.carrotsearch.randomizedtesting.ThreadLeakControl$StatementRunner.run(ThreadLeakControl.java:367)
	at com.carrotsearch.randomizedtesting.ThreadLeakControl.forkTimeoutingTask(ThreadLeakControl.java:811)
	at com.carrotsearch.randomizedtesting.ThreadLeakControl$3.evaluate(ThreadLeakControl.java:462)
	at com.carrotsearch.randomizedtesting.RandomizedRunner.runSingleTest(RandomizedRunner.java:916)
	at com.carrotsearch.randomizedtesting.RandomizedRunner$5.evaluate(RandomizedRunner.java:802)
	at com.carrotsearch.randomizedtesting.RandomizedRunner$6.evaluate(RandomizedRunner.java:852)
	at com.carrotsearch.randomizedtesting.RandomizedRunner$7.evaluate(RandomizedRunner.java:863)
	at com.carrotsearch.randomizedtesting.rules.StatementAdapter.evaluate(StatementAdapter.java:36)
	at com.carrotsearch.randomizedtesting.rules.SystemPropertiesRestoreRule$1.evaluate(SystemPropertiesRestoreRule.java:57)
	at org.apache.lucene.util.AbstractBeforeAfterRule$1.evaluate(AbstractBeforeAfterRule.java:45)
	at com.carrotsearch.randomizedtesting.rules.StatementAdapter.evaluate(StatementAdapter.java:36)
	at org.apache.lucene.util.TestRuleStoreClassName$1.evaluate(TestRuleStoreClassName.java:41)
	at com.carrotsearch.randomizedtesting.rules.NoShadowingOrOverridesOnMethodsRule$1.evaluate(NoShadowingOrOverridesOnMethodsRule.java:40)
	at com.carrotsearch.randomizedtesting.rules.NoShadowingOrOverridesOnMethodsRule$1.evaluate(NoShadowingOrOverridesOnMethodsRule.java:40)
	at com.carrotsearch.randomizedtesting.rules.StatementAdapter.evaluate(StatementAdapter.java:36)
	at com.carrotsearch.randomizedtesting.rules.StatementAdapter.evaluate(StatementAdapter.java:36)
	at com.carrotsearch.randomizedtesting.rules.StatementAdapter.evaluate(StatementAdapter.java:36)
	at org.apache.lucene.util.TestRuleAssertionsRequired$1.evaluate(TestRuleAssertionsRequired.java:53)
	at org.apache.lucene.util.TestRuleMarkFailure$1.evaluate(TestRuleMarkFailure.java:47)
	at org.apache.lucene.util.TestRuleIgnoreAfterMaxFailures$1.evaluate(TestRuleIgnoreAfterMaxFailures.java:64)
	at org.apache.lucene.util.TestRuleIgnoreTestSuites$1.evaluate(TestRuleIgnoreTestSuites.java:54)
	at com.carrotsearch.randomizedtesting.rules.StatementAdapter.evaluate(StatementAdapter.java:36)
	at com.carrotsearch.randomizedtesting.ThreadLeakControl$StatementRunner.run(ThreadLeakControl.java:367)
	at java.lang.Thread.run(Thread.java:745)




Build Log:
[...truncated 12532 lines...]
   [junit4] Suite: org.apache.solr.cloud.CollectionsAPISolrJTest
   [junit4]   2> Creating dataDir: /home/jenkins/workspace/Lucene-Solr-master-Linux/solr/build/solr-core/test/J0/temp/solr.cloud.CollectionsAPISolrJTest_5DB0A3CE006A4F90-001/init-core-data-001
   [junit4]   2> 1318379 INFO  (SUITE-CollectionsAPISolrJTest-seed#[5DB0A3CE006A4F90]-worker) [    ] o.a.s.SolrTestCaseJ4 Randomized ssl (true) and clientAuth (true) via: @org.apache.solr.util.RandomizeSSL(reason=, ssl=NaN, value=NaN, clientAuth=NaN)
   [junit4]   2> 1318380 INFO  (SUITE-CollectionsAPISolrJTest-seed#[5DB0A3CE006A4F90]-worker) [    ] o.a.s.c.MiniSolrCloudCluster Starting cluster of 4 servers in /home/jenkins/workspace/Lucene-Solr-master-Linux/solr/build/solr-core/test/J0/temp/solr.cloud.CollectionsAPISolrJTest_5DB0A3CE006A4F90-001/tempDir-001
   [junit4]   2> 1318380 INFO  (SUITE-CollectionsAPISolrJTest-seed#[5DB0A3CE006A4F90]-worker) [    ] o.a.s.c.ZkTestServer STARTING ZK TEST SERVER
   [junit4]   2> 1318381 INFO  (Thread-2590) [    ] o.a.s.c.ZkTestServer client port:0.0.0.0/0.0.0.0:0
   [junit4]   2> 1318381 INFO  (Thread-2590) [    ] o.a.s.c.ZkTestServer Starting server
   [junit4]   2> 1318481 INFO  (SUITE-CollectionsAPISolrJTest-seed#[5DB0A3CE006A4F90]-worker) [    ] o.a.s.c.ZkTestServer start zk server on port:40317
   [junit4]   2> 1318488 INFO  (jetty-launcher-1431-thread-1) [    ] o.e.j.s.Server jetty-9.3.14.v20161028
   [junit4]   2> 1318490 INFO  (jetty-launcher-1431-thread-2) [    ] o.e.j.s.Server jetty-9.3.14.v20161028
   [junit4]   2> 1318491 INFO  (jetty-launcher-1431-thread-3) [    ] o.e.j.s.Server jetty-9.3.14.v20161028
   [junit4]   2> 1318491 INFO  (jetty-launcher-1431-thread-1) [    ] o.e.j.s.h.ContextHandler Started o.e.j.s.ServletContextHandler@e4775d{/solr,null,AVAILABLE}
   [junit4]   2> 1318492 INFO  (jetty-launcher-1431-thread-4) [    ] o.e.j.s.Server jetty-9.3.14.v20161028
   [junit4]   2> 1318493 INFO  (jetty-launcher-1431-thread-2) [    ] o.e.j.s.h.ContextHandler Started o.e.j.s.ServletContextHandler@9a2d62{/solr,null,AVAILABLE}
   [junit4]   2> 1318495 INFO  (jetty-launcher-1431-thread-4) [    ] o.e.j.s.h.ContextHandler Started o.e.j.s.ServletContextHandler@10f662e{/solr,null,AVAILABLE}
   [junit4]   2> 1318495 INFO  (jetty-launcher-1431-thread-3) [    ] o.e.j.s.h.ContextHandler Started o.e.j.s.ServletContextHandler@bb7cd9{/solr,null,AVAILABLE}
   [junit4]   2> 1318495 INFO  (jetty-launcher-1431-thread-1) [    ] o.e.j.s.AbstractConnector Started ServerConnector@fd6591{SSL,[ssl, http/1.1]}{127.0.0.1:43693}
   [junit4]   2> 1318495 INFO  (jetty-launcher-1431-thread-1) [    ] o.e.j.s.Server Started @1319745ms
   [junit4]   2> 1318495 INFO  (jetty-launcher-1431-thread-1) [    ] o.a.s.c.s.e.JettySolrRunner Jetty properties: {hostContext=/solr, hostPort=43693}
   [junit4]   2> 1318495 INFO  (jetty-launcher-1431-thread-2) [    ] o.e.j.s.AbstractConnector Started ServerConnector@171f987{SSL,[ssl, http/1.1]}{127.0.0.1:44618}
   [junit4]   2> 1318495 INFO  (jetty-launcher-1431-thread-2) [    ] o.e.j.s.Server Started @1319745ms
   [junit4]   2> 1318495 ERROR (jetty-launcher-1431-thread-1) [    ] o.a.s.s.StartupLoggingUtils Missing Java Option solr.log.dir. Logging may be missing or incomplete.
   [junit4]   2> 1318495 INFO  (jetty-launcher-1431-thread-2) [    ] o.a.s.c.s.e.JettySolrRunner Jetty properties: {hostContext=/solr, hostPort=44618}
   [junit4]   2> 1318495 INFO  (jetty-launcher-1431-thread-1) [    ] o.a.s.s.SolrDispatchFilter  ___      _       Welcome to Apache Solr? version 7.0.0
   [junit4]   2> 1318496 INFO  (jetty-launcher-1431-thread-3) [    ] o.e.j.s.AbstractConnector Started ServerConnector@1135177{SSL,[ssl, http/1.1]}{127.0.0.1:34652}
   [junit4]   2> 1318496 INFO  (jetty-launcher-1431-thread-1) [    ] o.a.s.s.SolrDispatchFilter / __| ___| |_ _   Starting in cloud mode on port null
   [junit4]   2> 1318496 INFO  (jetty-launcher-1431-thread-3) [    ] o.e.j.s.Server Started @1319746ms
   [junit4]   2> 1318495 INFO  (jetty-launcher-1431-thread-4) [    ] o.e.j.s.AbstractConnector Started ServerConnector@d13af3{SSL,[ssl, http/1.1]}{127.0.0.1:35987}
   [junit4]   2> 1318496 INFO  (jetty-launcher-1431-thread-3) [    ] o.a.s.c.s.e.JettySolrRunner Jetty properties: {hostContext=/solr, hostPort=34652}
   [junit4]   2> 1318496 INFO  (jetty-launcher-1431-thread-4) [    ] o.e.j.s.Server Started @1319746ms
   [junit4]   2> 1318496 INFO  (jetty-launcher-1431-thread-1) [    ] o.a.s.s.SolrDispatchFilter \__ \/ _ \ | '_|  Install dir: null
   [junit4]   2> 1318496 ERROR (jetty-launcher-1431-thread-2) [    ] o.a.s.s.StartupLoggingUtils Missing Java Option solr.log.dir. Logging may be missing or incomplete.
   [junit4]   2> 1318496 INFO  (jetty-launcher-1431-thread-1) [    ] o.a.s.s.SolrDispatchFilter |___/\___/_|_|    Start time: 2017-01-07T17:26:32.312Z
   [junit4]   2> 1318496 INFO  (jetty-launcher-1431-thread-2) [    ] o.a.s.s.SolrDispatchFilter  ___      _       Welcome to Apache Solr? version 7.0.0
   [junit4]   2> 1318496 ERROR (jetty-launcher-1431-thread-3) [    ] o.a.s.s.StartupLoggingUtils Missing Java Option solr.log.dir. Logging may be missing or incomplete.
   [junit4]   2> 1318496 INFO  (jetty-launcher-1431-thread-2) [    ] o.a.s.s.SolrDispatchFilter / __| ___| |_ _   Starting in cloud mode on port null
   [junit4]   2> 1318496 INFO  (jetty-launcher-1431-thread-3) [    ] o.a.s.s.SolrDispatchFilter  ___      _       Welcome to Apache Solr? version 7.0.0
   [junit4]   2> 1318496 INFO  (jetty-launcher-1431-thread-4) [    ] o.a.s.c.s.e.JettySolrRunner Jetty properties: {hostContext=/solr, hostPort=35987}
   [junit4]   2> 1318496 INFO  (jetty-launcher-1431-thread-3) [    ] o.a.s.s.SolrDispatchFilter / __| ___| |_ _   Starting in cloud mode on port null
   [junit4]   2> 1318496 INFO  (jetty-launcher-1431-thread-3) [    ] o.a.s.s.SolrDispatchFilter \__ \/ _ \ | '_|  Install dir: null
   [junit4]   2> 1318496 INFO  (jetty-launcher-1431-thread-3) [    ] o.a.s.s.SolrDispatchFilter |___/\___/_|_|    Start time: 2017-01-07T17:26:32.312Z
   [junit4]   2> 1318497 ERROR (jetty-launcher-1431-thread-4) [    ] o.a.s.s.StartupLoggingUtils Missing Java Option solr.log.dir. Logging may be missing or incomplete.
   [junit4]   2> 1318497 INFO  (jetty-launcher-1431-thread-4) [    ] o.a.s.s.SolrDispatchFilter  ___      _       Welcome to Apache Solr? version 7.0.0
   [junit4]   2> 1318497 INFO  (jetty-launcher-1431-thread-4) [    ] o.a.s.s.SolrDispatchFilter / __| ___| |_ _   Starting in cloud mode on port null
   [junit4]   2> 1318497 INFO  (jetty-launcher-1431-thread-4) [    ] o.a.s.s.SolrDispatchFilter \__ \/ _ \ | '_|  Install dir: null
   [junit4]   2> 1318497 INFO  (jetty-launcher-1431-thread-4) [    ] o.a.s.s.SolrDispatchFilter |___/\___/_|_|    Start time: 2017-01-07T17:26:32.313Z
   [junit4]   2> 1318496 INFO  (jetty-launcher-1431-thread-2) [    ] o.a.s.s.SolrDispatchFilter \__ \/ _ \ | '_|  Install dir: null
   [junit4]   2> 1318497 INFO  (jetty-launcher-1431-thread-2) [    ] o.a.s.s.SolrDispatchFilter |___/\___/_|_|    Start time: 2017-01-07T17:26:32.313Z
   [junit4]   2> 1318498 INFO  (jetty-launcher-1431-thread-1) [    ] o.a.s.s.SolrDispatchFilter solr.xml found in ZooKeeper. Loading...
   [junit4]   2> 1318500 INFO  (jetty-launcher-1431-thread-4) [    ] o.a.s.s.SolrDispatchFilter solr.xml found in ZooKeeper. Loading...
   [junit4]   2> 1318501 INFO  (jetty-launcher-1431-thread-2) [    ] o.a.s.s.SolrDispatchFilter solr.xml found in ZooKeeper. Loading...
   [junit4]   2> 1318501 INFO  (jetty-launcher-1431-thread-3) [    ] o.a.s.s.SolrDispatchFilter solr.xml found in ZooKeeper. Loading...
   [junit4]   2> 1318524 WARN  (NIOServerCxn.Factory:0.0.0.0/0.0.0.0:0) [    ] o.a.z.s.NIOServerCnxn caught end of stream exception
   [junit4]   2> EndOfStreamException: Unable to read additional data from client sessionid 0x15979f7ae060003, likely client has closed socket
   [junit4]   2> 	at org.apache.zookeeper.server.NIOServerCnxn.doIO(NIOServerCnxn.java:228)
   [junit4]   2> 	at org.apache.zookeeper.server.NIOServerCnxnFactory.run(NIOServerCnxnFactory.java:208)
   [junit4]   2> 	at java.lang.Thread.run(Thread.java:745)
   [junit4]   2> 1318525 WARN  (NIOServerCxn.Factory:0.0.0.0/0.0.0.0:0) [    ] o.a.z.s.NIOServerCnxn caught end of stream exception
   [junit4]   2> EndOfStreamException: Unable to read additional data from client sessionid 0x15979f7ae060001, likely client has closed socket
   [junit4]   2> 	at org.apache.zookeeper.server.NIOServerCnxn.doIO(NIOServerCnxn.java:228)
   [junit4]   2> 	at org.apache.zookeeper.server.NIOServerCnxnFactory.run(NIOServerCnxnFactory.java:208)
   [junit4]   2> 	at java.lang.Thread.run(Thread.java:745)
   [junit4]   2> 1318529 INFO  (jetty-launcher-1431-thread-4) [    ] o.a.s.c.ZkContainer Zookeeper client=127.0.0.1:40317/solr
   [junit4]   2> 1318529 INFO  (jetty-launcher-1431-thread-1) [    ] o.a.s.c.ZkContainer Zookeeper client=127.0.0.1:40317/solr
   [junit4]   2> 1318529 INFO  (jetty-launcher-1431-thread-3) [    ] o.a.s.c.ZkContainer Zookeeper client=127.0.0.1:40317/solr
   [junit4]   2> 1318532 INFO  (jetty-launcher-1431-thread-2) [    ] o.a.s.c.ZkContainer Zookeeper client=127.0.0.1:40317/solr
   [junit4]   2> 1318535 WARN  (NIOServerCxn.Factory:0.0.0.0/0.0.0.0:0) [    ] o.a.z.s.NIOServerCnxn caught end of stream exception
   [junit4]   2> EndOfStreamException: Unable to read additional data from client sessionid 0x15979f7ae060008, likely client has closed socket
   [junit4]   2> 	at org.apache.zookeeper.server.NIOServerCnxn.doIO(NIOServerCnxn.java:228)
   [junit4]   2> 	at org.apache.zookeeper.server.NIOServerCnxnFactory.run(NIOServerCnxnFactory.java:208)
   [junit4]   2> 	at java.lang.Thread.run(Thread.java:745)
   [junit4]   2> 1318563 INFO  (jetty-launcher-1431-thread-2) [n:127.0.0.1:44618_solr    ] o.a.s.c.OverseerElectionContext I am going to be the leader 127.0.0.1:44618_solr
   [junit4]   2> 1318564 INFO  (jetty-launcher-1431-thread-3) [n:127.0.0.1:34652_solr    ] o.a.s.c.ZkController Register node as live in ZooKeeper:/live_nodes/127.0.0.1:34652_solr
   [junit4]   2> 1318564 INFO  (jetty-launcher-1431-thread-4) [n:127.0.0.1:35987_solr    ] o.a.s.c.ZkController Register node as live in ZooKeeper:/live_nodes/127.0.0.1:35987_solr
   [junit4]   2> 1318564 INFO  (jetty-launcher-1431-thread-1) [n:127.0.0.1:43693_solr    ] o.a.s.c.ZkController Register node as live in ZooKeeper:/live_nodes/127.0.0.1:43693_solr
   [junit4]   2> 1318565 INFO  (jetty-launcher-1431-thread-2) [n:127.0.0.1:44618_solr    ] o.a.s.c.Overseer Overseer (id=97242971648688140-127.0.0.1:44618_solr-n_0000000000) starting
   [junit4]   2> 1318566 INFO  (zkCallback-1450-thread-1-processing-n:127.0.0.1:34652_solr) [n:127.0.0.1:34652_solr    ] o.a.s.c.c.ZkStateReader Updated live nodes from ZooKeeper... (0) -> (3)
   [junit4]   2> 1318567 INFO  (zkCallback-1451-thread-1-processing-n:127.0.0.1:43693_solr) [n:127.0.0.1:43693_solr    ] o.a.s.c.c.ZkStateReader Updated live nodes from ZooKeeper... (0) -> (3)
   [junit4]   2> 1318575 INFO  (zkCallback-1449-thread-1-processing-n:127.0.0.1:35987_solr) [n:127.0.0.1:35987_solr    ] o.a.s.c.c.ZkStateReader Updated live nodes from ZooKeeper... (0) -> (3)
   [junit4]   2> 1318580 INFO  (zkCallback-1452-thread-1-processing-n:127.0.0.1:44618_solr) [n:127.0.0.1:44618_solr    ] o.a.s.c.c.ZkStateReader Updated live nodes from ZooKeeper... (0) -> (3)
   [junit4]   2> 1318593 INFO  (jetty-launcher-1431-thread-2) [n:127.0.0.1:44618_solr    ] o.a.s.c.ZkController Register node as live in ZooKeeper:/live_nodes/127.0.0.1:44618_solr
   [junit4]   2> 1318594 INFO  (zkCallback-1450-thread-1-processing-n:127.0.0.1:34652_solr) [n:127.0.0.1:34652_solr    ] o.a.s.c.c.ZkStateReader Updated live nodes from ZooKeeper... (3) -> (4)
   [junit4]   2> 1318595 INFO  (zkCallback-1452-thread-1-processing-n:127.0.0.1:44618_solr) [n:127.0.0.1:44618_solr    ] o.a.s.c.c.ZkStateReader Updated live nodes from ZooKeeper... (3) -> (4)
   [junit4]   2> 1318595 INFO  (zkCallback-1449-thread-1-processing-n:127.0.0.1:35987_solr) [n:127.0.0.1:35987_solr    ] o.a.s.c.c.ZkStateReader Updated live nodes from ZooKeeper... (3) -> (4)
   [junit4]   2> 1318595 INFO  (zkCallback-1451-thread-1-processing-n:127.0.0.1:43693_solr) [n:127.0.0.1:43693_solr    ] o.a.s.c.c.ZkStateReader Updated live nodes from ZooKeeper... (3) -> (4)
   [junit4]   2> 1318732 INFO  (jetty-launcher-1431-thread-3) [n:127.0.0.1:34652_solr    ] o.a.s.c.CorePropertiesLocator Found 0 core definitions underneath /home/jenkins/workspace/Lucene-Solr-master-Linux/solr/build/solr-core/test/J0/temp/solr.cloud.CollectionsAPISolrJTest_5DB0A3CE006A4F90-001/tempDir-001/node3/.
   [junit4]   2> 1318763 INFO  (jetty-launcher-1431-thread-2) [n:127.0.0.1:44618_solr    ] o.a.s.c.CorePropertiesLocator Found 0 core definitions underneath /home/jenkins/workspace/Lucene-Solr-master-Linux/solr/build/solr-core/test/J0/temp/solr.cloud.CollectionsAPISolrJTest_5DB0A3CE006A4F90-001/tempDir-001/node2/.
   [junit4]   2> 1318781 INFO  (jetty-launcher-1431-thread-1) [n:127.0.0.1:43693_solr    ] o.a.s.c.CorePropertiesLocator Found 0 core definitions underneath /home/jenkins/workspace/Lucene-Solr-master-Linux/solr/build/solr-core/test/J0/temp/solr.cloud.CollectionsAPISolrJTest_5DB0A3CE006A4F90-001/tempDir-001/node1/.
   [junit4]   2> 1318995 INFO  (jetty-launcher-1431-thread-4) [n:127.0.0.1:35987_solr    ] o.a.s.c.CorePropertiesLocator Found 0 core definitions underneath /home/jenkins/workspace/Lucene-Solr-master-Linux/solr/build/solr-core/test/J0/temp/solr.cloud.CollectionsAPISolrJTest_5DB0A3CE006A4F90-001/tempDir-001/node4/.
   [junit4]   2> 1319559 WARN  (NIOServerCxn.Factory:0.0.0.0/0.0.0.0:0) [    ] o.a.z.s.NIOServerCnxn caught end of stream exception
   [junit4]   2> EndOfStreamException: Unable to read additional data from client sessionid 0x15979f7ae06000d, likely client has closed socket
   [junit4]   2> 	at org.apache.zookeeper.server.NIOServerCnxn.doIO(NIOServerCnxn.java:228)
   [junit4]   2> 	at org.apache.zookeeper.server.NIOServerCnxnFactory.run(NIOServerCnxnFactory.java:208)
   [junit4]   2> 	at java.lang.Thread.run(Thread.java:745)
   [junit4]   2> 1319563 INFO  (SUITE-CollectionsAPISolrJTest-seed#[5DB0A3CE006A4F90]-worker) [    ] o.a.s.c.c.ZkStateReader Updated live nodes from ZooKeeper... (0) -> (4)
   [junit4]   2> 1319564 INFO  (SUITE-CollectionsAPISolrJTest-seed#[5DB0A3CE006A4F90]-worker) [    ] o.a.s.c.s.i.ZkClientClusterStateProvider Cluster at 127.0.0.1:40317/solr ready
   [junit4]   2> 1319586 INFO  (TEST-CollectionsAPISolrJTest.testAddAndRemoveRole-seed#[5DB0A3CE006A4F90]) [    ] o.a.s.SolrTestCaseJ4 ###Starting testAddAndRemoveRole
   [junit4]   2> 1319693 INFO  (qtp26755048-9398) [n:127.0.0.1:34652_solr    ] o.a.s.h.a.CollectionsHandler Invoked Collection Action :addrole with params node=127.0.0.1:34652_solr&role=overseer&action=ADDROLE&wt=javabin&version=2 and sendToOCPQueue=true
   [junit4]   2> 1319695 INFO  (OverseerThreadFactory-4383-thread-1-processing-n:127.0.0.1:44618_solr) [n:127.0.0.1:44618_solr    ] o.a.s.c.OverseerRoleCmd Overseer role added to 127.0.0.1:34652_solr
   [junit4]   2> 1319697 INFO  (Thread-2627) [n:127.0.0.1:44618_solr    ] o.a.s.c.OverseerNodePrioritizer prioritizing overseer nodes at 97242971648688140-127.0.0.1:44618_solr-n_0000000000 overseer designates are [127.0.0.1:34652_solr]
   [junit4]   2> 1319698 INFO  (Thread-2627) [n:127.0.0.1:44618_solr    ] o.a.s.c.OverseerNodePrioritizer sorted nodes [97242971648688140-127.0.0.1:44618_solr-n_0000000000, 97242971648688139-127.0.0.1:43693_solr-n_0000000001, 97242971648688137-127.0.0.1:34652_solr-n_0000000002, 97242971648688138-127.0.0.1:35987_solr-n_0000000003]
   [junit4]   2> 1319698 INFO  (Thread-2627) [n:127.0.0.1:44618_solr    ] o.a.s.c.OverseerNodePrioritizer asking node 97242971648688137-127.0.0.1:34652_solr-n_0000000002 to come join election at head
   [junit4]   2> 1319698 INFO  (qtp26755048-9398) [n:127.0.0.1:34652_solr    ] o.a.s.s.HttpSolrCall [admin] webapp=null path=/admin/collections params={node=127.0.0.1:34652_solr&role=overseer&action=ADDROLE&wt=javabin&version=2} status=0 QTime=5
   [junit4]   2> 1319701 INFO  (qtp26755048-9413) [n:127.0.0.1:34652_solr    ] o.a.s.h.a.CollectionsHandler Invoked Collection Action :clusterstatus with params action=CLUSTERSTATUS&wt=javabin&version=2 and sendToOCPQueue=true
   [junit4]   2> 1319703 INFO  (qtp26755048-9417) [n:127.0.0.1:34652_solr    ] o.a.s.s.HttpSolrCall [admin] webapp=null path=/admin/cores params={op=rejoinAtHead&qt=/admin/cores&action=OVERSEEROP&electionNode=97242971648688137-127.0.0.1:34652_solr-n_0000000002&wt=javabin&version=2} status=0 QTime=0
   [junit4]   2> 1319703 INFO  (Thread-2627) [n:127.0.0.1:44618_solr    ] o.a.s.c.OverseerNodePrioritizer asking the old first in line 97242971648688139-127.0.0.1:43693_solr-n_0000000001 to rejoin election  
   [junit4]   2> 1319703 INFO  (qtp26755048-9413) [n:127.0.0.1:34652_solr    ] o.a.s.s.HttpSolrCall [admin] webapp=null path=/admin/collections params={action=CLUSTERSTATUS&wt=javabin&version=2} status=0 QTime=2
   [junit4]   2> 1319707 INFO  (qtp26755048-9398) [n:127.0.0.1:34652_solr    ] o.a.s.h.a.CollectionsHandler Invoked Collection Action :removerole with params node=127.0.0.1:34652_solr&role=overseer&action=REMOVEROLE&wt=javabin&version=2 and sendToOCPQueue=true
   [junit4]   2> 1319709 INFO  (OverseerCollectionConfigSetProcessor-97242971648688140-127.0.0.1:44618_solr-n_0000000000) [n:127.0.0.1:44618_solr    ] o.a.s.c.OverseerTaskQueue Response ZK path: /overseer/collection-queue-work/qnr-0000000000 doesn't exist.  Requestor may have disconnected from ZooKeeper
   [junit4]   2> 1319709 INFO  (OverseerThreadFactory-4383-thread-2-processing-n:127.0.0.1:44618_solr) [n:127.0.0.1:44618_solr    ] o.a.s.c.OverseerRoleCmd Overseer role removed from 127.0.0.1:34652_solr
   [junit4]   2> 1319711 INFO  (qtp26755048-9398) [n:127.0.0.1:34652_solr    ] o.a.s.s.HttpSolrCall [admin] webapp=null path=/admin/collections params={node=127.0.0.1:34652_solr&role=overseer&action=REMOVEROLE&wt=javabin&version=2} status=0 QTime=4
   [junit4]   2> 1319712 INFO  (qtp26755048-9415) [n:127.0.0.1:34652_solr    ] o.a.s.h.a.CollectionsHandler Invoked Collection Action :clusterstatus with params action=CLUSTERSTATUS&wt=javabin&version=2 and sendToOCPQueue=true
   [junit4]   2> 1319713 INFO  (qtp26755048-9415) [n:127.0.0.1:34652_solr    ] o.a.s.s.HttpSolrCall [admin] webapp=null path=/admin/collections params={action=CLUSTERSTATUS&wt=javabin&version=2} status=0 QTime=0
   [junit4]   2> 1319713 INFO  (TEST-CollectionsAPISolrJTest.testAddAndRemoveRole-seed#[5DB0A3CE006A4F90]) [    ] o.a.s.SolrTestCaseJ4 ###Ending testAddAndRemoveRole
   [junit4]   2> 1319737 INFO  (TEST-CollectionsAPISolrJTest.testCreateAndDeleteAlias-seed#[5DB0A3CE006A4F90]) [    ] o.a.s.SolrTestCaseJ4 ###Starting testCreateAndDeleteAlias
   [junit4]   2> 1319738 INFO  (qtp26755048-9417) [n:127.0.0.1:34652_solr    ] o.a.s.h.a.CollectionsHandler Invoked Collection Action :create with params replicationFactor=1&collection.configName=conf&name=aliasedCollection&action=CREATE&numShards=1&wt=javabin&version=2 and sendToOCPQueue=true
   [junit4]   2> 1319741 INFO  (OverseerThreadFactory-4383-thread-3-processing-n:127.0.0.1:44618_solr) [n:127.0.0.1:44618_solr    ] o.a.s.c.CreateCollectionCmd Create collection aliasedCollection
   [junit4]   2> 1319741 INFO  (OverseerCollectionConfigSetProcessor-97242971648688140-127.0.0.1:44618_solr-n_0000000000) [n:127.0.0.1:44618_solr    ] o.a.s.c.OverseerTaskQueue Response ZK path: /overseer/collection-queue-work/qnr-0000000002 doesn't exist.  Requestor may have disconnected from ZooKeeper
   [junit4]   2> 1319828 INFO  (qtp10718507-9382) [n:127.0.0.1:43693_solr    ] o.a.s.s.HttpSolrCall [admin] webapp=null path=/admin/cores params={op=rejoin&qt=/admin/cores&action=OVERSEEROP&electionNode=97242971648688139-127.0.0.1:43693_solr-n_0000000001&wt=javabin&version=2} status=0 QTime=0
   [junit4]   2> 1319830 INFO  (OverseerStateUpdate-97242971648688140-127.0.0.1:44618_solr-n_0000000000) [n:127.0.0.1:44618_solr    ] o.a.s.c.Overseer Quit command received {
   [junit4]   2>   "operation":"quit",
   [junit4]   2>   "id":"97242971648688140-127.0.0.1:44618_solr-n_0000000000"} 127.0.0.1:44618_solr
   [junit4]   2> 1319846 INFO  (qtp10718507-9392) [n:127.0.0.1:43693_solr    ] o.a.s.h.a.CoreAdminOperation core create command qt=/admin/cores&collection.configName=conf&newCollection=true&name=aliasedCollection_shard1_replica1&action=CREATE&numShards=1&collection=aliasedCollection&shard=shard1&wt=javabin&version=2
   [junit4]   2> 1499741 ERROR (qtp26755048-9417) [n:127.0.0.1:34652_solr    ] o.a.s.h.RequestHandlerBase org.apache.solr.common.SolrException: create the collection time out:180s
   [junit4]   2> 	at org.apache.solr.handler.admin.CollectionsHandler.handleResponse(CollectionsHandler.java:292)
   [junit4]   2> 	at org.apache.solr.handler.admin.CollectionsHandler.handleRequestBody(CollectionsHandler.java:218)
   [junit4]   2> 	at org.apache.solr.handler.RequestHandlerBase.handleRequest(RequestHandlerBase.java:166)
   [junit4]   2> 	at org.apache.solr.servlet.HttpSolrCall.handleAdminRequest(HttpSolrCall.java:664)
   [junit4]   2> 	at org.apache.solr.servlet.HttpSolrCall.call(HttpSolrCall.java:445)
   [junit4]   2> 	at org.apache.solr.servlet.SolrDispatchFilter.doFilter(SolrDispatchFilter.java:345)
   [junit4]   2> 	at org.apache.solr.servlet.SolrDispatchFilter.doFilter(SolrDispatchFilter.java:296)
   [junit4]   2> 	at org.eclipse.jetty.servlet.ServletHandler$CachedChain.doFilter(ServletHandler.java:1699)
   [junit4]   2> 	at org.apache.solr.client.solrj.embedded.JettySolrRunner$DebugFilter.doFilter(JettySolrRunner.java:113)
   [junit4]   2> 	at org.eclipse.jetty.servlet.ServletHandler$CachedChain.doFilter(ServletHandler.java:1699)
   [junit4]   2> 	at org.eclipse.jetty.servlet.ServletHandler.doHandle(ServletHandler.java:582)
   [junit4]   2> 	at org.eclipse.jetty.server.session.SessionHandler.doHandle(SessionHandler.java:224)
   [junit4]   2> 	at org.eclipse.jetty.server.handler.ContextHandler.doHandle(ContextHandler.java:1180)
   [junit4]   2> 	at org.eclipse.jetty.servlet.ServletHandler.doScope(ServletHandler.java:512)
   [junit4]   2> 	at org.eclipse.jetty.server.session.SessionHandler.doScope(SessionHandler.java:185)
   [junit4]   2> 	at org.eclipse.jetty.server.handler.ContextHandler.doScope(ContextHandler.java:1112)
   [junit4]   2> 	at org.eclipse.jetty.server.handler.ScopedHandler.handle(ScopedHandler.java:141)
   [junit4]   2> 	at org.eclipse.jetty.server.handler.gzip.GzipHandler.handle(GzipHandler.java:462)
   [junit4]   2> 	at org.eclipse.jetty.server.handler.HandlerWrapper.handle(HandlerWrapper.java:134)
   [junit4]   2> 	at org.eclipse.jetty.server.Server.handle(Server.java:534)
   [junit4]   2> 	at org.eclipse.jetty.server.HttpChannel.handle(HttpChannel.java:320)
   [junit4]   2> 	at org.eclipse.jetty.server.HttpConnection.onFillable(HttpConnection.java:251)
   [junit4]   2> 	at org.eclipse.jetty.io.AbstractConnection$ReadCallback.succeeded(AbstractConnection.java:273)
   [junit4]   2> 	at org.eclipse.jetty.io.FillInterest.fillable(FillInterest.java:95)
   [junit4]   2> 	at org.eclipse.jetty.io.ssl.SslConnection.onFillable(SslConnection.java:202)
   [junit4]   2> 	at org.eclipse.jetty.io.AbstractConnection$ReadCallback.succeeded(AbstractConnection.java:273)
   [junit4]   2> 	at org.eclipse.jetty.io.FillInterest.fillable(FillInterest.java:95)
   [junit4]   2> 	at org.eclipse.jetty.io.SelectChannelEndPoint$2.run(SelectChannelEndPoint.java:93)
   [junit4]   2> 	at org.eclipse.jetty.util.thread.strategy.ExecuteProduceConsume.executeProduceConsume(ExecuteProduceConsume.java:303)
   [junit4]   2> 	at org.eclipse.jetty.util.thread.strategy.ExecuteProduceConsume.produceConsume(ExecuteProduceConsume.java:148)
   [junit4]   2> 	at org.eclipse.jetty.util.thread.strategy.ExecuteProduceConsume.run(ExecuteProduceConsume.java:136)
   [junit4]   2> 	at org.eclipse.jetty.util.thread.QueuedThreadPool.runJob(QueuedThreadPool.java:671)
   [junit4]   2> 	at org.eclipse.jetty.util.thread.QueuedThreadPool$2.run(QueuedThreadPool.java:589)
   [junit4]   2> 	at java.lang.Thread.run(Thread.java:745)
   [junit4]   2> 
   [junit4]   2> 1499741 INFO  (qtp26755048-9417) [n:127.0.0.1:34652_solr    ] o.a.s.s.HttpSolrCall [admin] webapp=null path=/admin/collections params={replicationFactor=1&collection.configName=conf&name=aliasedCollection&action=CREATE&numShards=1&wt=javabin&version=2} status=500 QTime=180003
   [junit4]   2> 1499741 ERROR (qtp26755048-9417) [n:127.0.0.1:34652_solr    ] o.a.s.s.HttpSolrCall null:org.apache.solr.common.SolrException: create the collection time out:180s
   [junit4]   2> 	at org.apache.solr.handler.admin.CollectionsHandler.handleResponse(CollectionsHandler.java:292)
   [junit4]   2> 	at org.apache.solr.handler.admin.CollectionsHandler.handleRequestBody(CollectionsHandler.java:218)
   [junit4]   2> 	at org.apache.solr.handler.RequestHandlerBase.handleRequest(RequestHandlerBase.java:166)
   [junit4]   2> 	at org.apache.solr.servlet.HttpSolrCall.handleAdminRequest(HttpSolrCall.java:664)
   [junit4]   2> 	at org.apache.solr.servlet.HttpSolrCall.call(HttpSolrCall.java:445)
   [junit4]   2> 	at org.apache.solr.servlet.SolrDispatchFilter.doFilter(SolrDispatchFilter.java:345)
   [junit4]   2> 	at org.apache.solr.servlet.SolrDispatchFilter.doFilter(SolrDispatchFilter.java:296)
   [junit4]   2> 	at org.eclipse.jetty.servlet.ServletHandler$CachedChain.doFilter(ServletHandler.java:1699)
   [junit4]   2> 	at org.apache.solr.client.solrj.embedded.JettySolrRunner$DebugFilter.doFilter(JettySolrRunner.java:113)
   [junit4]   2> 	at org.eclipse.jetty.servlet.ServletHandler$CachedChain.doFilter(ServletHandler.java:1699)
   [junit4]   2> 	at org.eclipse.jetty.servlet.ServletHandler.doHandle(ServletHandler.java:582)
   [junit4]   2> 	at org.eclipse.jetty.server.session.SessionHandler.doHandle(SessionHandler.java:224)
   [junit4]   2> 	at org.eclipse.jetty.server.handler.ContextHandler.doHandle(ContextHandler.java:1180)
   [junit4]   2> 	at org.eclipse.jetty.servlet.ServletHandler.doScope(ServletHandler.java:512)
   [junit4]   2> 	at org.eclipse.jetty.server.session.SessionHandler.doScope(SessionHandler.java:185)
   [junit4]   2> 	at org.eclipse.jetty.server.handler.ContextHandler.doScope(ContextHandler.java:1112)
   [junit4]   2> 	at org.eclipse.jetty.server.handler.ScopedHandler.handle(ScopedHandler.java:141)
   [junit4]   2> 	at org.eclipse.jetty.server.handler.gzip.GzipHandler.handle(GzipHandler.java:462)
   [junit4]   2> 	at org.eclipse.jetty.server.handler.HandlerWrapper.handle(HandlerWrapper.java:134)
   [junit4]   2> 	at org.eclipse.jetty.server.Server.handle(Server.java:534)
   [junit4]   2> 	at org.eclipse.jetty.server.HttpChannel.handle(HttpChannel.java:320)
   [junit4]   2> 	at org.eclipse.jetty.server.HttpConnection.onFillable(HttpConnection.java:251)
   [junit4]   2> 	at org.eclipse.jetty.io.AbstractConnection$ReadCallback.succeeded(AbstractConnection.java:273)
   [junit4]   2> 	at org.eclipse.jetty.io.FillInterest.fillable(FillInterest.java:95)
   [junit4]   2> 	at org.eclipse.jetty.io.ssl.SslConnection.onFillable(SslConnection.java:202)
   [junit4]   2> 	at org.eclipse.jetty.io.AbstractConnection$ReadCallback.succeeded(AbstractConnection.java:273)
   [junit4]   2> 	at org.eclipse.jetty.io.FillInterest.fillable(FillInterest.java:95)
   [junit4]   2> 	at org.eclipse.jetty.io.SelectChannelEndPoint$2.run(SelectChannelEndPoint.java:93)
   [junit4]   2> 	at org.eclipse.jetty.util.thread.strategy.ExecuteProduceConsume.executeProduceConsume(ExecuteProduceConsume.java:303)
   [junit4]   2> 	at org.eclipse.jetty.util.thread.strategy.ExecuteProduceConsume.produceConsume(ExecuteProduceConsume.java:148)
   [junit4]   2> 	at org.eclipse.jetty.util.thread.strategy.ExecuteProduceConsume.run(ExecuteProduceConsume.java:136)
   [junit4]   2> 	at org.eclipse.jetty.util.thread.QueuedThreadPool.runJob(QueuedThreadPool.java:671)
   [junit4]   2> 	at org.eclipse.jetty.util.thread.QueuedThreadPool$2.run(QueuedThreadPool.java:589)
   [junit4]   2> 	at java.lang.Thread.run(Thread.java:745)
   [junit4]   2> 
   [junit4]   2> 1499743 INFO  (TEST-CollectionsAPISolrJTest.testCreateAndDeleteAlias-seed#[5DB0A3CE006A4F90]) [    ] o.a.s.SolrTestCaseJ4 ###Ending testCreateAndDeleteAlias
   [junit4]   2> NOTE: reproduce with: ant test  -Dtestcase=CollectionsAPISolrJTest -Dtests.method=testCreateAndDeleteAlias -Dtests.seed=5DB0A3CE006A4F90 -Dtests.multiplier=3 -Dtests.slow=true -Dtests.locale=ru-RU -Dtests.timezone=Africa/Nouakchott -Dtests.asserts=true -Dtests.file.encoding=US-ASCII
   [junit4] ERROR    180s J0 | CollectionsAPISolrJTest.testCreateAndDeleteAlias <<<
   [junit4]    > Throwable #1: org.apache.solr.client.solrj.impl.HttpSolrClient$RemoteSolrException: Error from server at https://127.0.0.1:34652/solr: create the collection time out:180s
   [junit4]    > 	at __randomizedtesting.SeedInfo.seed([5DB0A3CE006A4F90:9353E434A0D5BE0B]:0)
   [junit4]    > 	at org.apache.solr.client.solrj.impl.HttpSolrClient.executeMethod(HttpSolrClient.java:627)
   [junit4]    > 	at org.apache.solr.client.solrj.impl.HttpSolrClient.request(HttpSolrClient.java:279)
   [junit4]    > 	at org.apache.solr.client.solrj.impl.HttpSolrClient.request(HttpSolrClient.java:268)
   [junit4]    > 	at org.apache.solr.client.solrj.impl.LBHttpSolrClient.doRequest(LBHttpSolrClient.java:439)
   [junit4]    > 	at org.apache.solr.client.solrj.impl.LBHttpSolrClient.request(LBHttpSolrClient.java:391)
   [junit4]    > 	at org.apache.solr.client.solrj.impl.CloudSolrClient.sendRequest(CloudSolrClient.java:1344)
   [junit4]    > 	at org.apache.solr.client.solrj.impl.CloudSolrClient.requestWithRetryOnStaleState(CloudSolrClient.java:1095)
   [junit4]    > 	at org.apache.solr.client.solrj.impl.CloudSolrClient.request(CloudSolrClient.java:1037)
   [junit4]    > 	at org.apache.solr.client.solrj.SolrRequest.process(SolrRequest.java:149)
   [junit4]    > 	at org.apache.solr.client.solrj.SolrRequest.process(SolrRequest.java:166)
   [junit4]    > 	at org.apache.solr.cloud.CollectionsAPISolrJTest.testCreateAndDeleteAlias(CollectionsAPISolrJTest.java:128)
   [junit4]    > 	at java.lang.Thread.run(Thread.java:745)
   [junit4]   2> 1499761 INFO  (TEST-CollectionsAPISolrJTest.testList-seed#[5DB0A3CE006A4F90]) [    ] o.a.s.SolrTestCaseJ4 ###Starting testList
   [junit4]   2> 1499761 INFO  (qtp26755048-9413) [n:127.0.0.1:34652_solr    ] o.a.s.h.a.CollectionsHandler Invoked Collection Action :list with params action=LIST&wt=javabin&version=2 and sendToOCPQueue=true
   [junit4]   2> 1499762 INFO  (qtp26755048-9413) [n:127.0.0.1:34652_solr    ] o.a.s.s.HttpSolrCall [admin] webapp=null path=/admin/collections params={action=LIST&wt=javabin&version=2} status=0 QTime=0
   [junit4]   2> 1499762 INFO  (TEST-CollectionsAPISolrJTest.testList-seed#[5DB0A3CE006A4F90]) [    ] o.a.s.SolrTestCaseJ4 ###Ending testList
   [junit4]   2> 1499777 INFO  (TEST-CollectionsAPISolrJTest.testCreateAndDeleteShard-seed#[5DB0A3CE006A4F90]) [    ] o.a.s.SolrTestCaseJ4 ###Starting testCreateAndDeleteShard
   [junit4]   2> 1499777 INFO  (qtp26755048-9492) [n:127.0.0.1:34652_solr    ] o.a.s.h.a.CollectionsHandler Invoked Collection Action :create with params shards=shardA,shardB&replicationFactor=1&collection.configName=conf&name=solrj_implicit&router.name=implicit&action=CREATE&wt=javabin&version=2 and sendToOCPQueue=true
   [junit4]   2> 1679780 ERROR (qtp26755048-9492) [n:127.0.0.1:34652_solr    ] o.a.s.h.RequestHandlerBase org.apache.solr.common.SolrException: create the collection time out:180s
   [junit4]   2> 	at org.apache.solr.handler.admin.CollectionsHandler.handleResponse(CollectionsHandler.java:292)
   [junit4]   2> 	at org.apache.solr.handler.admin.CollectionsHandler.handleRequestBody(CollectionsHandler.java:218)
   [junit4]   2> 	at org.apache.solr.handler.RequestHandlerBase.handleRequest(RequestHandlerBase.java:166)
   [junit4]   2> 	at org.apache.solr.servlet.HttpSolrCall.handleAdminRequest(HttpSolrCall.java:664)
   [junit4]   2> 	at org.apache.solr.servlet.HttpSolrCall.call(HttpSolrCall.java:445)
   [junit4]   2> 	at org.apache.solr.servlet.SolrDispatchFilter.doFilter(SolrDispatchFilter.java:345)
   [junit4]   2> 	at org.apache.solr.servlet.SolrDispatchFilter.doFilter(SolrDispatchFilter.java:296)
   [junit4]   2> 	at org.eclipse.jetty.servlet.ServletHandler$CachedChain.doFilter(ServletHandler.java:1699)
   [junit4]   2> 	at org.apache.solr.client.solrj.embedded.JettySolrRunner$DebugFilter.doFilter(JettySolrRunner.java:113)
   [junit4]   2> 	at org.eclipse.jetty.servlet.ServletHandler$CachedChain.doFilter(ServletHandler.java:1699)
   [junit4]   2> 	at org.eclipse.jetty.servlet.ServletHandler.doHandle(ServletHandler.java:582)
   [junit4]   2> 	at org.eclipse.jetty.server.session.SessionHandler.doHandle(SessionHandler.java:224)
   [junit4]   2> 	at org.eclipse.jetty.server.handler.ContextHandler.doHandle(ContextHandler.java:1180)
   [junit4]   2> 	at org.eclipse.jetty.servlet.ServletHandler.doScope(ServletHandler.java:512)
   [junit4]   2> 	at org.eclipse.jetty.server.session.SessionHandler.doScope(SessionHandler.java:185)
   [junit4]   2> 	at org.eclipse.jetty.server.handler.ContextHandler.doScope(ContextHandler.java:1112)
   [junit4]   2> 	at org.eclipse.jetty.server.handler.ScopedHandler.handle(ScopedHandler.java:141)
   [junit4]   2> 	at org.eclipse.jetty.server.handler.gzip.GzipHandler.handle(GzipHandler.java:462)
   [junit4]   2> 	at org.eclipse.jetty.server.handler.HandlerWrapper.handle(HandlerWrapper.java:134)
   [junit4]   2> 	at org.eclipse.jetty.server.Server.handle(Server.java:534)
   [junit4]   2> 	at org.eclipse.jetty.server.HttpChannel.handle(HttpChannel.java:320)
   [junit4]   2> 	at org.eclipse.jetty.server.HttpConnection.onFillable(HttpConnection.java:251)
   [junit4]   2> 	at org.eclipse.jetty.io.AbstractConnection$ReadCallback.succeeded(AbstractConnection.java:273)
   [junit4]   2> 	at org.eclipse.jetty.io.FillInterest.fillable(FillInterest.java:95)
   [junit4]   2> 	at org.eclipse.jetty.io.ssl.SslConnection.onFillable(SslConnection.java:202)
   [junit4]   2> 	at org.eclipse.jetty.io.AbstractConnection$ReadCallback.succeeded(AbstractConnection.java:273)
   [junit4]   2> 	at org.eclipse.jetty.io.FillInterest.fillable(FillInterest.java:95)
   [junit4]   2> 	at org.eclipse.jetty.io.SelectChannelEndPoint$2.run(SelectChannelEndPoint.java:93)
   [junit4]   2> 	at org.eclipse.jetty.util.thread.strategy.ExecuteProduceConsume.executeProduceConsume(ExecuteProduceConsume.java:303)
   [junit4]   2> 	at org.eclipse.jetty.util.thread.strategy.ExecuteProduceConsume.produceConsume(ExecuteProduceConsume.java:148)
   [junit4]   2> 	at org.eclipse.jetty.util.thread.strategy.ExecuteProduceConsume.run(ExecuteProduceConsume.java:136)
   [junit4]   2> 	at org.eclipse.jetty.util.thread.QueuedThreadPool.runJob(QueuedThreadPool.java:671)
   [junit4]   2> 	at org.eclipse.jetty.util.thread.QueuedThreadPool$2.run(QueuedThreadPool.java:589)
   [junit4]   2> 	at java.lang.Thread.run(Thread.java:745)
   [junit4]   2> 
   [junit4]   2> 1679781 INFO  (qtp26755048-9492) [n:127.0.0.1:34652_solr    ] o.a.s.s.HttpSolrCall [admin] webapp=null path=/admin/collections params={shards=shardA,shardB&replicationFactor=1&collection.configName=conf&name=solrj_implicit&router.name=implicit&action=CREATE&wt=javabin&version=2} status=500 QTime=180003
   [junit4]   2> 1679781 ERROR (qtp26755048-9492) [n:127.0.0.1:34652_solr    ] o.a.s.s.HttpSolrCall null:org.apache.solr.common.SolrException: create the collection time out:180s
   [junit4]   2> 	at org.apache.solr.handler.admin.CollectionsHandler.handleResponse(CollectionsHandler.java:292)
   [junit4]   2> 	at org.apache.solr.handler.admin.CollectionsHandler.handleRequestBody(CollectionsHandler.java:218)
   [junit4]   2> 	at org.apache.solr.handler.RequestHandlerBase.handleRequest(RequestHandlerBase.java:166)
   [junit4]   2> 	at org.apache.solr.servlet.HttpSolrCall.handleAdminRequest(HttpSolrCall.java:664)
   [junit4]   2> 	at org.apache.solr.servlet.HttpSolrCall.call(HttpSolrCall.java:445)
   [junit4]   2> 	at org.apache.solr.servlet.SolrDispatchFilter.doFilter(SolrDispatchFilter.java:345)
   [junit4]   2> 	at org.apache.solr.servlet.SolrDispatchFilter.doFilter(SolrDispatchFilter.java:296)
   [junit4]   2> 	at org.eclipse.jetty.servlet.ServletHandler$CachedChain.doFilter(ServletHandler.java:1699)
   [junit4]   2> 	at org.apache.solr.client.solrj.embedded.JettySolrRunner$DebugFilter.doFilter(JettySolrRunner.java:113)
   [junit4]   2> 	at org.eclipse.jetty.servlet.ServletHandler$CachedChain.doFilter(ServletHandler.java:1699)
   [junit4]   2> 	at org.eclipse.jetty.servlet.ServletHandler.doHandle(ServletHandler.java:582)
   [junit4]   2> 	at org.eclipse.jetty.server.session.SessionHandler.doHandle(SessionHandler.java:224)
   [junit4]   2> 	at org.eclipse.jetty.server.handler.ContextHandler.doHandle(ContextHandler.java:1180)
   [junit4]   2> 	at org.eclipse.jetty.servlet.ServletHandler.doScope(ServletHandler.java:512)
   [junit4]   2> 	at org.eclipse.jetty.server.session.SessionHandler.doScope(SessionHandler.java:185)
   [junit4]   2> 	at org.eclipse.jetty.server.handler.ContextHandler.doScope(ContextHandler.java:1112)
   [junit4]   2> 	at org.eclipse.jetty.server.handler.ScopedHandler.handle(ScopedHandler.java:141)
   [junit4]   2> 	at org.eclipse.jetty.server.handler.gzip.GzipHandler.handle(GzipHandler.java:462)
   [junit4]   2> 	at org.eclipse.jetty.server.handler.HandlerWrapper.handle(HandlerWrapper.java:134)
   [junit4]   2> 	at org.eclipse.jetty.server.Server.handle(Server.java:534)
   [junit4]   2> 	at org.eclipse.jetty.server.HttpChannel.handle(HttpChannel.java:320)
   [junit4]   2> 	at org.eclipse.jetty.server.HttpConnection.onFillable(HttpConnection.java:251)
   [junit4]   2> 	at org.eclipse.jetty.io.AbstractConnection$ReadCallback.succeeded(AbstractConnection.java:273)
   [junit4]   2> 	at org.eclipse.jetty.io.FillInterest.fillable(FillInterest.java:95)
   [junit4]   2> 	at org.eclipse.jetty.io.ssl.SslConnection.onFillable(SslConnection.java:202)
   [junit4]   2> 	at org.eclipse.jetty.io.AbstractConnection$ReadCallback.succeeded(AbstractConnection.java:273)
   [junit4]   2> 	at org.eclipse.jetty.io.FillInterest.fillable(FillInterest.java:95)
   [junit4]   2> 	at org.eclipse.jetty.io.SelectChannelEndPoint$2.run(SelectChannelEndPoint.java:93)
   [junit4]   2> 	at org.eclipse.jetty.util.thread.strategy.ExecuteProduceConsume.executeProduceConsume(ExecuteProduceConsume.java:303)
   [junit4]   2> 	at org.eclipse.jetty.util.thread.strategy.ExecuteProduceConsume.produceConsume(ExecuteProduceConsume.java:148)
   [junit4]   2> 	at org.eclipse.jetty.util.thread.strategy.ExecuteProduceConsume.run(ExecuteProduceConsume.java:136)
   [junit4]   2> 	at org.eclipse.jetty.util.thread.QueuedThreadPool.runJob(QueuedThreadPool.java:671)
   [junit4]   2> 	at org.eclipse.jetty.util.thread.QueuedThreadPool$2.run(QueuedThreadPool.java:589)
   [junit4]   2> 	at java.lang.Thread.run(Thread.java:745)
   [junit4]   2> 
   [junit4]   2> 1679783 INFO  (TEST-CollectionsAPISolrJTest.testCreateAndDeleteShard-seed#[5DB0A3CE006A4F90]) [    ] o.a.s.SolrTestCaseJ4 ###Ending testCreateAndDeleteShard
   [junit4]   2> NOTE: reproduce with: ant test  -Dtestcase=CollectionsAPISolrJTest -Dtests.method=testCreateAndDeleteShard -Dtests.seed=5DB0A3CE006A4F90 -Dtests.multiplier=3 -Dtests.slow=true -Dtests.locale=ru-RU -Dtests.timezone=Africa/Nouakchott -Dtests.asserts=true -Dtests.file.encoding=US-ASCII
   [junit4] ERROR    180s J0 | CollectionsAPISolrJTest.testCreateAndDeleteShard <<<
   [junit4]    > Throwable #1: org.apache.solr.client.solrj.impl.HttpSolrClient$RemoteSolrException: Error from server at https://127.0.0.1:34652/solr: create the collection time out:180s
   [junit4]    > 	at __randomizedtesting.SeedInfo.seed([5DB0A3CE006A4F90:98EE17D2869F856D]:0)
   [junit4]    > 	at org.apache.solr.client.solrj.impl.HttpSolrClient.executeMethod(HttpSolrClient.java:627)
   [junit4]    > 	at org.apache.solr.client.solrj.impl.HttpSolrClient.request(HttpSolrClient.java:279)
   [junit4]    > 	at org.apache.solr.client.solrj.impl.HttpSolrClient.request(HttpSolrClient.java:268)
   [junit4]    > 	at org.apache.solr.client.solrj.impl.LBHttpSolrClient.doRequest(LBHttpSolrClient.java:439)
   [junit4]    > 	at org.apache.solr.client.solrj.impl.LBHttpSolrClient.request(LBHttpSolrClient.java:391)
   [junit4]    > 	at org.apache.solr.client.solrj.impl.CloudSolrClient.sendRequest(CloudSolrClient.java:1344)
   [junit4]    > 	at org.apache.solr.client.solrj.impl.CloudSolrClient.requestWithRetryOnStaleState(CloudSolrClient.java:1095)
   [junit4]    > 	at org.apache.solr.client.solrj.impl.CloudSolrClient.request(CloudSolrClient.java:1037)
   [junit4]    > 	at org.apache.solr.client.solrj.SolrRequest.process(SolrRequest.java:149)
   [junit4]    > 	at org.apache.solr.client.solrj.SolrRequest.process(SolrRequest.java:166)
   [junit4]    > 	at org.apache.solr.cloud.CollectionsAPISolrJTest.testCreateAndDeleteShard(CollectionsAPISolrJTest.java:100)
   [junit4]    > 	at java.lang.Thread.run(Thread.java:745)
   [junit4]   2> 1679800 INFO  (TEST-CollectionsAPISolrJTest.testBalanceShardUnique-seed#[5DB0A3CE006A4F90]) [    ] o.a.s.SolrTestCaseJ4 ###Starting testBalanceShardUnique
   [junit4]   2> 1679802 INFO  (qtp26755048-9415) [n:127.0.0.1:34652_solr    ] o.a.s.h.a.CollectionsHandler Invoked Collection Action :create with params replicationFactor=2&collection.configName=conf&name=balancedProperties&action=CREATE&numShards=2&wt=javabin&version=2 and sendToOCPQueue=true
   [junit4]   2> 1859805 ERROR (qtp26755048-9415) [n:127.0.0.1:34652_solr    ] o.a.s.h.RequestHandlerBase org.apache.solr.common.SolrException: create the collection time out:180s
   [junit4]   2> 	at org.apache.solr.handler.admin.CollectionsHandler.handleResponse(CollectionsHandler.java:292)
   [junit4]   2> 	at org.apache.solr.handler.admin.CollectionsHandler.handleRequestBody(CollectionsHandler.java:218)
   [junit4]   2> 	at org.apache.solr.handler.RequestHandlerBase.handleRequest(RequestHandlerBase.java:166)
   [junit4]   2> 	at org.apache.solr.servlet.HttpSolrCall.handleAdminRequest(HttpSolrCall.java:664)
   [junit4]   2> 	at org.apache.solr.servlet.HttpSolrCall.call(HttpSolrCall.java:445)
   [junit4]   2> 	at org.apache.solr.servlet.SolrDispatchFilter.doFilter(SolrDispatchFilter.java:345)
   [junit4]   2> 	at org.apache.solr.servlet.SolrDispatchFilter.doFilter(SolrDispatchFilter.java:296)
   [junit4]   2> 	at org.eclipse.jetty.servlet.ServletHandler$CachedChain.doFilter(ServletHandler.java:1699)
   [junit4]   2> 	at org.apache.solr.client.solrj.embedded.JettySolrRunner$DebugFilter.doFilter(JettySolrRunner.java:113)
   [junit4]   2> 	at org.eclipse.jetty.servlet.ServletHandler$CachedChain.doFilter(ServletHandler.java:1699)
   [junit4]   2> 	at org.eclipse.jetty.servlet.ServletHandler.doHandle(ServletHandler.java:582)
   [junit4]   2> 	at org.eclipse.jetty.server.session.SessionHandler.doHandle(SessionHandler.java:224)
   [junit4]   2> 	at org.eclipse.jetty.server.handler.ContextHandler.doHandle(ContextHandler.java:1180)
   [junit4]   2> 	at org.eclipse.jetty.servlet.ServletHandler.doScope(ServletHandler.java:512)
   [junit4]   2> 	at org.eclipse.jetty.server.session.SessionHandler.doScope(SessionHandler.java:185)
   [junit4]   2> 	at org.eclipse.jetty.server.handler.ContextHandler.doScope(ContextHandler.java:1112)
   [junit4]   2> 	at org.eclipse.jetty.server.handler.ScopedHandler.handle(ScopedHandler.java:141)
   [junit4]   2> 	at org.eclipse.jetty.server.handler.gzip.GzipHandler.handle(GzipHandler.java:462)
   [junit4]   2> 	at org.eclipse.jetty.server.handler.HandlerWrapper.handle(HandlerWrapper.java:134)
   [junit4]   2> 	at org.eclipse.jetty.server.Server.handle(Server.java:534)
   [junit4]   2> 	at org.eclipse.jetty.server.HttpChannel.handle(HttpChannel.java:320)
   [junit4]   2> 	at org.eclipse.jetty.server.HttpConnection.onFillable(HttpConnection.java:251)
   [junit4]   2> 	at org.eclipse.jetty.io.AbstractConnection$ReadCallback.succeeded(AbstractConnection.java:273)
   [junit4]   2> 	at org.eclipse.jetty.io.FillInterest.fillable(FillInterest.java:95)
   [junit4]   2> 	at org.eclipse.jetty.io.ssl.SslConnection.onFillable(SslConnection.java:202)
   [junit4]   2> 	at org.eclipse.jetty.io.AbstractConnection$ReadCallback.succeeded(AbstractConnection.java:273)
   [junit4]   2> 	at org.eclipse.jetty.io.FillInterest.fillable(FillInterest.java:95)
   [junit4]   2> 	at org.eclipse.jetty.io.SelectChannelEndPoint$2.run(SelectChannelEndPoint.java:93)
   [junit4]   2> 	at org.eclipse.jetty.util.thread.strategy.ExecuteProduceConsume.executeProduceConsume(ExecuteProduceConsume.java:303)
   [junit4]   2> 	at org.eclipse.jetty.util.thread.strategy.ExecuteProduceConsume.produceConsume(ExecuteProduceConsume.java:148)
   [junit4]   2> 	at org.eclipse.jetty.util.thread.strategy.ExecuteProduceConsume.run(ExecuteProduceConsume.java:136)
   [junit4]   2> 	at org.eclipse.jetty.util.thread.QueuedThreadPool.runJob(QueuedThreadPool.java:671)
   [junit4]   2> 	at org.eclipse.jetty.util.thread.QueuedThreadPool$2.run(QueuedThreadPool.java:589)
   [junit4]   2> 	at java.lang.Thread.run(Thread.java:745)
   [junit4]   2> 
   [junit4]   2> 1859805 INFO  (qtp26755048-9415) [n:127.0.0.1:34652_solr    ] o.a.s.s.HttpSolrCall [admin] webapp=null path=/admin/collections params={replicationFactor=2&collection.configName=conf&name=balancedProperties&action=CREATE&numShards=2&wt=javabin&version=2} status=500 QTime=180003
   [junit4]   2> 1859805 ERROR (qtp26755048-9415) [n:127.0.0.1:34652_solr    ] o.a.s.s.HttpSolrCall null:org.apache.solr.common.SolrException: create the collection time out:180s
   [junit4]   2> 	at org.apache.solr.handler.admin.CollectionsHandler.handleResponse(CollectionsHandler.java:292)
   [junit4]   2> 	at org.apache.solr.handler.admin.CollectionsHandler.handleRequestBody(CollectionsHandler.java:218)
   [junit4]   2> 	at org.apache.solr.handler.RequestHandlerBase.handleRequest(RequestHandlerBase.java:166)
   [junit4]   2> 	at org.apache.solr.servlet.HttpSolrCall.handleAdminRequest(HttpSolrCall.java:664)
   [junit4]   2> 	at org.apache.solr.servlet.HttpSolrCall.call(HttpSolrCall.java:445)
   [junit4]   2> 	at org.apache.solr.servlet.SolrDispatchFilter.doFilter(SolrDispatchFilter.java:345)
   [junit4]   2> 	at org.apache.solr.servlet.SolrDispatchFilter.doFilter(SolrDispatchFilter.java:296)
   [junit4]   2> 	at org.eclipse.jetty.servlet.ServletHandler$CachedChain.doFilter(ServletHandler.java:1699)
   [junit4]   2> 	at org.apache.solr.client.solrj.embedded.JettySolrRunner$DebugFilter.doFilter(JettySolrRunner.java:113)
   [junit4]   2> 	at org.eclipse.jetty.servlet.ServletHandler$CachedChain.doFilter(ServletHandler.java:1699)
   [junit4]   2> 	at org.eclipse.jetty.servlet.ServletHandler.doHandle(ServletHandler.java:582)
   [junit4]   2> 	at org.eclipse.jetty.server.session.SessionHandler.doHandle(SessionHandler.java:224)
   [junit4]   2> 	at org.eclipse.jetty.server.handler.ContextHandler.doHandle(ContextHandler.java:1180)
   [junit4]   2> 	at org.eclipse.jetty.servlet.ServletHandler.doScope(ServletHandler.java:512)
   [junit4]   2> 	at org.eclipse.jetty.server.session.SessionHandler.doScope(SessionHandler.java:185)
   [junit4]   2> 	at org.eclipse.jetty.server.handler.ContextHandler.doScope(ContextHandler.java:1112)
   [junit4]   2> 	at org.eclipse.jetty.server.handler.ScopedHandler.handle(ScopedHandler.java:141)
   [junit4]   2> 	at org.eclipse.jetty.server.handler.gzip.GzipHandler.handle(GzipHandler.java:462)
   [junit4]   2> 	at org.eclipse.jetty.server.handler.HandlerWrapper.handle(HandlerWrapper.java:134)
   [junit4]   2> 	at org.eclipse.jetty.server.Server.handle(Server.java:534)
   [junit4]   2> 	at org.eclipse.jetty.server.HttpChannel.handle(HttpChannel.java:320)
   [junit4]   2> 	at org.eclipse.jetty.server.HttpConnection.onFillable(HttpConnection.java:251)
   [junit4]   2> 	at org.eclipse.jetty.io.AbstractConnection$ReadCallback.succeeded(AbstractConnection.java:273)
   [junit4]   2> 	at org.eclipse.jetty.io.FillInterest.fillable(FillInterest.java:95)
   [junit4]   2> 	at org.eclipse.jetty.io.ssl.SslConnection.onFillable(SslConnection.java:202)
   [junit4]   2> 	at org.eclipse.jetty.io.AbstractConnection$ReadCallback.succeeded(AbstractConnection.java:273)
   [junit4]   2> 	at org.eclipse.jetty.io.FillInterest.fillable(FillInterest.java:95)
   [junit4]   2> 	at org.eclipse.jetty.io.SelectChannelEndPoint$2.run(SelectChannelEndPoint.java:93)
   [junit4]   2> 	at org.eclipse.jetty.util.thread.strategy.ExecuteProduceConsume.executeProduceConsume(ExecuteProduceConsume.java:303)
   [junit4]   2> 	at org.eclipse.jetty.util.thread.strategy.ExecuteProduceConsume.produceConsume(ExecuteProduceConsume.java:148)
   [junit4]   2> 	at org.eclipse.jetty.util.thread.strategy.ExecuteProduceConsume.run(ExecuteProduceConsume.java:136)
   [junit4]   2> 	at org.eclipse.jetty.util.thread.QueuedThreadPool.runJob(QueuedThreadPool.java:671)
   [junit4]   2> 	at org.eclipse.jetty.util.thread.QueuedThreadPool$2.run(QueuedThreadPool.java:589)
   [junit4]   2> 	at java.lang.Thread.run(Thread.java:745)
   [junit4]   2> 
   [junit4]   2> 1859807 INFO  (TEST-CollectionsAPISolrJTest.testBalanceShardUnique-seed#[5DB0A3CE006A4F90]) [    ] o.a.s.SolrTestCaseJ4 ###Ending testBalanceShardUnique
   [junit4]   2> NOTE: reproduce with: ant test  -Dtestcase=CollectionsAPISolrJTest -Dtests.method=testBalanceShardUnique -Dtests.seed=5DB0A3CE006A4F90 -Dtests.multiplier=3 -Dtests.slow=true -Dtests.locale=ru-RU -Dtests.timezone=Africa/Nouakchott -Dtests.asserts=true -Dtests.file.encoding=US-ASCII
   [junit4] ERROR    180s J0 | CollectionsAPISolrJTest.testBalanceShardUnique <<<
   [junit4]    > Throwable #1: org.apache.solr.client.solrj.impl.HttpSolrClient$RemoteSolrException: Error from server at https://127.0.0.1:34652/solr: create the collection time out:180s
   [junit4]    > 	at __randomizedtesting.SeedInfo.seed([5DB0A3CE006A4F90:15081583BACAE753]:0)
   [junit4]    > 	at org.apache.solr.client.solrj.impl.HttpSolrClient.executeMethod(HttpSolrClient.java:627)
   [junit4]    > 	at org.apache.solr.client.solrj.impl.HttpSolrClient.request(HttpSolrClient.java:279)
   [junit4]    > 	at org.apache.solr.client.solrj.impl.HttpSolrClient.request(HttpSolrClient.java:268)
   [junit4]    > 	at org.apache.solr.client.solrj.impl.LBHttpSolrClient.doRequest(LBHttpSolrClient.java:439)
   [junit4]    > 	at org.apache.solr.client.solrj.impl.LBHttpSolrClient.request(LBHttpSolrClient.java:391)
   [junit4]    > 	at org.apache.solr.client.solrj.impl.CloudSolrClient.sendRequest(CloudSolrClient.java:1344)
   [junit4]    > 	at org.apache.solr.client.solrj.impl.CloudSolrClient.requestWithRetryOnStaleState(CloudSolrClient.java:1095)
   [junit4]    > 	at org.apache.solr.client.solrj.impl.CloudSolrClient.request(CloudSolrClient.java:1037)
   [junit4]    > 	at org.apache.solr.client.solrj.SolrRequest.process(SolrRequest.java:149)
   [junit4]    > 	at org.apache.solr.client.solrj.SolrRequest.process(SolrRequest.java:166)
   [junit4]    > 	at org.apache.solr.cloud.CollectionsAPISolrJTest.testBalanceShardUnique(CollectionsAPISolrJTest.java:335)
   [junit4]    > 	at java.lang.Thread.run(Thread.java:745)
   [junit4]   2> 1859823 INFO  (TEST-CollectionsAPISolrJTest.testCreateCollectionWithPropertyParam-seed#[5DB0A3CE006A4F90]) [    ] o.a.s.SolrTestCaseJ4 ###Starting testCreateCollectionWithPropertyParam
   [junit4]   2> 1859826 INFO  (qtp26755048-9417) [n:127.0.0.1:34652_solr    ] o.a.s.h.a.CollectionsHandler Invoked Collection Action :create with params replicationFactor=1&property.ulogDir=/home/jenkins/workspace/Lucene-Solr-master-Linux/solr/build/solr-core/test/J0/temp/solr.cloud.CollectionsAPISolrJTest_5DB0A3CE006A4F90-001/testPropertyParamsForCreate-001/ulogDir-kfdex&property.dataDir=/home/jenkins/workspace/Lucene-Solr-master-Linux/solr/build/solr-core/test/J0/temp/solr.cloud.CollectionsAPISolrJTest_5DB0A3CE006A4F90-001/testPropertyParamsForCreate-001/dataDir-jicq&collection.configName=conf&name=solrj_test_core_props&action=CREATE&numShards=1&wt=javabin&version=2 and sendToOCPQueue=true
   [junit4]   2> 1919941 ERROR (OverseerThreadFactory-4383-thread-3-processing-n:127.0.0.1:44618_solr) [n:127.0.0.1:44618_solr    ] o.a.s.c.OverseerCollectionMessageHandler Error from shard: https://127.0.0.1:43693/solr
   [junit4]   2> org.apache.solr.client.solrj.SolrServerException: Timeout occured while waiting response from server at: https://127.0.0.1:43693/solr
   [junit4]   2> 	at org.apache.solr.client.solrj.impl.HttpSolrClient.executeMethod(HttpSolrClient.java:638)
   [junit4]   2> 	at org.apache.solr.client.solrj.impl.HttpSolrClient.request(HttpSolrClient.java:279)
   [junit4]   2> 	at org.apache.solr.client.solrj.impl.HttpSolrClient.request(HttpSolrClient.java:268)
   [junit4]   2> 	at org.apache.solr.client.solrj.SolrClient.request(SolrClient.java:1219)
   [junit4]   2> 	at org.apache.solr.handler.component.HttpShardHandler.lambda$submit$0(HttpShardHandler.java:163)
   [junit4]   2> 	at java.util.concurrent.FutureTask.run(FutureTask.java:266)
   [junit4]   2> 	at java.util.concurrent.Executors$RunnableAdapter.call(Executors.java:511)
   [junit4]   2> 	at java.util.concurrent.FutureTask.run(FutureTask.java:266)
   [junit4]   2> 	at com.codahale.metrics.InstrumentedExecutorService$InstrumentedRunnable.run(InstrumentedExecutorService.java:176)
   [junit4]   2> 	at org.apache.solr.common.util.ExecutorUtil$MDCAwareThreadPoolExecutor.lambda$execute$0(ExecutorUtil.java:229)
   [junit4]   2> 	at java.util.concurrent.ThreadPoolExecutor.runWorker(ThreadPoolExecutor.java:1142)
   [junit4]   2> 	at java.util.concurrent.ThreadPoolExecutor$Worker.run(ThreadPoolExecutor.java:617)
   [junit4]   2> 	at java.lang.Thread.run(Thread.java:745)
   [junit4]   2> Caused by: java.net.SocketTimeoutException: Read timed out
   [junit4]   2> 	at java.net.SocketInputStream.socketRead0(Native Method)
   [junit4]   2> 	at java.net.SocketInputStream.socketRead(SocketInputStream.java:116)
   [junit4]   2> 	at java.net.SocketInputStream.read(SocketInputStream.java:170)
   [junit4]   2> 	at java.net.SocketInputStream.read(SocketInputStream.java:141)
   [junit4]   2> 	at sun.security.ssl.InputRecord.readFully(InputRecord.java:465)
   [junit4]   2> 	at sun.security.ssl.InputRecord.read(InputRecord.java:503)
   [junit4]   2> 	at sun.security.ssl.SSLSocketImpl.readRecord(SSLSocketImpl.java:973)
   [junit4]   2> 	at sun.security.ssl.SSLSocketImpl.readDataRecord(SSLSocketImpl.java:930)
   [junit4]   2> 	at sun.security.ssl.AppInputStream.read(AppInputStream.java:105)
   [junit4]   2> 	at org.apache.http.impl.io.SessionInputBufferImpl.streamRead(SessionInputBufferImpl.java:139)
   [junit4]   2> 	at org.apache.http.impl.io.SessionInputBufferImpl.fillBuffer(SessionInputBufferImpl.java:155)
   [junit4]   2> 	at org.apache.http.impl.io.SessionInputBufferImpl.readLine(SessionInputBufferImpl.java:284)
   [junit4]   2> 	at org.apache.http.impl.conn.DefaultHttpResponseParser.parseHead(DefaultHttpResponseParser.java:140)
   [junit4]   2> 	at org.apache.http.impl.conn.DefaultHttpResponseParser.parseHead(DefaultHttpResponseParser.java:57)
   [junit4]   2> 	at org.apache.http.impl.io.AbstractMessageParser.parse(AbstractMessageParser.java:261)
   [junit4]   2> 	at org.apache.http.impl.DefaultBHttpClientConnection.receiveResponseHeader(DefaultBHttpClientConnection.java:165)
   [junit4]   2> 	at org.apache.http.impl.conn.CPoolProxy.receiveResponseHeader(CPoolProxy.java:167)
   [junit4]   2> 	at org.apache.http.protocol.HttpRequestExecutor.doReceiveResponse(HttpRequestExecutor.java:272)
   [junit4]   2> 	at org.apache.http.protocol.HttpRequestExecutor.execute(HttpRequestExecutor.java:124)
   [junit4]   2> 	at org.apache.solr.util.stats.InstrumentedHttpRequestExecutor.execute(InstrumentedHttpRequestExecutor.java:57)
   [junit4]   2> 	at org.apache.http.impl.execchain.MainClientExec.execute(MainClientExec.java:271)
   [junit4]   2> 	at org.apache.http.impl.execchain.ProtocolExec.execute(ProtocolExec.java:184)
   [junit4]   2> 	at org.apache.http.impl.execchain.RetryExec.execute(RetryExec.java:88)
   [junit4]   2> 	at org.apache.http.impl.execchain.RedirectExec.execute(RedirectExec.java:110)
   [junit4]   2> 	at org.apache.http.impl.client.InternalHttpClient.doExecute(InternalHttpClient.java:184)
   [junit4]   2> 	at org.apache.http.impl.client.CloseableHttpClient.execute(CloseableHttpClient.java:82)
   [junit4]   2> 	at org.apache.http.impl.client.CloseableHttpClient.execute(CloseableHttpClient.java:55)
   [junit4]   2> 	at org.apache.solr.client.solrj.impl.HttpSolrClient.executeMethod(HttpSolrClient.java:532)
   [junit4]   2> 	... 12 more
   [junit4]   2> 1919943 ERROR (OverseerThreadFactory-4383-thread-3-processing-n:127.0.0.1:44618_solr) [n:127.0.0.1:44618_solr    ] o.a.s.c.OverseerCollectionMessageHandler Cleaning up collection [aliasedCollection].
   [junit4]   2> 1919944 INFO  (OverseerThreadFactory-4383-thread-3-processing-n:127.0.0.1:44618_solr) [n:127.0.0.1:44618_solr    ] o.a.s.c.OverseerCollectionMessageHandler Executing Collection Cmd : action=UNLOAD&deleteInstanceDir=true&deleteDataDir=true
   [junit4]   2> 1950019 INFO  (zkCallback-1451-thread-2-processing-n:127.0.0.1:43693_solr) [n:127.0.0.1:43693_solr    ] o.a.s.c.c.ZkStateReader A cluster state change: [WatchedEvent state:SyncConnected type:NodeDeleted path:/collections/aliasedCollection/state.json] for collection [aliasedCollection] has occurred - updating... (live nodes size: [4])
   [junit4]   2> 1950020 ERROR (OverseerThreadFactory-4383-thread-3-processing-n:127.0.0.1:44618_solr) [n:127.0.0.1:44618_solr    ] o.a.s.c.OverseerCollectionMessageHandler Collection: aliasedCollection operation: create failed:org.apache.solr.common.SolrException: Could not fully remove collection: aliasedCollection
   [junit4]   2> 	at org.apache.solr.cloud.DeleteCollectionCmd.call(DeleteCollectionCmd.java:99)
   [junit4]   2> 	at org.apache.solr.cloud.OverseerCollectionMessageHandler.cleanupCollection(OverseerCollectionMessageHandler.java:694)
   [junit4]   2> 	at org.apache.solr.cloud.CreateCollectionCmd.call(CreateCollectionCmd.java:276)
   [junit4]   2> 	at org.apache.solr.cloud.OverseerCollectionMessageHandler.processMessage(OverseerCollectionMessageHandler.java:224)
   [junit4]   2> 	at org.apache.solr.cloud.OverseerTaskProcessor$Runner.run(OverseerTaskProcessor.java:463)
   [junit4]   2> 	at org.apache.solr.common.util.ExecutorUtil$MDCAwareThreadPoolExecutor.lambda$execute$0(ExecutorUtil.java:229)
   [junit4]   2> 	at java.util.concurrent.ThreadPoolExecutor.runWorker(ThreadPoolExecutor.java:1142)
   [junit4]   2> 	at java.util.concurrent.ThreadPoolExecutor$Worker.run(ThreadPoolExecutor.java:617)
   [junit4]   2> 	at java.lang.Thread.run(Thread.java:745)
   [junit4]   2> 
   [junit4]   2> 1950021 INFO  (OverseerThreadFactory-4383-thread-3-processing-n:127.0.0.1:44618_solr) [n:127.0.0.1:44618_solr    ] o.a.s.c.OverseerTaskQueue Response ZK path: /overseer/collection-queue-work/qnr-0000000004 doesn't exist.  Requestor may have disconnected from ZooKeeper
   [junit4]   2> 1950023 INFO  (OverseerStateUpdate-97242971648688140-127.0.0.1:44618_solr-n_0000000000) [n:127.0.0.1:44618_solr    ] o.a.s.c.Overseer Overseer Loop exiting : 127.0.0.1:44618_solr
   [junit4]   2> 1950024 WARN  (OverseerExitThread) [n:127.0.0.1:44618_solr    ] o.a.s.c.Overseer I'm exiting, but I'm still the leader
   [junit4]   2> 1950025 INFO  (OverseerExitThread) [n:127.0.0.1:44618_solr    ] o.a.s.c.Overseer Overseer (id=97242971648688140-127.0.0.1:44618_solr-n_0000000000) closing
   [junit4]   2> 1950025 INFO  (zkCallback-1451-thread-3-processing-n:127.0.0.1:43693_solr) [n:127.0.0.1:43693_solr    ] o.a.s.c.OverseerElectionContext I am going to be the leader 127.0.0.1:43693_solr
   [junit4]   2> 1950026 INFO  (zkCallback-1451-thread-3-processing-n:127.0.0.1:43693_solr) [n:127.0.0.1:43693_solr    ] o.a.s.c.Overseer Overseer (id=97242971648688139-127.0.0.1:43693_solr-n_0000000001) starting
   [junit4]   2> 1950032 INFO  (OverseerThreadFactory-4393-thread-1-processing-n:127.0.0.1:43693_solr) [n:127.0.0.1:43693_solr    ] o.a.s.c.CreateCollectionCmd Create collection solrj_implicit
   [junit4]   2> 1950032 INFO  (OverseerThreadFactory-4393-thread-2-processing-n:127.0.0.1:43693_solr) [n:127.0.0.1:43693_solr    ] o.a.s.c.CreateCollectionCmd Create collection balancedProperties
   [junit4]   2> 1950032 INFO  (OverseerThreadFactory-4393-thread-3-processing-n:127.0.0.1:43693_solr) [n:127.0.0.1:43693_solr    ] o.a.s.c.CreateCollectionCmd Create collection solrj_test_core_props
   [junit4]   2> 1950144 INFO  (qtp10718507-9382) [n:127.0.0.1:43693_solr    ] o.a.s.h.a.CoreAdminOperation core create command qt=/admin/cores&collection.configName=conf&newCollection=true&name=solrj_implicit_shardB_replica1&action=CREATE&numShards=2&collection=solrj_implicit&shard=shardB&wt=javabin&version=2
   [junit4]   2> 1950145 INFO  (qtp26755048-9415) [n:127.0.0.1:34652_solr    ] o.a.s.h.a.CoreAdminOperation core create command qt=/admin/cores&collection.configName=conf&newCollection=true&name=balancedProperties_shard2_replica2&action=CREATE&numShards=2&collection=balancedProperties&shard=shard2&wt=javabin&version=2
   [junit4]   2> 1950146 INFO  (qtp10718507-9522) [n:127.0.0.1:43693_solr    ] o.a.s.h.a.CoreAdminOperation core create command qt=/admin/cores&collection.configName=conf&newCollection=true&name=balancedProperties_shard1_replica1&action=CREATE&numShards=2&collection=balancedProperties&shard=shard1&wt=javabin&version=2
   [junit4]   2> 1950150 INFO  (zkCallback-1451-thread-3-processing-n:127.0.0.1:43693_solr) [n:127.0.0.1:43693_solr    ] o.a.s.c.c.ZkStateReader A cluster state change: [WatchedEvent state:SyncConnected type:NodeDataChanged path:/collections/solrj_implicit/state.json] for collection [solrj_implicit] has occurred - updating... (live nodes size: [4])
   [junit4]   2> 1950241 INFO  (qtp10718507-9525) [n:127.0.0.1:43693_solr    ] o.a.s.h.a.CoreAdminOperation core create command property.ulogDir=/home/jenkins/workspace/Lucene-Solr-master-Linux/solr/build/solr-core/test/J0/temp/solr.cloud.CollectionsAPISolrJTest_5DB0A3CE006A4F90-001/testPropertyParamsForCreate-001/ulogDir-kfdex&qt=/admin/cores&property.dataDir=/home/jenkins/workspace/Lucene-Solr-master-Linux/solr/build/solr-core/test/J0/temp/solr.cloud.CollectionsAPISolrJTest_5DB0A3CE006A4F90-001/testPropertyParamsForCreate-001/dataDir-jicq&collection.configName=conf&newCollection=true&name=solrj_test_core_props_shard1_replica1&action=CREATE&numShards=1&collection=solrj_test_core_props&shard=shard1&wt=javabin&version=2
   [junit4]   2> 1950245 INFO  (zkCallback-1451-thread-3-processing-n:127.0.0.1:43693_solr) [n:127.0.0.1:43693_solr    ] o.a.s.c.c.ZkStateReader A cluster state change: [WatchedEvent state:SyncConnected type:NodeDataChanged path:/collections/balancedProperties/state.json] for collection [balancedProperties] has occurred - updating... (live nodes size: [4])
   [junit4]   2> 1950245 INFO  (zkCallback-1450-thread-5-processing-n:127.0.0.1:34652_solr) [n:127.0.0.1:34652_solr    ] o.a.s.c.c.ZkStateReader A cluster state change: [WatchedEvent state:SyncConnected type:NodeDataChanged path:/collections/balancedProperties/state.json] for collection [balancedProperties] has occurred - updating... (live nodes size: [4])
   [junit4]   2> 1950245 INFO  (qtp6202913-9386) [n:127.0.0.1:44618_solr    ] o.a.s.h.a.CoreAdminOperation core create command qt=/admin/cores&collection.configName=conf&newCollection=true&name=balancedProperties_shard1_replica2&action=CREATE&numShards=2&collection=balancedProperties&shard=shard1&wt=javabin&version=2
   [junit4]   2> 1950248 INFO  (qtp7958009-9414) [n:127.0.0.1:35987_solr    ] o.a.s.h.a.CoreAdminOperation core create command qt=/admin/cores&collection.configName=conf&newCollection=true&name=solrj_implicit_shardA_replica1&action=CREATE&numShards=2&collection=solrj_implicit&shard=shardA&wt=javabin&version=2
   [junit4]   2> 1950249 INFO  (zkCallback-1451-thread-3-processing-n:127.0.0.1:43693_solr) [n:127.0.0.1:43693_solr    ] o.a.s.c.c.ZkStateReader A cluster state change: [WatchedEvent state:SyncConnected type:NodeDataChanged path:/collections/solrj_test_core_props/state.json] for collection [solrj_test_core_props] has occurred - updating... (live nodes size: [4])
   [junit4]   2> 1950252 INFO  (qtp7958009-9403) [n:127.0.0.1:35987_solr    ] o.a.s.h.a.CoreAdminOperation core create command qt=/admin/cores&collection.configName=conf&newCollection=true&name=balancedProperties_shard2_replica1&action=CREATE&numShards=2&collection=balancedProperties&shard=shard2&wt=javabin&version=2
   [junit4]   2> 1950252 INFO  (zkCallback-1450-thread-5-processing-n:127.0.0.1:34652_solr) [n:127.0.0.1:34652_solr    ] o.a.s.c.c.ZkStateReader A cluster state change: [WatchedEvent state:SyncConnected type:NodeDataChanged path:/collections/balancedProperties/state.json] for collection [balancedProperties] has occurred - updating... (live nodes size: [4])
   [junit4]   2> 1950253 INFO  (zkCallback-1452-thread-5-processing-n:127.0.0.1:44618_solr) [n:127.0.0.1:44618_solr    ] o.a.s.c.c.ZkStateReader A cluster state change: [WatchedEvent state:SyncConnected type:NodeDataChanged path:/collections/balancedProperties/state.json] for collection [balancedProperties] has occurred - updating... (live nodes size: [4])
   [junit4]   2> 1950253 INFO  (zkCallback-1451-thread-3-processing-n:127.0.0.1:43693_solr) [n:127.0.0.1:43693_solr    ] o.a.s.c.c.ZkStateReader A cluster state change: [WatchedEvent state:SyncConnected type:NodeDataChanged path:/collections/balancedProperties/state.json] for collection [balancedProperties] has occurred - updating... (live nodes size: [4])
   [junit4]   2> 1950255 INFO  (zkCallback-1451-thread-2-processing-n:127.0.0.1:43693_solr) [n:127.0.0.1:43693_solr    ] o.a.s.c.c.ZkStateReader A cluster state change: [WatchedEvent state:SyncConnected type:NodeDataChanged path:/collections/solrj_implicit/state.json] for collection [solrj_implicit] has occurred - updating... (live nodes size: [4])
   [junit4]   2> 1950255 INFO  (zkCallback-1449-thread-2-processing-n:127.0.0.1:35987_solr) [n:127.0.0.1:35987_solr    ] o.a.s.c.c.ZkStateReader A cluster state change: [WatchedEvent state:SyncConnected type:NodeDataChanged path:/collections/solrj_implicit/state.json] for collection [solrj_implicit] has occurred - updating... (live nodes size: [4])
   [junit4]   2> 1950358 INFO  (zkCallback-1451-thread-2-processing-n:127.0.0.1:43693_solr) [n:127.0.0.1:43693_solr    ] o.a.s.c.c.ZkStateReader A cluster state change: [WatchedEvent state:SyncConnected type:NodeDataChanged path:/collections/balancedProperties/state.json] for collection [balancedProperties] has occurred - updating... (live nodes size: [4])
   [junit4]   2> 1950358 INFO  (zkCallback-1450-thread-5-processing-n:127.0.0.1:34652_solr) [n:127.0.0.1:34652_solr    ] o.a.s.c.c.ZkStateReader A cluster state change: [WatchedEvent state:SyncConnected type:NodeDataChanged path:/collections/balancedProperties/state.json] for collection [balancedProperties] has occurred - updating... (live nodes size: [4])
   [junit4]   2> 1950358 INFO  (zkCallback-1449-thread-2-processing-n:127.0.0.1:35987_solr) [n:127.0.0.1:35987_solr    ] o.a.s.c.c.ZkStateReader A cluster state change: [WatchedEvent state:SyncConnected type:NodeDataChanged path:/collections/balancedProperties/state.json] for collection [balancedProperties] has occurred - updating... (live nodes size: [4])
   [junit4]   2> 1950358 INFO  (zkCallback-1452-thread-5-processing-n:127.0.0.1:44618_solr) [n:127.0.0.1:44618_solr    ] o.a.s.c.c.ZkStateReader A cluster state change: [WatchedEvent state:SyncConnected type:NodeDataChanged path:/collections/balancedProperties/state.json] for collection [balancedProperties] has occurred - updating... (live nodes size: [4])
   [junit4]   2> 1951161 INFO  (qtp26755048-9415) [n:127.0.0.1:34652_solr c:balancedProperties s:shard2  x:balancedProperties_shard2_replica2] o.a.s.c.SolrConfig Using Lucene MatchVersion: 7.0.0
   [junit4]   2> 1951162 INFO  (qtp10718507-9382) [n:127.0.0.1:43693_solr c:solrj_implicit s:shardB  x:solrj_implicit_shardB_replica1] o.a.s.c.SolrConfig Using Lucene MatchVersion: 7.0.0
   [junit4]   2> 1951162 INFO  (qtp10718507-9522) [n:127.0.0.1:43693_solr c:balancedProperties s:shard1  x:balancedProperties_shard1_replica1] o.a.s.c.SolrConfig Using Lucene MatchVersion: 7.0.0
   [junit4]   2> 1951186 INFO  (qtp10718507-9382) [n:127.0.0.1:43693_solr c:solrj_implicit s:shardB  x:solrj_implicit_shardB_replica1] o.a.s.s.IndexSchema [solrj_implicit_shardB_replica1] Schema name=minimal
   [junit4]   2> 1951187 INFO  (qtp26755048-9415) [n:127.0.0.1:34652_solr c:balancedProperties s:shard2  x:balancedProperties_shard2_replica2] o.a.s.s.IndexSchema [balancedProperties_shard2_replica2] Schema name=minimal
   [junit4]   2> 1951187 INFO  (qtp10718507-9522) [n:127.0.0.1:43693_solr c:balancedProperties s:shard1  x:balancedProperties_shard1_replica1] o.a.s.s.IndexSchema [balancedProperties_shard1_replica1] Schema name=minimal
   [junit4]   2> 1951191 INFO  (qtp10718507-9382) [n:127.0.0.1:43693_solr c:solrj_implicit s:shardB  x:solrj_implicit_shardB_replica1] o.a.s.s.IndexSchema Loaded schema minimal/1.1 with uniqueid field id
   [junit4]   2> 1951191 INFO  (qtp10718507-9522) [n:127.0.0.1:43693_solr c:balancedProperties s:shard1  x:balancedProperties_shard1_replica1] o.a.s.s.IndexSchema Loaded schema minimal/1.1 with uniqueid field id
   [junit4]   2> 1951191 INFO  (qtp26755048-9415) [n:127.0.0.1:34652_solr c:balancedProperties s:shard2  x:balancedProperties_shard2_replica2] o.a.s.s.IndexSchema Loaded schema minimal/1.1 with uniqueid field id
   [junit4]   2> 1951192 INFO  (qtp10718507-9382) [n:127.0.0.1:43693_solr c:solrj_implicit s:shardB  x:solrj_implicit_shardB_replica1] o.a.s.c.CoreContainer Creating SolrCore 'solrj_implicit_shardB_replica1' using configuration from collection solrj_implicit
   [junit4]   2> 1951192 INFO  (qtp26755048-9415) [n:127.0.0.1:34652_solr c:balancedProperties s:shard2  x:balancedProperties_shard2_replica2] o.a.s.c.CoreContainer Creating SolrCore 'balancedProperties_shard2_replica2' using configuration from collection balancedProperties
   [junit4]   2> 1951192 INFO  (qtp10718507-9522) [n:127.0.0.1:43693_solr c:balancedProperties s:shard1  x:balancedProperties_shard1_replica1] o.a.s.c.CoreContainer Creating SolrCore 'balancedProperties_shard1_replica1' using configuration from collection balancedProperties
   [junit4]   2> 1951193 INFO  (qtp10718507-9522) [n:127.0.0.1:43693_solr c:balancedProperties s:shard1  x:balancedProperties_shard1_replica1] o.a.s.c.SolrCore [[balancedProperties_shard1_replica1] ] Opening new SolrCore at [/home/jenkins/workspace/Lucene-Solr-master-Linux/solr/build/solr-core/test/J0/temp/solr.cloud.CollectionsAPISolrJTest_5DB0A3CE006A4F90-001/tempDir-001/node1/balancedProperties_shard1_replica1], dataDir=[/home/jenkins/workspace/Lucene-Solr-master-Linux/solr/build/solr-core/test/J0/temp/solr.cloud.CollectionsAPISolrJTest_5DB0A3CE006A4F90-001/tempDir-001/node1/./balancedProperties_shard1_replica1/data/]
   [junit4]   2> 1951193 INFO  (qtp26755048-9415) [n:127.0.0.1:34652_solr c:balancedProperties s:shard2  x:balancedProperties_shard2_replica2] o.a.s.c.SolrCore [[balancedProperties_shard2_replica2] ] Opening new SolrCore at [/home/jenkins/workspace/Lucene-Solr-master-Linux/solr/build/solr-core/test/J0/temp/solr.cloud.CollectionsAPISolrJTest_5DB0A3CE006A4F90-001/tempDir-001/node3/balancedProperties_shard2_replica2], dataDir=[/home/jenkins/workspace/Lucene-Solr-master-Linux/solr/build/solr-core/test/J0/temp/solr.cloud.CollectionsAPISolrJTest_5DB0A3CE006A4F90-001/tempDir-001/node3/./balancedProperties_shard2_replica2/data/]
   [junit4]   2> 1951193 INFO  (qtp10718507-9382) [n:127.0.0.1:43693_solr c:solrj_implicit s:shardB  x:solrj_implicit_shardB_replica1] o.a.s.c.SolrCore [[solrj_implicit_shardB_replica1] ] Opening new SolrCore at [/home/jenkins/workspace/Lucene-Solr-master-Linux/solr/build/solr-core/test/J0/temp/solr.cloud.CollectionsAPISolrJTest_5DB0A3CE006A4F90-001/tempDir-001/node1/solrj_implicit_shardB_replica1], dataDir=[/home/jenkins/workspace/Lucene-Solr-master-Linux/solr/build/solr-core/test/J0/temp/solr.cloud.CollectionsAPISolrJTest_5DB0A3CE006A4F90-001/tempDir-001/node1/./solrj_implicit_shardB_replica1/data/]
   [junit4]   2> 1951212 INFO  (qtp10718507-9522) [n:127.0.0.1:43693_solr c:balancedProperties s:shard1  x:balancedProperties_shard1_replica1] o.a.s.u.UpdateHandler Using UpdateLog implementation: org.apache.solr.update.UpdateLog
   [junit4]   2> 1951213 INFO  (qtp26755048-9415) [n:127.0.0.1:34652_solr c:balancedProperties s:shard2  x:balancedProperties_shard2_replica2] o.a.s.u.UpdateHandler Using UpdateLog implementation: org.apache.solr.update.UpdateLog
   [junit4]   2> 1951213 INFO  (qtp10718507-9522) [n:127.0.0.1:43693_solr c:balancedProperties s:shard1  x:balancedProperties_shard1_replica1] o.a.s.u.UpdateLog Initializing UpdateLog: dataDir=null defaultSyncLevel=FLUSH numRecordsToKeep=100 maxNumLogsToKeep=10 numVersionBuckets=65536
   [junit4]   2> 1951213 INFO  (qtp26755048-9415) [n:127.0.0.1:34652_solr c:balancedProperties s:shard2  x:balancedProperties_shard2_replica2] o.a.s.u.UpdateLog Initializing UpdateLog: dataDir=null defaultSyncLevel=FLUSH numRecordsToKeep=100 maxNumLogsToKeep=10 numVersionBuckets=65536
   [junit4]   2> 1951213 INFO  (qtp10718507-9382) [n:127.0.0.1:43693_solr c:solrj_implicit s:shardB  x:solrj_implicit_shardB_replica1] o.a.s.u.UpdateHandler Using UpdateLog implementation: org.apache.solr.update.UpdateLog
   [junit4]   2> 1951213 INFO  (qtp10718507-9382) [n:127.0.0.1:43693_solr c:solrj_implicit s:shardB  x:solrj_implicit_shardB_replica1] o.a.s.u.UpdateLog Initializing UpdateLog: dataDir=null defaultSyncLevel=FLUSH numRecordsToKeep=100 maxNumLogsToKeep=10 numVersionBuckets=65536
   [junit4]   2> 1951213 INFO  (qtp10718507-9522) [n:127.0.0.1:

[...truncated too long message...]

clipse.jetty.servlet.ServletHandler.doHandle(ServletHandler.java:582)
   [junit4]   2> 	at org.eclipse.jetty.server.session.SessionHandler.doHandle(SessionHandler.java:224)
   [junit4]   2> 	at org.eclipse.jetty.server.handler.ContextHandler.doHandle(ContextHandler.java:1180)
   [junit4]   2> 	at org.eclipse.jetty.servlet.ServletHandler.doScope(ServletHandler.java:512)
   [junit4]   2> 	at org.eclipse.jetty.server.session.SessionHandler.doScope(SessionHandler.java:185)
   [junit4]   2> 	at org.eclipse.jetty.server.handler.ContextHandler.doScope(ContextHandler.java:1112)
   [junit4]   2> 	at org.eclipse.jetty.server.handler.ScopedHandler.handle(ScopedHandler.java:141)
   [junit4]   2> 	at org.eclipse.jetty.server.handler.gzip.GzipHandler.handle(GzipHandler.java:462)
   [junit4]   2> 	at org.eclipse.jetty.server.handler.HandlerWrapper.handle(HandlerWrapper.java:134)
   [junit4]   2> 	at org.eclipse.jetty.server.Server.handle(Server.java:534)
   [junit4]   2> 	at org.eclipse.jetty.server.HttpChannel.handle(HttpChannel.java:320)
   [junit4]   2> 	at org.eclipse.jetty.server.HttpConnection.onFillable(HttpConnection.java:251)
   [junit4]   2> 	at org.eclipse.jetty.io.AbstractConnection$ReadCallback.succeeded(AbstractConnection.java:273)
   [junit4]   2> 	at org.eclipse.jetty.io.FillInterest.fillable(FillInterest.java:95)
   [junit4]   2> 	at org.eclipse.jetty.io.ssl.SslConnection.onFillable(SslConnection.java:202)
   [junit4]   2> 	at org.eclipse.jetty.io.AbstractConnection$ReadCallback.succeeded(AbstractConnection.java:273)
   [junit4]   2> 	at org.eclipse.jetty.io.FillInterest.fillable(FillInterest.java:95)
   [junit4]   2> 	at org.eclipse.jetty.io.SelectChannelEndPoint$2.run(SelectChannelEndPoint.java:93)
   [junit4]   2> 	at org.eclipse.jetty.util.thread.strategy.ExecuteProduceConsume.executeProduceConsume(ExecuteProduceConsume.java:303)
   [junit4]   2> 	at org.eclipse.jetty.util.thread.strategy.ExecuteProduceConsume.produceConsume(ExecuteProduceConsume.java:148)
   [junit4]   2> 	at org.eclipse.jetty.util.thread.strategy.ExecuteProduceConsume.run(ExecuteProduceConsume.java:136)
   [junit4]   2> 	at org.eclipse.jetty.util.thread.QueuedThreadPool.runJob(QueuedThreadPool.java:671)
   [junit4]   2> 	at org.eclipse.jetty.util.thread.QueuedThreadPool$2.run(QueuedThreadPool.java:589)
   [junit4]   2> 	at java.lang.Thread.run(Thread.java:745)
   [junit4]   2> 
   [junit4]   2> 1984475 INFO  (qtp6202913-9397) [n:127.0.0.1:44618_solr    ] o.a.s.s.HttpSolrCall [admin] webapp=null path=/admin/cores params={nodeName=127.0.0.1:43693_solr&onlyIfLeaderActive=true&core=solrj_replicatests_shard1_replica1&coreNodeName=core_node3&action=PREPRECOVERY&checkLive=true&state=recovering&onlyIfLeader=true&wt=javabin&version=2} status=400 QTime=20028
   [junit4]   2> 1985758 WARN  (zkCallback-1450-thread-5-processing-n:127.0.0.1:34652_solr) [n:127.0.0.1:34652_solr    ] o.a.s.c.c.ZkStateReader ZooKeeper watch triggered, but Solr cannot talk to ZK: [KeeperErrorCode = Session expired for /live_nodes]
   [junit4]   2> 1985758 INFO  (jetty-launcher-1431-thread-6) [    ] o.a.s.m.SolrMetricManager Closing metric reporters for: solr.node
   [junit4]   2> 1985759 INFO  (jetty-launcher-1431-thread-6) [    ] o.e.j.s.h.ContextHandler Stopped o.e.j.s.ServletContextHandler@bb7cd9{/solr,null,UNAVAILABLE}
   [junit4]   2> 1985759 WARN  (zkCallback-1452-thread-4-processing-n:127.0.0.1:44618_solr) [n:127.0.0.1:44618_solr    ] o.a.s.c.c.ZkStateReader ZooKeeper watch triggered, but Solr cannot talk to ZK: [KeeperErrorCode = Session expired for /live_nodes]
   [junit4]   2> 1985760 INFO  (jetty-launcher-1431-thread-7) [    ] o.a.s.m.SolrMetricManager Closing metric reporters for: solr.node
   [junit4]   2> 1985760 INFO  (jetty-launcher-1431-thread-7) [    ] o.e.j.s.h.ContextHandler Stopped o.e.j.s.ServletContextHandler@9a2d62{/solr,null,UNAVAILABLE}
   [junit4]   2> 1985761 WARN  (zkCallback-1451-thread-2-processing-n:127.0.0.1:43693_solr) [n:127.0.0.1:43693_solr    ] o.a.s.c.c.ZkStateReader ZooKeeper watch triggered, but Solr cannot talk to ZK: [KeeperErrorCode = Session expired for /live_nodes]
   [junit4]   2> 1985761 INFO  (jetty-launcher-1431-thread-5) [    ] o.a.s.m.SolrMetricManager Closing metric reporters for: solr.node
   [junit4]   2> 1985762 INFO  (jetty-launcher-1431-thread-5) [    ] o.e.j.s.h.ContextHandler Stopped o.e.j.s.ServletContextHandler@e4775d{/solr,null,UNAVAILABLE}
   [junit4]   2> 1985762 INFO  (SUITE-CollectionsAPISolrJTest-seed#[5DB0A3CE006A4F90]-worker) [    ] o.a.s.c.ZkTestServer connecting to 127.0.0.1:40317 40317
   [junit4]   2> 1985873 INFO  (Thread-2590) [    ] o.a.s.c.ZkTestServer connecting to 127.0.0.1:40317 40317
   [junit4]   2> 1985874 WARN  (Thread-2590) [    ] o.a.s.c.ZkTestServer Watch limit violations: 
   [junit4]   2> Maximum concurrent create/delete watches above limit:
   [junit4]   2> 
   [junit4]   2> 	5	/solr/collections/solrj_test/state.json
   [junit4]   2> 	5	/solr/aliases.json
   [junit4]   2> 	4	/solr/security.json
   [junit4]   2> 	4	/solr/configs/conf
   [junit4]   2> 
   [junit4]   2> Maximum concurrent data watches above limit:
   [junit4]   2> 
   [junit4]   2> 	7	/solr/collections/replicaProperties/state.json
   [junit4]   2> 	5	/solr/clusterprops.json
   [junit4]   2> 	5	/solr/clusterstate.json
   [junit4]   2> 	5	/solr/collections/solrj_newstateformat/state.json
   [junit4]   2> 	4	/solr/collections/balancedProperties/state.json
   [junit4]   2> 	3	/solr/collections/solrj_test_splitshard/state.json
   [junit4]   2> 	3	/solr/collections/solrj_replicatests/state.json
   [junit4]   2> 	2	/solr/overseer_elect/election/97242971648688139-127.0.0.1:43693_solr-n_0000000001
   [junit4]   2> 	2	/solr/collections/solrj_implicit/state.json
   [junit4]   2> 
   [junit4]   2> Maximum concurrent children watches above limit:
   [junit4]   2> 
   [junit4]   2> 	74	/solr/overseer/queue
   [junit4]   2> 	10	/solr/overseer/queue-work
   [junit4]   2> 	5	/solr/live_nodes
   [junit4]   2> 	5	/solr/collections
   [junit4]   2> 	3	/solr/overseer/collection-queue-work
   [junit4]   2> 
   [junit4]   2> 1985875 INFO  (SUITE-CollectionsAPISolrJTest-seed#[5DB0A3CE006A4F90]-worker) [    ] o.a.s.SolrTestCaseJ4 ###deleteCore
   [junit4]   2> NOTE: leaving temporary files on disk at: /home/jenkins/workspace/Lucene-Solr-master-Linux/solr/build/solr-core/test/J0/temp/solr.cloud.CollectionsAPISolrJTest_5DB0A3CE006A4F90-001
   [junit4]   2> Jan 07, 2017 5:37:39 PM com.carrotsearch.randomizedtesting.ThreadLeakControl checkThreadLeaks
   [junit4]   2> WARNING: Will linger awaiting termination of 1 leaked thread(s).
   [junit4]   2> NOTE: test params are: codec=Asserting(Lucene70): {}, docValues:{}, maxPointsInLeafNode=229, maxMBSortInHeap=7.203940149025694, sim=RandomSimilarity(queryNorm=false): {}, locale=ru-RU, timezone=Africa/Nouakchott
   [junit4]   2> NOTE: Linux 4.4.0-53-generic i386/Oracle Corporation 1.8.0_112 (32-bit)/cpus=12,threads=1,free=111754088,total=311787520
   [junit4]   2> NOTE: All tests run in this JVM: [DistributedQueryComponentOptimizationTest, TestImplicitCoreProperties, TestFunctionQuery, ZkNodePropsTest, AddBlockUpdateTest, JavabinLoaderTest, AsyncCallRequestStatusResponseTest, DistribDocExpirationUpdateProcessorTest, ShardSplitTest, TestLeaderElectionWithEmptyReplica, MinimalSchemaTest, PeerSyncTest, TestMacroExpander, TestDistributedSearch, CacheHeaderTest, SpellPossibilityIteratorTest, ReturnFieldsTest, MigrateRouteKeyTest, BufferStoreTest, QueryElevationComponentTest, HdfsCollectionsAPIDistributedZkTest, ScriptEngineTest, TestFieldCacheVsDocValues, TestExpandComponent, TestReplicaProperties, PreAnalyzedFieldManagedSchemaCloudTest, TestLFUCache, BlockJoinFacetDistribTest, UUIDFieldTest, TestUseDocValuesAsStored2, SolrMetricManagerTest, AnalysisAfterCoreReloadTest, DistributedVersionInfoTest, HdfsRecoveryZkTest, RuleEngineTest, TestClassicSimilarityFactory, TestCloudManagedSchema, RequiredFieldsTest, SortSpecParsingTest, HdfsThreadLeakTest, QueryResultKeyTest, TestRuleBasedAuthorizationPlugin, TestGraphTermsQParserPlugin, SearchHandlerTest, TestSubQueryTransformer, UniqFieldsUpdateProcessorFactoryTest, TestSolrDeletionPolicy2, ExplicitHLLTest, SuggestComponentContextFilterQueryTest, TestTolerantUpdateProcessorCloud, TestRandomFlRTGCloud, DistributedFacetPivotLargeTest, CdcrVersionReplicationTest, TestOrdValues, PathHierarchyTokenizerFactoryTest, TestSolrCoreProperties, PluginInfoTest, TestLMJelinekMercerSimilarityFactory, SyncSliceTest, TestDFRSimilarityFactory, SmileWriterTest, TestDefaultSearchFieldResource, DeleteShardTest, TestSolrConfigHandler, PingRequestHandlerTest, TestOmitPositions, TestManagedSchemaThreadSafety, TestQuerySenderListener, TestSimpleQParserPlugin, TestLRUStatsCache, TestFieldCacheSanityChecker, DistributedQueryElevationComponentTest, TestCrossCoreJoin, ResponseHeaderTest, TestManagedStopFilterFactory, TestDownShardTolerantSearch, TestJsonFacetRefinement, NumericFieldsTest, StandardRequestHandlerTest, DateMathParserTest, VersionInfoTest, TestNumericTerms32, TestPerFieldSimilarityWithDefaultOverride, TestLocalFSCloudBackupRestore, TriLevelCompositeIdRoutingTest, BigEndianAscendingWordDeserializerTest, TestExportWriter, GraphQueryTest, TestSolrCloudWithSecureImpersonation, TestDistribIDF, DocValuesMissingTest, TestFoldingMultitermQuery, TestReplicationHandler, FastVectorHighlighterTest, TestCustomSort, TestAnalyzedSuggestions, TestConfigSetsAPI, MultiTermTest, TestPseudoReturnFields, PKIAuthenticationIntegrationTest, DeleteLastCustomShardedReplicaTest, TestSolrFieldCacheMBean, ActionThrottleTest, TestDocBasedVersionConstraints, SystemInfoHandlerTest, SolrXmlInZkTest, TestSolrQueryParserDefaultOperatorResource, DistributedIntervalFacetingTest, TestEmbeddedSolrServerConstructors, TestJettySolrRunner, ConnectionReuseTest, CollectionReloadTest, CollectionsAPISolrJTest]
   [junit4] Completed [551/675 (1!)] on J0 in 668.02s, 12 tests, 3 errors <<< FAILURES!

[...truncated 54983 lines...]


Mime
View raw message