lucene-dev mailing list archives

Site index · List index
Message view « Date » · « Thread »
Top « Date » · « Thread »
From Policeman Jenkins Server <jenk...@thetaphi.de>
Subject [JENKINS] Lucene-Solr-6.4-Linux (32bit/jdk1.8.0_121) - Build # 91 - Unstable!
Date Thu, 02 Feb 2017 03:14:30 GMT
Build: https://jenkins.thetaphi.de/job/Lucene-Solr-6.4-Linux/91/
Java: 32bit/jdk1.8.0_121 -server -XX:+UseParallelGC

1 tests failed.
FAILED:  org.apache.solr.handler.admin.MBeansHandlerTest.testDiff

Error Message:
expected:<Was: [1, Now: 2], Delta: 1> but was:<Was: [4, Now: 5], Delta: 1>

Stack Trace:
org.junit.ComparisonFailure: expected:<Was: [1, Now: 2], Delta: 1> but was:<Was:
[4, Now: 5], Delta: 1>
	at __randomizedtesting.SeedInfo.seed([E201B7308FDBA6D2:271773AB9F6D9EB2]:0)
	at org.junit.Assert.assertEquals(Assert.java:125)
	at org.junit.Assert.assertEquals(Assert.java:147)
	at org.apache.solr.handler.admin.MBeansHandlerTest.testDiff(MBeansHandlerTest.java:63)
	at sun.reflect.NativeMethodAccessorImpl.invoke0(Native Method)
	at sun.reflect.NativeMethodAccessorImpl.invoke(NativeMethodAccessorImpl.java:62)
	at sun.reflect.DelegatingMethodAccessorImpl.invoke(DelegatingMethodAccessorImpl.java:43)
	at java.lang.reflect.Method.invoke(Method.java:498)
	at com.carrotsearch.randomizedtesting.RandomizedRunner.invoke(RandomizedRunner.java:1713)
	at com.carrotsearch.randomizedtesting.RandomizedRunner$8.evaluate(RandomizedRunner.java:907)
	at com.carrotsearch.randomizedtesting.RandomizedRunner$9.evaluate(RandomizedRunner.java:943)
	at com.carrotsearch.randomizedtesting.RandomizedRunner$10.evaluate(RandomizedRunner.java:957)
	at com.carrotsearch.randomizedtesting.rules.SystemPropertiesRestoreRule$1.evaluate(SystemPropertiesRestoreRule.java:57)
	at org.apache.lucene.util.TestRuleSetupTeardownChained$1.evaluate(TestRuleSetupTeardownChained.java:49)
	at org.apache.lucene.util.AbstractBeforeAfterRule$1.evaluate(AbstractBeforeAfterRule.java:45)
	at org.apache.lucene.util.TestRuleThreadAndTestName$1.evaluate(TestRuleThreadAndTestName.java:48)
	at org.apache.lucene.util.TestRuleIgnoreAfterMaxFailures$1.evaluate(TestRuleIgnoreAfterMaxFailures.java:64)
	at org.apache.lucene.util.TestRuleMarkFailure$1.evaluate(TestRuleMarkFailure.java:47)
	at com.carrotsearch.randomizedtesting.rules.StatementAdapter.evaluate(StatementAdapter.java:36)
	at com.carrotsearch.randomizedtesting.ThreadLeakControl$StatementRunner.run(ThreadLeakControl.java:367)
	at com.carrotsearch.randomizedtesting.ThreadLeakControl.forkTimeoutingTask(ThreadLeakControl.java:811)
	at com.carrotsearch.randomizedtesting.ThreadLeakControl$3.evaluate(ThreadLeakControl.java:462)
	at com.carrotsearch.randomizedtesting.RandomizedRunner.runSingleTest(RandomizedRunner.java:916)
	at com.carrotsearch.randomizedtesting.RandomizedRunner$5.evaluate(RandomizedRunner.java:802)
	at com.carrotsearch.randomizedtesting.RandomizedRunner$6.evaluate(RandomizedRunner.java:852)
	at com.carrotsearch.randomizedtesting.RandomizedRunner$7.evaluate(RandomizedRunner.java:863)
	at com.carrotsearch.randomizedtesting.rules.StatementAdapter.evaluate(StatementAdapter.java:36)
	at com.carrotsearch.randomizedtesting.rules.SystemPropertiesRestoreRule$1.evaluate(SystemPropertiesRestoreRule.java:57)
	at org.apache.lucene.util.AbstractBeforeAfterRule$1.evaluate(AbstractBeforeAfterRule.java:45)
	at com.carrotsearch.randomizedtesting.rules.StatementAdapter.evaluate(StatementAdapter.java:36)
	at org.apache.lucene.util.TestRuleStoreClassName$1.evaluate(TestRuleStoreClassName.java:41)
	at com.carrotsearch.randomizedtesting.rules.NoShadowingOrOverridesOnMethodsRule$1.evaluate(NoShadowingOrOverridesOnMethodsRule.java:40)
	at com.carrotsearch.randomizedtesting.rules.NoShadowingOrOverridesOnMethodsRule$1.evaluate(NoShadowingOrOverridesOnMethodsRule.java:40)
	at com.carrotsearch.randomizedtesting.rules.StatementAdapter.evaluate(StatementAdapter.java:36)
	at com.carrotsearch.randomizedtesting.rules.StatementAdapter.evaluate(StatementAdapter.java:36)
	at com.carrotsearch.randomizedtesting.rules.StatementAdapter.evaluate(StatementAdapter.java:36)
	at org.apache.lucene.util.TestRuleAssertionsRequired$1.evaluate(TestRuleAssertionsRequired.java:53)
	at org.apache.lucene.util.TestRuleMarkFailure$1.evaluate(TestRuleMarkFailure.java:47)
	at org.apache.lucene.util.TestRuleIgnoreAfterMaxFailures$1.evaluate(TestRuleIgnoreAfterMaxFailures.java:64)
	at org.apache.lucene.util.TestRuleIgnoreTestSuites$1.evaluate(TestRuleIgnoreTestSuites.java:54)
	at com.carrotsearch.randomizedtesting.rules.StatementAdapter.evaluate(StatementAdapter.java:36)
	at com.carrotsearch.randomizedtesting.ThreadLeakControl$StatementRunner.run(ThreadLeakControl.java:367)
	at java.lang.Thread.run(Thread.java:745)




Build Log:
[...truncated 12041 lines...]
   [junit4] Suite: org.apache.solr.handler.admin.MBeansHandlerTest
   [junit4]   2> Creating dataDir: /home/jenkins/workspace/Lucene-Solr-6.4-Linux/solr/build/solr-core/test/J0/temp/solr.handler.admin.MBeansHandlerTest_E201B7308FDBA6D2-001/init-core-data-001
   [junit4]   2> 1166400 INFO  (SUITE-MBeansHandlerTest-seed#[E201B7308FDBA6D2]-worker)
[    ] o.a.s.SolrTestCaseJ4 Randomized ssl (true) and clientAuth (false) via: @org.apache.solr.util.RandomizeSSL(reason=,
ssl=NaN, value=NaN, clientAuth=NaN)
   [junit4]   2> 1166400 INFO  (SUITE-MBeansHandlerTest-seed#[E201B7308FDBA6D2]-worker)
[    ] o.a.s.SolrTestCaseJ4 ####initCore
   [junit4]   2> 1166401 INFO  (SUITE-MBeansHandlerTest-seed#[E201B7308FDBA6D2]-worker)
[    ] o.a.s.c.SolrResourceLoader [null] Added 2 libs to classloader, from paths: [/home/jenkins/workspace/Lucene-Solr-6.4-Linux/solr/core/src/test-files/solr/collection1/lib,
/home/jenkins/workspace/Lucene-Solr-6.4-Linux/solr/core/src/test-files/solr/collection1/lib/classes]
   [junit4]   2> 1166437 INFO  (SUITE-MBeansHandlerTest-seed#[E201B7308FDBA6D2]-worker)
[    ] o.a.s.c.SolrConfig Using Lucene MatchVersion: 6.4.1
   [junit4]   2> 1166461 INFO  (SUITE-MBeansHandlerTest-seed#[E201B7308FDBA6D2]-worker)
[    ] o.a.s.s.IndexSchema [null] Schema name=test
   [junit4]   2> 1166543 WARN  (SUITE-MBeansHandlerTest-seed#[E201B7308FDBA6D2]-worker)
[    ] o.a.s.s.IndexSchema [null] default search field in schema is text. WARNING: Deprecated,
please use 'df' on request instead.
   [junit4]   2> 1166545 INFO  (SUITE-MBeansHandlerTest-seed#[E201B7308FDBA6D2]-worker)
[    ] o.a.s.s.IndexSchema Loaded schema test/1.0 with uniqueid field id
   [junit4]   2> 1166551 INFO  (SUITE-MBeansHandlerTest-seed#[E201B7308FDBA6D2]-worker)
[    ] o.a.s.u.UpdateShardHandler Creating UpdateShardHandler HTTP client with params: socketTimeout=30000&connTimeout=30000&retry=true
   [junit4]   2> 1166554 WARN  (SUITE-MBeansHandlerTest-seed#[E201B7308FDBA6D2]-worker)
[    ] o.a.s.m.r.SolrJmxReporter No serviceUrl or agentId was configured, using first MBeanServer.
   [junit4]   2> 1166556 INFO  (SUITE-MBeansHandlerTest-seed#[E201B7308FDBA6D2]-worker)
[    ] o.a.s.m.r.SolrJmxReporter JMX monitoring enabled at server: com.sun.jmx.mbeanserver.JmxMBeanServer@18dfe71
   [junit4]   2> 1166556 WARN  (SUITE-MBeansHandlerTest-seed#[E201B7308FDBA6D2]-worker)
[    ] o.a.s.m.r.SolrJmxReporter No serviceUrl or agentId was configured, using first MBeanServer.
   [junit4]   2> 1166560 INFO  (SUITE-MBeansHandlerTest-seed#[E201B7308FDBA6D2]-worker)
[    ] o.a.s.m.r.SolrJmxReporter JMX monitoring enabled at server: com.sun.jmx.mbeanserver.JmxMBeanServer@18dfe71
   [junit4]   2> 1166560 WARN  (SUITE-MBeansHandlerTest-seed#[E201B7308FDBA6D2]-worker)
[    ] o.a.s.m.r.SolrJmxReporter No serviceUrl or agentId was configured, using first MBeanServer.
   [junit4]   2> 1166560 INFO  (SUITE-MBeansHandlerTest-seed#[E201B7308FDBA6D2]-worker)
[    ] o.a.s.m.r.SolrJmxReporter JMX monitoring enabled at server: com.sun.jmx.mbeanserver.JmxMBeanServer@18dfe71
   [junit4]   2> 1166561 INFO  (coreLoadExecutor-3871-thread-1) [    x:collection1] o.a.s.c.SolrResourceLoader
[null] Added 2 libs to classloader, from paths: [/home/jenkins/workspace/Lucene-Solr-6.4-Linux/solr/core/src/test-files/solr/collection1/lib,
/home/jenkins/workspace/Lucene-Solr-6.4-Linux/solr/core/src/test-files/solr/collection1/lib/classes]
   [junit4]   2> 1166591 INFO  (coreLoadExecutor-3871-thread-1) [    x:collection1] o.a.s.c.SolrConfig
Using Lucene MatchVersion: 6.4.1
   [junit4]   2> 1166618 INFO  (coreLoadExecutor-3871-thread-1) [    x:collection1] o.a.s.s.IndexSchema
[collection1] Schema name=test
   [junit4]   2> 1166687 WARN  (coreLoadExecutor-3871-thread-1) [    x:collection1] o.a.s.s.IndexSchema
[collection1] default search field in schema is text. WARNING: Deprecated, please use 'df'
on request instead.
   [junit4]   2> 1166690 INFO  (coreLoadExecutor-3871-thread-1) [    x:collection1] o.a.s.s.IndexSchema
Loaded schema test/1.0 with uniqueid field id
   [junit4]   2> 1166695 INFO  (coreLoadExecutor-3871-thread-1) [    x:collection1] o.a.s.c.CoreContainer
Creating SolrCore 'collection1' using configuration from instancedir /home/jenkins/workspace/Lucene-Solr-6.4-Linux/solr/core/src/test-files/solr/collection1
   [junit4]   2> 1166696 WARN  (coreLoadExecutor-3871-thread-1) [    x:collection1] o.a.s.m.r.SolrJmxReporter
No serviceUrl or agentId was configured, using first MBeanServer.
   [junit4]   2> 1166696 INFO  (coreLoadExecutor-3871-thread-1) [    x:collection1] o.a.s.m.r.SolrJmxReporter
JMX monitoring enabled at server: com.sun.jmx.mbeanserver.JmxMBeanServer@18dfe71
   [junit4]   2> 1166696 INFO  (coreLoadExecutor-3871-thread-1) [    x:collection1] o.a.s.c.SolrCore
[[collection1] ] Opening new SolrCore at [/home/jenkins/workspace/Lucene-Solr-6.4-Linux/solr/core/src/test-files/solr/collection1],
dataDir=[/home/jenkins/workspace/Lucene-Solr-6.4-Linux/solr/build/solr-core/test/J0/temp/solr.handler.admin.MBeansHandlerTest_E201B7308FDBA6D2-001/init-core-data-001/]
   [junit4]   2> 1166696 INFO  (coreLoadExecutor-3871-thread-1) [    x:collection1] o.a.s.c.JmxMonitoredMap
JMX monitoring is enabled. Adding Solr mbeans to JMX Server: com.sun.jmx.mbeanserver.JmxMBeanServer@18dfe71
   [junit4]   2> 1166697 INFO  (coreLoadExecutor-3871-thread-1) [    x:collection1] o.a.s.u.RandomMergePolicy
RandomMergePolicy wrapping class org.apache.lucene.index.LogByteSizeMergePolicy: [LogByteSizeMergePolicy:
minMergeSize=1677721, mergeFactor=18, maxMergeSize=2147483648, maxMergeSizeForForcedMerge=9223372036854775807,
calibrateSizeByDeletes=false, maxMergeDocs=2147483647, maxCFSSegmentSizeMB=8.796093022207999E12,
noCFSRatio=0.4927128602925638]
   [junit4]   2> 1166722 INFO  (coreLoadExecutor-3871-thread-1) [    x:collection1] o.a.s.u.UpdateHandler
Using UpdateLog implementation: org.apache.solr.update.UpdateLog
   [junit4]   2> 1166722 INFO  (coreLoadExecutor-3871-thread-1) [    x:collection1] o.a.s.u.UpdateLog
Initializing UpdateLog: dataDir= defaultSyncLevel=FLUSH numRecordsToKeep=100 maxNumLogsToKeep=10
numVersionBuckets=65536
   [junit4]   2> 1166723 INFO  (coreLoadExecutor-3871-thread-1) [    x:collection1] o.a.s.u.CommitTracker
Hard AutoCommit: disabled
   [junit4]   2> 1166723 INFO  (coreLoadExecutor-3871-thread-1) [    x:collection1] o.a.s.u.CommitTracker
Soft AutoCommit: disabled
   [junit4]   2> 1166723 INFO  (coreLoadExecutor-3871-thread-1) [    x:collection1] o.a.s.u.RandomMergePolicy
RandomMergePolicy wrapping class org.apache.lucene.index.LogByteSizeMergePolicy: [LogByteSizeMergePolicy:
minMergeSize=1677721, mergeFactor=13, maxMergeSize=2147483648, maxMergeSizeForForcedMerge=9223372036854775807,
calibrateSizeByDeletes=true, maxMergeDocs=2147483647, maxCFSSegmentSizeMB=8.796093022207999E12,
noCFSRatio=0.0]
   [junit4]   2> 1166724 INFO  (coreLoadExecutor-3871-thread-1) [    x:collection1] o.a.s.s.SolrIndexSearcher
Opening [Searcher@18fc8e2[collection1] main]
   [junit4]   2> 1166724 INFO  (coreLoadExecutor-3871-thread-1) [    x:collection1] o.a.s.h.c.SpellCheckComponent
Initializing spell checkers
   [junit4]   2> 1166780 INFO  (coreLoadExecutor-3871-thread-1) [    x:collection1] o.a.s.s.DirectSolrSpellChecker
init: {name=direct,classname=DirectSolrSpellChecker,field=lowerfilt,minQueryLength=3}
   [junit4]   2> 1167015 INFO  (coreLoadExecutor-3871-thread-1) [    x:collection1] o.a.s.h.ReplicationHandler
Commits will be reserved for  10000
   [junit4]   2> 1167015 INFO  (searcherExecutor-3872-thread-1-processing-x:collection1)
[    x:collection1] o.a.s.h.c.SpellCheckComponent Loading spell index for spellchecker: default
   [junit4]   2> 1167016 INFO  (searcherExecutor-3872-thread-1-processing-x:collection1)
[    x:collection1] o.a.s.h.c.SpellCheckComponent Loading spell index for spellchecker: direct
   [junit4]   2> 1167016 INFO  (searcherExecutor-3872-thread-1-processing-x:collection1)
[    x:collection1] o.a.s.h.c.SpellCheckComponent Loading spell index for spellchecker: wordbreak
   [junit4]   2> 1167016 INFO  (searcherExecutor-3872-thread-1-processing-x:collection1)
[    x:collection1] o.a.s.h.c.SpellCheckComponent Loading spell index for spellchecker: multipleFields
   [junit4]   2> 1167016 INFO  (searcherExecutor-3872-thread-1-processing-x:collection1)
[    x:collection1] o.a.s.h.c.SpellCheckComponent Loading spell index for spellchecker: jarowinkler
   [junit4]   2> 1167016 INFO  (searcherExecutor-3872-thread-1-processing-x:collection1)
[    x:collection1] o.a.s.h.c.SpellCheckComponent Loading spell index for spellchecker: external
   [junit4]   2> 1167016 INFO  (searcherExecutor-3872-thread-1-processing-x:collection1)
[    x:collection1] o.a.s.h.c.SpellCheckComponent Loading spell index for spellchecker: freq
   [junit4]   2> 1167016 INFO  (searcherExecutor-3872-thread-1-processing-x:collection1)
[    x:collection1] o.a.s.h.c.SpellCheckComponent Loading spell index for spellchecker: fqcn
   [junit4]   2> 1167016 INFO  (searcherExecutor-3872-thread-1-processing-x:collection1)
[    x:collection1] o.a.s.h.c.SpellCheckComponent Loading spell index for spellchecker: perDict
   [junit4]   2> 1167017 INFO  (searcherExecutor-3872-thread-1-processing-x:collection1)
[    x:collection1] o.a.s.c.SolrCore [collection1] Registered new searcher Searcher@18fc8e2[collection1]
main{ExitableDirectoryReader(UninvertingDirectoryReader())}
   [junit4]   2> 1167017 INFO  (coreLoadExecutor-3871-thread-1) [    x:collection1] o.a.s.u.UpdateLog
Could not find max version in index or recent updates, using new clock 1558187961641598976
   [junit4]   2> 1167020 INFO  (SUITE-MBeansHandlerTest-seed#[E201B7308FDBA6D2]-worker)
[    ] o.a.s.SolrTestCaseJ4 ####initCore end
   [junit4]   2> 1167028 INFO  (TEST-MBeansHandlerTest.testXMLDiffWithExternalEntity-seed#[E201B7308FDBA6D2])
[    ] o.a.s.SolrTestCaseJ4 ###Starting testXMLDiffWithExternalEntity
   [junit4]   2> 1167039 INFO  (TEST-MBeansHandlerTest.testXMLDiffWithExternalEntity-seed#[E201B7308FDBA6D2])
[    ] o.a.s.SolrTestCaseJ4 ###Ending testXMLDiffWithExternalEntity
   [junit4]   2> 1167041 INFO  (TEST-MBeansHandlerTest.testBackCompatNames-seed#[E201B7308FDBA6D2])
[    ] o.a.s.SolrTestCaseJ4 ###Starting testBackCompatNames
   [junit4]   2> 1167042 INFO  (TEST-MBeansHandlerTest.testBackCompatNames-seed#[E201B7308FDBA6D2])
[    ] o.a.s.c.S.Request [collection1]  webapp=null path=null params={qt=/admin/mbeans&wt=xml}
status=0 QTime=0
   [junit4]   2> 1167047 INFO  (TEST-MBeansHandlerTest.testBackCompatNames-seed#[E201B7308FDBA6D2])
[    ] o.a.s.c.S.Request [collection1]  webapp=null path=null params={qt=/admin/mbeans&cat=QUERYHANDLER&wt=xml}
status=0 QTime=0
   [junit4]   2> 1167048 INFO  (TEST-MBeansHandlerTest.testBackCompatNames-seed#[E201B7308FDBA6D2])
[    ] o.a.s.c.S.Request [collection1]  webapp=null path=null params={qt=/admin/mbeans&cat=UPDATE&wt=xml}
status=0 QTime=0
   [junit4]   2> 1167048 INFO  (TEST-MBeansHandlerTest.testBackCompatNames-seed#[E201B7308FDBA6D2])
[    ] o.a.s.SolrTestCaseJ4 ###Ending testBackCompatNames
   [junit4]   2> 1167051 INFO  (TEST-MBeansHandlerTest.testDiff-seed#[E201B7308FDBA6D2])
[    ] o.a.s.SolrTestCaseJ4 ###Starting testDiff
   [junit4]   2> 1167052 INFO  (TEST-MBeansHandlerTest.testDiff-seed#[E201B7308FDBA6D2])
[    ] o.a.s.c.S.Request [collection1]  webapp=null path=null params={qt=/admin/mbeans&stats=true&wt=xml}
status=0 QTime=1
   [junit4]   2> 1167082 INFO  (TEST-MBeansHandlerTest.testDiff-seed#[E201B7308FDBA6D2])
[    ] o.a.s.c.S.Request [collection1]  webapp=null path=null params={qt=/admin/mbeans&stats=true&diff=true&wt=xml}
status=0 QTime=28
   [junit4]   2> 1167087 INFO  (TEST-MBeansHandlerTest.testDiff-seed#[E201B7308FDBA6D2])
[    ] o.a.s.SolrTestCaseJ4 ###Ending testDiff
   [junit4]   2> NOTE: reproduce with: ant test  -Dtestcase=MBeansHandlerTest -Dtests.method=testDiff
-Dtests.seed=E201B7308FDBA6D2 -Dtests.multiplier=3 -Dtests.slow=true -Dtests.locale=tr-TR
-Dtests.timezone=Antarctica/DumontDUrville -Dtests.asserts=true -Dtests.file.encoding=UTF-8
   [junit4] FAILURE 0.04s J0 | MBeansHandlerTest.testDiff <<<
   [junit4]    > Throwable #1: org.junit.ComparisonFailure: expected:<Was: [1, Now:
2], Delta: 1> but was:<Was: [4, Now: 5], Delta: 1>
   [junit4]    > 	at __randomizedtesting.SeedInfo.seed([E201B7308FDBA6D2:271773AB9F6D9EB2]:0)
   [junit4]    > 	at org.apache.solr.handler.admin.MBeansHandlerTest.testDiff(MBeansHandlerTest.java:63)
   [junit4]    > 	at java.lang.Thread.run(Thread.java:745)
   [junit4]   2> 1167091 INFO  (SUITE-MBeansHandlerTest-seed#[E201B7308FDBA6D2]-worker)
[    ] o.a.s.SolrTestCaseJ4 ###deleteCore
   [junit4]   2> 1167091 INFO  (SUITE-MBeansHandlerTest-seed#[E201B7308FDBA6D2]-worker)
[    ] o.a.s.c.CoreContainer Shutting down CoreContainer instance=5778097
   [junit4]   2> 1167092 INFO  (coreCloseExecutor-3877-thread-1) [    x:collection1] o.a.s.c.SolrCore
[collection1]  CLOSING SolrCore org.apache.solr.core.SolrCore@10c856f
   [junit4]   2> 1167137 INFO  (coreCloseExecutor-3877-thread-1) [    x:collection1] o.a.s.m.SolrMetricManager
Closing metric reporters for: solr.core.collection1
   [junit4]   2> 1167140 INFO  (SUITE-MBeansHandlerTest-seed#[E201B7308FDBA6D2]-worker)
[    ] o.a.s.m.SolrMetricManager Closing metric reporters for: solr.node
   [junit4]   2> NOTE: leaving temporary files on disk at: /home/jenkins/workspace/Lucene-Solr-6.4-Linux/solr/build/solr-core/test/J0/temp/solr.handler.admin.MBeansHandlerTest_E201B7308FDBA6D2-001
   [junit4]   2> NOTE: test params are: codec=Asserting(Lucene62): {}, docValues:{}, maxPointsInLeafNode=981,
maxMBSortInHeap=6.3059236110470165, sim=RandomSimilarity(queryNorm=true,coord=crazy): {},
locale=tr-TR, timezone=Antarctica/DumontDUrville
   [junit4]   2> NOTE: Linux 4.4.0-53-generic i386/Oracle Corporation 1.8.0_121 (32-bit)/cpus=12,threads=1,free=214094496,total=348913664
   [junit4]   2> NOTE: All tests run in this JVM: [TestSolr4Spatial2, SignatureUpdateProcessorFactoryTest,
SolrSlf4jReporterTest, TestSha256AuthenticationProvider, PolyFieldTest, TestComplexPhraseLeadingWildcard,
TestFieldCacheWithThreads, CursorPagingTest, HighlighterConfigTest, HdfsWriteToMultipleCollectionsTest,
TestCloudRecovery, DistributedQueryElevationComponentTest, MergeStrategyTest, ResourceLoaderTest,
TestCrossCoreJoin, DistributedSpellCheckComponentTest, DisMaxRequestHandlerTest, CloudExitableDirectoryReaderTest,
DirectoryFactoryTest, TestDocumentBuilder, CacheHeaderTest, SolrMetricManagerTest, TestStandardQParsers,
TestRangeQuery, DeleteShardTest, SuggestComponentContextFilterQueryTest, DateRangeFieldTest,
PeerSyncWithIndexFingerprintCachingTest, TestSortByMinMaxFunction, NotRequiredUniqueKeyTest,
DistribDocExpirationUpdateProcessorTest, ClassificationUpdateProcessorIntegrationTest, TestSchemalessBufferedUpdates,
TestConfigSetsAPI, TestStressRecovery, TestCSVLoader, TestNamedUpdateProcessors, TestFastLRUCache,
ExplicitHLLTest, FileBasedSpellCheckerTest, AsyncCallRequestStatusResponseTest, TestRestManager,
TestBlobHandler, StandardRequestHandlerTest, TestStressLucene, TestCloudInspectUtil, SecurityConfHandlerTest,
TestHashQParserPlugin, TestCryptoKeys, HdfsDirectoryTest, TestExceedMaxTermLength, TestJsonFacets,
UUIDFieldTest, TestSolrCLIRunExample, TestRawResponseWriter, HttpPartitionTest, TestManagedSchemaAPI,
CdcrReplicationDistributedZkTest, UniqFieldsUpdateProcessorFactoryTest, CurrencyFieldOpenExchangeTest,
TestSQLHandler, TestScoreJoinQPNoScore, TestJoin, TestFastWriter, TestImplicitCoreProperties,
BlockCacheTest, TestSolr4Spatial, TestLocalFSCloudBackupRestore, TestSSLRandomization, DistanceUnitsTest,
TestTolerantUpdateProcessorCloud, RollingRestartTest, CoreMergeIndexesAdminHandlerTest, TestAtomicUpdateErrorCases,
DistributedDebugComponentTest, SolrGangliaReporterTest, TestDistribIDF, ClusterStateTest,
LeaderFailureAfterFreshStartTest, TestDocSet, DistributedVersionInfoTest, SolrCoreTest, TestComponentsName,
TestFileDictionaryLookup, TestEmbeddedSolrServerConstructors, AlternateDirectoryTest, TestIBSimilarityFactory,
RequiredFieldsTest, BlockJoinFacetRandomTest, TestPerFieldSimilarityWithDefaultOverride, OverseerRolesTest,
AnalysisErrorHandlingTest, ConjunctionSolrSpellCheckerTest, TestDownShardTolerantSearch, TestJmxIntegration,
PeerSyncReplicationTest, TestFunctionQuery, TestSchemaResource, TestSizeLimitedDistributedMap,
JSONWriterTest, CollectionTooManyReplicasTest, AnalysisAfterCoreReloadTest, JavabinLoaderTest,
TestXmlQParser, AddSchemaFieldsUpdateProcessorFactoryTest, TestLeaderElectionWithEmptyReplica,
TestBadConfig, TestNumericTerms64, BigEndianAscendingWordDeserializerTest, TestFieldTypeCollectionResource,
XsltUpdateRequestHandlerTest, TestRandomDVFaceting, TestFaceting, TestHashPartitioner, TestStressReorder,
TestCoreContainer, StatsComponentTest, QueryElevationComponentTest, PeerSyncTest, TestFiltering,
SolrRequestParserTest, TestFoldingMultitermQuery, SuggesterTest, SolrCoreCheckLockOnStartupTest,
TestUpdate, DirectUpdateHandlerOptimizeTest, StatelessScriptUpdateProcessorFactoryTest, TestSolrDeletionPolicy1,
TestReversedWildcardFilterFactory, TestOmitPositions, XmlUpdateRequestHandlerTest, TestValueSourceCache,
FieldAnalysisRequestHandlerTest, FastVectorHighlighterTest, RegexBoostProcessorTest, UpdateRequestProcessorFactoryTest,
MBeansHandlerTest]
   [junit4] Completed [408/680 (1!)] on J0 in 0.76s, 3 tests, 1 failure <<< FAILURES!

[...truncated 55609 lines...]


Mime
View raw message