lucene-dev mailing list archives

Site index · List index
Message view « Date » · « Thread »
Top « Date » · « Thread »
From Policeman Jenkins Server <jenk...@thetaphi.de>
Subject [JENKINS-EA] Lucene-Solr-master-Linux (64bit/jdk-9-ea+153) - Build # 18894 - Still Unstable!
Date Fri, 03 Feb 2017 03:41:37 GMT
Build: https://jenkins.thetaphi.de/job/Lucene-Solr-master-Linux/18894/
Java: 64bit/jdk-9-ea+153 -XX:-UseCompressedOops -XX:+UseParallelGC

3 tests failed.
FAILED:  org.apache.solr.handler.TestReqParamsAPI.test

Error Message:
Could not get expected value  'A val' for path 'params/a' full output: {   "responseHeader":{     "status":0,     "QTime":0},   "params":{     "wt":"json",     "useParams":""},   "context":{     "webapp":"/solr",     "path":"/dump0",     "httpMethod":"GET"}},  from server:  https://127.0.0.1:44115/solr/collection1_shard1_replica1

Stack Trace:
java.lang.AssertionError: Could not get expected value  'A val' for path 'params/a' full output: {
  "responseHeader":{
    "status":0,
    "QTime":0},
  "params":{
    "wt":"json",
    "useParams":""},
  "context":{
    "webapp":"/solr",
    "path":"/dump0",
    "httpMethod":"GET"}},  from server:  https://127.0.0.1:44115/solr/collection1_shard1_replica1
	at __randomizedtesting.SeedInfo.seed([8623CF5E6E900586:E77F084C06C687E]:0)
	at org.junit.Assert.fail(Assert.java:93)
	at org.junit.Assert.assertTrue(Assert.java:43)
	at org.apache.solr.core.TestSolrConfigHandler.testForResponseElement(TestSolrConfigHandler.java:556)
	at org.apache.solr.handler.TestReqParamsAPI.testReqParams(TestReqParamsAPI.java:127)
	at org.apache.solr.handler.TestReqParamsAPI.test(TestReqParamsAPI.java:69)
	at java.base/jdk.internal.reflect.NativeMethodAccessorImpl.invoke0(Native Method)
	at java.base/jdk.internal.reflect.NativeMethodAccessorImpl.invoke(NativeMethodAccessorImpl.java:62)
	at java.base/jdk.internal.reflect.DelegatingMethodAccessorImpl.invoke(DelegatingMethodAccessorImpl.java:43)
	at java.base/java.lang.reflect.Method.invoke(Method.java:543)
	at com.carrotsearch.randomizedtesting.RandomizedRunner.invoke(RandomizedRunner.java:1713)
	at com.carrotsearch.randomizedtesting.RandomizedRunner$8.evaluate(RandomizedRunner.java:907)
	at com.carrotsearch.randomizedtesting.RandomizedRunner$9.evaluate(RandomizedRunner.java:943)
	at com.carrotsearch.randomizedtesting.RandomizedRunner$10.evaluate(RandomizedRunner.java:957)
	at com.carrotsearch.randomizedtesting.rules.SystemPropertiesRestoreRule$1.evaluate(SystemPropertiesRestoreRule.java:57)
	at org.apache.lucene.util.TestRuleSetupTeardownChained$1.evaluate(TestRuleSetupTeardownChained.java:49)
	at org.apache.lucene.util.AbstractBeforeAfterRule$1.evaluate(AbstractBeforeAfterRule.java:45)
	at org.apache.lucene.util.TestRuleThreadAndTestName$1.evaluate(TestRuleThreadAndTestName.java:48)
	at org.apache.lucene.util.TestRuleIgnoreAfterMaxFailures$1.evaluate(TestRuleIgnoreAfterMaxFailures.java:64)
	at org.apache.lucene.util.TestRuleMarkFailure$1.evaluate(TestRuleMarkFailure.java:47)
	at com.carrotsearch.randomizedtesting.rules.StatementAdapter.evaluate(StatementAdapter.java:36)
	at com.carrotsearch.randomizedtesting.ThreadLeakControl$StatementRunner.run(ThreadLeakControl.java:368)
	at com.carrotsearch.randomizedtesting.ThreadLeakControl.forkTimeoutingTask(ThreadLeakControl.java:817)
	at com.carrotsearch.randomizedtesting.ThreadLeakControl$3.evaluate(ThreadLeakControl.java:468)
	at com.carrotsearch.randomizedtesting.RandomizedRunner.runSingleTest(RandomizedRunner.java:916)
	at com.carrotsearch.randomizedtesting.RandomizedRunner$5.evaluate(RandomizedRunner.java:802)
	at com.carrotsearch.randomizedtesting.RandomizedRunner$6.evaluate(RandomizedRunner.java:852)
	at com.carrotsearch.randomizedtesting.RandomizedRunner$7.evaluate(RandomizedRunner.java:863)
	at com.carrotsearch.randomizedtesting.rules.StatementAdapter.evaluate(StatementAdapter.java:36)
	at com.carrotsearch.randomizedtesting.rules.SystemPropertiesRestoreRule$1.evaluate(SystemPropertiesRestoreRule.java:57)
	at org.apache.lucene.util.AbstractBeforeAfterRule$1.evaluate(AbstractBeforeAfterRule.java:45)
	at com.carrotsearch.randomizedtesting.rules.StatementAdapter.evaluate(StatementAdapter.java:36)
	at org.apache.lucene.util.TestRuleStoreClassName$1.evaluate(TestRuleStoreClassName.java:41)
	at com.carrotsearch.randomizedtesting.rules.NoShadowingOrOverridesOnMethodsRule$1.evaluate(NoShadowingOrOverridesOnMethodsRule.java:40)
	at com.carrotsearch.randomizedtesting.rules.NoShadowingOrOverridesOnMethodsRule$1.evaluate(NoShadowingOrOverridesOnMethodsRule.java:40)
	at com.carrotsearch.randomizedtesting.rules.StatementAdapter.evaluate(StatementAdapter.java:36)
	at com.carrotsearch.randomizedtesting.rules.StatementAdapter.evaluate(StatementAdapter.java:36)
	at org.apache.lucene.util.TestRuleAssertionsRequired$1.evaluate(TestRuleAssertionsRequired.java:53)
	at org.apache.lucene.util.TestRuleMarkFailure$1.evaluate(TestRuleMarkFailure.java:47)
	at org.apache.lucene.util.TestRuleIgnoreAfterMaxFailures$1.evaluate(TestRuleIgnoreAfterMaxFailures.java:64)
	at org.apache.lucene.util.TestRuleIgnoreTestSuites$1.evaluate(TestRuleIgnoreTestSuites.java:54)
	at com.carrotsearch.randomizedtesting.rules.StatementAdapter.evaluate(StatementAdapter.java:36)
	at com.carrotsearch.randomizedtesting.ThreadLeakControl$StatementRunner.run(ThreadLeakControl.java:368)
	at java.base/java.lang.Thread.run(Thread.java:844)


FAILED:  org.apache.solr.handler.admin.TestApiFramework.testFramework

Error Message:


Stack Trace:
java.lang.ExceptionInInitializerError
	at __randomizedtesting.SeedInfo.seed([8623CF5E6E900586:915505796844E9BB]:0)
	at net.sf.cglib.core.KeyFactory$Generator.generateClass(KeyFactory.java:166)
	at net.sf.cglib.core.DefaultGeneratorStrategy.generate(DefaultGeneratorStrategy.java:25)
	at net.sf.cglib.core.AbstractClassGenerator.create(AbstractClassGenerator.java:216)
	at net.sf.cglib.core.KeyFactory$Generator.create(KeyFactory.java:144)
	at net.sf.cglib.core.KeyFactory.create(KeyFactory.java:116)
	at net.sf.cglib.core.KeyFactory.create(KeyFactory.java:108)
	at net.sf.cglib.core.KeyFactory.create(KeyFactory.java:104)
	at net.sf.cglib.proxy.Enhancer.<clinit>(Enhancer.java:69)
	at org.easymock.internal.ClassProxyFactory.createEnhancer(ClassProxyFactory.java:259)
	at org.easymock.internal.ClassProxyFactory.createProxy(ClassProxyFactory.java:174)
	at org.easymock.internal.MocksControl.createMock(MocksControl.java:60)
	at org.easymock.EasyMock.createMock(EasyMock.java:104)
	at org.apache.solr.handler.admin.TestCoreAdminApis.getCoreContainerMock(TestCoreAdminApis.java:76)
	at org.apache.solr.handler.admin.TestApiFramework.testFramework(TestApiFramework.java:59)
	at java.base/jdk.internal.reflect.NativeMethodAccessorImpl.invoke0(Native Method)
	at java.base/jdk.internal.reflect.NativeMethodAccessorImpl.invoke(NativeMethodAccessorImpl.java:62)
	at java.base/jdk.internal.reflect.DelegatingMethodAccessorImpl.invoke(DelegatingMethodAccessorImpl.java:43)
	at java.base/java.lang.reflect.Method.invoke(Method.java:543)
	at com.carrotsearch.randomizedtesting.RandomizedRunner.invoke(RandomizedRunner.java:1713)
	at com.carrotsearch.randomizedtesting.RandomizedRunner$8.evaluate(RandomizedRunner.java:907)
	at com.carrotsearch.randomizedtesting.RandomizedRunner$9.evaluate(RandomizedRunner.java:943)
	at com.carrotsearch.randomizedtesting.RandomizedRunner$10.evaluate(RandomizedRunner.java:957)
	at com.carrotsearch.randomizedtesting.rules.SystemPropertiesRestoreRule$1.evaluate(SystemPropertiesRestoreRule.java:57)
	at org.apache.lucene.util.TestRuleSetupTeardownChained$1.evaluate(TestRuleSetupTeardownChained.java:49)
	at org.apache.lucene.util.AbstractBeforeAfterRule$1.evaluate(AbstractBeforeAfterRule.java:45)
	at org.apache.lucene.util.TestRuleThreadAndTestName$1.evaluate(TestRuleThreadAndTestName.java:48)
	at org.apache.lucene.util.TestRuleIgnoreAfterMaxFailures$1.evaluate(TestRuleIgnoreAfterMaxFailures.java:64)
	at org.apache.lucene.util.TestRuleMarkFailure$1.evaluate(TestRuleMarkFailure.java:47)
	at com.carrotsearch.randomizedtesting.rules.StatementAdapter.evaluate(StatementAdapter.java:36)
	at com.carrotsearch.randomizedtesting.ThreadLeakControl$StatementRunner.run(ThreadLeakControl.java:368)
	at com.carrotsearch.randomizedtesting.ThreadLeakControl.forkTimeoutingTask(ThreadLeakControl.java:817)
	at com.carrotsearch.randomizedtesting.ThreadLeakControl$3.evaluate(ThreadLeakControl.java:468)
	at com.carrotsearch.randomizedtesting.RandomizedRunner.runSingleTest(RandomizedRunner.java:916)
	at com.carrotsearch.randomizedtesting.RandomizedRunner$5.evaluate(RandomizedRunner.java:802)
	at com.carrotsearch.randomizedtesting.RandomizedRunner$6.evaluate(RandomizedRunner.java:852)
	at com.carrotsearch.randomizedtesting.RandomizedRunner$7.evaluate(RandomizedRunner.java:863)
	at com.carrotsearch.randomizedtesting.rules.StatementAdapter.evaluate(StatementAdapter.java:36)
	at com.carrotsearch.randomizedtesting.rules.SystemPropertiesRestoreRule$1.evaluate(SystemPropertiesRestoreRule.java:57)
	at org.apache.lucene.util.AbstractBeforeAfterRule$1.evaluate(AbstractBeforeAfterRule.java:45)
	at com.carrotsearch.randomizedtesting.rules.StatementAdapter.evaluate(StatementAdapter.java:36)
	at org.apache.lucene.util.TestRuleStoreClassName$1.evaluate(TestRuleStoreClassName.java:41)
	at com.carrotsearch.randomizedtesting.rules.NoShadowingOrOverridesOnMethodsRule$1.evaluate(NoShadowingOrOverridesOnMethodsRule.java:40)
	at com.carrotsearch.randomizedtesting.rules.NoShadowingOrOverridesOnMethodsRule$1.evaluate(NoShadowingOrOverridesOnMethodsRule.java:40)
	at com.carrotsearch.randomizedtesting.rules.StatementAdapter.evaluate(StatementAdapter.java:36)
	at com.carrotsearch.randomizedtesting.rules.StatementAdapter.evaluate(StatementAdapter.java:36)
	at org.apache.lucene.util.TestRuleAssertionsRequired$1.evaluate(TestRuleAssertionsRequired.java:53)
	at org.apache.lucene.util.TestRuleMarkFailure$1.evaluate(TestRuleMarkFailure.java:47)
	at org.apache.lucene.util.TestRuleIgnoreAfterMaxFailures$1.evaluate(TestRuleIgnoreAfterMaxFailures.java:64)
	at org.apache.lucene.util.TestRuleIgnoreTestSuites$1.evaluate(TestRuleIgnoreTestSuites.java:54)
	at com.carrotsearch.randomizedtesting.rules.StatementAdapter.evaluate(StatementAdapter.java:36)
	at com.carrotsearch.randomizedtesting.ThreadLeakControl$StatementRunner.run(ThreadLeakControl.java:368)
	at java.base/java.lang.Thread.run(Thread.java:844)
Caused by: java.lang.reflect.InaccessibleObjectException: Unable to make protected final java.lang.Class java.lang.ClassLoader.defineClass(java.lang.String,byte[],int,int,java.security.ProtectionDomain) throws java.lang.ClassFormatError accessible: module java.base does not "opens java.lang" to unnamed module @6c812f12
	at java.base/java.lang.reflect.AccessibleObject.checkCanSetAccessible(AccessibleObject.java:207)
	at java.base/java.lang.reflect.Method.checkCanSetAccessible(Method.java:192)
	at java.base/java.lang.reflect.Method.setAccessible(Method.java:186)
	at net.sf.cglib.core.ReflectUtils$2.run(ReflectUtils.java:56)
	at java.base/java.security.AccessController.doPrivileged(Native Method)
	at net.sf.cglib.core.ReflectUtils.<clinit>(ReflectUtils.java:46)
	... 52 more


FAILED:  org.apache.solr.handler.admin.TestCoreAdminApis.testCalls

Error Message:


Stack Trace:
java.lang.ExceptionInInitializerError
	at __randomizedtesting.SeedInfo.seed([8623CF5E6E900586:B4E2D035EB1CB621]:0)
	at net.sf.cglib.core.KeyFactory$Generator.generateClass(KeyFactory.java:166)
	at net.sf.cglib.core.DefaultGeneratorStrategy.generate(DefaultGeneratorStrategy.java:25)
	at net.sf.cglib.core.AbstractClassGenerator.create(AbstractClassGenerator.java:216)
	at net.sf.cglib.core.KeyFactory$Generator.create(KeyFactory.java:144)
	at net.sf.cglib.core.KeyFactory.create(KeyFactory.java:116)
	at net.sf.cglib.core.KeyFactory.create(KeyFactory.java:108)
	at net.sf.cglib.core.KeyFactory.create(KeyFactory.java:104)
	at net.sf.cglib.proxy.Enhancer.<clinit>(Enhancer.java:69)
	at org.easymock.internal.ClassProxyFactory.createEnhancer(ClassProxyFactory.java:259)
	at org.easymock.internal.ClassProxyFactory.createProxy(ClassProxyFactory.java:174)
	at org.easymock.internal.MocksControl.createMock(MocksControl.java:60)
	at org.easymock.EasyMock.createMock(EasyMock.java:104)
	at org.apache.solr.handler.admin.TestCoreAdminApis.getCoreContainerMock(TestCoreAdminApis.java:76)
	at org.apache.solr.handler.admin.TestCoreAdminApis.testCalls(TestCoreAdminApis.java:43)
	at java.base/jdk.internal.reflect.NativeMethodAccessorImpl.invoke0(Native Method)
	at java.base/jdk.internal.reflect.NativeMethodAccessorImpl.invoke(NativeMethodAccessorImpl.java:62)
	at java.base/jdk.internal.reflect.DelegatingMethodAccessorImpl.invoke(DelegatingMethodAccessorImpl.java:43)
	at java.base/java.lang.reflect.Method.invoke(Method.java:543)
	at com.carrotsearch.randomizedtesting.RandomizedRunner.invoke(RandomizedRunner.java:1713)
	at com.carrotsearch.randomizedtesting.RandomizedRunner$8.evaluate(RandomizedRunner.java:907)
	at com.carrotsearch.randomizedtesting.RandomizedRunner$9.evaluate(RandomizedRunner.java:943)
	at com.carrotsearch.randomizedtesting.RandomizedRunner$10.evaluate(RandomizedRunner.java:957)
	at com.carrotsearch.randomizedtesting.rules.SystemPropertiesRestoreRule$1.evaluate(SystemPropertiesRestoreRule.java:57)
	at org.apache.lucene.util.TestRuleSetupTeardownChained$1.evaluate(TestRuleSetupTeardownChained.java:49)
	at org.apache.lucene.util.AbstractBeforeAfterRule$1.evaluate(AbstractBeforeAfterRule.java:45)
	at org.apache.lucene.util.TestRuleThreadAndTestName$1.evaluate(TestRuleThreadAndTestName.java:48)
	at org.apache.lucene.util.TestRuleIgnoreAfterMaxFailures$1.evaluate(TestRuleIgnoreAfterMaxFailures.java:64)
	at org.apache.lucene.util.TestRuleMarkFailure$1.evaluate(TestRuleMarkFailure.java:47)
	at com.carrotsearch.randomizedtesting.rules.StatementAdapter.evaluate(StatementAdapter.java:36)
	at com.carrotsearch.randomizedtesting.ThreadLeakControl$StatementRunner.run(ThreadLeakControl.java:368)
	at com.carrotsearch.randomizedtesting.ThreadLeakControl.forkTimeoutingTask(ThreadLeakControl.java:817)
	at com.carrotsearch.randomizedtesting.ThreadLeakControl$3.evaluate(ThreadLeakControl.java:468)
	at com.carrotsearch.randomizedtesting.RandomizedRunner.runSingleTest(RandomizedRunner.java:916)
	at com.carrotsearch.randomizedtesting.RandomizedRunner$5.evaluate(RandomizedRunner.java:802)
	at com.carrotsearch.randomizedtesting.RandomizedRunner$6.evaluate(RandomizedRunner.java:852)
	at com.carrotsearch.randomizedtesting.RandomizedRunner$7.evaluate(RandomizedRunner.java:863)
	at com.carrotsearch.randomizedtesting.rules.StatementAdapter.evaluate(StatementAdapter.java:36)
	at com.carrotsearch.randomizedtesting.rules.SystemPropertiesRestoreRule$1.evaluate(SystemPropertiesRestoreRule.java:57)
	at org.apache.lucene.util.AbstractBeforeAfterRule$1.evaluate(AbstractBeforeAfterRule.java:45)
	at com.carrotsearch.randomizedtesting.rules.StatementAdapter.evaluate(StatementAdapter.java:36)
	at org.apache.lucene.util.TestRuleStoreClassName$1.evaluate(TestRuleStoreClassName.java:41)
	at com.carrotsearch.randomizedtesting.rules.NoShadowingOrOverridesOnMethodsRule$1.evaluate(NoShadowingOrOverridesOnMethodsRule.java:40)
	at com.carrotsearch.randomizedtesting.rules.NoShadowingOrOverridesOnMethodsRule$1.evaluate(NoShadowingOrOverridesOnMethodsRule.java:40)
	at com.carrotsearch.randomizedtesting.rules.StatementAdapter.evaluate(StatementAdapter.java:36)
	at com.carrotsearch.randomizedtesting.rules.StatementAdapter.evaluate(StatementAdapter.java:36)
	at org.apache.lucene.util.TestRuleAssertionsRequired$1.evaluate(TestRuleAssertionsRequired.java:53)
	at org.apache.lucene.util.TestRuleMarkFailure$1.evaluate(TestRuleMarkFailure.java:47)
	at org.apache.lucene.util.TestRuleIgnoreAfterMaxFailures$1.evaluate(TestRuleIgnoreAfterMaxFailures.java:64)
	at org.apache.lucene.util.TestRuleIgnoreTestSuites$1.evaluate(TestRuleIgnoreTestSuites.java:54)
	at com.carrotsearch.randomizedtesting.rules.StatementAdapter.evaluate(StatementAdapter.java:36)
	at com.carrotsearch.randomizedtesting.ThreadLeakControl$StatementRunner.run(ThreadLeakControl.java:368)
	at java.base/java.lang.Thread.run(Thread.java:844)
Caused by: java.lang.reflect.InaccessibleObjectException: Unable to make protected final java.lang.Class java.lang.ClassLoader.defineClass(java.lang.String,byte[],int,int,java.security.ProtectionDomain) throws java.lang.ClassFormatError accessible: module java.base does not "opens java.lang" to unnamed module @64c588ce
	at java.base/java.lang.reflect.AccessibleObject.checkCanSetAccessible(AccessibleObject.java:207)
	at java.base/java.lang.reflect.Method.checkCanSetAccessible(Method.java:192)
	at java.base/java.lang.reflect.Method.setAccessible(Method.java:186)
	at net.sf.cglib.core.ReflectUtils$2.run(ReflectUtils.java:56)
	at java.base/java.security.AccessController.doPrivileged(Native Method)
	at net.sf.cglib.core.ReflectUtils.<clinit>(ReflectUtils.java:46)
	... 52 more




Build Log:
[...truncated 11082 lines...]
   [junit4] Suite: org.apache.solr.handler.TestReqParamsAPI
   [junit4]   2> Creating dataDir: /home/jenkins/workspace/Lucene-Solr-master-Linux/solr/build/solr-core/test/J1/temp/solr.handler.TestReqParamsAPI_8623CF5E6E900586-001/init-core-data-001
   [junit4]   2> 343905 INFO  (SUITE-TestReqParamsAPI-seed#[8623CF5E6E900586]-worker) [    ] o.a.s.SolrTestCaseJ4 Using PointFields
   [junit4]   2> 343907 INFO  (SUITE-TestReqParamsAPI-seed#[8623CF5E6E900586]-worker) [    ] o.a.s.SolrTestCaseJ4 Randomized ssl (true) and clientAuth (true) via: @org.apache.solr.util.RandomizeSSL(reason="", ssl=0.0/0.0, value=0.0/0.0, clientAuth=0.0/0.0)
   [junit4]   2> 343910 INFO  (SUITE-TestReqParamsAPI-seed#[8623CF5E6E900586]-worker) [    ] o.a.s.c.MiniSolrCloudCluster Starting cluster of 2 servers in /home/jenkins/workspace/Lucene-Solr-master-Linux/solr/build/solr-core/test/J1/temp/solr.handler.TestReqParamsAPI_8623CF5E6E900586-001/tempDir-001
   [junit4]   2> 343911 INFO  (SUITE-TestReqParamsAPI-seed#[8623CF5E6E900586]-worker) [    ] o.a.s.c.ZkTestServer STARTING ZK TEST SERVER
   [junit4]   2> 343911 INFO  (Thread-749) [    ] o.a.s.c.ZkTestServer client port:0.0.0.0/0.0.0.0:0
   [junit4]   2> 343912 INFO  (Thread-749) [    ] o.a.s.c.ZkTestServer Starting server
   [junit4]   2> 344011 INFO  (SUITE-TestReqParamsAPI-seed#[8623CF5E6E900586]-worker) [    ] o.a.s.c.ZkTestServer start zk server on port:38366
   [junit4]   2> 344045 INFO  (jetty-launcher-458-thread-1) [    ] o.e.j.s.Server jetty-9.3.14.v20161028
   [junit4]   2> 344046 INFO  (jetty-launcher-458-thread-2) [    ] o.e.j.s.Server jetty-9.3.14.v20161028
   [junit4]   2> 344046 INFO  (jetty-launcher-458-thread-1) [    ] o.e.j.s.h.ContextHandler Started o.e.j.s.ServletContextHandler@7b50bedd{/solr,null,AVAILABLE}
   [junit4]   2> 344046 INFO  (jetty-launcher-458-thread-2) [    ] o.e.j.s.h.ContextHandler Started o.e.j.s.ServletContextHandler@9ca75a4{/solr,null,AVAILABLE}
   [junit4]   2> 344049 INFO  (jetty-launcher-458-thread-2) [    ] o.e.j.s.AbstractConnector Started ServerConnector@2f5de4ea{SSL,[ssl, http/1.1]}{127.0.0.1:44115}
   [junit4]   2> 344049 INFO  (jetty-launcher-458-thread-2) [    ] o.e.j.s.Server Started @345783ms
   [junit4]   2> 344049 INFO  (jetty-launcher-458-thread-2) [    ] o.a.s.c.s.e.JettySolrRunner Jetty properties: {hostContext=/solr, hostPort=44115}
   [junit4]   2> 344050 ERROR (jetty-launcher-458-thread-2) [    ] o.a.s.s.StartupLoggingUtils Missing Java Option solr.log.dir. Logging may be missing or incomplete.
   [junit4]   2> 344050 INFO  (jetty-launcher-458-thread-2) [    ] o.a.s.s.SolrDispatchFilter  ___      _       Welcome to Apache Solr? version 7.0.0
   [junit4]   2> 344050 INFO  (jetty-launcher-458-thread-2) [    ] o.a.s.s.SolrDispatchFilter / __| ___| |_ _   Starting in cloud mode on port null
   [junit4]   2> 344050 INFO  (jetty-launcher-458-thread-2) [    ] o.a.s.s.SolrDispatchFilter \__ \/ _ \ | '_|  Install dir: null
   [junit4]   2> 344050 INFO  (jetty-launcher-458-thread-2) [    ] o.a.s.s.SolrDispatchFilter |___/\___/_|_|    Start time: 2017-02-03T03:03:12.977264Z
   [junit4]   2> 344049 INFO  (jetty-launcher-458-thread-1) [    ] o.e.j.s.AbstractConnector Started ServerConnector@4f3f82bd{SSL,[ssl, http/1.1]}{127.0.0.1:43540}
   [junit4]   2> 344051 INFO  (jetty-launcher-458-thread-1) [    ] o.e.j.s.Server Started @345784ms
   [junit4]   2> 344051 INFO  (jetty-launcher-458-thread-1) [    ] o.a.s.c.s.e.JettySolrRunner Jetty properties: {hostContext=/solr, hostPort=43540}
   [junit4]   2> 344051 ERROR (jetty-launcher-458-thread-1) [    ] o.a.s.s.StartupLoggingUtils Missing Java Option solr.log.dir. Logging may be missing or incomplete.
   [junit4]   2> 344051 INFO  (jetty-launcher-458-thread-1) [    ] o.a.s.s.SolrDispatchFilter  ___      _       Welcome to Apache Solr? version 7.0.0
   [junit4]   2> 344051 INFO  (jetty-launcher-458-thread-1) [    ] o.a.s.s.SolrDispatchFilter / __| ___| |_ _   Starting in cloud mode on port null
   [junit4]   2> 344051 INFO  (jetty-launcher-458-thread-1) [    ] o.a.s.s.SolrDispatchFilter \__ \/ _ \ | '_|  Install dir: null
   [junit4]   2> 344051 INFO  (jetty-launcher-458-thread-1) [    ] o.a.s.s.SolrDispatchFilter |___/\___/_|_|    Start time: 2017-02-03T03:03:12.978726Z
   [junit4]   2> 344054 INFO  (jetty-launcher-458-thread-2) [    ] o.a.s.s.SolrDispatchFilter solr.xml found in ZooKeeper. Loading...
   [junit4]   2> 344061 INFO  (jetty-launcher-458-thread-1) [    ] o.a.s.s.SolrDispatchFilter solr.xml found in ZooKeeper. Loading...
   [junit4]   2> 344069 INFO  (jetty-launcher-458-thread-2) [    ] o.a.s.c.ZkContainer Zookeeper client=127.0.0.1:38366/solr
   [junit4]   2> 344086 INFO  (jetty-launcher-458-thread-1) [    ] o.a.s.c.ZkContainer Zookeeper client=127.0.0.1:38366/solr
   [junit4]   2> 344110 INFO  (jetty-launcher-458-thread-1) [    ] o.a.s.c.OverseerElectionContext I am going to be the leader 127.0.0.1:43540_solr
   [junit4]   2> 344110 INFO  (jetty-launcher-458-thread-2) [    ] o.a.s.c.ZkController Register node as live in ZooKeeper:/live_nodes/127.0.0.1:44115_solr
   [junit4]   2> 344111 INFO  (jetty-launcher-458-thread-1) [    ] o.a.s.c.Overseer Overseer (id=97392459306958854-127.0.0.1:43540_solr-n_0000000000) starting
   [junit4]   2> 344114 INFO  (zkCallback-467-thread-1) [    ] o.a.s.c.c.ZkStateReader Updated live nodes from ZooKeeper... (0) -> (1)
   [junit4]   2> 344116 INFO  (zkCallback-469-thread-1) [    ] o.a.s.c.c.ZkStateReader Updated live nodes from ZooKeeper... (0) -> (1)
   [junit4]   2> 344122 INFO  (jetty-launcher-458-thread-1) [    ] o.a.s.c.ZkController Register node as live in ZooKeeper:/live_nodes/127.0.0.1:43540_solr
   [junit4]   2> 344124 INFO  (zkCallback-467-thread-1) [    ] o.a.s.c.c.ZkStateReader Updated live nodes from ZooKeeper... (1) -> (2)
   [junit4]   2> 344124 INFO  (zkCallback-469-thread-1) [    ] o.a.s.c.c.ZkStateReader Updated live nodes from ZooKeeper... (1) -> (2)
   [junit4]   2> 344221 INFO  (jetty-launcher-458-thread-1) [    ] o.a.s.c.CorePropertiesLocator Found 0 core definitions underneath /home/jenkins/workspace/Lucene-Solr-master-Linux/solr/build/solr-core/test/J1/temp/solr.handler.TestReqParamsAPI_8623CF5E6E900586-001/tempDir-001/node2/.
   [junit4]   2> 344276 INFO  (jetty-launcher-458-thread-2) [    ] o.a.s.c.CorePropertiesLocator Found 0 core definitions underneath /home/jenkins/workspace/Lucene-Solr-master-Linux/solr/build/solr-core/test/J1/temp/solr.handler.TestReqParamsAPI_8623CF5E6E900586-001/tempDir-001/node1/.
   [junit4]   2> 344430 INFO  (SUITE-TestReqParamsAPI-seed#[8623CF5E6E900586]-worker) [    ] o.a.s.c.c.ZkStateReader Updated live nodes from ZooKeeper... (0) -> (2)
   [junit4]   2> 344431 INFO  (SUITE-TestReqParamsAPI-seed#[8623CF5E6E900586]-worker) [    ] o.a.s.c.s.i.ZkClientClusterStateProvider Cluster at 127.0.0.1:38366/solr ready
   [junit4]   2> 344470 INFO  (qtp1696655716-2752) [    ] o.a.s.h.a.CollectionsHandler Invoked Collection Action :create with params replicationFactor=2&collection.configName=conf1&name=collection1&action=CREATE&numShards=1&wt=javabin&version=2 and sendToOCPQueue=true
   [junit4]   2> 344472 INFO  (OverseerThreadFactory-1231-thread-1) [    ] o.a.s.c.CreateCollectionCmd Create collection collection1
   [junit4]   2> 344578 INFO  (qtp1696655716-2760) [    ] o.a.s.h.a.CoreAdminOperation core create command qt=/admin/cores&collection.configName=conf1&newCollection=true&name=collection1_shard1_replica1&action=CREATE&numShards=1&collection=collection1&shard=shard1&wt=javabin&version=2
   [junit4]   2> 344595 INFO  (qtp813654598-2745) [    ] o.a.s.h.a.CoreAdminOperation core create command qt=/admin/cores&collection.configName=conf1&newCollection=true&name=collection1_shard1_replica2&action=CREATE&numShards=1&collection=collection1&shard=shard1&wt=javabin&version=2
   [junit4]   2> 344717 INFO  (zkCallback-469-thread-2) [    ] o.a.s.c.c.ZkStateReader A cluster state change: [WatchedEvent state:SyncConnected type:NodeDataChanged path:/collections/collection1/state.json] for collection [collection1] has occurred - updating... (live nodes size: [2])
   [junit4]   2> 344717 INFO  (zkCallback-467-thread-1) [    ] o.a.s.c.c.ZkStateReader A cluster state change: [WatchedEvent state:SyncConnected type:NodeDataChanged path:/collections/collection1/state.json] for collection [collection1] has occurred - updating... (live nodes size: [2])
   [junit4]   2> 345587 INFO  (qtp1696655716-2760) [    ] o.a.s.c.SolrConfig Using Lucene MatchVersion: 7.0.0
   [junit4]   2> 345592 INFO  (qtp1696655716-2760) [    ] o.a.s.s.IndexSchema [collection1_shard1_replica1] Schema name=minimal
   [junit4]   2> 345594 INFO  (qtp1696655716-2760) [    ] o.a.s.s.IndexSchema Loaded schema minimal/1.1 with uniqueid field id
   [junit4]   2> 345594 INFO  (qtp1696655716-2760) [    ] o.a.s.c.CoreContainer Creating SolrCore 'collection1_shard1_replica1' using configuration from collection collection1
   [junit4]   2> 345595 INFO  (qtp1696655716-2760) [    ] o.a.s.c.SolrCore [[collection1_shard1_replica1] ] Opening new SolrCore at [/home/jenkins/workspace/Lucene-Solr-master-Linux/solr/build/solr-core/test/J1/temp/solr.handler.TestReqParamsAPI_8623CF5E6E900586-001/tempDir-001/node1/collection1_shard1_replica1], dataDir=[/home/jenkins/workspace/Lucene-Solr-master-Linux/solr/build/solr-core/test/J1/temp/solr.handler.TestReqParamsAPI_8623CF5E6E900586-001/tempDir-001/node1/./collection1_shard1_replica1/data/]
   [junit4]   2> 345622 INFO  (qtp813654598-2745) [    ] o.a.s.c.SolrConfig Using Lucene MatchVersion: 7.0.0
   [junit4]   2> 345631 INFO  (qtp813654598-2745) [    ] o.a.s.s.IndexSchema [collection1_shard1_replica2] Schema name=minimal
   [junit4]   2> 345633 INFO  (qtp813654598-2745) [    ] o.a.s.s.IndexSchema Loaded schema minimal/1.1 with uniqueid field id
   [junit4]   2> 345634 INFO  (qtp813654598-2745) [    ] o.a.s.c.CoreContainer Creating SolrCore 'collection1_shard1_replica2' using configuration from collection collection1
   [junit4]   2> 345634 INFO  (qtp813654598-2745) [    ] o.a.s.c.SolrCore [[collection1_shard1_replica2] ] Opening new SolrCore at [/home/jenkins/workspace/Lucene-Solr-master-Linux/solr/build/solr-core/test/J1/temp/solr.handler.TestReqParamsAPI_8623CF5E6E900586-001/tempDir-001/node2/collection1_shard1_replica2], dataDir=[/home/jenkins/workspace/Lucene-Solr-master-Linux/solr/build/solr-core/test/J1/temp/solr.handler.TestReqParamsAPI_8623CF5E6E900586-001/tempDir-001/node2/./collection1_shard1_replica2/data/]
   [junit4]   2> 345751 INFO  (qtp1696655716-2760) [    ] o.a.s.u.UpdateHandler Using UpdateLog implementation: org.apache.solr.update.UpdateLog
   [junit4]   2> 345751 INFO  (qtp1696655716-2760) [    ] o.a.s.u.UpdateLog Initializing UpdateLog: dataDir=null defaultSyncLevel=FLUSH numRecordsToKeep=100 maxNumLogsToKeep=10 numVersionBuckets=65536
   [junit4]   2> 345756 INFO  (qtp1696655716-2760) [    ] o.a.s.u.CommitTracker Hard AutoCommit: disabled
   [junit4]   2> 345756 INFO  (qtp1696655716-2760) [    ] o.a.s.u.CommitTracker Soft AutoCommit: disabled
   [junit4]   2> 345757 INFO  (qtp1696655716-2760) [    ] o.a.s.s.SolrIndexSearcher Opening [Searcher@4ae398c1[collection1_shard1_replica1] main]
   [junit4]   2> 345757 INFO  (qtp1696655716-2760) [    ] o.a.s.r.ManagedResourceStorage Configured ZooKeeperStorageIO with znodeBase: /configs/conf1
   [junit4]   2> 345758 INFO  (qtp1696655716-2760) [    ] o.a.s.r.ManagedResourceStorage Loaded null at path _rest_managed.json using ZooKeeperStorageIO:path=/configs/conf1
   [junit4]   2> 345758 INFO  (qtp1696655716-2760) [    ] o.a.s.s.ZkIndexSchemaReader Creating ZooKeeper watch for the managed schema at /configs/conf1/managed-schema
   [junit4]   2> 345758 INFO  (qtp1696655716-2760) [    ] o.a.s.s.ZkIndexSchemaReader Current schema version 0 is already the latest
   [junit4]   2> 345758 INFO  (qtp1696655716-2760) [    ] o.a.s.h.ReplicationHandler Commits will be reserved for  10000
   [junit4]   2> 345758 INFO  (searcherExecutor-1236-thread-1) [    ] o.a.s.c.SolrCore [collection1_shard1_replica1] Registered new searcher Searcher@4ae398c1[collection1_shard1_replica1] main{ExitableDirectoryReader(UninvertingDirectoryReader())}
   [junit4]   2> 345758 INFO  (qtp1696655716-2760) [    ] o.a.s.u.UpdateLog Could not find max version in index or recent updates, using new clock 1558279350842818560
   [junit4]   2> 345762 INFO  (qtp1696655716-2760) [    ] o.a.s.c.ShardLeaderElectionContext Waiting until we see more replicas up for shard shard1: total=2 found=1 timeoutin=9999ms
   [junit4]   2> 345790 INFO  (qtp813654598-2745) [    ] o.a.s.u.UpdateHandler Using UpdateLog implementation: org.apache.solr.update.UpdateLog
   [junit4]   2> 345790 INFO  (qtp813654598-2745) [    ] o.a.s.u.UpdateLog Initializing UpdateLog: dataDir=null defaultSyncLevel=FLUSH numRecordsToKeep=100 maxNumLogsToKeep=10 numVersionBuckets=65536
   [junit4]   2> 345795 INFO  (qtp813654598-2745) [    ] o.a.s.u.CommitTracker Hard AutoCommit: disabled
   [junit4]   2> 345795 INFO  (qtp813654598-2745) [    ] o.a.s.u.CommitTracker Soft AutoCommit: disabled
   [junit4]   2> 345795 INFO  (qtp813654598-2745) [    ] o.a.s.s.SolrIndexSearcher Opening [Searcher@513f28d1[collection1_shard1_replica2] main]
   [junit4]   2> 345796 INFO  (qtp813654598-2745) [    ] o.a.s.r.ManagedResourceStorage Configured ZooKeeperStorageIO with znodeBase: /configs/conf1
   [junit4]   2> 345796 INFO  (qtp813654598-2745) [    ] o.a.s.r.ManagedResourceStorage Loaded null at path _rest_managed.json using ZooKeeperStorageIO:path=/configs/conf1
   [junit4]   2> 345796 INFO  (qtp813654598-2745) [    ] o.a.s.s.ZkIndexSchemaReader Creating ZooKeeper watch for the managed schema at /configs/conf1/managed-schema
   [junit4]   2> 345796 INFO  (qtp813654598-2745) [    ] o.a.s.s.ZkIndexSchemaReader Current schema version 0 is already the latest
   [junit4]   2> 345796 INFO  (qtp813654598-2745) [    ] o.a.s.h.ReplicationHandler Commits will be reserved for  10000
   [junit4]   2> 345796 INFO  (searcherExecutor-1237-thread-1) [    ] o.a.s.c.SolrCore [collection1_shard1_replica2] Registered new searcher Searcher@513f28d1[collection1_shard1_replica2] main{ExitableDirectoryReader(UninvertingDirectoryReader())}
   [junit4]   2> 345797 INFO  (qtp813654598-2745) [    ] o.a.s.u.UpdateLog Could not find max version in index or recent updates, using new clock 1558279350883713024
   [junit4]   2> 345863 INFO  (zkCallback-469-thread-2) [    ] o.a.s.c.c.ZkStateReader A cluster state change: [WatchedEvent state:SyncConnected type:NodeDataChanged path:/collections/collection1/state.json] for collection [collection1] has occurred - updating... (live nodes size: [2])
   [junit4]   2> 345863 INFO  (zkCallback-467-thread-1) [    ] o.a.s.c.c.ZkStateReader A cluster state change: [WatchedEvent state:SyncConnected type:NodeDataChanged path:/collections/collection1/state.json] for collection [collection1] has occurred - updating... (live nodes size: [2])
   [junit4]   2> 346262 INFO  (qtp1696655716-2760) [    ] o.a.s.c.ShardLeaderElectionContext Enough replicas found to continue.
   [junit4]   2> 346262 INFO  (qtp1696655716-2760) [    ] o.a.s.c.ShardLeaderElectionContext I may be the new leader - try and sync
   [junit4]   2> 346263 INFO  (qtp1696655716-2760) [    ] o.a.s.c.SyncStrategy Sync replicas to https://127.0.0.1:44115/solr/collection1_shard1_replica1/
   [junit4]   2> 346263 INFO  (qtp1696655716-2760) [    ] o.a.s.u.PeerSync PeerSync: core=collection1_shard1_replica1 url=https://127.0.0.1:44115/solr START replicas=[https://127.0.0.1:43540/solr/collection1_shard1_replica2/] nUpdates=100
   [junit4]   2> 346263 INFO  (qtp1696655716-2760) [    ] o.a.s.u.PeerSync PeerSync: core=collection1_shard1_replica1 url=https://127.0.0.1:44115/solr DONE.  We have no versions.  sync failed.
   [junit4]   2> 346266 INFO  (qtp813654598-2753) [    ] o.a.s.c.S.Request [collection1_shard1_replica2]  webapp=/solr path=/get params={distrib=false&qt=/get&fingerprint=false&getVersions=100&wt=javabin&version=2} status=0 QTime=0
   [junit4]   2> 346266 INFO  (qtp1696655716-2760) [    ] o.a.s.c.SyncStrategy Leader's attempt to sync with shard failed, moving to the next candidate
   [junit4]   2> 346266 INFO  (qtp1696655716-2760) [    ] o.a.s.c.ShardLeaderElectionContext We failed sync, but we have no versions - we can't sync in that case - we were active before, so become leader anyway
   [junit4]   2> 346268 INFO  (qtp1696655716-2760) [    ] o.a.s.c.ShardLeaderElectionContext I am the new leader: https://127.0.0.1:44115/solr/collection1_shard1_replica1/ shard1
   [junit4]   2> 346369 INFO  (zkCallback-469-thread-1) [    ] o.a.s.c.c.ZkStateReader A cluster state change: [WatchedEvent state:SyncConnected type:NodeDataChanged path:/collections/collection1/state.json] for collection [collection1] has occurred - updating... (live nodes size: [2])
   [junit4]   2> 346369 INFO  (zkCallback-467-thread-1) [    ] o.a.s.c.c.ZkStateReader A cluster state change: [WatchedEvent state:SyncConnected type:NodeDataChanged path:/collections/collection1/state.json] for collection [collection1] has occurred - updating... (live nodes size: [2])
   [junit4]   2> 346418 INFO  (qtp1696655716-2760) [    ] o.a.s.c.ZkController I am the leader, no recovery necessary
   [junit4]   2> 346421 INFO  (qtp1696655716-2760) [    ] o.a.s.s.HttpSolrCall [admin] webapp=null path=/admin/cores params={qt=/admin/cores&collection.configName=conf1&newCollection=true&name=collection1_shard1_replica1&action=CREATE&numShards=1&collection=collection1&shard=shard1&wt=javabin&version=2} status=0 QTime=1843
   [junit4]   2> 346520 INFO  (zkCallback-469-thread-2) [    ] o.a.s.c.c.ZkStateReader A cluster state change: [WatchedEvent state:SyncConnected type:NodeDataChanged path:/collections/collection1/state.json] for collection [collection1] has occurred - updating... (live nodes size: [2])
   [junit4]   2> 346520 INFO  (zkCallback-467-thread-1) [    ] o.a.s.c.c.ZkStateReader A cluster state change: [WatchedEvent state:SyncConnected type:NodeDataChanged path:/collections/collection1/state.json] for collection [collection1] has occurred - updating... (live nodes size: [2])
   [junit4]   2> 346811 INFO  (qtp813654598-2745) [    ] o.a.s.s.HttpSolrCall [admin] webapp=null path=/admin/cores params={qt=/admin/cores&collection.configName=conf1&newCollection=true&name=collection1_shard1_replica2&action=CREATE&numShards=1&collection=collection1&shard=shard1&wt=javabin&version=2} status=0 QTime=2215
   [junit4]   2> 346814 INFO  (qtp1696655716-2752) [    ] o.a.s.h.a.CollectionsHandler Wait for new collection to be active for at most 30 seconds. Check all shard replicas
   [junit4]   2> 346906 INFO  (zkCallback-469-thread-1) [    ] o.a.s.c.c.ZkStateReader A cluster state change: [WatchedEvent state:SyncConnected type:NodeDataChanged path:/collections/collection1/state.json] for collection [collection1] has occurred - updating... (live nodes size: [2])
   [junit4]   2> 346906 INFO  (zkCallback-467-thread-1) [    ] o.a.s.c.c.ZkStateReader A cluster state change: [WatchedEvent state:SyncConnected type:NodeDataChanged path:/collections/collection1/state.json] for collection [collection1] has occurred - updating... (live nodes size: [2])
   [junit4]   2> 347814 INFO  (qtp1696655716-2752) [    ] o.a.s.s.HttpSolrCall [admin] webapp=null path=/admin/collections params={replicationFactor=2&collection.configName=conf1&name=collection1&action=CREATE&numShards=1&wt=javabin&version=2} status=0 QTime=3343
   [junit4]   2> 347821 INFO  (TEST-TestReqParamsAPI.test-seed#[8623CF5E6E900586]) [    ] o.a.s.SolrTestCaseJ4 ###Starting test
   [junit4]   2> 347824 INFO  (TEST-TestReqParamsAPI.test-seed#[8623CF5E6E900586]) [    ] o.a.s.c.TestSolrConfigHandler going to send config command. path /config?wt=json , payload: {
   [junit4]   2> 'create-requesthandler' : { 'name' : '/dump0', 'class': 'org.apache.solr.handler.DumpRequestHandler' }
   [junit4]   2> }
   [junit4]   2> 347827 INFO  (qtp1696655716-2760) [    ] o.a.s.h.SolrConfigHandler Executed config commands successfully and persisted to ZK [{"create-requesthandler":{
   [junit4]   2>     "name":"/dump0",
   [junit4]   2>     "class":"org.apache.solr.handler.DumpRequestHandler"}}]
   [junit4]   2> 347827 INFO  (qtp1696655716-2760) [    ] o.a.s.h.SolrConfigHandler Waiting up to 30 secs for 2 replicas to set the property overlay to be of version 0 for collection collection1
   [junit4]   2> 347827 INFO  (Thread-768) [    ] o.a.s.c.SolrCore config update listener called for core collection1_shard1_replica1
   [junit4]   2> 347827 INFO  (Thread-769) [    ] o.a.s.c.SolrCore config update listener called for core collection1_shard1_replica2
   [junit4]   2> 347828 INFO  (Thread-768) [    ] o.a.s.c.SolrCore core reload collection1_shard1_replica1
   [junit4]   2> 347828 INFO  (Thread-769) [    ] o.a.s.c.SolrCore core reload collection1_shard1_replica2
   [junit4]   2> 347830 INFO  (solrHandlerExecutor-1246-thread-2) [    ] o.a.s.h.SolrConfigHandler Time elapsed : 0 secs, maxWait 30
   [junit4]   2> 347830 INFO  (solrHandlerExecutor-1246-thread-1) [    ] o.a.s.h.SolrConfigHandler Time elapsed : 0 secs, maxWait 30
   [junit4]   2> 347832 INFO  (Thread-769) [    ] o.a.s.c.SolrConfig Using Lucene MatchVersion: 7.0.0
   [junit4]   2> 347832 INFO  (Thread-768) [    ] o.a.s.c.SolrConfig Using Lucene MatchVersion: 7.0.0
   [junit4]   2> 347838 INFO  (Thread-769) [    ] o.a.s.s.IndexSchema [collection1_shard1_replica2] Schema name=minimal
   [junit4]   2> 347838 INFO  (Thread-768) [    ] o.a.s.s.IndexSchema [collection1_shard1_replica1] Schema name=minimal
   [junit4]   2> 347846 INFO  (Thread-768) [    ] o.a.s.s.IndexSchema Loaded schema minimal/1.1 with uniqueid field id
   [junit4]   2> 347846 INFO  (Thread-769) [    ] o.a.s.s.IndexSchema Loaded schema minimal/1.1 with uniqueid field id
   [junit4]   2> 347847 INFO  (Thread-768) [    ] o.a.s.c.CoreContainer Reloading SolrCore 'collection1_shard1_replica1' using configuration from collection collection1
   [junit4]   2> 347847 INFO  (Thread-769) [    ] o.a.s.c.CoreContainer Reloading SolrCore 'collection1_shard1_replica2' using configuration from collection collection1
   [junit4]   2> 347848 INFO  (Thread-769) [    ] o.a.s.c.SolrCore [[collection1_shard1_replica2] ] Opening new SolrCore at [/home/jenkins/workspace/Lucene-Solr-master-Linux/solr/build/solr-core/test/J1/temp/solr.handler.TestReqParamsAPI_8623CF5E6E900586-001/tempDir-001/node2/collection1_shard1_replica2], dataDir=[/home/jenkins/workspace/Lucene-Solr-master-Linux/solr/build/solr-core/test/J1/temp/solr.handler.TestReqParamsAPI_8623CF5E6E900586-001/tempDir-001/node2/./collection1_shard1_replica2/data/]
   [junit4]   2> 347848 INFO  (Thread-768) [    ] o.a.s.c.SolrCore [[collection1_shard1_replica1] ] Opening new SolrCore at [/home/jenkins/workspace/Lucene-Solr-master-Linux/solr/build/solr-core/test/J1/temp/solr.handler.TestReqParamsAPI_8623CF5E6E900586-001/tempDir-001/node1/collection1_shard1_replica1], dataDir=[/home/jenkins/workspace/Lucene-Solr-master-Linux/solr/build/solr-core/test/J1/temp/solr.handler.TestReqParamsAPI_8623CF5E6E900586-001/tempDir-001/node1/./collection1_shard1_replica1/data/]
   [junit4]   2> 347939 INFO  (qtp813654598-2753) [    ] o.a.s.h.SolrConfigHandler expecting overlay version 0 but my version is -1
   [junit4]   2> 347939 INFO  (qtp813654598-2753) [    ] o.a.s.c.S.Request [collection1_shard1_replica2]  webapp=/solr path=/config/znodeVersion params={overlay=0&wt=javabin&version=2} status=0 QTime=0
   [junit4]   2> 347939 INFO  (SolrConfigHandler-refreshconf) [    ] o.a.s.h.SolrConfigHandler Trying to update my configs
   [junit4]   2> 347939 INFO  (SolrConfigHandler-refreshconf) [    ] o.a.s.c.SolrCore config update listener called for core collection1_shard1_replica2
   [junit4]   2> 347939 INFO  (qtp1696655716-2754) [    ] o.a.s.h.SolrConfigHandler expecting overlay version 0 but my version is -1
   [junit4]   2> 347939 INFO  (solrHandlerExecutor-1246-thread-2) [    ] o.a.s.h.SolrConfigHandler Could not get expectedVersion 0 from https://127.0.0.1:43540/solr/collection1_shard1_replica2/ for prop overlay   after 1 attempts
   [junit4]   2> 347939 INFO  (SolrConfigHandler-refreshconf) [    ] o.a.s.h.SolrConfigHandler Trying to update my configs
   [junit4]   2> 347939 INFO  (SolrConfigHandler-refreshconf) [    ] o.a.s.c.SolrCore core reload collection1_shard1_replica2
   [junit4]   2> 347939 INFO  (qtp1696655716-2754) [    ] o.a.s.c.S.Request [collection1_shard1_replica1]  webapp=/solr path=/config/znodeVersion params={overlay=0&wt=javabin&version=2} status=0 QTime=0
   [junit4]   2> 347939 INFO  (SolrConfigHandler-refreshconf) [    ] o.a.s.c.SolrCore config update listener called for core collection1_shard1_replica1
   [junit4]   2> 347939 INFO  (solrHandlerExecutor-1246-thread-2) [    ] o.a.s.h.SolrConfigHandler Time elapsed : 0 secs, maxWait 30
   [junit4]   2> 347939 INFO  (solrHandlerExecutor-1246-thread-1) [    ] o.a.s.h.SolrConfigHandler Could not get expectedVersion 0 from https://127.0.0.1:44115/solr/collection1_shard1_replica1/ for prop overlay   after 1 attempts
   [junit4]   2> 347940 INFO  (solrHandlerExecutor-1246-thread-1) [    ] o.a.s.h.SolrConfigHandler Time elapsed : 0 secs, maxWait 30
   [junit4]   2> 347940 INFO  (SolrConfigHandler-refreshconf) [    ] o.a.s.c.SolrCore core reload collection1_shard1_replica1
   [junit4]   2> 347957 INFO  (Thread-769) [    ] o.a.s.u.CommitTracker Hard AutoCommit: disabled
   [junit4]   2> 347957 INFO  (Thread-769) [    ] o.a.s.u.CommitTracker Soft AutoCommit: disabled
   [junit4]   2> 347958 INFO  (Thread-769) [    ] o.a.s.s.SolrIndexSearcher Opening [Searcher@703a4fd3[collection1_shard1_replica2] main]
   [junit4]   2> 347958 INFO  (Thread-768) [    ] o.a.s.u.CommitTracker Hard AutoCommit: disabled
   [junit4]   2> 347958 INFO  (Thread-768) [    ] o.a.s.u.CommitTracker Soft AutoCommit: disabled
   [junit4]   2> 347961 INFO  (Thread-768) [    ] o.a.s.s.SolrIndexSearcher Opening [Searcher@4eb8edbd[collection1_shard1_replica1] main]
   [junit4]   2> 347962 INFO  (Thread-769) [    ] o.a.s.r.ManagedResourceStorage Configured ZooKeeperStorageIO with znodeBase: /configs/conf1
   [junit4]   2> 347962 INFO  (Thread-768) [    ] o.a.s.r.ManagedResourceStorage Configured ZooKeeperStorageIO with znodeBase: /configs/conf1
   [junit4]   2> 347962 INFO  (Thread-769) [    ] o.a.s.r.ManagedResourceStorage Loaded null at path _rest_managed.json using ZooKeeperStorageIO:path=/configs/conf1
   [junit4]   2> 347962 INFO  (Thread-769) [    ] o.a.s.s.ZkIndexSchemaReader Creating ZooKeeper watch for the managed schema at /configs/conf1/managed-schema
   [junit4]   2> 347962 INFO  (Thread-768) [    ] o.a.s.r.ManagedResourceStorage Loaded null at path _rest_managed.json using ZooKeeperStorageIO:path=/configs/conf1
   [junit4]   2> 347962 INFO  (Thread-768) [    ] o.a.s.s.ZkIndexSchemaReader Creating ZooKeeper watch for the managed schema at /configs/conf1/managed-schema
   [junit4]   2> 347962 INFO  (Thread-769) [    ] o.a.s.s.ZkIndexSchemaReader Current schema version 0 is already the latest
   [junit4]   2> 347962 INFO  (Thread-769) [    ] o.a.s.h.ReplicationHandler Commits will be reserved for  10000
   [junit4]   2> 347962 INFO  (Thread-768) [    ] o.a.s.s.ZkIndexSchemaReader Current schema version 0 is already the latest
   [junit4]   2> 347962 INFO  (Thread-768) [    ] o.a.s.h.ReplicationHandler Commits will be reserved for  10000
   [junit4]   2> 347962 INFO  (searcherExecutor-1247-thread-1) [    ] o.a.s.c.SolrCore [collection1_shard1_replica2] Registered new searcher Searcher@703a4fd3[collection1_shard1_replica2] main{ExitableDirectoryReader(UninvertingDirectoryReader())}
   [junit4]   2> 347962 INFO  (searcherExecutor-1248-thread-1) [    ] o.a.s.c.SolrCore [collection1_shard1_replica1] Registered new searcher Searcher@4eb8edbd[collection1_shard1_replica1] main{ExitableDirectoryReader(UninvertingDirectoryReader())}
   [junit4]   2> 347962 INFO  (Thread-769) [    ] o.a.s.u.UpdateLog Could not find max version in index or recent updates, using new clock 1558279353153880064
   [junit4]   2> 347962 INFO  (Thread-768) [    ] o.a.s.u.UpdateLog Could not find max version in index or recent updates, using new clock 1558279353153880064
   [junit4]   2> 347966 INFO  (Thread-768) [    ] o.a.s.u.DefaultSolrCoreState New IndexWriter is ready to be used.
   [junit4]   2> 347966 INFO  (Thread-769) [    ] o.a.s.u.DefaultSolrCoreState New IndexWriter is ready to be used.
   [junit4]   2> 347967 INFO  (Thread-769) [    ] o.a.s.s.SolrIndexSearcher Opening [Searcher@5de1d977[collection1_shard1_replica2] main]
   [junit4]   2> 347967 INFO  (Thread-768) [    ] o.a.s.s.SolrIndexSearcher Opening [Searcher@524bbd85[collection1_shard1_replica1] main]
   [junit4]   2> 347967 INFO  (searcherExecutor-1247-thread-1) [    ] o.a.s.c.SolrCore [collection1_shard1_replica2] Registered new searcher Searcher@5de1d977[collection1_shard1_replica2] main{ExitableDirectoryReader(UninvertingDirectoryReader())}
   [junit4]   2> 347967 INFO  (searcherExecutor-1248-thread-1) [    ] o.a.s.c.SolrCore [collection1_shard1_replica1] Registered new searcher Searcher@524bbd85[collection1_shard1_replica1] main{ExitableDirectoryReader(UninvertingDirectoryReader())}
   [junit4]   2> 347967 INFO  (Thread-769) [    ] o.a.s.c.SolrCore [collection1_shard1_replica2]  CLOSING SolrCore org.apache.solr.core.SolrCore@4917cdf5
   [junit4]   2> 347967 INFO  (Thread-769) [    ] o.a.s.m.SolrMetricManager Closing metric reporters for: solr.core.collection1.shard1.replica2
   [junit4]   2> 347971 INFO  (SolrConfigHandler-refreshconf) [    ] o.a.s.c.SolrConfig Using Lucene MatchVersion: 7.0.0
   [junit4]   2> 347971 INFO  (SolrConfigHandler-refreshconf) [    ] o.a.s.c.SolrConfig Using Lucene MatchVersion: 7.0.0
   [junit4]   2> 347979 INFO  (SolrConfigHandler-refreshconf) [    ] o.a.s.s.IndexSchema [collection1_shard1_replica2] Schema name=minimal
   [junit4]   2> 347979 INFO  (SolrConfigHandler-refreshconf) [    ] o.a.s.s.IndexSchema [collection1_shard1_replica1] Schema name=minimal
   [junit4]   2> 347981 INFO  (SolrConfigHandler-refreshconf) [    ] o.a.s.s.IndexSchema Loaded schema minimal/1.1 with uniqueid field id
   [junit4]   2> 347981 INFO  (SolrConfigHandler-refreshconf) [    ] o.a.s.s.IndexSchema Loaded schema minimal/1.1 with uniqueid field id
   [junit4]   2> 347982 INFO  (SolrConfigHandler-refreshconf) [    ] o.a.s.c.CoreContainer Reloading SolrCore 'collection1_shard1_replica2' using configuration from collection collection1
   [junit4]   2> 347982 INFO  (SolrConfigHandler-refreshconf) [    ] o.a.s.c.CoreContainer Reloading SolrCore 'collection1_shard1_replica1' using configuration from collection collection1
   [junit4]   2> 347982 INFO  (SolrConfigHandler-refreshconf) [    ] o.a.s.c.SolrCore [[collection1_shard1_replica2] ] Opening new SolrCore at [/home/jenkins/workspace/Lucene-Solr-master-Linux/solr/build/solr-core/test/J1/temp/solr.handler.TestReqParamsAPI_8623CF5E6E900586-001/tempDir-001/node2/collection1_shard1_replica2], dataDir=[/home/jenkins/workspace/Lucene-Solr-master-Linux/solr/build/solr-core/test/J1/temp/solr.handler.TestReqParamsAPI_8623CF5E6E900586-001/tempDir-001/node2/./collection1_shard1_replica2/data/]
   [junit4]   2> 347982 INFO  (SolrConfigHandler-refreshconf) [    ] o.a.s.c.SolrCore [[collection1_shard1_replica1] ] Opening new SolrCore at [/home/jenkins/workspace/Lucene-Solr-master-Linux/solr/build/solr-core/test/J1/temp/solr.handler.TestReqParamsAPI_8623CF5E6E900586-001/tempDir-001/node1/collection1_shard1_replica1], dataDir=[/home/jenkins/workspace/Lucene-Solr-master-Linux/solr/build/solr-core/test/J1/temp/solr.handler.TestReqParamsAPI_8623CF5E6E900586-001/tempDir-001/node1/./collection1_shard1_replica1/data/]
   [junit4]   2> 348041 INFO  (qtp1696655716-2756) [    ] o.a.s.h.SolrConfigHandler I already have the expected version 0 of config
   [junit4]   2> 348041 INFO  (qtp813654598-2745) [    ] o.a.s.h.SolrConfigHandler I already have the expected version 0 of config
   [junit4]   2> 348041 INFO  (qtp1696655716-2756) [    ] o.a.s.h.SolrConfigHandler isStale false , resourceloader org.apache.solr.cloud.ZkSolrResourceLoader
   [junit4]   2> 348041 INFO  (qtp813654598-2745) [    ] o.a.s.h.SolrConfigHandler isStale false , resourceloader org.apache.solr.cloud.ZkSolrResourceLoader
   [junit4]   2> 348041 INFO  (qtp1696655716-2756) [    ] o.a.s.c.S.Request [collection1_shard1_replica1]  webapp=/solr path=/config/znodeVersion params={overlay=0&wt=javabin&version=2} status=0 QTime=0
   [junit4]   2> 348041 INFO  (qtp813654598-2745) [    ] o.a.s.c.S.Request [collection1_shard1_replica2]  webapp=/solr path=/config/znodeVersion params={overlay=0&wt=javabin&version=2} status=0 QTime=0
   [junit4]   2> 348042 INFO  (qtp1696655716-2760) [    ] o.a.s.h.SolrConfigHandler Took 214.0ms to set the property overlay to be of version 0 for collection collection1
   [junit4]   2> 348042 INFO  (qtp1696655716-2760) [    ] o.a.s.c.S.Request [collection1_shard1_replica1]  webapp=/solr path=/config params={wt=json} status=0 QTime=215
   [junit4]   2> 348042 INFO  (qtp1696655716-2760) [    ] o.a.s.c.SolrCore [collection1_shard1_replica1]  CLOSING SolrCore org.apache.solr.core.SolrCore@589beae2
   [junit4]   2> 348042 INFO  (qtp1696655716-2760) [    ] o.a.s.m.SolrMetricManager Closing metric reporters for: solr.core.collection1.shard1.replica1
   [junit4]   2> 348042 INFO  (TEST-TestReqParamsAPI.test-seed#[8623CF5E6E900586]) [    ] o.a.s.c.TestSolrConfigHandler going to send config command. path /config?wt=json , payload: {
   [junit4]   2> 'create-requesthandler' : { 'name' : '/dump1', 'class': 'org.apache.solr.handler.DumpRequestHandler', 'useParams':'x' }
   [junit4]   2> }
   [junit4]   2> 348043 INFO  (qtp1696655716-2752) [    ] o.a.s.c.ZkController Persisted config data to node /configs/conf1/configoverlay.json 
   [junit4]   2> 348043 INFO  (qtp1696655716-2752) [    ] o.a.s.h.SolrConfigHandler Executed config commands successfully and persisted to ZK [{"create-requesthandler":{
   [junit4]   2>     "name":"/dump1",
   [junit4]   2>     "class":"org.apache.solr.handler.DumpRequestHandler",
   [junit4]   2>     "useParams":"x"}}]
   [junit4]   2> 348043 INFO  (qtp1696655716-2752) [    ] o.a.s.h.SolrConfigHandler Waiting up to 30 secs for 2 replicas to set the property overlay to be of version 1 for collection collection1
   [junit4]   2> 348044 INFO  (Thread-770) [    ] o.a.s.c.SolrCore config update listener called for core collection1_shard1_replica2
   [junit4]   2> 348044 INFO  (Thread-771) [    ] o.a.s.c.SolrCore config update listener called for core collection1_shard1_replica1
   [junit4]   2> 348044 INFO  (Thread-770) [    ] o.a.s.c.SolrCore core reload collection1_shard1_replica2
   [junit4]   2> 348045 INFO  (Thread-771) [    ] o.a.s.c.SolrCore core reload collection1_shard1_replica1
   [junit4]   2> 348046 INFO  (solrHandlerExecutor-1257-thread-1) [    ] o.a.s.h.SolrConfigHandler Time elapsed : 0 secs, maxWait 30
   [junit4]   2> 348046 INFO  (solrHandlerExecutor-1257-thread-2) [    ] o.a.s.h.SolrConfigHandler Time elapsed : 0 secs, maxWait 30
   [junit4]   2> 348089 INFO  (SolrConfigHandler-refreshconf) [    ] o.a.s.u.CommitTracker Hard AutoCommit: disabled
   [junit4]   2> 348089 INFO  (SolrConfigHandler-refreshconf) [    ] o.a.s.u.CommitTracker Soft AutoCommit: disabled
   [junit4]   2> 348090 INFO  (SolrConfigHandler-refreshconf) [    ] o.a.s.s.SolrIndexSearcher Opening [Searcher@569b86f3[collection1_shard1_replica1] main]
   [junit4]   2> 348090 INFO  (SolrConfigHandler-refreshconf) [    ] o.a.s.r.ManagedResourceStorage Configured ZooKeeperStorageIO with znodeBase: /configs/conf1
   [junit4]   2> 348091 INFO  (SolrConfigHandler-refreshconf) [    ] o.a.s.r.ManagedResourceStorage Loaded null at path _rest_managed.json using ZooKeeperStorageIO:path=/configs/conf1
   [junit4]   2> 348091 INFO  (SolrConfigHandler-refreshconf) [    ] o.a.s.s.ZkIndexSchemaReader Creating ZooKeeper watch for the managed schema at /configs/conf1/managed-schema
   [junit4]   2> 348091 INFO  (SolrConfigHandler-refreshconf) [    ] o.a.s.s.ZkIndexSchemaReader Current schema version 0 is already the latest
   [junit4]   2> 348091 INFO  (SolrConfigHandler-refreshconf) [    ] o.a.s.h.ReplicationHandler Commits will be reserved for  10000
   [junit4]   2> 348091 INFO  (searcherExecutor-1256-thread-1) [    ] o.a.s.c.SolrCore [collection1_shard1_replica1] Registered new searcher Searcher@569b86f3[collection1_shard1_replica1] main{ExitableDirectoryReader(UninvertingDirectoryReader())}
   [junit4]   2> 348091 INFO  (SolrConfigHandler-refreshconf) [    ] o.a.s.u.UpdateLog Could not find max version in index or recent updates, using new clock 1558279353289146368
   [junit4]   2> 348091 INFO  (SolrConfigHandler-refreshconf) [    ] o.a.s.u.CommitTracker Hard AutoCommit: disabled
   [junit4]   2> 348091 INFO  (SolrConfigHandler-refreshconf) [    ] o.a.s.u.CommitTracker Soft AutoCommit: disabled
   [junit4]   2> 348093 INFO  (SolrConfigHandler-refreshconf) [    ] o.a.s.s.SolrIndexSearcher Opening [Searcher@7d086814[collection1_shard1_replica2] main]
   [junit4]   2> 348094 INFO  (SolrConfigHandler-refreshconf) [    ] o.a.s.r.ManagedResourceStorage Configured ZooKeeperStorageIO with znodeBase: /configs/conf1
   [junit4]   2> 348094 INFO  (SolrConfigHandler-refreshconf) [    ] o.a.s.r.ManagedResourceStorage Loaded null at path _rest_managed.json using ZooKeeperStorageIO:path=/configs/conf1
   [junit4]   2> 348094 INFO  (SolrConfigHandler-refreshconf) [    ] o.a.s.s.ZkIndexSchemaReader Creating ZooKeeper watch for the managed schema at /configs/conf1/managed-schema
   [junit4]   2> 348094 INFO  (SolrConfigHandler-refreshconf) [    ] o.a.s.s.ZkIndexSchemaReader Current schema version 0 is already the latest
   [junit4]   2> 348094 INFO  (SolrConfigHandler-refreshconf) [    ] o.a.s.h.ReplicationHandler Commits will be reserved for  10000
   [junit4]   2> 348094 INFO  (searcherExecutor-1255-thread-1) [    ] o.a.s.c.SolrCore [collection1_shard1_replica2] Registered new searcher Searcher@7d086814[collection1_shard1_replica2] main{ExitableDirectoryReader(UninvertingDirectoryReader())}
   [junit4]   2> 348094 INFO  (SolrConfigHandler-refreshconf) [    ] o.a.s.u.UpdateLog Could not find max version in index or recent updates, using new clock 1558279353292292096
   [junit4]   2> 348095 INFO  (SolrConfigHandler-refreshconf) [    ] o.a.s.u.DefaultSolrCoreState New IndexWriter is ready to be used.
   [junit4]   2> 348095 INFO  (SolrConfigHandler-refreshconf) [    ] o.a.s.s.SolrIndexSearcher Opening [Searcher@14451838[collection1_shard1_replica1] main]
   [junit4]   2> 348095 INFO  (searcherExecutor-1256-thread-1) [    ] o.a.s.c.SolrCore [collection1_shard1_replica1] Registered new searcher Searcher@14451838[collection1_shard1_replica1] main{ExitableDirectoryReader(UninvertingDirectoryReader())}
   [junit4]   2> 348097 INFO  (SolrConfigHandler-refreshconf) [    ] o.a.s.u.DefaultSolrCoreState New IndexWriter is ready to be used.
   [junit4]   2> 348097 INFO  (SolrConfigHandler-refreshconf) [    ] o.a.s.s.SolrIndexSearcher Opening [Searcher@543b6cb9[collection1_shard1_replica2] main]
   [junit4]   2> 348097 INFO  (searcherExecutor-1255-thread-1) [    ] o.a.s.c.SolrCore [collection1_shard1_replica2] Registered new searcher Searcher@543b6cb9[collection1_shard1_replica2] main{ExitableDirectoryReader(UninvertingDirectoryReader())}
   [junit4]   2> 348097 INFO  (SolrConfigHandler-refreshconf) [    ] o.a.s.c.SolrCore [collection1_shard1_replica2]  CLOSING SolrCore org.apache.solr.core.SolrCore@1c36333c
   [junit4]   2> 348097 INFO  (SolrConfigHandler-refreshconf) [    ] o.a.s.m.SolrMetricManager Closing metric reporters for: solr.core.collection1.shard1.replica2
   [junit4]   2> 348106 INFO  (Thread-771) [    ] o.a.s.c.SolrConfig Using Lucene MatchVersion: 7.0.0
   [junit4]   2> 348108 INFO  (Thread-770) [    ] o.a.s.c.SolrConfig Using Lucene MatchVersion: 7.0.0
   [junit4]   2> 348114 INFO  (Thread-771) [    ] o.a.s.s.IndexSchema [collection1_shard1_replica1] Schema name=minimal
   [junit4]   2> 348114 INFO  (Thread-770) [    ] o.a.s.s.IndexSchema [collection1_shard1_replica2] Schema name=minimal
   [junit4]   2> 348116 INFO  (Thread-771) [    ] o.a.s.s.IndexSchema Loaded schema minimal/1.1 with uniqueid field id
   [junit4]   2> 348117 INFO  (Thread-770) [    ] o.a.s.s.IndexSchema Loaded schema minimal/1.1 with uniqueid field id
   [junit4]   2> 348117 INFO  (Thread-771) [    ] o.a.s.c.CoreContainer Reloading SolrCore 'collection1_shard1_replica1' using configuration from collection collection1
   [junit4]   2> 348117 INFO  (Thread-770) [    ] o.a.s.c.CoreContainer Reloading SolrCore 'collection1_shard1_replica2' using configuration from collection collection1
   [junit4]   2> 348118 INFO  (Thread-771) [    ] o.a.s.c.SolrCore [[collection1_shard1_replica1] ] Opening new SolrCore at [/home/jenkins/workspace/Lucene-Solr-master-Linux/solr/build/solr-core/test/J1/temp/solr.handler.TestReqParamsAPI_8623CF5E6E900586-001/tempDir-001/node1/collection1_shard1_replica1], dataDir=[/home/jenkins/workspace/Lucene-Solr-master-Linux/solr/build/solr-core/test/J1/temp/solr.handler.TestReqParamsAPI_8623CF5E6E900586-001/tempDir-001/node1/./collection1_shard1_replica1/data/]
   [junit4]   2> 348118 INFO  (Thread-770) [    ] o.a.s.c.SolrCore [[collection1_shard1_replica2] ] Opening new SolrCore at [/home/jenkins/workspace/Lucene-Solr-master-Linux/solr/build/solr-core/test/J1/temp/solr.handler.TestReqParamsAPI_8623CF5E6E900586-001/tempDir-001/node2/collection1_shard1_replica2], dataDir=[/home/jenkins/workspace/Lucene-Solr-master-Linux/solr/build/solr-core/test/J1/temp/solr.handler.TestReqParamsAPI_8623CF5E6E900586-001/tempDir-001/node2/./collection1_shard1_replica2/data/]
   [junit4]   2> 348149 INFO  (qtp813654598-2747) [    ] o.a.s.h.SolrConfigHandler expecting overlay version 1 but my version is 0
   [junit4]   2> 348149 INFO  (qtp813654598-2747) [    ] o.a.s.c.S.Request [collection1_shard1_replica2]  webapp=/solr path=/config/znodeVersion params={overlay=1&wt=javabin&version=2} status=0 QTime=0
   [junit4]   2> 348149 INFO  (SolrConfigHandler-refreshconf) [    ] o.a.s.h.SolrConfigHandler Trying to update my configs
   [junit4]   2> 348149 INFO  (SolrConfigHandler-refreshconf) [    ] o.a.s.c.SolrCore config update listener called for core collection1_shard1_replica2
   [junit4]   2> 348149 INFO  (qtp1696655716-2759) [    ] o.a.s.h.SolrConfigHandler expecting overlay version 1 but my version is 0
   [junit4]   2> 348149 INFO  (solrHandlerExecutor-1257-thread-2) [    ] o.a.s.h.SolrConfigHandler Could not get expectedVersion 1 from https://127.0.0.1:43540/solr/collection1_shard1_replica2/ for prop overlay   after 1 attempts
   [junit4]   2> 348149 INFO  (solrHandlerExecutor-1257-thread-2) [    ] o.a.s.h.SolrConfigHandler Time elapsed : 0 secs, maxWait 30
   [junit4]   2> 348149 INFO  (SolrConfigHandler-refreshconf) [    ] o.a.s.c.SolrCore core reload collection1_shard1_replica2
   [junit4]   2> 348150 INFO  (qtp1696655716-2759) [    ] o.a.s.c.S.Request [collection1_shard1_replica1]  webapp=/solr path=/config/znodeVersion params={overlay=1&wt=javabin&version=2} status=0 QTime=1
   [junit4]   2> 348151 INFO  (SolrConfigHandler-refreshconf) [    ] o.a.s.h.SolrConfigHandler Trying to update my configs
   [junit4]   2> 348151 INFO  (SolrConfigHandler-refreshconf) [    ] o.a.s.c.SolrCore config update listener called for core collection1_shard1_replica1
   [junit4]   2> 348151 INFO  (solrHandlerExecutor-1257-thread-1) [    ] o.a.s.h.SolrConfigHandler Could not get expectedVersion 1 from https://127.0.0.1:44115/solr/collection1_shard1_replica1/ for prop overlay   after 1 attempts
   [junit4]   2> 348151 INFO  (solrHandlerExecutor-1257-thread-1) [    ] o.a.s.h.SolrConfigHandler Time elapsed : 0 secs, maxWait 30
   [junit4]   2> 348151 INFO  (SolrConfigHandler-refreshconf) [    ] o.a.s.c.SolrCore core reload collection1_shard1_replica1
   [junit4]   2> 348222 INFO  (Thread-770) [    ] o.a.s.u.CommitTracker Hard AutoCommit: disabled
   [junit4]   2> 348222 INFO  (Thread-770) [    ] o.a.s.u.CommitTracker Soft AutoCommit: disabled
   [junit4]   2> 348223 INFO  (Thread-770) [    ] o.a.s.s.SolrIndexSearcher Opening [Searcher@1c66464c[collection1_shard1_replica2] main]
   [junit4]   2> 348223 INFO  (Thread-771) [    ] o.a.s.u.CommitTracker Hard AutoCommit: disabled
   [junit4]   2> 348223 INFO  (Thread-771) [    ] o.a.s.u.CommitTracker Soft AutoCommit: disabled
   [junit4]   2> 348224 INFO  (Thread-771) [    ] o.a.s.s.SolrIndexSearcher Opening [Searcher@6de9f22d[collection1_shard1_replica1] main]
   [junit4]   2> 348224 INFO  (Thread-770) [    ] o.a.s.r.ManagedResourceStorage Configured ZooKeeperStorageIO with znodeBase: /configs/conf1
   [junit4]   2> 348224 INFO  (Thread-770) [    ] o.a.s.r.ManagedResourceStorage Loaded null at path _rest_managed.json using ZooKeeperStorageIO:path=/configs/conf1
   [junit4]   2> 348224 INFO  (Thread-770) [    ] o.a.s.s.ZkIndexSchemaReader Creating ZooKeeper watch for the managed schema at /configs/conf1/managed-schema
   [junit4]   2> 348225 INFO  (Thread-771) [    ] o.a.s.r.ManagedResourceStorage Configured ZooKeeperStorageIO with znodeBase: /configs/conf1
   [junit4]   2> 348225 INFO  (Thread-770) [    ] o.a.s.s.ZkIndexSchemaReader Current schema version 0 is already the latest
   [junit4]   2> 348225 INFO  (Thread-770) [    ] o.a.s.h.ReplicationHandler Commits will be reserved for  10000
   [junit4]   2> 348225 INFO  (Thread-771) [    ] o.a.s.r.ManagedResourceStorage Loaded null at path _rest_managed.json using ZooKeeperStorageIO:path=/configs/conf1
   [junit4]   2> 348225 INFO  (Thread-771) [    ] o.a.s.s.ZkIndexSchemaReader Creating ZooKeeper watch for the managed schema at /configs/conf1/managed-schema
   [junit4]   2> 348225 INFO  (searcherExecutor-1265-thread-1) [    ] o.a.s.c.SolrCore [collection1_shard1_replica2] Registered new searcher Searcher@1c66464c[collection1_shard1_replica2] main{ExitableDirectoryReader(UninvertingDirectoryReader())}
   [junit4]   2> 348225 INFO  (Thread-770) [    ] o.a.s.u.UpdateLog Could not find max version in index or recent updates, using new clock 1558279353429655552
   [junit4]   2> 348226 INFO  (Thread-771) [    ] o.a.s.s.ZkIndexSchemaReader Current schema version 0 is already the latest
   [junit4]   2> 348226 INFO  (Thread-771) [    ] o.a.s.h.ReplicationHandler Commits will be reserved for  10000
   [junit4]   2> 348226 INFO  (searcherExecutor-1264-thread-1) [    ] o.a.s.c.SolrCore [collection1_shard1_replica1] Registered new searcher Searcher@6de9f22d[collection1_shard1_replica1] main{ExitableDirectoryReader(UninvertingDirectoryReader())}
   [junit4]   2> 348226 INFO  (Thread-771) [    ] o.a.s.u.UpdateLog Could not find max version in index or recent updates, using new clock 1558279353430704128
   [junit4]   2> 348228 INFO  (Thread-770) [    ] o.a.s.u.DefaultSolrCoreState New IndexWriter is ready to be used.
   [junit4]   2> 348228 INFO  (Thread-771) [    ] o.a.s.u.DefaultSolrCoreState New IndexWriter is ready to be used.
   [junit4]   2> 348228 INFO  (Thread-770) [    ] o.a.s.s.SolrIndexSearcher Opening [Searcher@3cb5eacf[collection1_shard1_replica2] main]
   [junit4]   2> 348228 INFO  (Thread-771) [    ] o.a.s.s.SolrIndexSearcher Opening [Searcher@5babe37f[collection1_shard1_replica1] main]
   [junit4]   2> 348228 INFO  (searcherExecutor-1265-thread-1) [    ] o.a.s.c.SolrCore [collection1_shard1_replica2] Registered new searcher Searcher@3cb5eacf[collection1_shard1_replica2] main{ExitableDirectoryReader(UninvertingDirectoryReader())}
   [junit4]   2> 348228 INFO  (Thread-771) [    ] o.a.s.c.SolrCore [collection1_shard1_replica1]  CLOSING SolrCore org.apache.solr.core.SolrCore@f79b012
   [junit4]   2> 348228 INFO  (searcherExecutor-1264-thread-1) [    ] o.a.s.c.SolrCore [collection1_shard1_replica1] Registered new searcher Searcher@5babe37f[collection1_shard1_replica1] main{ExitableDirectoryReader(UninvertingDirectoryReader())}
   [junit4]   2> 348228 INFO  (Thread-770) [    ] o.a.s.c.SolrCore [collection1_shard1_replica2]  CLOSING SolrCore org.apache.solr.core.SolrCore@2092f252
   [junit4]   2> 348228 INFO  (Thread-771) [    ] o.a.s.m.SolrMetricManager Closing metric reporters for: solr.core.collection1.shard1.replica1
   [junit4]   2> 348228 INFO  (Thread-770) [    ] o.a.s.m.SolrMetricManager Closing metric reporters for: solr.core.collection1.shard1.replica2
   [junit4]   2> 348233 INFO  (SolrConfigHandler-refreshconf) [    ] o.a.s.c.SolrConfig Using Lucene MatchVersion: 7.0.0
   [junit4]   2> 348234 INFO  (SolrConfigHandler-refreshconf) [    ] o.a.s.c.SolrConfig Using Lucene MatchVersion: 7.0.0
   [junit4]   2> 348247 INFO  (SolrConfigHandler-refreshconf) [    ] o.a.s.s.IndexSchema [collection1_shard1_replica2] Schema name=minimal
   [junit4]   2> 348247 INFO  (SolrConfigHandler-refreshconf) [    ] o.a.s.s.IndexSchema [collection1_shard1_replica1] Schema name=minimal
   [junit4]   2> 348250 INFO  (qtp813654598-2753) [    ] o.a.s.h.SolrConfigHandler I already have the expected version 1 of config
   [junit4]   2> 348250 INFO  (qtp813654598-2753) [    ] o.a.s.h.SolrConfigHandler isStale false , resourceloader org.apache.solr.cloud.ZkSolrResourceLoader
   [junit4]   2> 348250 INFO  (qtp813654598-2753) [    ] o.a.s.c.S.Request [collection1_shard1_replica2]  webapp=/solr path=/config/znodeVersion params={overlay=1&wt=javabin&version=2} status=0 QTime=0
   [junit4]   2> 348251 INFO  (SolrConfigHandler-refreshconf) [    ] o.a.s.s.IndexSchema Loaded schema minimal/1.1 with uniqueid field id
   [junit4]   2> 348251 INFO  (SolrConfigHandler-refreshconf) [    ] o.a.s.s.IndexSchema Loaded schema minimal/1.1 with uniqueid field id
   [junit4]   2> 348252 INFO  (qtp1696655716-2754) [    ] o.a.s.h.SolrConfigHandler I already have the expected version 1 of config
   [junit4]   2> 348252 INFO  (qtp1696655716-2754) [    ] o.a.s.h.SolrConfigHandler isStale false , resourceloader org.apache.solr.cloud.ZkSolrResourceLoader
   [junit4]   2> 348252 INFO  (qtp1696655716-2754) [    ] o.a.s.c.S.Request [collection1_shard1_replica1]  webapp=/solr path=/config/znodeVersion params={overlay=1&wt=javabin&version=2} status=0 QTime=0
   [junit4]   2> 348252 INFO  (SolrConfigHandler-refreshconf) [    ] o.a.s.c.CoreContainer Reloading SolrCore 'collection1_shard1_replica1' using configuration from collection collection1
   [junit4]   2> 348252 INFO  (SolrConfigHandler-refreshconf) [    ] o.a.s.c.CoreContainer Reloading SolrCore 'collection1_shard1_replica2' using configuration from collection collection1
   [junit4]   2> 348253 INFO  (qtp1696655716-2752) [    ] o.a.s.h.SolrConfigHandler Took 209.0ms to set the property overlay to be of version 1 for collection collection1
   [junit4]   2> 348253 INFO  (SolrConfigHandler-refreshconf) [    ] o.a.s.c.SolrCore [[collection1_shard1_replica1] ] Opening new SolrCore at [/home/jenkins/workspace/Lucene-Solr-master-Linux/solr/build/solr-core/test/J1/temp/solr.handler.TestReqParamsAPI_8623CF5E6E900586-001/tempDir-001/node1/collection1_shard1_replica1], dataDir=[/home/jenkins/workspace/Lucene-Solr-master-Linux/solr/build/solr-core/test/J1/temp/solr.handler.TestReqParamsAPI_8623CF5E6E900586-001/tempDir-001/node1/./collection1_shard1_replica1/data/]
   [junit4]   2> 348253 INFO  (SolrConfigHandler-refreshconf) [    ] o.a.s.c.SolrCore [[collection1_shard1_replica2] ] Opening new SolrCore at [/home/jenkins/workspace/Lucene-Solr-master-Linux/solr/build/solr-core/test/J1/temp/solr.handler.TestReqParamsAPI_8623CF5E6E900586-001/tempDir-001/node2/collection1_shard1_replica2], dataDir=[/home/jenkins/workspace/Lucene-Solr-master-Linux/solr/build/solr-core/test/J1/temp/solr.handler.TestReqParamsAPI_8623CF5E6E900586-001/tempDir-001/node2/./collection1_shard1_replica2/data/]
   [junit4]   2> 348253 INFO  (qtp1696655716-2752) [    ] o.a.s.c.S.Request [collection1_shard1_replica1]  webapp=/solr path=/config params={wt=json} status=0 QTime=210
   [junit4]   2> 348253 INFO  (qtp1696655716-2752) [    ] o.a.s.c.SolrCore [collection1_shard1_replica1]  CLOSING SolrCore org.apache.solr.core.SolrCore@3f539d96
   [junit4]   2> 348254 INFO  (qtp1696655716-2752) [    ] o.a.s.m.SolrMetricManager Closing metric reporters for: solr.core.collection1.shard1.replica1
   [junit4]   2> 348254 INFO  (TEST-TestReqParamsAPI.test-seed#[8623CF5E6E900586]) [    ] o.a.s.c.AbstractDistribZkTestBase Wait for recoveries to finish - collection: collection1 failOnTimeout:true timeout (sec):90
   [junit4]   2> 348254 INFO  (TEST-TestReqParamsAPI.test-seed#[8623CF5E6E900586]) [    ] o.a.s.c.AbstractDistribZkTestBase Recoveries finished - collection: collection1
   [junit4]   2> 348254 INFO  (TEST-TestReqParamsAPI.test-seed#[8623CF5E6E900586]) [    ] o.a.s.c.TestSolrConfigHandler going to send config command. path /config/params?wt=json , payload:  {
   [junit4]   2>   'set' : {'x': {                    'a':'A val',
   [junit4]   2>                     'b': 'B val'}
   [junit4]   2>              }
   [junit4]   2>   }
   [junit4]   2> 348256 INFO  (qtp1696655716-2755) [    ] o.a.s.h.SolrConfigHandler Waiting up to 30 secs for 2 replicas to set the property params to be of version 0 for collection collection1
   [junit4]   2> 348256 INFO  (Thread-773) [    ] o.a.s.c.SolrCore config update listener called for core collection1_shard1_replica2
   [junit4]   2> 348256 INFO  (Thread-772) [    ] o.a.s.c.SolrCore config update listener called for core collection1_shard1_replica1
   [junit4]   2> 348257 INFO  (Thread-773) [    ] o.a.s.c.RequestParams conf resource params.json loaded . version : 0 
   [junit4]   2> 348257 INFO  (Thread-773) [    ] o.a.s.c.RequestParams request params refreshed to version 0
   [junit4]   2> 348257 INFO  (Thread-772) [    ] o.a.s.c.RequestParams conf resource params.json loaded . version : 0 
   [junit4]   2> 348257 INFO  (Thread-772) [    ] o.a.s.c.RequestParams request params refreshed to version 0
   [junit4]   2> 348258 INFO  (solrHandlerExecutor-1274-thread-1) [    ] o.a.s.h.SolrConfigHandler Time elapsed : 0 secs, maxWait 30
   [junit4]   2> 348258 INFO  (solrHandlerExecutor-1274-thread-2) [    ] o.a.s.h.SolrConfigHandler Time elapsed : 0 secs, maxWait 30
   [junit4]   2> 348361 INFO  (qtp1696655716-2752) [    ] o.a.s.h.SolrConfigHandler I already have the expected version 0 of params
   [junit4]   2> 348361 INFO  (qtp1696655716-2752) [    ] o.a.s.h.SolrConfigHandler isStale false , resourceloader org.apache.solr.cloud.ZkSolrResourceLoader
   [junit4]   2> 348361 INFO  (qtp1696655716-2752) [    ] o.a.s.c.S.Request [collection1_shard1_replica1]  webapp=/solr path=/config/znodeVersion params={params=0&wt=javabin&version=2} status=0 QTime=0
   [junit4]   2> 348361 INFO  (qtp813654598-2745) [    ] o.a.s.h.SolrConfigHandler I already have the expected version 0 of params
   [junit4]   2> 348361 INFO  (qtp813654598-2745) [    ] o.a.s.h.SolrConfigHandler isStale false , resourceloader org.apache.solr.cloud.ZkSolrResourceLoader
   [junit4]   2> 348361 INFO  (qtp813654598-2745) [    ] o.a.s.c.S.Request [collection1_shard1_replica2]  webapp=/solr path=/config/znodeVersion params={params=0&wt=javabin&version=2} status=0 QTime=0
   [junit4]   2> 348369 INFO  (SolrConfigHandler-refreshconf) [    ] o.a.s.u.CommitTracker Hard AutoCommit: disabled
   [junit4]   2> 348369 INFO  (qtp1696655716-2755) [    ] o.a.s.h.SolrConfigHandler Took 113.0ms to set the property params to be of version 0 for collection collection1
   [junit4]   2> 348369 INFO  (SolrConfigHandler-refreshconf) [    ] o.a.s.u.CommitTracker Soft AutoCommit: disabled
   [junit4]   2> 348369 INFO  (qtp1696655716-2755) [    ] o.a.s.c.S.Request [collection1_shard1_replica1]  webapp=/solr path=/config/params params={wt=json} status=0 QTime=114
   [junit4]   2> 348369 INFO  (SolrConfigHandler-refreshconf) [    ] o.a.s.u.CommitTracker Hard AutoCommit: disabled
   [junit4]   2> 348369 INFO  (SolrConfigHandler-refreshconf) [    ] o.a.s.u.CommitTracker Soft AutoCommit: disabled
   [junit4]   2> 348370 INFO  (SolrConfigHandler-refreshconf) [    ] o.a.s.s.SolrIndexSearcher Opening [Searcher@15a9c752[collection1_shard1_replica2] main]
   [junit4]   2> 348370 INFO  (SolrConfigHandler-refreshconf) [    ] o.a.s.s.SolrIndexSearcher Opening [Searcher@3a0bb9fd[collection1_shard1_replica1] main]
   [junit4]   2> 348371 INFO  (SolrConfigHandler-refreshconf) [    ] o.a.s.r.ManagedResourceStorage Configured ZooKeeperStorageIO with znodeBase: /configs/conf1
   [junit4]   2> 348371 INFO  (SolrConfigHandler-refreshconf) [    ] o.a.s.r.ManagedResourceStorage Configured ZooKeeperStorageIO with znodeBase: /configs/conf1
   [junit4]   2> 348371 INFO  (SolrConfigHandler-refreshconf) [    ] o.a.s.r.ManagedResourceStorage Loaded null at path _rest_managed.json using ZooKeeperStorageIO:path=/configs/conf1
   [junit4]   2> 348371 INFO  (SolrConfigHandler-refreshconf) [    ] o.a.s.s.ZkIndexSchemaReader Creating ZooKeeper watch for the managed schema at /configs/conf1/managed-schema
   [junit4]   2> 348371 INFO  (SolrConfigHandler-refreshconf) [    ] o.a.s.r.ManagedResourceStorage Loaded null at path _rest_managed.json using ZooKeeperStorageIO:path=/configs/conf1
   [junit4]   2> 348371 INFO  (SolrConfigHandler-refreshconf) [    ] o.a.s.s.ZkIndexSchemaReader Creating ZooKeeper watch for the managed schema at /configs/conf1/managed-schema
   [junit4]   2> 348372 INFO  (SolrConfigHandler-refreshconf) [    ] o.a.s.s.ZkIndexSchemaReader Current schema version 0 is already the latest
   [junit4]   2> 348372 INFO  (SolrConfigHandler-refreshconf) [    ] o.a.s.s.ZkIndexSchemaReader Current schema version 0 is already the latest
   [junit4]   2> 348372 INFO  (SolrConfigHandler-refreshconf) [    ] o.a.s.h.ReplicationHandler Commits will be reserved for  10000
   [junit4]   2> 348372 INFO  (SolrConfigHandler-refreshconf) [    ] o.a.s.h.ReplicationHandler Commits will be reserved for  10000
   [junit4]   2> 348372 INFO  (searcherExecutor-1272-thread-1) [    ] o.a.s.c.SolrCore [collection1_shard1_replica1] Registered new searcher Searcher@3a0bb9fd[collection1_shard1_replica1] main{ExitableDirectoryReader(UninvertingDirectoryReader())}
   [junit4]   2> 348372 INFO  (SolrConfigHandler-refreshconf) [    ] o.a.s.u.UpdateLog Could not find max version in index or recent updates, using new clock 1558279353583796224
   [junit4]   2> 348372 INFO  (SolrConfigHandler-refreshconf) [    ] o.a.s.u.UpdateLog Could not find max version in index or recent updates, using new clock 1558279353583796224
   [junit4]   2> 348372 INFO  (searcherExecutor-1273-thread-1) [    ] o.a.s.c.SolrCore [collection1_shard1_replica2] Registered new searcher Searcher@15a9c752[collection1_shard1_replica2] main{ExitableDirectoryReader(UninvertingDirectoryReader())}
   [junit4]   2> 348373 INFO  (qtp1696655716-2860) [    ] o.a.s.c.S.Request [collection1_shard1_replica1]  webapp=/solr path=/config/params params={wt=json} status=0 QTime=0
   [junit4]   2> 348375 INFO  (SolrConfigHandler-refreshconf) [    ] o.a.s.u.DefaultSolrCoreState New IndexWriter is ready to be used.
   [junit4]   2> 348375 INFO  (SolrConfigHandler-refreshconf) [    ] o.a.s.s.SolrIndexSearcher Opening [Searcher@166810cd[collection1_shard1_replica1] main]
   [junit4]   2> 348375 INFO  (searcherExecutor-1272-thread-1) [    ] o.a.s.c.SolrCore [collection1_shard1_replica1] Registered new searcher Searcher@166810cd[collection1_shard1_replica1] main{ExitableDirectoryReader(UninvertingDirectoryReader())}
   [junit4]   2> 348375 INFO  (SolrConfigHandler-refreshconf) [    ] o.a.s.c.SolrCore [collection1_shard1_replica1]  CLOSING SolrCore org.apache.solr.core.SolrCore@1f0200ae
   [junit4]   2> 348375 INFO  (SolrConfigHandler-refreshconf) [    ] o.a.s.u.DefaultSolrCoreState New IndexWriter is ready to be used.
   [junit4]   2> 348376 INFO  (SolrConfigHandler-refreshconf) [    ] o.a.s.s.SolrIndexSearcher Opening [Searcher@5b6e5349[collection1_shard1_replica2] main]
   [junit4]   2> 348376 INFO  (searcherExecutor-1273-thread-1) [    ] o.a.s.c.SolrCore [collection1_shard1_replica2] Registered new searcher Searcher@5b6e5349[collection1_shard1_replica2] main{ExitableDirectoryReader(UninvertingDirectoryReader())}
   [junit4]   2> 348376 INFO  (SolrConfigHandler-refreshconf) [    ] o.a.s.m.SolrMetricManager Closing metric reporters for: solr.core.collection1.shard1.replica1
   [junit4]   2> 348376 INFO  (SolrConfigHandler-refreshconf) [    ] o.a.s.c.SolrCore [collection1_shard1_replica2]  CLOSING SolrCore org.apache.solr.core.SolrCore@261d21c0
   [junit4]   2> 348376 INFO  (SolrConfigHandler-refreshconf) [    ] o.a.s.m.SolrMetricManager Closing metric reporters for: solr.core.collection1.shard1.replica2
   [junit4]   2> 348378 INFO  (qtp1696655716-2754) [    ] o.a.s.c.S.Request [collection1_shard1_replica1]  webapp=/solr path=/config/overlay params={wt=json} status=0 QTime=0
   [junit4]   2> 348381 INFO  (qtp1696655716-2756) [    ] o.a.s.c.S.Request [collection1_shard1_replica1]  webapp=/solr path=/dump0 params={wt=json&useParams=x} status=0 QTime=1
   [junit4]   2> 348473 INFO  (OverseerCollectionConfigSetProcessor-97392459306958854-127.0.0.1:43540_solr-n_0000000000) [    ] o.a.s.c.OverseerTaskQueue Response ZK path: /overseer/collection-queue-work/qnr-0000000000 doesn't exist.  Requestor may have disconnected from ZooKeeper
   [junit4]   2> 348484 INFO  (qtp1696655716-2758) [    ] o.a.s.c.S.Request [collection1_shard1_replica1]  webapp=/solr path=/dump0 params={wt=json&useParams=x} status=0 QTime=0
   [junit4]   2> 348587 INFO  (qtp1696655716-2861) [    ] o.a.s.c.S.Request [collection1_shard1_replica1]  webapp=/solr path=/dump0 params={wt=json&useParams=x} status=0 QTime=0
   [junit4]   2> 348689 INFO  (qtp1696655716-2760) [    ] o.a.s.c.S.Request [collection1_shard1_replica1]  webapp=/solr path=/dump0 params={wt=json&useParams=x} status=0 QTime=0
   [junit4]   2> 348792 INFO  (qtp1696655716-2758) [    ] o.a.s.c.S.Request [collection1_shard1_replica1]  webapp=/solr path=/dump0 params={wt=json&useParams=x} status=0 QTime=0
   [junit4]   2> 348894 INFO  (qtp1696655716-2861) [    ] o.a.s.c.S.Request [collection1_shard1_replica1]  webapp=/solr path=/dump0 params={wt=json&useParams=x} status=0 QTime=0
   [junit4]   2> 348997 INFO  (qtp1696655716-2860) [    ] o.a.s.c.S.Request [collection1_shard1_replica1]  webapp=/solr path=/dump0 params={wt=json&useParams=x} status=0 QTime=0
   [junit4]   2> 349100 INFO  (qtp1696655716-2758) [    ] o.a.s.c.S.Request [collection1_shard1_replica1]  webapp=/solr path=/dump0 params={wt=json&useParams=x} status=0 QTime=0
   [junit4]   2> 349203 INFO  (qtp1696655716-2756) [    ] o.a.s.c.S.Request [collection1_shard1_replica1]  webapp=/solr path=/dump0 params={wt=json&useParams=x} status=0 QTime=0
   [junit4]   2> 349306 INFO  (qtp1696655716-2755) [    ] o.a.s.c.S.Request [collection1_shard1_replica1]  webapp=/solr path=/dump0 params={wt=json&useParams=x} status=0 QTime=0
   [junit4]   2> 349408 INFO  (qtp1696655716-2752) [    ] o.a.s.c.S.Request [collection1_shard1_replica1]  webapp=/solr path=/dump0 params={wt=json&useParams=x} status=0 QTime=0
   [junit4]   2> 349511 INFO  (qtp1696655716-2861) [    ] o.a.s.c.S.Request [collection1_shard1_replica1]  webapp=/solr path=/dump0 params={wt=json&useParams=x} status=0 QTime=0
   [junit4]   2> 349614 INFO  (qtp1696655716-2755) [    ] o.a.s.c.S.Request [collection1_shard1_replica1]  webapp=/solr path=/dump0 params={wt=json&useParams=x} status=0 QTime=0
   [junit4]   2> 349716 INFO  (qtp1696655716-2752) [    ] o.a.s.c.S.Request [collection1_shard1_replica1]  webapp=/solr path=/dump0 params={wt=json&useParams=x} status=0 QTime=0
   [junit4]   2> 349818 INFO  (qtp1696655716-2860) [    ] o.a.s.c.S.Request [collection1_shard1_replica1]  webapp=/solr path=/dump0 params={wt=json&useParams=x} status=0 QTime=0
   [junit4]   2> 349921 INFO  (qtp1696655716-2760) [    ] o.a.s.c.S.Request [collection1_shard1_replica1]  webapp=/solr path=/dump0 params={wt=json&useParams=x} status=0 QTime=0
   [junit4]   2> 350023 INFO  (qtp1696655716-2752) [    ] o.a.s.c.S.Request [collection1_shard1_replica1]  webapp=/solr path=/dump0 params={wt=json&useParams=x} status=0 QTime=0
   [junit4]   2> 350126 INFO  (qtp1696655716-2860) [    ] o.a.s.c.S.Request [collection1_shard1_replica1]  webapp=/solr path=/dump0 params={wt=json&useParams=x} status=0 QTime=0
   [junit4]   2> 350229 INFO  (qtp1696655716-2756) [    ] o.a.s.c.S.Request [collection1_shard1_replica1]  webapp=/solr path=/dump0 params={wt=json&useParams=x} status=0 QTime=0
   [junit4]   2> 350331 INFO  (qtp1696655716-2861) [    ] o.a.s.c.S.Request [collection1_shard1_replica1]  webapp=/solr path=/dump0 params={wt=json&useParams=x} status=0 QTime=0
   [junit4]   2> 350434 INFO  (qtp1696655716-2758) [    ] o.a.s.c.S.Request [collection1_shard1_replica1]  webapp=/solr path=/dump0 params={wt=json&useParams=x} status=0 QTime=0
   [junit4]   2> 350536 INFO  (qtp1696655716-2756) [    ] o.a.s.c.S.Request [collection1_shard1_replica1]  webapp=/solr path=/dump0 params={wt=json&useParams=x} status=0 QTime=0
   [junit4]   2> 350639 INFO  (qtp1696655716-2754) [    ] o.a.s.c.S.Request [collection1_shard1_replica1]  webapp=/solr path=/dump0 params={wt=json&useParams=x} status=0 QTime=0
   [junit4]   2> 350742 INFO  (qtp1696655716-2758) [    ] o.a.s.c.S.Request [collection1_shard1_replica1]  webapp=/solr path=/dump0 params={wt=json&useParams=x} status=0 QTime=0
   [junit4]   2> 350845 INFO  (qtp1696655716-2756) [    ] o.a.s.c.S.Request [collection1_shard1_replica1]  webapp=/solr path=/dump0 params={wt=json&useParams=x} status=0 QTime=0
   [junit4]   2> 350948 INFO  (qtp1696655716-2860) [    ] o.a.s.c.S.Request [collection1_shard1_replica1]  webapp=/solr path=/dump0 params={wt=json&useParams=x} status=0 QTime=0
   [junit4]   2> 351050 INFO  (qtp1696655716-2752) [    ] o.a.s.c.S.Request [collection1_shard1_replica1]  webapp=/solr path=/dump0 params={wt=json&useParams=x} status=0 QTime=0
   [junit4]   2> 351153 INFO  (qtp1696655716-2760) [    ] o.a.s.c.S.Request [collection1_shard1_replica1]  webapp=/solr path=/dump0 params={wt=json&useParams=x} status=0 QTime=0
   [junit4]   2> 351255 INFO  (qtp1696655716-2754) [    ] o.a.s.c.S.Request [collection1_shard1_replica1]  webapp=/solr path=/dump0 params={wt=json&useParams=x} status=0 QTime=0
   [junit4]   2> 351358 INFO  (qtp1696655716-2752) [    ] o.a.s.c.S.Request [collection1_shard1_replica1]  webapp=/solr path=/dump0 params={wt=json&useParams=x} status=0 QTime=0
   [junit4]   2> 351461 INFO  (qtp1696655716-2755) [    ] o.a.s.c.S.Request [collection1_shard1_replica1]  webapp=/solr path=/dump0 params={wt=json&useParams=x} status=0 QTime=0
   [junit4]   2> 351564 INFO  (qtp1696655716-2758) [    ] o.a.s.c.S.Request [collection1_shard1_replica1]  webapp=/solr path=/dump0 params={wt=json&useParams=x} status=0 QTime=0
   [junit4]   2> 351666 INFO  (qtp1696655716-2756) [    ] o.a.s.c.S.Request [collection1_shard1_replica1]  webapp=/solr path=/dump0 params={wt=json&useParams=x} status=0 QTime=0
   [junit4]   2> 351770 INFO  (qtp1696655716-2756) [    ] o.a.s.c.S.Request [collection1_shard1_replica1]  webapp=/solr path=/dump0 params={wt=json&useParams=x} status=0 QTime=0
   [junit4]   2> 351873 INFO  (qtp1696655716-2755) [    ] o.a.s.c.S.Request [collection1_shard1_replica1]  webapp=/solr path=/dump0 params={wt=json&useParams=x} status=0 QTime=0
   [junit4]   2> 351976 INFO  (qtp1696655716-2758) [    ] o.a.s.c.S.Request [collection1_shard1_replica1]  webapp=/solr path=/dump0 params={wt=json&useParams=x} status=0 QTime=0
   [junit4]   2> 352078 INFO  (qtp1696655716-2754) [    ] o.a.s.c.S.Request [collection1_shard1_replica1]  webapp=/solr path=/dump0 params={wt=json&useParams=x} status=0 QTime=0
   [junit4]   2> 352181 INFO  (qtp1696655716-2752) [    ] o.a.s.c.S.Request [collection1_shard1_replica1]  webapp=/solr path=/dump0 params={wt=json&useParams=x} status=0 QTime=0
   [junit4]   2> 352284 INFO  (qtp1696655716-2756) [    ] o.a.s.c.S.Request [collection1_shard1_replica1]  webapp=/solr path=/dump0 params={wt=json&useParams=x} status=0 QTime=0
   [junit4]   2> 352387 INFO  (qtp1696655716-2861) [    ] o.a.s.c.S.Request [collection1_shard1_replica1]  webapp=/solr path=/dump0 params={wt=json&useParams=x} status=0 QTime=0
   [junit4]   2> 352490 INFO  (qtp1696655716-2752) [    ] o.a.s.c.S.Request [collection1_shard1_replica1]  webapp=/solr path=/dump0 params={wt=json&useParams=x} status=0 QTime=0
   [junit4]   2> 352593 INFO  (qtp1696655716-2756) [    ] o.a.s.c.S.Request [collection1_shard1_replica1]  webapp=/solr path=/dump0 params={wt=json&useParams=x} status=0 QTime=0
   [junit4]   2> 352695 INFO  (qtp1696655716-2860) [    ] o.a.s.c.S.Request [collection1_shard1_replica1]  webapp=/solr path=/dump0 params={wt=json&useParams=x} status=0 QTime=0
   [junit4]   2> 352798 INFO  (qtp1696655716-2752) [    ] o.a.s.c.S.Request [collection1_shard1_replica1]  webapp=/solr path=/dump0 params={wt=json&useParams=x} status=0 QTime=0
   [junit4]   2> 352901 INFO  (qtp1696655716-2760) [    ] o.a.s.c.S.Request [collection1_shard1_replica1]  webapp=/solr path=/dump0 params={wt=json&useParams=x} status=0 QTime=0
   [junit4]   2> 353003 INFO  (qtp1696655716-2755) [    ] o.a.s.c.S.Request [collection1_shard1_replica1]  webapp=/solr path=/dump0 params={wt=json&useParams=x} status=0 QTime=0
   [junit4]   2> 353105 INFO  (qtp1696655716-2752) [    ] o.a.s.c.S.Request [collection1_shard1_replica1]  webapp=/solr path=/dump0 params={wt=json&useParams=x} status=0 QTime=0
   [junit4]   2> 353208 INFO  (qtp1696655716-2760) [    ] o.a.s.c.S.Request [collection1_shard1_replica1]  webapp=/solr path=/dump0 params={wt=json&useParams=x} status=0 QTime=0
   [junit4]   2> 353310 INFO  (qtp1696655716-2754) [    ] o.a.s.c.S.Request [collection1_shard1_replica1]  webapp=/solr path=/dump0 params={wt=json&useParams=x} status=0 QTime=0
   [junit4]   2> 353411 INFO  (TEST-TestReqParamsAPI.test-seed#[8623CF5E6E900586]) [    ] o.a.s.SolrTestCaseJ4 ###Ending test
   [junit4]   2> NOTE: reproduce with: ant test  -Dtestcase=TestReqParamsAPI -Dtests.method=test -Dtests.seed=8623CF5E6E900586 -Dtests.multiplier=3 -Dtests.slow=true -Dtests.locale=ii-CN -Dtests.timezone=America/Buenos_Aires -Dtests.asserts=true -Dtests.file.encoding=US-ASCII
   [junit4] FAILURE 5.60s J1 | TestReqParamsAPI.test <<<
   [junit4]    > Throwable #1: java.lang.AssertionError: Could not get expected value  'A val' for path 'params/a' full output: {
   [junit4]    >   "responseHeader":{
   [junit4]    >     "status":0,
   [junit4]    >     "QTime":0},
   [junit4]    >   "params":{
   [junit4]    >     "wt":"json",
   [junit4]    >     "useParams":""},
   [junit4]    >   "context":{
   [junit4]    >     "webapp":"/solr",
   [junit4]    >     "path":"/dump0",
   [junit4]    >     "httpMethod":"GET"}},  from server:  https://127.0.0.1:44115/solr/collection1_shard1_replica1
   [junit4]    > 	at __randomizedtesting.SeedInfo.seed([8623CF5E6E900586:E77F084C06C687E]:0)
   [junit4]    > 	at org.apache.solr.core.TestSolrConfigHandler.testForResponseElement(TestSolrConfigHandler.java:556)
   [junit4]    > 	at org.apache.solr.handler.TestReqParamsAPI.testReqParams(TestReqParamsAPI.java:127)
   [junit4]    > 	at org.apache.solr.handler.TestReqParamsAPI.test(TestReqParamsAPI.java:69)
   [junit4]    > 	at java.base/jdk.internal.reflect.NativeMethodAccessorImpl.invoke0(Native Method)
   [junit4]    > 	at java.base/jdk.internal.reflect.NativeMethodAccessorImpl.invoke(NativeMethodAccessorImpl.java:62)
   [junit4]    > 	at java.base/jdk.internal.reflect.DelegatingMethodAccessorImpl.invoke(DelegatingMethodAccessorImpl.java:43)
   [junit4]    > 	at java.base/java.lang.reflect.Method.invoke(Method.java:543)
   [junit4]    > 	at java.base/java.lang.Thread.run(Thread.java:844)
   [junit4]   2> 353426 INFO  (jetty-launcher-458-thread-1) [    ] o.e.j.s.AbstractConnector Stopped ServerConnector@2f5de4ea{SSL,[ssl, http/1.1]}{127.0.0.1:0}
   [junit4]   2> 353427 INFO  (jetty-launcher-458-thread-2) [    ] o.e.j.s.AbstractConnector Stopped ServerConnector@4f3f82bd{SSL,[ssl, http/1.1]}{127.0.0.1:0}
   [junit4]   2> 353427 INFO  (jetty-launcher-458-thread-1) [    ] o.a.s.c.CoreContainer Shutting down CoreContainer instance=861728029
   [junit4]   2> 353427 INFO  (jetty-launcher-458-thread-2) [    ] o.a.s.c.CoreContainer Shutting down CoreContainer instance=1291443869
   [junit4]   2> 353428 INFO  (coreCloseExecutor-1281-thread-1) [    ] o.a.s.c.SolrCore [collection1_shard1_replica1]  CLOSING SolrCore org.apache.solr.core.SolrCore@23136f80
   [junit4]   2> 353428 INFO  (coreCloseExecutor-1282-thread-1) [    ] o.a.s.c.SolrCore [collection1_shard1_replica2]  CLOSING SolrCore org.apache.solr.core.SolrCore@5a980452
   [junit4]   2> 353429 INFO  (coreCloseExecutor-1282-thread-1) [    ] o.a.s.m.SolrMetricManager Closing metric reporters for: solr.core.collection1.shard1.replica2
   [junit4]   2> 353429 INFO  (coreCloseExecutor-1281-thread-1) [    ] o.a.s.m.SolrMetricManager Closing metric reporters for: solr.core.collection1.shard1.replica1
   [ju

[...truncated too long message...]

ting dataDir: /home/jenkins/workspace/Lucene-Solr-master-Linux/solr/build/solr-core/test/J1/temp/solr.handler.admin.TestApiFramework_8623CF5E6E900586-001/init-core-data-001
   [junit4]   2> 1927438 INFO  (SUITE-TestApiFramework-seed#[8623CF5E6E900586]-worker) [    ] o.a.s.SolrTestCaseJ4 Using PointFields
   [junit4]   2> 1927440 INFO  (SUITE-TestApiFramework-seed#[8623CF5E6E900586]-worker) [    ] o.a.s.SolrTestCaseJ4 Randomized ssl (false) and clientAuth (true) via: @org.apache.solr.util.RandomizeSSL(reason="", ssl=0.0/0.0, value=0.0/0.0, clientAuth=0.0/0.0)
   [junit4]   2> 1927441 INFO  (TEST-TestApiFramework.testTrailingTemplatePaths-seed#[8623CF5E6E900586]) [    ] o.a.s.SolrTestCaseJ4 ###Starting testTrailingTemplatePaths
   [junit4]   2> 1927441 INFO  (TEST-TestApiFramework.testTrailingTemplatePaths-seed#[8623CF5E6E900586]) [    ] o.a.s.SolrTestCaseJ4 ###Ending testTrailingTemplatePaths
   [junit4]   2> 1927441 INFO  (TEST-TestApiFramework.testFramework-seed#[8623CF5E6E900586]) [    ] o.a.s.SolrTestCaseJ4 ###Starting testFramework
   [junit4]   2> 1927499 INFO  (TEST-TestApiFramework.testFramework-seed#[8623CF5E6E900586]) [    ] o.a.s.SolrTestCaseJ4 ###Ending testFramework
   [junit4]   2> NOTE: reproduce with: ant test  -Dtestcase=TestApiFramework -Dtests.method=testFramework -Dtests.seed=8623CF5E6E900586 -Dtests.multiplier=3 -Dtests.slow=true -Dtests.locale=smn -Dtests.timezone=America/Argentina/Jujuy -Dtests.asserts=true -Dtests.file.encoding=US-ASCII
   [junit4] ERROR   0.06s J1 | TestApiFramework.testFramework <<<
   [junit4]    > Throwable #1: java.lang.ExceptionInInitializerError
   [junit4]    > 	at __randomizedtesting.SeedInfo.seed([8623CF5E6E900586:915505796844E9BB]:0)
   [junit4]    > 	at net.sf.cglib.core.KeyFactory$Generator.generateClass(KeyFactory.java:166)
   [junit4]    > 	at net.sf.cglib.core.DefaultGeneratorStrategy.generate(DefaultGeneratorStrategy.java:25)
   [junit4]    > 	at net.sf.cglib.core.AbstractClassGenerator.create(AbstractClassGenerator.java:216)
   [junit4]    > 	at net.sf.cglib.core.KeyFactory$Generator.create(KeyFactory.java:144)
   [junit4]    > 	at net.sf.cglib.core.KeyFactory.create(KeyFactory.java:116)
   [junit4]    > 	at net.sf.cglib.core.KeyFactory.create(KeyFactory.java:108)
   [junit4]    > 	at net.sf.cglib.core.KeyFactory.create(KeyFactory.java:104)
   [junit4]    > 	at net.sf.cglib.proxy.Enhancer.<clinit>(Enhancer.java:69)
   [junit4]    > 	at org.easymock.internal.ClassProxyFactory.createEnhancer(ClassProxyFactory.java:259)
   [junit4]    > 	at org.easymock.internal.ClassProxyFactory.createProxy(ClassProxyFactory.java:174)
   [junit4]    > 	at org.easymock.internal.MocksControl.createMock(MocksControl.java:60)
   [junit4]    > 	at org.easymock.EasyMock.createMock(EasyMock.java:104)
   [junit4]    > 	at org.apache.solr.handler.admin.TestCoreAdminApis.getCoreContainerMock(TestCoreAdminApis.java:76)
   [junit4]    > 	at org.apache.solr.handler.admin.TestApiFramework.testFramework(TestApiFramework.java:59)
   [junit4]    > 	at java.base/jdk.internal.reflect.NativeMethodAccessorImpl.invoke0(Native Method)
   [junit4]    > 	at java.base/jdk.internal.reflect.NativeMethodAccessorImpl.invoke(NativeMethodAccessorImpl.java:62)
   [junit4]    > 	at java.base/jdk.internal.reflect.DelegatingMethodAccessorImpl.invoke(DelegatingMethodAccessorImpl.java:43)
   [junit4]    > 	at java.base/java.lang.reflect.Method.invoke(Method.java:543)
   [junit4]    > 	at java.base/java.lang.Thread.run(Thread.java:844)
   [junit4]    > Caused by: java.lang.reflect.InaccessibleObjectException: Unable to make protected final java.lang.Class java.lang.ClassLoader.defineClass(java.lang.String,byte[],int,int,java.security.ProtectionDomain) throws java.lang.ClassFormatError accessible: module java.base does not "opens java.lang" to unnamed module @6c812f12
   [junit4]    > 	at java.base/java.lang.reflect.AccessibleObject.checkCanSetAccessible(AccessibleObject.java:207)
   [junit4]    > 	at java.base/java.lang.reflect.Method.checkCanSetAccessible(Method.java:192)
   [junit4]    > 	at java.base/java.lang.reflect.Method.setAccessible(Method.java:186)
   [junit4]    > 	at net.sf.cglib.core.ReflectUtils$2.run(ReflectUtils.java:56)
   [junit4]    > 	at java.base/java.security.AccessController.doPrivileged(Native Method)
   [junit4]    > 	at net.sf.cglib.core.ReflectUtils.<clinit>(ReflectUtils.java:46)
   [junit4]    > 	... 52 more
   [junit4]   2> 1927501 INFO  (SUITE-TestApiFramework-seed#[8623CF5E6E900586]-worker) [    ] o.a.s.SolrTestCaseJ4 ###deleteCore
   [junit4]   2> NOTE: leaving temporary files on disk at: /home/jenkins/workspace/Lucene-Solr-master-Linux/solr/build/solr-core/test/J1/temp/solr.handler.admin.TestApiFramework_8623CF5E6E900586-001
   [junit4]   2> NOTE: test params are: codec=Asserting(Lucene70): {}, docValues:{}, maxPointsInLeafNode=1855, maxMBSortInHeap=5.449368675388722, sim=RandomSimilarity(queryNorm=true): {}, locale=smn, timezone=America/Argentina/Jujuy
   [junit4]   2> NOTE: Linux 4.4.0-53-generic amd64/Oracle Corporation 9-ea (64-bit)/cpus=12,threads=1,free=218078280,total=523763712
   [junit4]   2> NOTE: All tests run in this JVM: [TestAuthorizationFramework, TestSchemaNameResource, DocExpirationUpdateProcessorFactoryTest, TestSolrCloudWithHadoopAuthPlugin, TimeZoneUtilsTest, TestStressInPlaceUpdates, TestNamedUpdateProcessors, TestScoreJoinQPNoScore, DistributedIntervalFacetingTest, SaslZkACLProviderTest, DistributedTermsComponentTest, TestBackupRepositoryFactory, MetricsHandlerTest, DirectSolrConnectionTest, CloudExitableDirectoryReaderTest, TestXIncludeConfig, TestExceedMaxTermLength, TestDistribDocBasedVersion, DocumentBuilderTest, RestartWhileUpdatingTest, EnumFieldTest, SpellCheckCollatorTest, ConvertedLegacyTest, TestTrie, TestFieldCacheWithThreads, SolrCloudExampleTest, HLLSerializationTest, AddSchemaFieldsUpdateProcessorFactoryTest, SuggesterFSTTest, OutOfBoxZkACLAndCredentialsProvidersTest, TestDynamicFieldCollectionResource, FileUtilsTest, PeerSyncWithIndexFingerprintCachingTest, DeleteShardTest, PreAnalyzedUpdateProcessorTest, RulesTest, ZkStateWriterTest, TermsComponentTest, TestReqParamsAPI, QueryParsingTest, TestSystemIdResolver, MigrateRouteKeyTest, TestSimpleTrackingShardHandler, ShufflingReplicaListTransformerTest, TestLeaderInitiatedRecoveryThread, TestConfigsApi, LeaderFailureAfterFreshStartTest, TestPartialUpdateDeduplication, TestUpdate, DeleteLastCustomShardedReplicaTest, TestCharFilters, TestCollectionAPI, StressHdfsTest, TestQueryTypes, OverseerModifyCollectionTest, TermVectorComponentTest, LoggingHandlerTest, TestSha256AuthenticationProvider, SpellingQueryConverterTest, BasicFunctionalityTest, TestMiniSolrCloudCluster, TestExactSharedStatsCache, SchemaVersionSpecificBehaviorTest, TestCustomStream, AnalysisErrorHandlingTest, DistributedVersionInfoTest, CreateCollectionCleanupTest, TestStressVersions, DistributedSuggestComponentTest, ShardRoutingTest, OverseerTaskQueueTest, TestDocumentBuilder, CdcrReplicationDistributedZkTest, TestInPlaceUpdatesStandalone, TestPivotHelperCode, SortByFunctionTest, IndexSchemaRuntimeFieldTest, WrapperMergePolicyFactoryTest, TestBM25SimilarityFactory, ConcurrentDeleteAndCreateCollectionTest, CachingDirectoryFactoryTest, DistributedFacetPivotLongTailTest, TestFieldCacheSort, TestPushWriter, SOLR749Test, TestConfigSetProperties, ClassificationUpdateProcessorIntegrationTest, SolrIndexSplitterTest, SpatialRPTFieldTypeTest, DirectSolrSpellCheckerTest, TestSolrIndexConfig, TestInitQParser, TestCoreContainer, TestSchemaVersionResource, TestManagedSynonymFilterFactory, TestShortCircuitedRequests, TestMacros, SolrCmdDistributorTest, BadComponentTest, CollectionTooManyReplicasTest, ChaosMonkeyNothingIsSafeTest, TestSearchPerf, ShardRoutingCustomTest, TestSearcherReuse, DOMUtilTest, TestFieldCache, CloudMLTQParserTest, AsyncCallRequestStatusResponseTest, TestSystemCollAutoCreate, TestCursorMarkWithoutUniqueKey, HdfsRestartWhileUpdatingTest, StatsReloadRaceTest, CollectionsAPIDistributedZkTest, LeaderElectionIntegrationTest, TestZkChroot, ZkCLITest, ZkControllerTest, TestRealTimeGet, TestSolr4Spatial, StatsComponentTest, ShowFileRequestHandlerTest, CurrencyFieldOpenExchangeTest, SimplePostToolTest, CoreAdminHandlerTest, TestStressLucene, SpatialFilterTest, TestCSVLoader, PolyFieldTest, WordBreakSolrSpellCheckerTest, DirectUpdateHandlerOptimizeTest, StatelessScriptUpdateProcessorFactoryTest, TestSurroundQueryParser, TestQueryUtils, StandardRequestHandlerTest, DocumentAnalysisRequestHandlerTest, PathHierarchyTokenizerFactoryTest, RequiredFieldsTest, IndexSchemaTest, UniqFieldsUpdateProcessorFactoryTest, BinaryUpdateRequestHandlerTest, CSVRequestHandlerTest, HighlighterConfigTest, TestQuerySenderListener, UpdateParamsTest, AlternateDirectoryTest, TestQuerySenderNoQuery, TestStressRecovery, TestUtils, UUIDFieldTest, DistributedMLTComponentTest, TestHighlightDedupGrouping, TestPathTrie, ConnectionReuseTest, CollectionReloadTest, DeleteStatusTest, DistribJoinFromCollectionTest, DistributedQueueTest, RecoveryAfterSoftCommitTest, SharedFSAutoReplicaFailoverUtilsTest, SimpleCollectionCreateDeleteTest, SolrXmlInZkTest, TestCloudDeleteByQuery, TestCloudInspectUtil, TestCloudPivotFacet, TestCloudPseudoReturnFields, TestCloudRecovery, TestDeleteCollectionOnDownNodes, TestRebalanceLeaders, TestRequestForwarding, TestSegmentSorting, TestSizeLimitedDistributedMap, TestSolrCloudWithDelegationTokens, TestSolrCloudWithKerberosAlt, TestStressLiveNodes, TestTolerantUpdateProcessorCloud, VMParamsZkACLAndCredentialsProvidersTest, ExitableDirectoryReaderTest, HdfsDirectoryFactoryTest, TestConfigOverlay, TestConfigSetImmutable, TestDynamicLoading, TestSolrDynamicMBean, TestSolrXml, TestSolrCoreSnapshots, TestConfigReload, TestRestoreCore, CoreAdminRequestStatusTest, CoreMergeIndexesAdminHandlerTest, SecurityConfHandlerTest, TestApiFramework]
   [junit4] Completed [561/692 (3!)] on J1 in 0.08s, 2 tests, 1 error <<< FAILURES!

[...truncated 51959 lines...]


Mime
View raw message